##TITLE=1H_CA-9163
 CDCl3
 8 sc, 
 15.6.2023
##JCAMPDX= 6.0         $$ Bruker NMR JCAMP-DX V2.0
##DATA TYPE= NMR SPECTRUM
##DATA CLASS= NTUPLES
##ORIGIN= UXNMR, Bruker Analytische Messtechnik GmbH
##OWNER= root
$$ XWIN-NMR		Version 3.5
$$ Thu Jun 15 13:40:49 2023 Russian Standard Time (UT+4h)  she@DPX200
##.OBSERVE FREQUENCY= 200.13135
##.OBSERVE NUCLEUS= ^1H
##.ACQUISITION MODE= SIMULTANEOUS
##.ACQUISITION SCHEME= undefined
##.AVERAGES= 10
##.DIGITISER RES= 18
##SPECTROMETER/DATA SYSTEM= spect
##.PULSE SEQUENCE= zg30
##.SOLVENT NAME= Acetone
##.SHIFT REFERENCE= (INTERNAL, Acetone, 0, 15.7337)
##AUDIT TRAIL= $$ (NUMBER, WHEN, WHO, WHERE, WHAT)
$$ ##TITLE= Audit trail, XWIN-NMR		Version 3.5
$$ ##JCAMPDX= 5.01
$$ ##ORIGIN= Bruker BioSpin GmbH
$$ ##OWNER= she
$$ F:/spectra/data/she/nmr/H-F/1/pdata/1/auditp.txt
$$ ##AUDIT TRAIL=  $$ (NUMBER, WHEN, WHO, WHERE, WHAT)
(   1,<2023-06-15 13:39:30.62 +0400>,<she>,<DPX200>,
      <created by zg, POWCHK disabled, PULCHK disabled
       terminated by command 'halt'
       configuration hash MD5:
       00 E9 B6 7A A2 85 ED C7 34 08 36 98 17 FE 4E 26
       data hash MD5: 16K
       14 B0 1D B0 6D AE E2 9C BE 3B 99 15 D5 AF 21 44>)
(   2,<2023-06-15 13:39:37.28 +0400>,<she>,<DPX200>,
      <Start of raw data processing
       efp BC_mod = 2 LB = 0.24 FT_mod = 6 PKNL = 1 PHC0 = -20783.86 PHC1 = 12.45272 SI = 16K 
       data hash MD5: 16K
       2D D3 11 DC 38 FB D4 02 47 44 8F B5 89 C4 D1 0A>)
(   3,<2023-06-15 13:39:58.64 +0400>,<she>,<DPX200>,
      <pk PHC0 = 1.779225 PHC1 = -3.6 
       data hash MD5: 16K
       12 6B CA 5C 6F 61 9B A8 F0 28 02 DE 1C 5A 97 0B>)
(   4,<2023-06-15 13:40:02.48 +0400>,<she>,<DPX200>,
      <abs ABSG = 5 
       data hash MD5: 16K
       BB 1F 68 9D BC 8F 76 5B B6 87 5A DF EF 7F AD AE>)
$$ ##END=
$$ 
$$ hash MD5
$$ 69 F6 52 D5 14 63 FC 0E 48 3F C3 D4 3F 82 0E C4
##$RELAX= 
##$RELAX= 
##$RELAX= 
##$RELAX= 
##$RELAX= 
##$RELAX= 
$$ Bruker specific parameters
$$ --------------------------
##$DU= <F:/spectra>
##$EXPNO= 1
##$NAME= <H-F>
##$PROCNO= 1
##$TYPE= <nmr>
##$USER= <she>
##$AMP= (0..31)
100 100 100 100 100 100 100 100 100 100 100 100 100 100 100 100 100 100 
100 100 100 100 100 100 100 100 100 100 100 100 100 100 
##$AQSEQ= 0
##$AQ_mod= 1
##$AUNM= <au_zg>
##$AUTOPOS= <>
##$BF1= 200.13
##$BF2= 200.13
##$BF3= 200.13
##$BF4= 200.13
##$BF5= 200.13
##$BF6= 200.13
##$BF7= 200.13
##$BF8= 200.13
##$BYTORDA= 1
##$CFDGTYP= 0
##$CFRGTYP= 5
##$CHEMSTR= <none>
##$CNST= (0..31)
1 1 145 1 1 1 1 1 1 1 1 1 1 1 1 1 1 1 1 1 1 1 1 1 1 1 1 1 1 1 1 1 
##$CPDPRG= <>
##$CPDPRG1= <>
##$CPDPRG2= <>
##$CPDPRG3= <>
##$CPDPRG4= <mlev>
##$CPDPRG5= <mlev>
##$CPDPRG6= <mlev>
##$CPDPRG7= <mlev>
##$CPDPRG8= <mlev>
##$CPDPRGB= <>
##$CPDPRGT= <>
##$D= (0..31)
0 1.2 0 0 0 0 0 0 0 0.06 0 0.03 0 0 0 0 0.0002 0 0 0 0 0 0 0 0 0 0 0 0 
0 0 0 
##$DATE= 1686821970
##$DBL= (0..7)
120 120 120 120 120 120 120 120 
##$DBP= (0..7)
150 150 150 150 150 150 150 150 
##$DBP07= 0
##$DBPNAM0= <>
##$DBPNAM1= <>
##$DBPNAM2= <>
$$ [...]
##$SUBNAM3= <"">
##$SUBNAM4= <"">
##$SUBNAM5= <"">
##$SUBNAM6= <"">
##$SUBNAM7= <"">
##$SUBNAM8= <"">
##$SUBNAM9= <"">
##$SW= 18.05172834244
##$SWIBOX= (0..15)
0 0 2 0 0 0 0 0 0 0 0 0 0 0 0 0 
##$SW_h= 3612.71676300578
##$TD= 16384
##$TD0= 1
##$TE= 0
##$TE2= 300
##$TE3= 300
##$TEG= 300
##$TL= (0..7)
0 120 120 120 120 120 120 120 
##$TP= (0..7)
150 150 150 150 150 150 150 150 
##$TP07= 0
##$TPNAME0= <>
##$TPNAME1= <>
##$TPNAME2= <>
##$TPNAME3= <>
##$TPNAME4= <>
##$TPNAME5= <>
##$TPNAME6= <>
##$TPNAME7= <>
##$TPOAL= (0..7)
0.5 0.5 0.5 0.5 0.5 0.5 0.5 0.5 
##$TPOFFS= (0..7)
0 0 0 0 0 0 0 0 
##$TUNHIN= 0
##$TUNHOUT= 0
##$TUNXOUT= 0
##$USERA1= <user>
##$USERA2= <user>
##$USERA3= <user>
##$USERA4= <user>
##$USERA5= <user>
##$V9= 5
##$VALIST= <valist>
##$VCLIST= <CCCCCCCCCCCCCCC>
##$VD= 0
##$VDLIST= <DDDDDDDDDDDDDDD>
##$VPLIST= <PPPPPPPPPPPPPPP>
##$VTLIST= <TTTTTTTTTTTTTTT>
##$WBST= 1024
##$WBSW= 4
##$XGAIN= (0..3)
0 0 0 0 
##$XL= 0
##$YL= 0
##$YMAX_a= 162858
##$YMIN_a= -114912
##$ZGOPTNS= <>
##$ZL1= 120
##$ZL2= 120
##$ZL3= 120
##$ZL4= 120
##$ABSF1= 15.80087
##$ABSF2= -2.250981
##$ABSG= 5
##$ABSL= 3
##$ALPHA= 0
##$AQORDER= 0
##$ASSFAC= 0
##$ASSFACI= 0
##$ASSFACX= 0
##$ASSWID= 0
##$AUNMP= <proc_1d>
##$AZFE= 0.1
##$AZFW= 0.1
##$BCFW= 0
##$BC_mod= 2
##$BYTORDP= 0
##$COROFFS= 0
##$CY= -3
##$DATMOD= 1
##$DC= 0
##$DFILT= <>
##$DTYPP= 0
##$F1P= 0
##$F2P= 0
##$FCOR= 1
##$FTSIZE= 16384
##$FT_mod= 6
##$GAMMA= 0
##$GB= 0
##$INTBC= 1
##$INTSCL= 3.70164e-10
##$ISEN= 128
##$LB= 0.24
##$LEV0= 0
##$LPBIN= 0
##$MAXI= 10000
##$MC2= 0
##$MEAN= 0
##$ME_mod= 0
##$MI= 1.114404
##$NCOEF= 0
##$NC_proc= -8
##$NLEV= 6
##$NOISF1= 3.799351
##$NOISF2= 2.8
##$NSP= 0
##$NTH_PI= 0
##$NZP= 0
##$OFFSET= 15.73367
##$PC= 1
##$PHC0= -20782.08
##$PHC1= 8.85272
##$PH_mod= 1
##$PKNL= yes
##$PPARMOD= 0
##$PSCAL= 0
##$PSIGN= 0
##$REVERSE= no
##$SF= 200.130007578355
##$SI= 16384
##$SIGF1= 3
##$SIGF2= 2
##$SINO= 5.538805
##$SIOLD= 16384
##$SREGLST= <1H.CDCl3>
##$SSB= 0
##$STSI= 16384
##$STSR= 0
##$SW_p= 3612.71676300578
##$SYMM= 0
##$S_DEV= 0
##$TDeff= 16384
##$TDoff= 0
##$TI= <>
##$TILT= no
##$TM1= 0
##$TM2= 0
##$TOPLEV= 0
##$USERP1= <user>
##$USERP2= <user>
##$USERP3= <user>
##$USERP4= <user>
##$USERP5= <user>
##$WDW= 1
##$XDIM= 16384
##$YMAX_p= 274250325
##$YMIN_p= -847713
$$ End of Bruker specific parameters
$$ ---------------------------------
##NTUPLES= NMR SPECTRUM
##VAR_NAME=  FREQUENCY,     SPECTRUM/REAL,   SPECTRUM/IMAG
##SYMBOL=    X,             R,               I
##VAR_TYPE=  INDEPENDENT,   DEPENDENT,       DEPENDENT
##VAR_FORM=  AFFN,          ASDF,            ASDF
##VAR_DIM=   16384,         16384,           16384
##UNITS=     HZ,            ARBITRARY UNITS, ARBITRARY UNITS
##FACTOR=    0.220516191357247, 1,           1
##FIRST=     3148.77954330188, 0,            0
##LAST=      -463.937219703898, 0,           0
##MIN=       -463.937219703898, -847713,     0
##MAX=       3148.77954330188, 274250325,    0
$$ Real data points
##PAGE= N=1
##DATA TABLE= (X++(R..R)), XYDATA
$$ [...]
6921E1104800O582341Q175891R337846Q609914N373667R93217j970942k502426
6913H5704308q5179M933914J1048840J6882396J2119718q655976k4524763k2549935
6905G4873323j5373391j0345395p312709n453352m091352l093656j854321j558122
6897B5791025j368612j502697j162567p49973q77597p29299l91693n60597n41527
6888A7906463n33808n34135n51562n42660l69173n44528q6447l2804l06800K6563
6878A4431109k77418j80923k5388k80326m38999k6019J72236p2182l61816j2026
6868A2928248l63431m67151q6411k83080k50078J28030n2165J00527j78378j34494
6858A1341617q0737k09549O9476l4679J9317L88574N42069j13730O9286K31773
$$ y = [51104800, 57687141, 65863032, 75200878, 83810792, 89184459, 90177676, 88206734, 85704308, 85619129, 90553043, 101601883, 118484279, 130603997, 121948021, 97423258, 74873323, 59499932, 49154537, 41841828, 36388476, 32297124, 29203468, 27349147, 25791025, 24422413, 22919716, 21757149, 21007176, 20129579, 19400280, 19008587, 18447990, 17906463, 17372655, 16838520, 16286958, 15744298, 15375125, 14830597, 14744150, 14711346, 14404546, 14431109, 14153691, 13972768, 13947380, 13667054, 13228055, 13202036, 13374272, 13302090, 12940274, 12928248, 12564817, 12097666, 12011255, 11728175, 11478097, 11606127, 11553962, 11654489, 11476111, 11341617, 11260880, 11051331, 11120807, 11086128, 11105445, 11494019, 12036088, 11922358, 11991644, 12223417]
6848A2223417o7200K69104L00255j38965O1685N08426L45894L14168M36180N75713
6838A4828677N54979N99616J044261R95350O82892R56204J043409J627495K023586
6829B4356469K070546K706861K840679K966006L345817M268037M423077L844043
6821E0821535K849742J005304l37892j104405k628427l959183m765444m520111
6813C7361119m412530l740106k424957k458891j794374j491236j218925p72673
6805A9047427o71663o61360k43641m24378p22660j44154m83206k8732m66342l76668
6795A4824623k0503K10525Q259O30672Q08530M09067R81427J140241Q90118J261098
6785B1144057J608730R70620N81804m54505k00797p07021j605552j638938j724865
$$ y = [12223417, 12156217, 12425321, 12725576, 12586611, 12648296, 13156722, 13502616, 13816784, 14252964, 14828677, 15383656, 15983272, 17027533, 18022883, 18705775, 19661979, 20705388, 22332883, 24356469, 26427015, 29133876, 31974555, 34940561, 38286378, 42554415, 46977492, 50821535, 53671277, 54676581, 54338689, 53234284, 50605857, 46646674, 41881230, 37361119, 32948589, 29208483, 26783526, 24324635, 22530261, 21039025, 19820100, 19047427, 18375764, 17714404, 17470763, 17046385, 16323725, 16179571, 15696365, 15667633, 15201291, 14824623, 14804120, 15014645, 15022904, 15653576, 16462106, 16871173, 17852600, 18992841, 19882959, 21144057, 22752787, 23723407, 24305211, 23850706, 23649909, 22942888, 21337336, 19698398, 17973533]
6776A7973533j777385j666425j229350j291673r17134p74889o20411l31585m91872
6767H872809l32936k77514k90075l05362K4595j97627k22777J22511k65552k62831
6757F865241q7787j9623k18621J7387k33572J27575L34520K3206j40622L99865
6747G067569L9242l52515P3518l69463l4944j43603k40964j66619M9083k05139
6737E716165k20166k16509k80154k75676k6643k38412r9147k66827N6810J89639
6727D339080n4210n0480j35223J77552J4418j3128Q4386k84979j94830j10341
6717C772245K77324L06655m83285j20040j14894p1982J92886k52910j70899j86504
6707C148596j34466N2802r02l93987p445K07655J85012J07789o6269J14199r8482
$$ y = [17973533, 16196148, 14529723, 13300373, 12008700, 11091566, 10316677, 9696266, 9364681, 8872809, 8539873, 8262359, 7972284, 7666922, 7691517, 7493890, 7271113, 7393624, 7128072, 6865241, 6777454, 6757831, 6539210, 6556597, 6323025, 6450600, 6785120, 6808326, 6667704, 7067569, 7106811, 6754296, 6827814, 6458351, 6423407, 6279804, 6038840, 5872221, 5921304, 5716165, 5495999, 5279490, 4999336, 4723660, 4697017, 4458605, 4359458, 4092631, 4149441, 4339080, 4284870, 4234390, 4099167, 4276719, 4291137, 4278009, 4362395, 4077416, 3882586, 3772245, 4049569, 4356224, 3872939, 3752899, 3638005, 3566023, 3758909, 3505999, 3335100, 3148596, 3014130, 3066932, 3066030, 2672043, 2664598, 2872253, 3057265, 3165054, 3098785, 3212984, 3114502]
6696C114502P7562j42829j49655P9709N2961L54464R1083l00888J3354o7499j13596
6685C009168m03749J87817O2467j47268k6098j20698M83427j51025l52351J12020
6675B653710n0608K90032L74423J21755p0538J68298p2891r3464o6618l8831j20986
6664C094282R4826o3560O8308K26746o6738o2347n3785K41678j70610J10412J75561
6653C594773P506j28405j04524j62552j36750p9828j45159J96855m93371L40544
6643B889089L77076l26761J90J02280O9801L99517K45218K00567m35118k6720
6633C495139q2296K6083N7937P2972p1062k29506L00362L4777k34662M8049J49050
6622C566843N8847j29021j32632N5589P1041K2755l16438M14102m60804l8804
$$ y = [3114502, 3192064, 3049235, 2899580, 2979289, 3032250, 3386714, 3477797, 3176909, 3190263, 3122764, 3009168, 2605419, 2793236, 2855703, 2708435, 2682337, 2561639, 3045066, 2894041, 2541690, 2653710, 2603102, 2893134, 3267557, 3389312, 3318774, 3487072, 3414181, 3320717, 3254099, 3215268, 3094282, 3189108, 3125548, 3193856, 3420602, 3353864, 3291517, 3237732, 3479410, 3308800, 3419212, 3594773, 3602279, 3473874, 3369350, 3206798, 3070048, 2990220, 2845061, 3041916, 2548545, 2889089, 3266165, 2939404, 2939594, 3041874, 3111675, 3511192, 3756410, 3956977, 3521859, 3495139, 3412843, 3438926, 3496863, 3569835, 3498773, 3269267, 3569629, 3604406, 3369744, 3417793, 3566843, 3625690, 3496669, 3364037, 3419626, 3490667, 3513422, 3196984, 3611086, 3150282, 3111478]
6612C111478J98518O14555R418J15249l52565R7039j09009J3552L96944l48974
6602C746205n6932k14794O520j6803j25154m0693L9938J6106j14258K51518L1745
6591C523398k4795K60167J32039J25783n3923j55809J04064m6813k46018p7482
6581C540611l61522Q4937K16555j10539K09351N9059L5928R2314l18024J31838
6571C580508l4428K2908J49169K6314l8648n0190L73209j03506l34749R6836Q4561
6560C771984K75920l2376j52107P7317j51573k84584k00012N8600p3682j40164
6550C149323m2773Q7501K89053q2853J69723L55182j33816L18837K1253n7139
6540D074291K06959j48476J07019j54825N7356j07217R9480J62650J62896J30055
$$ y = [3111478, 3309996, 3924551, 3933969, 4049218, 3696653, 3793692, 3684683, 3698235, 4095179, 3746205, 3689273, 3474479, 3480999, 3464196, 3339042, 3298349, 3338287, 3354393, 3240135, 3491653, 3523398, 3498603, 3758770, 3890809, 4016592, 3962669, 3806860, 3910924, 3864111, 3618093, 3540611, 3179089, 3264026, 3480581, 3370042, 3579393, 3638452, 3674380, 3766694, 3448670, 3580508, 3546080, 3568988, 3718157, 3744471, 3705823, 3655633, 4028842, 3925336, 3590587, 3687423, 3771984, 4047904, 4015528, 3863421, 3940738, 3789165, 3504581, 3304569, 3363169, 3289487, 3149323, 3106550, 3194051, 3483104, 3400251, 3569974, 3925156, 3791340, 4110177, 4131430, 4074291, 4281250, 4132774, 4239793, 4084968, 4142324, 4035107, 4134587, 4297237, 4460133, 4590188]
6530D590188j04194L26019o865Q2153L71235l7968J51234k4178M42025L52295
6520F141944N2152L51611J38770L94048K16076L17187M83434K0620K8782J43717
6510H288341K30625j36613J14981k0325k7855l6511n17250k97647l43138j76186
6500G078422j90038j00818m58262n04491k51540l43948K9689L07104j59317o44023
6490D762778O7174k13984k51395j60830k671N5797j31829J38277j63079N7991
6480D158229L5020j57633j03783j92118j37812q7368K60456j41873o3142n3359
6470C516617K41604l52j60016O8795j27402K8945L9224J07493k28443k57976L9141
6459C267630J90487j12325j89844O1848j97221J69883L17979j70538j36718N6165
$$ y = [4590188, 4485994, 4812013, 4805148, 4887301, 5258536, 5220568, 5371802, 5347624, 5789649, 6141944, 6194096, 6545707, 6684477, 7078525, 7294601, 7611788, 8095222, 8115842, 8144624, 8288341, 8518966, 8382353, 8497334, 8477009, 8449154, 8412643, 7895393, 7597746, 7254608, 7078422, 6888384, 6787566, 6329304, 5824813, 5573273, 5229325, 5259014, 5566118, 5406801, 4762778, 4829952, 4615968, 4364573, 4203743, 4201072, 4256869, 4125040, 4263317, 4100238, 4158229, 4193249, 4035616, 3931833, 3739715, 3601903, 3514535, 3774991, 3633118, 3569976, 3516617, 3758221, 3757869, 3597853, 3666648, 3539246, 3568191, 3607415, 3714908, 3486465, 3228489, 3267630, 3458117, 3345792, 3155948, 3217796, 3020575, 3190458, 3508437, 3337899, 3201181, 3257346]
6449C257346k63914k0560M75998k55231n6934p1402Q3452J40298L9556k92334
6439C036275j06572J63026L65548q8590l18697m841J41239J21434J65509J94701
6429C669032j25922J09167N5463k67988L9781m7544N64421l9920j01109l2476
6419C822905j78469R4451o057J50780K11237k6299j08799J83390N7428k47759
6409C952808L47666M809M2168K57978j02342o2908r2977L49085J79041m47878
6399D427450q4023r920J30265J94216j39462j43785J05892K09916p839J07609
6389D790319J65424K74794m2840M7879M0743K3510K09924j30851N2405K21351
6379E652658k22069N5267O8602K06176l77796R9870k2155o347K13362j49491k10381
$$ y = [3257346, 2993432, 2972872, 3448870, 3193639, 3136705, 3065303, 3148755, 3289053, 3328609, 3036275, 2929703, 3092729, 3458277, 3369687, 3050990, 3046149, 3187388, 3308822, 3474331, 3669032, 3543110, 3652277, 3707740, 3439752, 3479533, 3431989, 3996410, 3956490, 3855381, 3822905, 3644436, 3738887, 3732830, 3883610, 4094847, 4068548, 3959749, 4143139, 4200567, 3952808, 4300474, 4305283, 4347451, 4605429, 4503087, 4440179, 4347202, 4696287, 4875328, 4427450, 4343427, 4333507, 4463772, 4657988, 4518526, 4374741, 4480633, 4690549, 4682710, 4790319, 4955743, 5230537, 5187697, 5235576, 5276319, 5299829, 5509753, 5378902, 5431307, 5652658, 5430589, 5485856, 5554458, 5760634, 5382838, 5482708, 5460553, 5454206, 5667568, 5518077, 5307696]
6368E307696k51523j53832k91837n8310K97683k15924L94609o7222m34559k08529
6358D318252L06800j12294j75770L7721p047J25731m32144j22803l52820n4531
6348C531095k14646j98193J99036N053J52930L5533J01629O8229k24639l03651
6338C152376j3477J22888q8632p0082q7566q3216j44267o8646m61962P4548q7249
6327B244715j24325J36427k07143l21206J53196K08872K47024L18566k51385K61498
6317B666239k22173j91228j4010n1310j26262j83855J26465k3551M3593k7723
6307A996185J33196M7218k20337m31337P0772R6195R7574J9037k02022K84554
6297A891035L5340l55564q0970K09042j06274k31720j2384O6500p1613j58413
$$ y = [5307696, 5056173, 4902341, 4610504, 4552194, 4849877, 4633953, 5028562, 4961340, 4526781, 4318252, 4625052, 4512758, 4336988, 4374709, 4367662, 4493393, 4061249, 3938446, 3585626, 3531095, 3316449, 3118256, 3317292, 3322345, 3475275, 3510808, 3612437, 3680666, 3456027, 3152376, 3138899, 3261787, 3173155, 3103073, 3015507, 2932291, 2788024, 2719378, 2257416, 2331964, 2244715, 2120390, 2256817, 2049674, 1728468, 1881664, 2090536, 2337560, 2656126, 2404741, 2666239, 2444066, 2252838, 2238828, 2187518, 2061256, 1877401, 2003866, 1980315, 2023908, 1996185, 2129381, 2176599, 1956262, 1524925, 1595697, 1691892, 1789466, 1808503, 1606481, 1891035, 1926375, 1570811, 1489841, 1698883, 1592609, 1360889, 1348505, 1415005, 1343392, 1184979]
6287A184979J60231J97246r8343K72304m6359j71050p9783J64086J70966q7422
6277A666855l44074k94317j0730l8139K11307l7384J13518j16290O5898Q6189
6267A302833R3973N4575J1031N5283P9555N245l76028j55966K49965L4827N426
6256A360719J18421k9272j16744j01502N8386J39003j31590J14198O7624j61906
6246A317337p498L9783J81804k74577J02742J03764K75768j75389j22410K19703
6236A661027J20611J17130j11561j47132j65874K17778j89288j95493K56921Q2256
6226A646375P4538L07567j37588j04905m53075J94318m5321K01297R7428J03388
6216A884022m16397k93313M11066J63356r6786o4474L00662P7227k85416J58234
$$ y = [1184979, 1345210, 1542456, 1444113, 1716417, 1670058, 1499008, 1419225, 1583311, 1754277, 1666855, 1322781, 1028464, 1017734, 979595, 1190902, 1153518, 1267036, 1150746, 1216644, 1302833, 1396806, 1451381, 1462412, 1517695, 1597250, 1602495, 1226467, 1070501, 1320466, 1355293, 1360719, 1479140, 1449868, 1333124, 1231622, 1290008, 1429011, 1297421, 1411619, 1479243, 1317337, 1309839, 1349622, 1531426, 1256849, 1359591, 1463355, 1739123, 1563734, 1441324, 1661027, 1781638, 1898768, 1787207, 1640075, 1474201, 1691979, 1502691, 1307198, 1564119, 1646375, 1720913, 2028480, 1890892, 1785987, 1332912, 1527230, 1481909, 1683206, 1780634, 1884022, 1467625, 1174312, 1585378, 1748734, 1651948, 1587474, 1888136, 1965363, 1679947, 1838181]
6206A838181J51945p2647r8575j56496L59085j2794J11878O5329J30057N5228
6196B371191j81490j32345j13519K22636j28679k6493L0849o7343K92918K2210
6186B289935O6394k5155m04698o0127J59822M1297l1973J92166K68389j17351
6176B378699L39992r7451k04228j23490K40219k81047J77532Q195o8508m1672
6166B328241J47730k22353j70973N9145m6334L87370K01219k02028l13719J03958
6156B272256K92470k29388o7802K18933J96357k72909j31487r162J35711K20645
6146B625624n5489J14083J00824j32217K8838J7824j18386J21148Q292k46341
6136B464200L27900M70487m13837J38730k07905k84671l8578J30746J43769M518
$$ y = [1838181, 1990126, 1917479, 1818904, 1662408, 2021493, 2008699, 2120577, 2185906, 2315963, 2371191, 2189701, 2057356, 1943837, 2166473, 2037794, 2011301, 2042150, 1974807, 2267725, 2289935, 2356329, 2331174, 1926476, 1866349, 2026171, 2067468, 2035495, 2227661, 2496050, 2378699, 2718691, 2621240, 2417012, 2293522, 2533741, 2252694, 2430226, 2438421, 2369913, 2328241, 2475971, 2253618, 2082645, 2141790, 2095456, 2482826, 2684045, 2482017, 2168298, 2272256, 2564726, 2335338, 2267536, 2486469, 2682826, 2409917, 2278430, 2269268, 2404979, 2625624, 2570135, 2684218, 2785042, 2652825, 2681663, 2699487, 2581101, 2702249, 2710541, 2464200, 2792100, 3262587, 2848750, 2987480, 2779575, 2494904, 2456326, 2587072, 2730841, 2735359]
6126B735359j58273k582K4144j17451J29416J44656k02036L4735l2937N1163j6962
6115B589232j07453P824K83407J04230k22707k10429L75934K86579l36793K89171
6105C058995R7175k01760q6526Q4049Q7575J62644j14104m3829K21776R9338j1960
6094C353373k13772l196j58997k34828L12227j24231J11410q8939j14707O1589
6084B899929j89485M33928K02720m1562m1608J40051j65374K81646k39471l2960
6074C247814J44130o234J68255J14079K77240k024n3260J76442j22003J65J977
6063C946581K36355j09369k11195K6853J52319n0729L88551k3260j55982J43940
6053D344064L14637J45174k62975J43065L57672L18374k45858o9113l1965J03656
$$ y = [2735359, 2577086, 2574504, 2598648, 2481197, 2610613, 2755269, 2553233, 2587968, 2555031, 2606194, 2589232, 2481779, 2489603, 2773010, 2877240, 2654533, 2444104, 2820038, 3106617, 2769824, 3058995, 3156170, 2954410, 2867884, 2951933, 3039508, 3202152, 3088048, 3044219, 3265995, 3365333, 3353373, 3139601, 3136405, 2977408, 2742580, 3054807, 2930576, 3041986, 2953047, 2838340, 2899929, 2710444, 3144372, 3347092, 3305530, 3263922, 3403973, 3238599, 3520245, 3280774, 3247814, 3391944, 3385710, 3553965, 3668044, 3945284, 3943260, 3890000, 4066442, 3944439, 3944604, 3946581, 4182936, 4073567, 3862372, 3889225, 4041544, 3990815, 4379366, 4356106, 4200124, 4344064, 4658701, 4803875, 4540900, 4683965, 5041637, 5360011, 5114153, 5045040, 5013075, 5116731]
6043E116731J09026K17363k68530K80959J8547R3604M82936J96888J73444o3903
6033F357065L05979L84099L47355M20895P5638L0585J13823L64230j23240q7026
6023H189403J43260O6340q7713r0250j45332r9713N01258J15880K30752N7670
6013H881555k0502L95808N05754K51849j74112K03324M78488N58134M00666L00139
6003A1781103J45164k9086L66828K77788m08082L7777l14334j79062K6682m9835
5993A1654943J3723p7457J54955K98557l25329K60512O6436Q3074O71489J64379
5983A2965282J89629k47505O48195N21172L43836M84328K16085o3174j98029o71183
5973A4188636j41848R5971k90466m77063r8409o15534o08622J13586r4340L28975
$$ y = [5116731, 5225757, 5443120, 5174590, 5455549, 5474096, 5567700, 6050636, 6247524, 6420968, 6357065, 6663044, 7047143, 7394498, 7815393, 7891031, 7921616, 8035439, 8399669, 8276429, 8189403, 8332663, 8399003, 8311290, 8221040, 8075708, 7975995, 8477253, 8593133, 8823885, 8881555, 8861053, 9256861, 9762615, 10014464, 9840352, 10043676, 10522164, 11080298, 11480964, 11781103, 11926267, 11897181, 12264009, 12541797, 12133715, 12171492, 11857158, 11678096, 11704778, 11654943, 11668666, 11591209, 11746164, 12044721, 11719392, 11979904, 12046340, 12129414, 12800903, 12965282, 13154911, 12907406, 13555601, 14076773, 14420609, 14904937, 15121022, 15057848, 14859819, 14188636, 14046788, 14142759, 13852293, 13375230, 13276821, 12661287, 12052665, 12166251, 12071911, 12400886]
5963A2400886J04636r0647K35838K48435J35243P4891K39095L21367O0939K95360
5953A4026043J39853L68646L73939N36748L26364J93714L38242N16973L83047
5944A7203569K91581L17652P45407L53404K02795P37045Q38393M84402R34200
5935B2108448R95167N58684K61649M95285J98371J37290l22764j099549n79037
5926B2753544q38411p12098n64982o32998n54920j48790n19722k91909R8498O6544
5916A8654756K45714J60168J71839J33817K0928j74692K42772K70580M3731M436
5906A9774049j04872J44184j6740Q2705J73524k354K939J84036M52635L49066
5896B1039172K51121K77729O16019O22767K24907M57106M87491P93859K00171
$$ y = [12400886, 12505522, 12414875, 12650713, 12899148, 13034391, 13109282, 13348377, 13669744, 13730683, 14026043, 14165896, 14534542, 14908481, 15445229, 15771593, 15965307, 16303549, 16820522, 17203569, 17495150, 17812802, 18558209, 18911613, 19114408, 19851453, 20689846, 21174248, 22108448, 23103615, 23662299, 23923948, 24419233, 24617604, 24754894, 24432130, 23332581, 22753544, 21915133, 21203035, 20638053, 20005055, 19450135, 19301345, 18781623, 18489714, 18588212, 18654756, 18900470, 19060638, 19232477, 19366294, 19387222, 19212530, 19455302, 19725882, 19769613, 19774049, 19669177, 19813361, 19796621, 19879326, 20052850, 20050496, 20053435, 20237471, 20690106, 21039172, 21290293, 21568022, 22184041, 22806808, 23031715, 23488821, 23976312, 24770171, 24970342]
5887B4970342K98248N36095K23032L5521O80642P31123R93877J207138J410410
5878C1086428K017029K073269J941098K561809L213025L332881L902353M329831
5870E4457723M741110M765940L770757K330869N88946j568120l690155m476973
5862F0920097m811441m425009l738898k924623k102071j465673j020865o91093
5854C9740424N5736K56989M47429P31975J378527J625028J471975J449784J371050
5845D8528917M82913k26538m98833r55742j513129j903971j947238k191458k343119
5836C7431802k024991j768478j828393j447846j205919p67336j003880o01480
5828B6783479n22394n02001q10397l88989l28795n20954n4594k25257j81389n07692
$$ y = [24970342, 25268590, 25804685, 26027717, 26063238, 26743880, 27475003, 28468880, 29676018, 31086428, 33103457, 35176726, 37117824, 39679633, 42892658, 46225539, 50127892, 54457723, 59198833, 63964773, 67735530, 70066399, 70655345, 69087225, 65397070, 60920097, 56108656, 51683647, 47944749, 45020126, 42918055, 41452382, 40431517, 39740424, 39796160, 40053149, 40500578, 41232553, 42611080, 44236108, 45708083, 47157867, 48528917, 49011830, 48785292, 48286459, 47330717, 45817588, 43913617, 41966379, 39774921, 37431802, 35406811, 33638333, 31809940, 30362094, 29156175, 28388839, 27384959, 26783479, 26261085, 25759084, 24948687, 24559698, 24230903, 23709949, 23655355, 23430098, 23248709, 22741017]
5818B2741017m68540k72072l40856n11787m98447q79886m34405r9129k07119k32816
5808A8795960n4217l6721j66025J05625J02470K40325J73243j69704K48049M05565
5798A9644570K86802k43387J88761l31830j29688r2276O2524L0019l14129o8102
5788A9033264l80526n08880n24366j02834J83095J41863l27880l08854O672j52095
5778A7059459M9126R119k1620M45790P08888n407L42277J45749P497J02631M95500
5767A9339009J72249k44387K18755K97216N23718K58939j49328j07861r6642l46372
5757A9865296l28291k33706l70320Q2979Q9718J38240O3577j56254L70756J75995
5747A9697990K124J07309L50415L85476L03123O05935K61821M52178L07625N99530
$$ y = [22741017, 22272477, 22000405, 21659549, 21147762, 20649315, 19769429, 19335024, 19235895, 19028776, 18795960, 18741743, 18705022, 18538997, 18644622, 18747092, 18987417, 19160660, 18990956, 19239005, 19644570, 19931372, 19687985, 19876746, 19544916, 19415228, 19322952, 19385476, 19415495, 19101366, 19033264, 18652738, 18143858, 17619492, 17516658, 17699753, 17841616, 17513736, 17204882, 17211554, 17059459, 17108585, 17117704, 17096084, 17541874, 18250762, 18245355, 18587632, 18733381, 18740878, 18843509, 19339009, 19511258, 19266871, 19485626, 19782842, 20306560, 20565499, 20416171, 20308310, 20211668, 19865296, 19537005, 19303299, 18932979, 19015958, 19105676, 19243916, 19307493, 19151239, 19521995, 19697990, 19700114, 19807423, 20157838, 20543314, 20846437, 21452372, 21714193, 22166371, 22473996, 23073526]
5737B3073526O13322R78461J096419L71303L44357j21323m73879n7776N26067
5728B6350477J79068M2692M22067O28772J60567P20394O5735J50670N47308l736
5718B9264014L19830M44642j74335j01848n7747n9022j42315k5960K05686K02875
5708B9875820L264J00351o4385l70597p72602p75301l57035K07548m48200l2336
5698B7366527K40903j3217m7128l47685M15997K81942K02491k08432k597r0251
5688B7798550k27058J2593j75690k42341m1452j2800j57437J08519J67791M87016
5678B7717691m0064k67011n74880l94855k03492l46811j07809m78447m59168l21098
5668B4524056m10627J3465n19619l22746m85780P7846l20336k44005J31823j24811
$$ y = [23073526, 23686848, 24665309, 25761728, 26133031, 26477388, 26356065, 25882186, 25824410, 26350477, 26529545, 26572237, 26994304, 27623076, 27783643, 28504037, 28569772, 28720442, 29267750, 29264014, 29583844, 30028486, 29854151, 29752303, 29694556, 29635534, 29493219, 29467259, 29672945, 29875820, 29879084, 29979435, 29915050, 29544453, 28771851, 27996550, 27639515, 27847063, 27398863, 27366527, 27607430, 27594213, 27547085, 27199400, 27615397, 27897339, 28099830, 27891398, 27888801, 27798550, 27571492, 27584085, 27408395, 27166054, 27124602, 27111802, 26954365, 27062884, 27230675, 27717691, 27677627, 27410616, 26835736, 26440881, 26237389, 25890578, 25782769, 25304322, 24845154, 24524056, 24113429, 24126894, 23607275, 23284529, 22798749, 22876595, 22556259, 22312254, 22444077, 22319266]
5658B2319266k23842l81086j05636J76107l13591k50492l26270k26629n7793l46452
5648B0263582n88243j66384k8661m79110k10441l89120J86221j03714l10839K88606
5638A8461897K76461J14529j3648o50356l0906L01736n6535K8859J18044n0250
5628A8499831N0778K7324K31812J0837K88034J98810J98753l32949J46542j0927
5618A9308845Q7483J59978N06506R5645r9673L41137L11169L87133L49027R0226
5608B1537476M83945J81868J31308L19722N56502K91488J76551L46389L23160
5599B4348409N52094N46130M62712M10592P73348O69135Q44715R26637P39124
5590C0272896Q32332J327241J406363J688222J862905J942889K232052K547401
$$ y = [22319266, 22095424, 21714338, 21608702, 21784809, 21471218, 21220726, 20894456, 20667827, 20610034, 20263582, 19675339, 19508955, 19480294, 19001184, 18790743, 18401623, 18587844, 18484130, 18173291, 18461897, 18738358, 18852887, 18839239, 18188883, 18157977, 18459713, 18403178, 18432037, 18550081, 18499831, 18550609, 18577933, 18809745, 18820582, 19108616, 19307426, 19506179, 19173230, 19319772, 19308845, 19396328, 19556306, 20062812, 20158457, 20058784, 20399921, 20711090, 21098223, 21447250, 21537476, 22021421, 22203289, 22334597, 22654319, 23210821, 23502309, 23678860, 24025249, 24348409, 24900503, 25446633, 25909345, 26319937, 27093285, 27762420, 28607135, 29533772, 30272896, 31105228, 32432469, 33838832, 35527054, 37389959, 39332848, 41564900, 44112301]
5582D4112301K665911K949757L167997L289431L368293K926017K308528J538036
5574F6326271K5572n47523j542006k208479k056622k419544k330958k034588j935116
5565E1277007j659839j264688p24039l65224o3969J68401M88814O99713P38995
5556D9295171J046660R94253K14082m91354j218784j687767j812146k369976k582199
5547D1387940k555857k081880j728171j615233j183518j118850q30471p31918
5539B9542042p77897n86765o08493o51406j29610k4755l10683k83127n1274M7804
5529B6165836J09668R4517k59506k28628m24008l64834n3607k02395M5980j96312
5519B4686711Q0865J23676K62320o1674J72639P23778O72047J53634M57547J060360
$$ y = [44112301, 46778212, 49727969, 52895966, 56185397, 59553690, 62479707, 64788235, 66326271, 66351843, 65804320, 64262314, 62053835, 59997213, 57577669, 55246711, 53212123, 51277007, 49617168, 48352480, 47628441, 47263217, 47199248, 47367649, 47856463, 48556176, 49295171, 50341831, 51336084, 51550166, 51058812, 49840028, 48152261, 46340115, 43970139, 41387940, 38832083, 36750203, 35022032, 33406799, 32223281, 31104431, 30273960, 29542042, 28764145, 28177380, 27568887, 26917481, 26787871, 26763116, 26452433, 26169306, 26118032, 26165836, 26275504, 26370021, 26110515, 25881887, 25457879, 25093045, 25039438, 24837043, 24883023, 24686711, 24767576, 24891252, 25153572, 25091898, 25264537, 25988315, 26660362, 26813996, 27271543, 28331903]
5509B8331903Q46643J037168J008003R48965P66376O30783N17964Q0173j82086
5500C3985892n07243j036958j097732j574696q56421r24993r88239o10926q84229
5491B5504455p06695m95733m1807k16546j98742j60161k87074j51911j21097k58588
5481B2866101j31420P1628m17356k86884M37045M8240J2736K67207N01769K73463
5471B3642529J3992J40982M93115Q54171O80944P61455N29665N55193Q80716O75016
5461B9227778j8337J15824l30171o54945q58041q90768p52329o80121o62887o41122
5451B3854881l69876p54175l89796n11591l1659k25265k86009Q0080j15708J08660
5441B1359542j19234j76354k10715k93692L18676J00211q1956L76461K45233K64869
$$ y = [28331903, 29178546, 30215714, 31223717, 32172682, 32939058, 33569841, 34087805, 34167978, 33985892, 33478649, 32441691, 31343959, 29769263, 28912842, 27987849, 26999610, 26388684, 25504455, 24797760, 24302027, 24260220, 24043674, 23844932, 23684771, 23397697, 23245786, 23124689, 22866101, 22734681, 22806309, 22388953, 22102069, 22539114, 22587354, 22600090, 22867297, 23369066, 23642529, 23656521, 23797503, 24290618, 25144789, 25825733, 26587188, 27116853, 27672046, 28552762, 29227778, 29209441, 29325265, 28995094, 28340149, 27482108, 26591340, 25839011, 25158890, 24496003, 23854881, 23485005, 22730830, 22341034, 21829443, 21797784, 21572519, 21286510, 21366590, 21250882, 21359542, 21240308, 21063954, 20853239, 20559547, 20878223, 20978434, 20896478, 21272939, 21518172, 21783041]
5431B1783041N61500J5947m921N1782K11574O28648K96136N82560N03541N41323
5421B5171131Q28351Q85622P33815P95780J021682Q81168J100069J026037Q14415
5412C3258070O80300M86958N16153q2881m74404n78744J59479m08106m68178M76477
5402C3565124m0924K62998K44570n26031k76434m27395o64216j274126j446115
5393B9417451j283369j384035j143547j134719j005877r48660o03265q01175n90474
5384B0522330m37473m18336l66469j99875l48383m00806k05884k59518N305j51866
5374A7739025r8532R8619j43506j48847P2209L33953J63258o5190L0773j019P0182
5363A8050925J84644Q6037l4802K27366j47954L8545K24417K33408l40554O9795
$$ y = [21783041, 22344541, 22360488, 22355567, 22407349, 22618923, 23247571, 23543707, 24126267, 24629808, 25171131, 25999482, 26885104, 27618919, 28414699, 29436381, 30317549, 31417618, 32443655, 33258070, 33938370, 34425328, 34941481, 34858600, 34384196, 33805452, 33964931, 33556825, 33088647, 33565124, 33524200, 33787198, 34031768, 33505737, 33229303, 32801908, 32137692, 30863566, 29417451, 28134082, 26750047, 25606500, 24471781, 23465904, 22517244, 21913979, 21112804, 20522330, 20084857, 19666521, 19300052, 19100177, 18751794, 18350988, 18145104, 17885586, 17890891, 17739025, 17640493, 17739112, 17595606, 17446759, 17518968, 17852921, 18016179, 17950989, 17981762, 17980743, 18050925, 18235569, 18321606, 18286804, 18514170, 18366216, 18404761, 18629178, 18862586, 18522032, 18591827]
5353A8591827K22092L89049M56782O4555L84951O00077J60774K71376L15368K69621
5343B1726472m7340j86995k52356q0946n04999m24916q2360l15197k6808l09003
5333A9495552j18777o0336J11425j67666k74844m17666o74660r19309m86256l67221
5323A6120242o10597o89594j15759l86987m03581k19261k83205r2817p1171l72319
5313A2874951m3506r8095J6128k21595j29878M1810l02568n2280j22323L60249
5303A2322893j47871j22753q2154M6972j83689j39808o7790l9833L9833n7088
5293A1568712l3319r4012J3469J42703J63428p9184L23533R3973j31240R0208
5283A2058271P6116J1094j81002j15097J74115j10465j82145K72696L28225O4220
$$ y = [18591827, 18813919, 19202968, 19659750, 19724305, 20109256, 20709333, 20870107, 21141483, 21456851, 21726472, 21679132, 21492137, 21239781, 21158835, 20653836, 20228920, 20146560, 19831363, 19804555, 19495552, 19376775, 19316439, 19427864, 19260198, 18985354, 18567688, 17893028, 16973719, 16487463, 16120242, 15509645, 14820051, 14704292, 14317305, 13913724, 13694463, 13411258, 13318441, 13247270, 12874951, 12831445, 12733350, 12749478, 12527883, 12398005, 12439815, 12137247, 12084967, 11962644, 12322893, 12175022, 12052269, 11970115, 12017087, 11833398, 11693590, 11625800, 11585967, 11625800, 11568712, 11535393, 11441381, 11454850, 11597553, 11760981, 11681797, 12005330, 12099303, 11968063, 12058271, 12134387, 12145481, 11964479, 11849382, 12023497, 11913032, 11730887, 12003583, 12331808, 12396028]
5273A2396028j16403M97054J23302p8870J81240k92640j41751q3934k13840k90471
5263A1979715l8496m42321J31217j18981j76564q4923p6981k359q7273j60535
5253A0922499j16695k8470j39416J5644J49200K26855J92671q6891n8074k96010
5243A0781313J16940K64357q9657R3819l69678k94547K8475j564J66901L36053
5233A1032412k43995L2942K92082r7245j34218j39653j35908k83122K3996P6899
5223A0424190j299R8105m95849N679L27530J8084j61761O0042J10703L7345J05399
5212A0528168O1401k57123J39866M73585N79148j24012K12504L56755J79472K19894
5202A2369658k23074Q8008n6905l92104j51722j77972l30950j11084l60086l90810
$$ y = [12396028, 12279625, 12776679, 12899981, 12821111, 13002351, 12709711, 12567960, 12484026, 12270186, 11979715, 11941219, 11498898, 11630115, 11511134, 11334570, 11249647, 11172666, 11170307, 11083034, 10922499, 10805804, 10777334, 10637918, 10653562, 10802762, 11029617, 11222288, 11135397, 11077323, 10781313, 10898253, 11162610, 11072953, 11166772, 10797094, 10502547, 10531022, 10529458, 10696359, 11032412, 10788417, 10821359, 11113441, 11016196, 10881978, 10742325, 10606417, 10323295, 10347291, 10424190, 10422891, 10520996, 10025147, 10030826, 10358356, 10376440, 10214679, 10274721, 10385424, 10422769, 10528168, 10589569, 10332446, 10472312, 10945897, 11525045, 11401033, 11613537, 11970292, 12149764, 12369658, 12146584, 12234592, 12177687, 11785583, 11633861, 11455889, 11124939, 11013855, 10653769, 10262959]
5192A0262959j43223k90536j61644J18813j18618J89006l04558P5183j37758m1678
5182I447946M5240l82549p6004J52273R5625P8784l02442r7568K32667K67060
5172I461032K10018k62009k84170Q4002l9258N2063m9994K8638N9372M07773K05357
5161I872824k38570k62541l26939j66863l95338m9193o11022l16517K2396k26350
5151G301887j94509p4869o1894k50160l82921J00508k41437J25611j01444l40643
5141E880129j90525K67766m1445J1929J99843m621k44543m749j71811k04067p7361
5130E420545O9565q033L1046l62551j8761r6257r8718n0995l59257M1669J27024
5119D695277j00563k7852R6726K86601K85729j24362k48007j47833K99190l08928
$$ y = [10262959, 10119736, 9829200, 9667556, 9786369, 9667751, 9856757, 9552199, 9627382, 9489624, 9447946, 9493186, 9110637, 9034633, 9186906, 9282531, 9361315, 9058873, 8961305, 9193972, 9461032, 9671050, 9409041, 9124871, 9208873, 9169615, 9221678, 9171684, 9200322, 9259694, 9667467, 9872824, 9634254, 9371713, 9044774, 8877911, 8482573, 8433380, 7822358, 7505841, 7528237, 7301887, 7107378, 7032509, 6970615, 6720455, 6337534, 6438042, 6196605, 6322216, 6220772, 5880129, 5689604, 5957370, 5915925, 5927854, 6127697, 6123076, 5878533, 5873784, 5701973, 5497906, 5420545, 5490110, 5482077, 5513123, 5150572, 5131811, 5035554, 4936836, 4885841, 4526584, 4568253, 4695277, 4594714, 4566862, 4663588, 4950189, 5235918, 5111556, 4863549, 4715716, 5014906, 4705978]
5109D705978k32414J48343J02167k07630J54956k02786l3754K29829M6443l26131
5099D385001r9730l50850J7730J17791k65538J43505J29576P9629R177j61523
5089D004768J19887J07049l12277j85310K56757k60582o0134K96044k46289J11862
5079C831775l427j98575J62556J46577j5263N3676Q5216k21652p5292J14510K23756
5068D103857Q0968l00921K5847q5903q0778K70492q0616k72689K3444J70869K27498
5057D082068J28192M13713N78874n8647k05559k0305J07912m36208n44188o9803
5047C976049p7373j23284l3333J3991J34194k00817J45423j07765k0505N5765
5037C762345l9206k03090K56556k1681j9607K23624j9571l35L1792P1362J66545
$$ y = [4705978, 4473564, 4621907, 4724074, 4516444, 4671400, 4468614, 4434860, 4664689, 4711132, 4385001, 4285271, 3934421, 3952151, 4069942, 3804404, 3947909, 4077485, 4157114, 4166291, 4004768, 4124655, 4231704, 3919427, 3734117, 3990874, 3730292, 3670158, 3966202, 3719913, 3831775, 3828348, 3629773, 3792329, 3938906, 3923643, 3977319, 4062535, 3840883, 3765591, 3880101, 4103857, 4184825, 3883904, 3909751, 3823848, 3743070, 4013562, 3932946, 3660257, 3683701, 3854570, 4082068, 4210260, 4623973, 5202847, 5144200, 4938641, 4918336, 5026248, 4590040, 4045852, 3976049, 3898676, 3775392, 3742059, 3756050, 3890244, 3689427, 3834850, 3727085, 3706580, 3762345, 3723139, 3520049, 3776605, 3754924, 3735317, 3958941, 3939370, 3939035, 3970827, 4042189, 4208734]
5026D208734P8568l8056M37613m7387k30063J90944l7402j66920R9627M99156
5016D994814M76421J46463K63560j41858K38820O89799J73371L58027M40798L03827
5006G944042p3632Q3297J05887K27541j72559j67738J62165j87500L89913N21754
4996H833170k38379o05392k7764O3951L78040J96438m3336k38909j01031l71094
4986G845694j07681j68878j83970p00307l83426p3336k33774j45024R5641l40263
4976E604676J53050J08774j99913k6415k71171j86993k65559J58191j58762r6097
4966D819781J21617J08340k93752j32616M3439J18212J43677m84960K78365J64668
4956D886771m17312J06372K5819K16152J35505J30320L12912k32508M393M80895
$$ y = [4208734, 4287302, 4249246, 4686859, 4639472, 4409409, 4600353, 4562951, 4396031, 4495658, 4994814, 5471235, 5617698, 5881258, 5739400, 5978220, 6668019, 6841390, 7199417, 7640215, 7944042, 7870410, 7953707, 8059594, 8287135, 8114576, 7946838, 8109003, 7921503, 8311416, 8833170, 8594791, 7989399, 7961635, 8025586, 8403626, 8600064, 8556728, 8317819, 8216788, 7845694, 7738013, 7569135, 7385165, 6684858, 6301432, 6228096, 5994322, 5849298, 5944939, 5604676, 5757726, 5866500, 5666587, 5640172, 5369001, 5182008, 4916449, 5074640, 4915878, 4819781, 4941398, 5049738, 4755986, 4623370, 4666809, 4785021, 4928698, 4443738, 4722103, 4886771, 4469459, 4575831, 4601650, 4817802, 4953307, 5083627, 5396539, 5164031, 5168424, 5649319]
4946E649319j25399J39658M81967K22490o1815K13385K38269J1454L70354J36159
4936G275841J92585m23636m6214N68360l00640k63179J22255R5532q0178k36563
4926F904163R0083J20024P5506j94535Q6708m9124k88034J3392k18027p3442l58703
4915F108011k62819Q0735j07556m84567j43886p7011l0388j12661Q6517m882l47114
4904D704379j97907o2183k4488K9696J56925l43745j4732k34143J82418l036P1917
4893D265101J07626J63142l19902j63977K24484J6749j49423j48389j931j9260
4883C974220J24721J93115P0879m06191k21901j29410J43945J75712R4072j42396
4873C876766K96954j60786J32990L19686J27930j98895J01841p7878J4806q4493
$$ y = [5649319, 5523920, 5663578, 6145545, 6368035, 6306220, 6519605, 6757874, 6769328, 7139682, 7275841, 7468426, 7044790, 6998576, 7566936, 7266296, 7003117, 7125372, 7220904, 7140726, 6904163, 6994246, 7114270, 7189776, 6995241, 7081949, 7032825, 6744791, 6758183, 6540156, 6466714, 6108011, 5845192, 5925927, 5818371, 5333804, 5189918, 5112907, 5082519, 4969858, 5056375, 5051493, 4704379, 4506472, 4444289, 4419801, 4449497, 4606422, 4262677, 4247945, 4013802, 4196220, 4193184, 4265101, 4372727, 4535869, 4215967, 4051990, 4276474, 4293223, 4143800, 3995411, 3993480, 3974220, 4098941, 4292056, 4362935, 3956744, 3734843, 3605433, 3749378, 3925090, 4019162, 3876766, 4173720, 4012934, 4145924, 4465610, 4593540, 4394645, 4496486, 4418608, 4433414, 4348921]
4863D348921j90966J01420o0371K70290J5144j97073J09933J10730r0275P5710
4853D493463j70090N9006R0494l26572k12674O1760L05462R0311k38363J05278
4843D258075J2319m95072Q5582R1684p9739K89667j40911k75003K22855j81028
4833C788429L58111J57940l0209r9379k38393r4100K67887J35952K73234K28029
4823D747501r407l04120l59875j75717l6759K10566m49318n8758j18126j74698
4813C271289J31137J13687L4919L7907Q1588n8403K0212r4475J34492j88986K88519
4802C771886J73955k0940k366l47589J68916K06235r4515J69974N3610j14640
4792C964526n5830J13894K04992j31966J31247j3560m3582j46332K46325J52643
$$ y = [4348921, 4157955, 4259375, 4199004, 4469294, 4484438, 4287365, 4397298, 4508028, 4417753, 4493463, 4323373, 4382379, 4472873, 4146301, 3933627, 3995387, 4300849, 4391160, 4152797, 4258075, 4270394, 3775322, 3860904, 3952588, 3872849, 4162516, 4021605, 3746602, 3969457, 3788429, 4146540, 4304480, 4274271, 4174892, 3936499, 3842399, 4110286, 4246238, 4519472, 4747501, 4738094, 4433974, 4074099, 3898382, 3861623, 4072189, 3622871, 3564113, 3445987, 3271289, 3402426, 3516113, 3551032, 3588939, 3670527, 3612124, 3632336, 3537861, 3672353, 3483367, 3771886, 3945841, 3924901, 3922535, 3574946, 3743862, 3950097, 3855582, 4025556, 4079166, 3964526, 3908696, 4022590, 4227582, 4095616, 4226863, 4213303, 4169721, 4023389, 4269714, 4422357]
4782D422357P6429J94388m9351P2112m951q7207q852j50056K82628L27258l3566
4771E041189k22498L2649j98238n09200n6162q030k92484k35435l50440J22191
4761C323542Q851R8717k19272j83522r8165J47938p1735K0481j60755L55917K49446
4750C471443m7930l93022j63173J29813o0668R3872K73279k59263J01122K58928
4740C404401M834j17684m9410L83235l11756J83294L52352M6856k45973Q8337
4730C738486K93420J68018J28980j13628k87619N252j2697O5701j79482j79645
4720C626786J62858l86504j97485N02421m6283R874O385k96722j02394k09665
4710C069271j85085K02710k04641J29927j86290J74243J3951J60160K26581j36789
$$ y = [4422357, 4498786, 4693174, 4643823, 4715935, 4710984, 4623777, 4614925, 4464869, 4747497, 5074755, 5041189, 4818691, 4851340, 4653102, 4143902, 4087740, 4079710, 3787226, 3551791, 3201351, 3323542, 3332393, 3431110, 3211838, 3028316, 2930151, 3078089, 3006354, 3026835, 2866080, 3221997, 3471443, 3423513, 3030491, 2867318, 2997131, 2936463, 3030335, 3303614, 3044351, 3145473, 3404401, 3409235, 3291551, 3242141, 3625376, 3313620, 3496914, 3849266, 3896122, 3650149, 3738486, 4031906, 4199924, 4328904, 4215276, 3927657, 3932909, 3920212, 3985913, 3806431, 3626786, 3789644, 3403140, 3205655, 3708076, 3661793, 3671667, 3678052, 3381330, 3278936, 3069271, 2884186, 3086896, 2882255, 3012182, 2825892, 3000135, 3014086, 3174246, 3400827, 3264038]
4700C264038J93927J63484l56497j36647J89682o9155J94462M00293r5009j42421
4690C606157J03537K15998m6187J55044P3526j69437J07471R7730k7171n7768
4680D058900J29346K09957l28506l20081K10076O04356J5945M7584K180N3290
4670D683047J83418Q952J53030K15962N09901n8891K68079L8474J16942J17883
4660F236797K03332P6393L47801j10509K30900N7305j50539N7815k09791m35568
4650F303936R9427K61383k20086J02226J13743N570j66332k00659J84983L41492
4640F825683q2661J24503J19757k75989j52294j85117l228K39358k05847J4306
4630F418471k46799l20598L66634j06485o8213j84137L87627j03998l43549J11147
$$ y = [3264038, 3457965, 3621449, 3264952, 3128305, 3317987, 3248832, 3443294, 3843587, 3748578, 3606157, 3709694, 3925692, 3879505, 4034549, 4108075, 3938638, 4046109, 4143839, 4116668, 4058900, 4188246, 4398203, 4069697, 3749616, 3959692, 4564048, 4579993, 4627577, 4629757, 4683047, 4866465, 4875417, 5028447, 5244409, 5754310, 5695419, 5963498, 6001972, 6118914, 6236797, 6440129, 6516522, 6864323, 6753814, 6984714, 7042019, 6891480, 6949295, 6739504, 6303936, 6403363, 6664746, 6444660, 6546886, 6660629, 6666199, 6499867, 6299208, 6484191, 6825683, 6743022, 6867525, 6987282, 6711293, 6558999, 6373882, 6370654, 6610012, 6404165, 6418471, 6171672, 5851074, 6217708, 6111223, 6043010, 5858873, 6246500, 6142502, 5798953, 5910100]
4620E910100K65756M17208j93922k155o209K10226N1512Q0978j24386L4527J55726
4609F799361K7554L5788j88567j60089Q0250J82794o5194Q5050K81972l0552M8918
4598G097285L30040P0024J50847P10723L01645J74938N14667O35785K62937j7152
4588A0231739K80448N51002J01077O2668k3570j05055n81557r2340k43360m3364
4578A0137688j15762J78486o5464J21749l8788J71587R6707J10379L91990J51963
4568A1140535J50514r5038j93113j89257j5510n82601k91995k82698m66354n87358
4558H587125m77590l47130J07803k69806J27660l38979r4822q3237k1656M3136
4548G232504P6614P1928j89117l85323j02511L25196L00341R969J47538K09678
$$ y = [5910100, 6175856, 6593064, 6399142, 6396987, 6390778, 6601004, 6652516, 6733494, 6609108, 6643635, 6799361, 6826915, 6862703, 6674136, 6514047, 6594297, 6777091, 6711897, 6796947, 7078919, 7048367, 7097285, 7427325, 7497349, 7648196, 8358919, 8660564, 8835502, 9350169, 9985954, 10248891, 10231739, 10512187, 11063189, 11164266, 11226934, 11203364, 11098309, 10516752, 10424412, 10181052, 10137688, 10021926, 10200412, 10134948, 10256697, 10217909, 10389496, 10486203, 10596582, 10988572, 11140535, 11291049, 11196011, 11002898, 10813641, 10798131, 10215530, 9923535, 9640837, 9174483, 8587125, 8109535, 7762405, 7870208, 7600402, 7728062, 7389083, 7294261, 7211024, 7189368, 7232504, 7309118, 7381046, 7191929, 6806606, 6704095, 7029291, 7329632, 7339601, 7487139, 7696817]
4538G696817r327j23759J12295J55331j7400k25121M07790K57910J50476j64548
4528H240464n9986K75055J10095L15722l75654q3767m03174j7032K34681p3339
4518H163065j31856M3661l5528Q9961N362j75375J06585K03356J65723Q630j7279
4507H426305M16181K4040J84145o9439K39508L05795O706J78737Q4779K49625
4497A0046382j89853l66166Q3311l8803P0907m861m9780P5762m45622n0727K21110
4486I351660r7862j1815K90683l5476q0195o9591M41162M83117J13480P9230L62517
4475A0826910P7868L7091k65615l61132k15095r1721l95770K80657j38579K12209
4465I966823K03098k00921J69729J93492O2175K95666J43856L00568J2233j90230
$$ y = [7696817, 7687490, 7563731, 7676026, 7831357, 7813957, 7588836, 7996626, 8254536, 8405012, 8240464, 8180478, 8455533, 8565628, 8881350, 8505696, 8421929, 8018755, 8001723, 8236404, 8163065, 8031209, 8074870, 8039342, 8129303, 8134665, 7959290, 8065875, 8269231, 8434954, 8443584, 8426305, 8842486, 8866526, 9050671, 8981232, 9220740, 9526535, 9533241, 9711978, 9796757, 10046382, 9856529, 9490363, 9573674, 9534871, 9605778, 9600917, 9551137, 9626899, 9181277, 9130550, 9351660, 9253798, 9241983, 9532666, 9497190, 9416995, 9347404, 9788566, 10271683, 10385163, 10464393, 10826910, 10904778, 10941869, 10676254, 10315122, 10100027, 10008306, 9612536, 9893193, 9754614, 9966823, 10169921, 9969000, 10138729, 10332221, 10394396, 10690062, 10833918, 11134486, 11146719, 10956489]
4455A0956489m5890M66696K25048J79413L93923M19911M76355O52063J43599K15843
4445A4083450M43054Q3164K91950j64069k1906j67579L04491K11416J96039j79870
4435A5080140J81952K54477N4093j16192K61794l44893j06906J65919o3052J95395
4425A5562727k50753P5766M37992k25075O0538k14794p9518k83375n3799l81749
4415A4647960k7331j30112l49451j99397j52743l58117o1494j6170Q0637J03461
4405A3537243j8766M43721J79393L3718o6842j57978j71615j40332j89692k04266
4395A3244584j70807m26642J1173m5817k09158K39290J42122m9358J22652K50473
4385A3108512K96822J11407K44549K76229k09634P3913L75168K29865O09038K38638
$$ y = [10956489, 10910599, 11377295, 11602343, 11781756, 12175679, 12595590, 13071945, 13724008, 13867607, 14083450, 14526504, 14609668, 14901618, 14737549, 14715643, 14548064, 14852555, 15063971, 15260010, 15080140, 15262092, 15516569, 15570662, 15454470, 15716264, 15371371, 15264465, 15430384, 15367332, 15562727, 15311974, 15387740, 15825732, 15600657, 15661195, 15446401, 15366883, 15083508, 15029709, 14647960, 14620629, 14490517, 14141066, 13941669, 13788926, 13430809, 13369315, 13353145, 13433782, 13537243, 13518477, 13962198, 14141591, 14175309, 14108467, 13950489, 13778874, 13638542, 13448850, 13244584, 13073777, 12647135, 12658308, 12612491, 12403333, 12642623, 12784745, 12735387, 12858039, 13108512, 13405334, 13516741, 13761290, 14037519, 13827885, 13901798, 14276966, 14506831, 15115869, 15354507]
4375A5354507K47050R87330J00961M12171J00450j36866Q7869l11544K34400J65188
4365A7241516k09835m80609l94681j77747m95459J27711k54066l28457j12690
4356A4915683K0811j33844M48601j25544j94689p1861r9735k79321j42799k55865
4346A4081437l51820j86526j6517r474j89793l1932j85922R2045K38608j30070
4336A3310036j36558j15711j19309k77864k62181j16197l87999k21316j48502
4327A1524399N4368m7666K63581J63805j746k2521n791k71115k49151l17446j89484
4316A0901233K54992L95604N6683l26327k01705J95746k3359k82527j46366K40058
4306A1064032J52536m2419J07106L76869q386q9743L11636l81628N1376k13153
$$ y = [15354507, 15601557, 16588887, 16689848, 17102019, 17202469, 17065603, 17153472, 16841928, 17076328, 17241516, 17031681, 16551072, 16156391, 15978644, 15483185, 15610896, 15356830, 15028373, 14915683, 14936494, 14802650, 15251251, 15125707, 14931018, 14859157, 14759422, 14480101, 14337302, 14081437, 13729617, 13543091, 13526574, 13517100, 13327307, 13295375, 13109453, 13201498, 13440106, 13310036, 13173478, 13057767, 12938458, 12660594, 12398413, 12282216, 11894217, 11672901, 11524399, 11578767, 11531101, 11794682, 11958487, 11956741, 11934220, 11928429, 11657314, 11408163, 11090717, 10901233, 11156225, 11551829, 11608512, 11282185, 11080480, 11276226, 11252867, 10970340, 10823974, 11064032, 11216568, 11174149, 11281255, 11658124, 11649738, 11559995, 11871631, 11490003, 11541379, 11328226]
4296A1328226M5146P6045j44748K33294M0633q845J9517M0005L5215o1272K53002
4285A1856218J82056J79399p6993j62444Q1066N25140L0012K45497L00040J68155
4275A3328146R7950R0856N5786R6309L68892J80410M9238J30465K64120M99385
4265A5161557O30706j18772r1712L29258K25036Q5822M81747j0380L34834L15572
4255A7343668P6922K67803K40456L53924L14419J42033O70000K52131K16933J65958
4245B0044247K85647M08014O46811N03724p452N88694O95193N15026O64894Q77968
4235B5222766N98042O56487O06417N20435O90542O51054M14350N19685J018831
4226C0898609M65468L13229P34817K81931P20798J130197J048851J031609R83126
$$ y = [11328226, 11373372, 11449417, 11304669, 11537963, 11578596, 11569751, 11589268, 11629273, 11664488, 11603216, 11856218, 12038274, 12217673, 12140680, 11978236, 12059302, 12584442, 12614454, 12859951, 13159991, 13328146, 13426096, 13516952, 13572738, 13669047, 14037939, 14218349, 14267587, 14398052, 14662172, 15161557, 15792263, 15673491, 15581779, 15911037, 16136073, 16221895, 16703642, 16693262, 17028096, 17343668, 17420590, 17688393, 17928849, 18282773, 18597192, 18739225, 19409225, 19661356, 19878289, 20044247, 20329894, 20737908, 21384719, 21888443, 21880991, 22469685, 23164878, 23679904, 24344798, 25222766, 25820808, 26477295, 27083712, 27604147, 28294689, 28945743, 29360093, 29879778, 30898609, 31364077, 31677306, 32412123, 32694054, 33414852, 34545049, 35593900, 36625509, 37608635]
4217C7608635J232083J178841J413806J186021J110313J056227J266379N55205
4209D6607510R11189J053324J120774J404934R25858J650081J472878J311237
4201E6457785J783782J788118K297105K251239K601707K747693K845068L189842
4193G5962339L740571M077438N246943O016345O214772Q007615R445688J0678807
4185A29390518J2598849J3284616J2015064Q923228L130727j015717m767829q596598
4177A64962858j1765736j2708594j1085820q436927o325793m441602l011082j617694
4169A05569610m5732R58830J839871L115023M550247O198651P279071P642202
4161A37107773N714279K534654L3467j269750k299644k701104j674574P49466
$$ y = [37608635, 38840718, 40019559, 41433365, 42619386, 43729699, 44785926, 46052305, 46607510, 47518699, 48572023, 49692797, 51097731, 52023589, 53673670, 55146548, 56457785, 58241567, 60029685, 62326790, 64578029, 67179736, 69927429, 72772497, 75962339, 79702910, 83780348, 89027291, 95043636, 101258408, 109266023, 118711711, 129390518, 141989367, 155273983, 167289047, 176212275, 179343002, 178327285, 173559456, 164962858, 153197122, 140488528, 129402708, 120965781, 114639988, 110198386, 107187304, 105569610, 105523878, 106482708, 108322579, 111437602, 115987849, 122186500, 129465571, 137107773, 142822052, 145356706, 145390173, 144120423, 141820779, 139119675, 137445101, 138194567]
4153A38194567L489689N467007P492071J0100322J2562135J5131172J7544753
4146B09981716K0367354K1226167J7202996N472092j0291956k2368237k5273166
4139B16316966k1771806j6898859j2617543j0183826p401041n845416l830944
4132A37767531k801290k355309j687527m33636P8543J045594K114631L194392
4124A36922929M316487N760459P652486R826287J2445744J5626563J7640197J6993647
4116B27184799J0004025k112024j4501826k1624952k1402308j8147117j4328575
4109A45072022j0314117q035053n708879m044020l351611k890158l120100k697394
4101A04910690k724902k121618j758152j188453k35647N48383P40277J973626
$$ y = [138194567, 141684256, 147151263, 154643334, 164743656, 177305791, 192436963, 209981716, 230349070, 251575237, 268778233, 274250325, 263958369, 241590132, 216316966, 194545160, 177646301, 165028758, 154844932, 147443891, 141598475, 137767531, 134966241, 132610932, 130923405, 130489769, 130568312, 131613906, 133728537, 136922929, 141239416, 146999875, 154652361, 164478648, 176924392, 192550955, 210191152, 227184799, 237188824, 235076800, 220574974, 198950022, 177547714, 159400597, 145072022, 134757905, 126722852, 121013973, 116969953, 113618342, 110728184, 107608084, 104910690, 102185788, 100064170, 98306018, 97117565, 96881918, 97430301, 98170578, 100144204]
4093A00144204K746923K470626K516319J358733o81936j585987k755413m174681
4085A00038788n264989n347293m130637k543457j456654k78717J089382K293208
4077H4399631M368911O690102P577083N347562j694928q615365j1635394j0502590
4069G5935012q264138o504801n160832l894205l154359k583482k107425k043893
4061D2221877j613784j303894j091359q07883p06581j028406o80943o76073p10518
4052C3602436k89860j49652n88138m86506k67408m99556n36025q32878q76094
4043B9076319n91686m69986n15368n89266o34024m75954m20880l34052m76281
4034B4568822j69756M278k94833J91790j19390l66561J02322Q0964J63040M3922
$$ y = [100144204, 102891127, 105361753, 107878072, 109236805, 108554869, 106968882, 104213469, 100038788, 94773799, 89426506, 85295869, 82752412, 81295758, 81017041, 82106423, 84399631, 88768542, 95458644, 103035727, 108383289, 106688361, 98072996, 86437602, 75935012, 67670874, 61166073, 56005241, 52111036, 48956677, 46373195, 44265770, 42221877, 40608093, 39304199, 38212840, 37404957, 36698376, 35669970, 34989027, 34312954, 33602436, 33312576, 33162924, 32574786, 32088280, 31820872, 31321316, 30785291, 29952413, 29076319, 28484633, 28014647, 27499279, 26910013, 26275989, 25800035, 25379155, 25045103, 24568822, 24399066, 24403344, 24108511, 24300301, 24180911, 23814350, 23916672, 23997636, 24160676, 24204598]
4024B4204598O0031p0834K77570K84908J41791O69665Q8166l61167m02773l50050
4014B4541905o15925r53258o83567j157438j032044l72537k00536l93347m03780
4005A8729473m35389q00187k79988k71213m07409m00873j97627l78375o1147p2968
3995A5424297k34213k72109j604J34092M5768j01810n15307J41835L33497L48950
3985A5303396n7401J30704k98606l98980p5434k6042m0711J14128K82048J09267
3975A5042369j42002m04432K92710K70034j998K9566L21365J86771j16130l98049
3965A5080204J48222m5822m35625J19197o8695J06307N6604O7826J15969m96962
3955A4647225n46798p96815l76435j75713n04963n16787L8999l74619K59726n73002
$$ y = [24204598, 24264629, 24193795, 24471365, 24756273, 24898064, 25567729, 25655895, 25294728, 24891955, 24541905, 23925980, 22972722, 22289155, 21131717, 20099673, 19727136, 19526600, 19133253, 18729473, 18294084, 17493897, 17213909, 16942696, 16535287, 16134414, 15936787, 15558412, 15497265, 15424297, 15190084, 14917975, 14916371, 15050463, 15096231, 14994421, 14479114, 14620949, 14954446, 15303396, 15245995, 15376699, 15078093, 14679113, 14603679, 14577637, 14536926, 14651054, 14933102, 15042369, 14900367, 14495935, 14788645, 15058679, 15056681, 15086247, 15407612, 15594383, 15478253, 15080204, 15228426, 15182604, 14746979, 14866176, 14797481, 14903788, 14960392, 15028218, 15144187, 14647225, 14100427, 13303612, 12927177, 12751464, 12246501, 11729714, 11768713, 11394094, 11653820, 11080818]
3945A1080818k96533j3831k91610j05901j86788M9689j3739n0212Q5919R4147
3935A0351959l95708k31206k4499k54814K1967L37770Q755j47395M41505k43047
3925I865287J7009j5584L8998O0597k56243J43046R7778N58436J69992K14703
3915A0894019n9984L34580N8008L30296K95281J75217n00991P7970l96573l57951
3905A0849872n66350m68521j66990o9016j83273N9269R2770j04560q3227M74907
3895I834881j36853l98099j4309R3672J78081l13116p0198Q8397N7086J98858
3885I518400p7562J9452m15435P1730K80608k12967K02263m0456K56600K45177
3875I847810J12570n26778J31708J11499L0006k75997j81684n07743k55853J10984
$$ y = [11080818, 10784285, 10770454, 10478844, 10372943, 10186155, 10235844, 10222105, 10171893, 10257812, 10351959, 9956251, 9725045, 9700546, 9445732, 9467699, 9805469, 9814224, 9666829, 10108334, 9865287, 9882296, 9866712, 9905710, 9966307, 9710064, 9853110, 9950888, 10509324, 10679316, 10894019, 10834035, 11168615, 11226623, 11556919, 11852200, 12027417, 11526426, 11604396, 11207823, 10849872, 10283522, 9815001, 9648011, 9578995, 9395722, 9454991, 9547761, 9443201, 9359974, 9834881, 9698028, 9299929, 9285620, 9379292, 9557373, 9244257, 9174059, 9262456, 9319542, 9518400, 9440838, 9460290, 9044855, 9116585, 9397193, 9184226, 9386489, 9346033, 9602633, 9847810, 9960380, 9433602, 9565310, 9676809, 9706815, 9430818, 9249134, 8741391, 8485538, 8596522]
3865H596522k44677l87173j11583J6858k35972n1436p9241J37034J48700k35126
3855G553906r1114K49215k1425j44958k947p73325q2099J49507n2727o021j83636
3844F594376j72202q6676J18118J11338j73777K7209J50120l3334Q7070O3092
3834F685334L00245K94822j14052K34190l9207O0531L52201j21994J74241J90010
3824H016321k60846K3286L30779o1853k170l60860m45494m32181J91310Q1217
3814G079509n25215k31038L723R826j69894j63990j64395l15653M5406J0521k10085
3803E368715J1465J04062J57144J23585k21691N7420K68136j94094o5798n6757
3793E552187j39479J89595p6106j38030J44701K0440O2528O0415J1690L7883J04843
$$ y = [8596522, 8351845, 7964672, 7853089, 7869947, 7633975, 7582539, 7503298, 7640332, 7789032, 7553906, 7462792, 7712007, 7690582, 7545624, 7542677, 6769352, 6687253, 6836760, 6784033, 6778012, 6594376, 6422174, 6335498, 6453616, 6564954, 6391177, 6418386, 6568506, 6535172, 6622242, 6685334, 6985579, 7280401, 7166349, 7400539, 7361332, 7421863, 7774064, 7652070, 7826311, 8016321, 7755475, 7778761, 8109540, 8047687, 8045517, 7684657, 7239163, 6806982, 6998292, 7079509, 6554294, 6323256, 6326979, 6336805, 6166911, 6002921, 5838526, 5522873, 5568279, 5578800, 5368715, 5380180, 5484242, 5641386, 5764971, 5543280, 5600700, 5868836, 5674742, 5608944, 5552187, 5412708, 5602303, 5526197, 5388167, 5532868, 5553308, 5615836, 5676251, 5687941, 5725824, 5830667]
3782E830667o2152j01327p4132l91549j45162R3823j2139l41376K72L24639J10249
3771E231813Q934J0489J51234K08703K0212k75384j34953j0201m7855M9237j93176
3760E019053j46899L34369r5833l93838r2834J50913l07962j48844K84933J02067
3750D705125j14028m1278j3265P6505M39109k95150J6832n4813m2194J86992o3719
3739D800116J55899r8339L0170N3172L4925K4734Q862j71882R8205M8714k96880
3728D687696j59644M8904M9774K34649l25310j10047k42879k67017J71948J8627
3718D106701j91154K08097j61454K22971J39807k26297L1463m05375M79628J40490
3708D344877k90378j18103Q9809j99029o0806M90187J86323l27820n7582k83219
$$ y = [5830667, 5768515, 5667188, 5593056, 5201507, 5056345, 5150168, 5138029, 4796653, 4796925, 5121564, 5231813, 5240747, 5251236, 5402470, 5611173, 5631385, 5356001, 5221048, 5210847, 5162992, 5212229, 5019053, 4872154, 5206523, 5110690, 4716852, 4624018, 4774931, 4466969, 4318125, 4603058, 4705125, 4591097, 4549819, 4536554, 4613059, 5052168, 4757018, 4773850, 4719037, 4676843, 4863835, 4800116, 4956015, 4857676, 4887846, 4941018, 4975943, 5000677, 5009539, 4837657, 4935862, 4984576, 4687696, 4528052, 4576956, 4626730, 4861379, 4536069, 4426022, 4183143, 3916126, 4088074, 4106701, 3915547, 4123644, 3962190, 4185161, 4324968, 4098671, 4130134, 3724759, 4204387, 4344877, 4054499, 3936396, 4026205, 3827176, 3766370, 4256557, 4442880, 4115060, 4057478, 3774259]
3698C774259k06920K4667J55358Q7260J33001m51090k7490P8040k23634j54881
3688C188570j66546J47684j97108L53310k52289p0143o8455l26853K53310K33571
3678C095051j39236K16102o6732J08541M06310j32036n2308k41344J76266M005
3668C374619J22030N7318m63297l4065K33216r3741J30402K6121j04023k02495
3658C046085N2427K3281j08008N78K76J75346j41651j95244k7477M8264J9366
3647B893243M0704L5178J31333k26644O5522L4431R2780K27474k76223k48142
3637B769656q4860K86769P8689L4048J04724k25581o6105R3298n3509J48257j5812
3626C069574j62568r6659j54005L7474O6388k66719p7631J81068K36578L20128
$$ y = [3774259, 3567339, 3592006, 3747364, 3834624, 3967625, 3516535, 3489045, 3567085, 3343451, 3188570, 3022024, 3169708, 2972600, 3325910, 3073621, 3003478, 2935023, 2608170, 2861480, 3095051, 2955815, 3171917, 3105185, 3213726, 3620036, 3488000, 3435692, 3194348, 3370614, 3374619, 3496649, 3553967, 3090670, 3056605, 3289821, 3196080, 3326482, 3352603, 3248580, 3046085, 3098512, 3121793, 3013785, 3014363, 3014639, 3189985, 3048334, 2853090, 2825613, 2873877, 2893243, 2933947, 2969125, 3100458, 2873814, 2939336, 2973767, 3066547, 3294021, 3017798, 2769656, 2684796, 2971565, 3050254, 3084302, 3189026, 2963445, 2897340, 2990638, 2937129, 3085386, 3069574, 2907006, 2810347, 2656342, 2693816, 2760204, 2493485, 2415854, 2596922, 2833500, 3153628]
3616C153628k19249l82917k0944J4748m8208j57624k5670K45919J54123K16692
3606B930498k88420K71060K65380m61365j55319k34777P5493J54466j31927n3133
3596B371956k3369K75836M8092k55226j19729J44516K43543N8464K3447L30753
3586C098283J52732q0982L9622J09709L01290k98028j83232N4740m2993l80435
3576B770706q8124q1156j76123J16309K14008k17363k33753Q765K60452n7516
3566B516205r2265r3895r2262L27135J51228m755j5146J0110n9434k8456P560
3555B626025L06030o3873J38022R2607J1532l27363k82889J18022K0865k08186
3545B430792l9520J60512L5181k67927K47139J67166j37499O5229J26359l12481
$$ y = [3153628, 2934379, 2551462, 2530518, 2545266, 2497058, 2339434, 2313764, 2559683, 2713806, 2930498, 2642078, 2913138, 3178518, 2717153, 2561834, 2327057, 2402550, 2557016, 2425089, 2371956, 2348587, 2624423, 2672515, 2417289, 2297560, 2442076, 2685619, 2744083, 2767530, 3098283, 3251015, 3170033, 3209655, 3319364, 3620654, 3322626, 3139394, 3194134, 3151141, 2770706, 2682582, 2601426, 2425303, 2541612, 2755620, 2538257, 2304504, 2313269, 2573721, 2516205, 2423940, 2330045, 2237783, 2564918, 2716146, 2711391, 2696245, 2706355, 2646921, 2618465, 2626025, 2932055, 2868182, 3006204, 3098811, 3110343, 2782980, 2500091, 2618113, 2638978, 2430792, 2391272, 2551784, 2586965, 2319038, 2566177, 2733343, 2595844, 2661073, 2787432, 2474951]
3535B474951m6483k4432p8787J76131O1896k84179P465m9406j31388m1460J12826
3524B177134L49675J73577J21063j33294j04834j55934J07725P3730L4490j56361
3514B486971n9392K9222k22573R2804K34283j05168n2209r6710N1156k42530j98709
3503A917145l5609R3069J06769j27809K0083j20559q5314m0230l25483Q6772J58263
3492A647097l375j90189N7436j98436O6062P9310P5026L19415Q4334J03290m1153
3481A998817j43442J55048l1396K24870m6411o0511J43811m09879j97818J45117
3471A778206J20887q331j10351n5307J57779N1124K3353K02308q960k36799K455
3460A916364l79608K53875J50339n23647L41417K29119j02434n922J57848J88061
$$ y = [2474951, 2428468, 2404036, 2325249, 2501380, 2563276, 2279097, 2286562, 2237156, 2105768, 2064308, 2177134, 2526809, 2700386, 2821449, 2688155, 2583321, 2427387, 2535112, 2608842, 2643332, 2486971, 2427579, 2456801, 2234228, 2327032, 2561315, 2456147, 2403938, 2307228, 2358384, 2115854, 1917145, 1881536, 1974605, 2081374, 1953565, 1973648, 1853089, 1767775, 1727545, 1402062, 1488834, 1647097, 1643722, 1453533, 1510969, 1312533, 1378595, 1457905, 1532931, 1852346, 1936680, 2039970, 1998817, 1855375, 2010423, 1979027, 2203897, 2157486, 2096975, 2240786, 1830907, 1633089, 1778206, 1899093, 1890762, 1780411, 1725104, 1882883, 1934007, 1957360, 2159668, 2150708, 1913909, 1916364, 1536756, 1790631, 1940970, 1417323, 1758740, 1987859, 1885425, 1879503, 2037351, 2225412]
3450B225412J37416j49611j45167J15681O8056N9800l2108K74671k37717m8569
3440B267864J64161k13690K778k55774J68626N6234k29705K1538j1387J7574l28540
3429A659679M68430K04391l26819l35233M10408Q5789o2751n6782l51912L23645
3419B018845m5984J23498K06828o6928j15864J9116J66358j54033M51721L46294
3409B949851L24600L13187l34980l64236l28155J94818m32911k75113K34726k66344
3399B015443J45952j13771m23J49116n3641l00151J68364N0230k41643k4915k00646
3388A593915j09754J63386J18182J28488j45330q3959r854m08845Q3483J06325
3378A436037M34991K51670j40861J55653k07758r9037n0571K4092p3220j00278
$$ y = [2225412, 2362828, 2213217, 2068050, 2183731, 2251787, 2311587, 2279479, 2554150, 2316433, 2267864, 2432025, 2218335, 2221113, 1965339, 2133965, 2190199, 1960494, 1982032, 1970645, 1988219, 1659679, 2128109, 2332500, 2005681, 1670448, 2080856, 2166645, 2103894, 2047112, 1695200, 2018845, 1972861, 2096359, 2303187, 2236259, 2120395, 2139511, 2305869, 2151836, 2603557, 2949851, 3274451, 3587638, 3252658, 2888422, 2560267, 2755085, 2322174, 2047061, 2281787, 2015443, 2161395, 2047624, 2047201, 2196317, 2142676, 1842525, 2010889, 2061119, 1819476, 1794561, 1593915, 1484161, 1647547, 1765729, 1894217, 1748887, 1664928, 1655074, 1246229, 1329712, 1436037, 1871028, 2122698, 1981837, 2137490, 1929732, 1830695, 1780124, 1804216, 1730996, 1630718]
3368A630718J26057O8674k81396k10662M8842k3093j45769j4158J54698r1671
3358A262240K03894J1015j83826N7779K29718j09664Q6695q0434O9383K9532Q3338
3347A659670L8853k07419k23397j2948M4150R9563N9890K75520r3452J78598j55799
3336A663229k30374L35055L16034j52194l98789J17058k3920R5999L29188K69493
3326B320779j70756r6539j08677L1076J37674j31782k920J268j24867R6407K78308
3315B229971J1826N1264K73779k49803J32282O9897j36282K39199K30571M9532
3305B902236n2843Q618k7719k39700j06734J89835L20373M37865K94231l3023
3295C693139J22382J16273k95848K65494p86l4677J65121K58321J03607j6068
$$ y = [1630718, 1756775, 1825449, 1544053, 1333391, 1382233, 1359140, 1213371, 1199213, 1353911, 1262240, 1466134, 1477149, 1293323, 1351102, 1580820, 1471156, 1557851, 1477417, 1546800, 1576332, 1659670, 1698523, 1491104, 1267707, 1254759, 1298909, 1398472, 1458362, 1733882, 1640430, 1819028, 1663229, 1432855, 1767910, 2083944, 1931750, 1532961, 1650019, 1626099, 1722098, 2051286, 2320779, 2150023, 2053484, 1944807, 1975883, 2113557, 1981775, 1978855, 1980123, 1855256, 1951663, 2229971, 2241797, 2293061, 2566840, 2317037, 2449319, 2519216, 2382934, 2622133, 2852704, 2902236, 2849393, 2858011, 2830292, 2590592, 2483858, 2673693, 2994066, 3431931, 3726162, 3693139, 3815521, 3931794, 3635946, 3901440, 3900654, 3865977, 4031098, 4289419, 4393026, 4376958]
3285D376958j45976j84090k00842K83275L42167K18483L43947j53442j10470J80388
3275D950398M15501L52745J41144J64984K22706M30519L73001K75310j5373j58554
3265G152381j08577J01494L38301J10287K39130j26689K61941J02625j89789K83613
3255H164717Q1860Q90265N21822J68228O25326M46719R97195L56322L83593M94152
3245A3130199P17405N52720Q3979n1629k99780n66546p15789m06993J85235l67585
3235A2261216j58425j43941j04816m01337j83571k0530n4607p2474p2628j36639
3225A0912248K39641o5315j5097K90759k08736J25327J32212J13456J66869j29047
3215A1562317M90976J34420J18252O94624M84502N03298N23977N63727J122022
$$ y = [4376958, 4230982, 4046892, 3846050, 4129325, 4471492, 4689975, 5033922, 4880480, 4770010, 4950398, 5365899, 5718644, 5859788, 6024772, 6247478, 6677997, 7050998, 7326308, 7310935, 7152381, 7043804, 7145298, 7483599, 7593886, 7833016, 7706327, 7968268, 8070893, 7881104, 8164717, 8246577, 9136842, 9658664, 9826892, 10452218, 10898937, 11896132, 12252454, 12636047, 13130199, 13847604, 14400324, 14484303, 14432674, 14132894, 13566348, 12850559, 12443566, 12628801, 12261216, 12102791, 11958850, 11854034, 11452697, 11269126, 11248596, 11193989, 11121515, 11048887, 10912248, 11151889, 11086574, 11071477, 11362236, 11153500, 11278827, 11411039, 11524495, 11691364, 11562317, 12053293, 12187713, 12305965, 13000589, 13485091, 13988389, 14512366, 15076093, 16198115]
3206A6198115J351473Q87447J545806J254516J770522K057979K753198L793748
3198C1612804N502674P946959R599978O130589l551944j0325510r877786o814899
3190C0222865m521937l308183k299609j661331q19072q12520k49331k6656J65824
3181A6690050L15722K67824K96798O17280N72418J249598J568464J295996J793971
3172B4668121K491042L851865N561582P763643R278860M207180n738309j0783892
3164D1300092r256366n694206m205501l279030k440690j728541j574285j360562
3156A1760911o23854q06196p21847o91961o41342l26090m99720j10639m87276
3147F851986l86123k97463j45691j11273O5150m5830l45359J43416k59788m5808
$$ y = [16198115, 17549588, 18437035, 19982841, 21237357, 23007879, 25065858, 27819056, 31612804, 37115478, 45062437, 54662415, 60793004, 57241060, 46915550, 37037764, 30222865, 25700928, 22392745, 20093136, 18431805, 17612733, 16800213, 16550882, 16524226, 16690050, 17005772, 17273596, 17570394, 18187674, 18760092, 20009690, 21578154, 22874150, 24668121, 27159163, 31011028, 36572610, 44336253, 53615113, 57822293, 52083984, 41300092, 32043726, 26349520, 22144019, 18864989, 16424299, 14695758, 13121473, 11760911, 11137057, 10330861, 9609014, 8917053, 8275711, 7949621, 7449901, 7339262, 6851986, 6465863, 6168400, 6022709, 5911436, 5976586, 5930756, 5585397, 5728813, 5469025, 5423217]
3137E423217j61142o549j16838K8859J12082n40356j29302l9398l60765n29449
3127C680359k86387J3779J60200l5804j36707k47649l2829J46584j34532n0401
3117C076613j57426m00699J27586j55143j24309p3552j25507J2552K19906L7137
3107B437158p9540n4507m07031p6236j9227q2839K0802J78601J22837k55426J423
3096A786015k2314l9128p048j8053J71668j34519n4886l90379L0856M8517l2570
3085A338159L12390k35257O0759r2568k87156L3006J98125K17147r0228N1847
3075A506224l9507J66829n2643k56237j7235K34766J36340K4k72058q399j67003
3064A231101J39681J71104K3566M1006n625o861K35863m4445K19103j14529p2206
$$ y = [5423217, 5262075, 5255526, 5138688, 5167547, 5279629, 4739273, 4609971, 4570573, 4209808, 3680359, 3393972, 3407751, 3567951, 3532147, 3395440, 3147791, 3114962, 3261546, 3127014, 3076613, 2919187, 2518488, 2646074, 2490931, 2366622, 2293070, 2167563, 2180115, 2400021, 2437158, 2357618, 2303111, 1896080, 1819844, 1800617, 1717778, 1738580, 1917181, 2040018, 1784592, 1786015, 1763701, 1724573, 1717525, 1699472, 1871140, 1736621, 1681735, 1291356, 1322212, 1370729, 1338159, 1650549, 1415292, 1476051, 1383483, 1096327, 1129333, 1327458, 1544605, 1454377, 1506224, 1466717, 1633546, 1580903, 1324666, 1307431, 1542197, 1678537, 1678561, 1406503, 1398104, 1231101, 1370782, 1541886, 1565452, 1606458, 1600833, 1593972, 1829835, 1785390, 2004493, 1889964, 1817758]
3053A817758Q1353j18526K33159r0818k03769l96743J92464Q5424R8290J0355
3043A708947P745J15843j83882p054K44758N4356O9637k85603J91501L38336J97390
3032B451974P078n4305M28095j4447j51673o2134J2914m2198k75139K17366j55727
3021B361804K28187J8601J82095M57162r6920L18159j9369K09564N26490j25549
3011D060224j59930J78701K23362K44517K36092L78368L82800L20811K05821j51783
3001E918983K22655P0953l59764j45087L530o7593Q0704K51990K47430k18588
2991F005213j54663k7040l55522j56500P5378k50632L0373L8434q7417j1689J29791
2980E235726L5090J53359L41204K36386J25503M00226M26068L78489K83030P29242
$$ y = [1817758, 1899111, 1780585, 2013744, 1922926, 1719157, 1322414, 1514878, 1600302, 1698592, 1708947, 1716692, 1832535, 1648653, 1641599, 1886357, 1940713, 2010350, 1724747, 1916248, 2254584, 2451974, 2459052, 2404747, 2832842, 2818395, 2666722, 2604588, 2617502, 2575304, 2300165, 2517531, 2361804, 2589991, 2608592, 2790687, 3247849, 3150929, 3469088, 3449719, 3659283, 4185773, 4060224, 3900294, 4078995, 4302357, 4546874, 4782966, 5161334, 5544134, 5864945, 6070766, 5918983, 6141638, 6212591, 5852827, 5707740, 5711270, 5643677, 5724381, 5976371, 6223801, 6005213, 5850550, 5823510, 5467988, 5311488, 5386866, 5136234, 5166607, 5205041, 5117624, 5105935, 5235726, 5270816, 5424175, 5765379, 6001765, 6127268, 6527494, 6953562, 7332051, 7615081, 8344323]
2970H344323Q54077N20609N69324M84501L63330J93747K13725O7686n09134r15262
2960A0186926m01474k90144l79928m46575l40309l33580o75617q04689n02931
2951F011679m44609n12506l24889K1856j41959j29152J67911L43395J3936J91592
2941E197254K8713K08276K76432K72786L67952N93392m8633J11715N01446K16560
2931G725893J26809k25011K6860Q2177k68167l43038j26379n54312m40033j93088
2921E811711j08541l36717m15582k90262m51260l87228m5056j63868j67500j46012
2911C299685j88219j41112j03430K25030J49679P4587j13412l11758l9387l2911
2901B818752k63334m4611L6125N3972m98960k85215M8437o9037J22706M3998m186
$$ y = [8344323, 9198400, 9719009, 10288333, 10772834, 11136164, 11329911, 11543636, 11611322, 11102188, 10186926, 9785452, 9495308, 9115380, 8668805, 8328496, 7994916, 7319299, 6514610, 6011679, 5567070, 5054564, 4729675, 4751531, 4609572, 4480420, 4648331, 4991726, 5005662, 5197254, 5225967, 5434243, 5710675, 5983461, 6351413, 6944805, 6896172, 7007887, 7509333, 7725893, 7852702, 7627691, 7654551, 7736728, 7468561, 7125523, 6999144, 6444832, 6004799, 5811711, 5703170, 5366453, 4950871, 4660609, 4209349, 3822121, 3777065, 3613197, 3445697, 3299685, 3111466, 2970354, 2866924, 3091954, 3241633, 3316220, 3202808, 2891050, 2851663, 2818752, 2555418, 2510807, 2546932, 2600904, 2101944, 1816729, 1865166, 1796129, 1918835, 1962833, 1958647]
2890A958647k36907J90521Q7129j99604J5736Q5636j42977J4306j97890j50042
2880A424555K92387p6605N6090j51330n505Q5008o0805l77052Q4741j02971k00691
2869I67822J32854R109j31766o9115J02370N8568k98183N6749o4720J10393n1791
2858H22290o6874j70263L52806K42868k52234l05392j00357j37680k4784L06366
2848F66746j18768K86184p7372j69454j08028m5204k09055o0090O3327r9650Q9550
2837B18186N6761k88366J87701J71320n3738J01531k51908J8378K0875j96981
2827a6241L98648j96375j43698J09797n9136o3054p1273K30705J88260n6140j48696
2816A72797k69299j24525Q3076P1505q8977R4731J73382l12566N8941j25202j51994
$$ y = [1958647, 1721740, 1912261, 1999390, 1799786, 1815522, 1901158, 1758181, 1772487, 1574597, 1424555, 1716942, 1640337, 1696427, 1545097, 1539592, 1624600, 1563795, 1186743, 1271484, 1168513, 967822, 1100676, 1109785, 978019, 908904, 1011274, 1069842, 771659, 828408, 763688, 874081, 822290, 755416, 585153, 937959, 1180827, 928593, 623201, 522844, 385164, 360380, 666746, 547978, 834162, 756790, 587336, 479308, 434104, 225049, 164959, 228286, 128636, 218186, 274947, -13419, 174282, 345602, 291864, 393395, 141487, 159865, 180740, -16241, 382407, 186032, 42334, 152131, 92995, 29941, -41332, 189373, 377633, 321493, 172797, -96502, -221027, -137951, -66446, -155423, -60692, 112690, -199876, -140935, -266137, -418131]
2805d18131M94331J37968J7586l90186k99459k7585L80239J40105j55431O1438
2795e9125J33714K03839j3103l05595L2585l27340K86748J45505L6613p9079J88142
2784B42904l27896j10320P2866n8335n5169K55256j16433k5931Q9503J65908n2500
2773G9853n8548J58325j30677k5576q1803J4710K16683l11121k15401Q0872K56505
2762a6178L5997l80996J5460L35121k7790j41510O18702l1814n83687L20371K5084
2751A68760m10272J15729k03762K95317m6881M5469o9500L11331p4065p532K13561
2740C38155q8103j58095q5607j59182M776j12588p6133K41757K12263k03505J83417
2729I7155l54057n0253K26818j79353P1522J47211k28312K95304k25216p3833
$$ y = [-418131, 76200, 214168, 231754, -158432, -457891, -485476, -105237, 34868, -120563, -59125, 74589, 278428, 265325, -40270, -7685, -335025, -48277, 97228, 133841, 54762, 242904, -84992, -195312, -122446, -180781, -235950, 19306, -97127, -123058, -33555, 132353, 79853, 21305, 179630, 48953, 23377, -58426, -43716, 172967, -138154, -353555, -272683, -16178, 19819, -361177, -345717, -10596, -38386, -179896, 438806, 406992, -176695, 143676, 168760, -241512, -125783, -329545, -34228, -81109, -35640, -105140, 206191, 132126, 124594, 338155, 250052, 91957, 6350, -152832, -148056, -260644, -336777, -95020, 117243, -86262, 97155, -256902, -307155, -80337, -259690, -188168, -40957, -269269, 26035, -199181, -273014]
2719b73014m4193J89593Q5054K9823M4184j3688j02069m1678K98330P8246j17513
2708A33075k72798K8429J43284l13412J6852J96205K35576M5113J82279j12350
2698B82253j80630J11336j85699j60995k1471p3362K46627K56994j77801p1376
2688B5876O5335n6092L5563J03900k66749J58585J00584k3433P1675N1266L697
2677B70207L30477k11401j80493J39394q657J0010K74055k93582J53918l0942
2667D52986J13318J41478q0471n1447J30653J36080o0238j21425K12452K32414
2657A105800m3329n8794J30470L3232k03458K74085J7383L76208J20099j30622
2647A621074Q4104m9113o713J77767j14991k13548j58860L01657J98295j45916
$$ y = [-273014, -317207, -127614, -42560, -12737, 31447, 17759, -84310, -125988, 172342, 250588, 133075, -139723, -111294, 31990, -281422, -264570, -68365, 167211, 212324, 394603, 282253, 101623, 212959, 27260, -133735, -155206, -228568, 18059, 275053, 97252, 25876, 91211, 35119, 70682, 174582, -92167, 66418, 167002, 143569, 215244, 266510, 270207, 600684, 389283, 208790, 348184, 339527, 349537, 623592, 330010, 483928, 452986, 566304, 707782, 627311, 575864, 706517, 842597, 782359, 660934, 873386, 1105800, 1062471, 1003677, 1134147, 1167379, 963921, 1238006, 1255389, 1631597, 1751696, 1621074, 1705178, 1656065, 1649352, 1827119, 1712128, 1498580, 1339720, 1641377, 1839672, 1693756]
2637A693756K5028k22517L02355j7994L54708L20340k52462j77146J54365L00609
2627B481042m9602Q491J48658k55929J02332K36279J61381j0986K87275J03852
2617C212793j24380P3105n8773j94156O5635K52708m1537N3554o4163j51007m6155
2606B977624r254m5864o7364P0752k54322J89272K28913J62148n8274R2443K87070
2595C573144k01773J71518K03866J55869N2729K22876K54762K59923M12535r7541
2585E007908m34695l54028J00126r0862m95816O2330R7503j95239Q0746j40503
2575C637470k47844l8632r7187R001l797R0372j10202M3344k71029l51395K64677
2564B924778J02591j08526J36475q6269k63884M9391K5608O9244K45923R435J42841
$$ y = [1693756, 1718784, 1496267, 1798622, 1780628, 2135336, 2455676, 2203214, 2026068, 2180433, 2481042, 2431440, 2439931, 2588589, 2332660, 2434992, 2671271, 2832652, 2821666, 3108941, 3212793, 3088413, 3161518, 3102745, 2908589, 2974224, 3226932, 3185395, 3238949, 3174786, 3023779, 2977624, 2968370, 2922506, 2855142, 2925894, 2671572, 2860844, 3089757, 3251905, 3193631, 3286074, 3573144, 3371371, 3542889, 3746755, 3902624, 3955353, 4178229, 4432991, 4692914, 5105449, 5007908, 4573213, 4219185, 4319311, 4228449, 3732633, 3794963, 3892466, 3697227, 3777973, 3637470, 3389626, 3350994, 3253807, 3262808, 3259011, 3349383, 3239181, 3282525, 3011496, 2660101, 2924778, 3027369, 2918843, 3055318, 2969049, 2705165, 2754556, 2780164, 2849408, 3095331, 3104766, 3247607]
2553C247607P3808m6024J67710p0342k19050j53801m47311m18502O8696j21076
2543B081715k74777J25157j48888m60469m6764M8168k6046J12587j68001j02056
2533A140626j16434J28790O987j06837L1018r539Q6763L02017j36828k82372k04729
2522H39462j20207K39620j68073Q8921J27364k6295j43324m7609j62613p7026
2512E50220N7213j21516l58274J60217M18560j23807j24478k67180k28613J26819
2502H9161N2229l95955K72653J71374J39978k75097j41382j07636J81545n4946
2492f8076m0566P1914o1624k68365M77237M47578j91342j95173k43783M5819o3256
2481h9637J24182N7276J31687k59837k27091K09297J1949o9748k33675J7228j26534
$$ y = [3247607, 3321415, 3275391, 3443101, 3372759, 3153709, 2999908, 2552597, 2134095, 2202791, 2081715, 1806938, 1932095, 1783207, 1322738, 1275974, 1324142, 1298096, 1410683, 1242682, 1140626, 1024192, 1152982, 1159969, 1053132, 1084150, 1074611, 1161374, 1463391, 1326563, 1044191, 839462, 719255, 958875, 790802, 879723, 1007087, 980792, 837468, 789859, 627246, 550220, 607433, 485917, 127643, 287860, 706420, 582613, 458135, 190955, -37658, 89161, 141390, -254565, 18088, 189462, 329440, 54343, -87039, -194675, -13130, -68076, -108642, -36728, -98352, -366717, 110520, 558098, 366756, 171583, -72200, -26381, -89637, 34545, 91821, 223508, -36329, -263420, -54123, -42174, -111922, -345597, -328369, -454903]
2470d54903J56983K82444K6008j85060j27217K2312J15837P3645j15534R3012
2460a12473q5475K35101r4721J25780n2531k4781k47009N9269J37135J04895k4419
2449B0771L47825p9294k32096j51132L7125Q3381l19117M9022k19586R0999j46707
2438e18809j14954M14271j02748J7210l5668j3650L17894o098K28819K5073l68905
2427a57565l790J47074J13310j02028j86974L95232o6354L8474l7229m82j61174
2416b1506j92191k20273p5358K39018j10164K27048m5366Q1737j29240q7506J21346
2405b12455l4627J49558p9219j32404K71756J73943r3491K9324q5230k05539L3606
2394a84778j13925J05331j02401r2213J06806J11032P8023J75496m8368m8923
$$ y = [-454903, -297920, -15476, 10532, -174528, -301745, -279433, -163596, -89951, -205485, -112473, -197948, 37153, -57568, 68212, 15681, -9100, -256109, -196840, -59705, 45190, 20771, 368596, 289302, 57206, -93926, -56801, 26580, -292537, -243515, -463101, -372102, -518809, -633763, -219492, -322240, -305030, -340698, -354348, -36454, -42552, 186267, 211340, -157565, -161355, -14281, 99029, -2999, -189973, 205259, 138905, 177379, 140150, 139668, -21506, -213697, -433970, -509328, -270310, -380474, -153426, -198792, -117055, -246295, -333801, -212455, -247082, -97524, -176743, -309147, -37391, 136552, 43061, 72385, -12845, -218384, -184778, -298703, -193372, -295773, -387986, -281180, -170148, -92125, 83371, 35003, -13920]
2384a3920k18338J20612N0048r3349K16653K27444q4521M0419J10213M5715J34597
2373E35573k8967m2206m1479P9439J39174k85215k15456K28410k0833j25608m25307
2362b02475M8702k47643L00186J9538k12579J56936K71220q3098n354J50904o0473
2351A35864N945k17292K0640J17100N953l40301J71784j56643O8195J79910j37119
2340a45964j11252J3307J75347j5617N9821j1254O2928J0371j45919L5587k88791
2329c61436Q1644K16156k02623K41578J02934p7129j18844q1866K3834j35878
2319c11630J82533K85165j16418L0681j20470L5676l6358k80089J63736L2136
2309a35038J44965j2414o4805L28963n7522j53206p2524q7812j84951Q9550j39157
$$ y = [-13920, -232258, -111646, -61598, -154947, 61706, 289150, 204629, 245048, 355261, 400976, 535573, 506606, 464400, 422921, 502360, 641534, 356319, 140863, 369273, 348440, 222832, -202475, -153773, -401416, -101230, -81692, -294271, -137335, 133885, 50787, 45433, 196337, 135864, 141809, -75483, -54843, 62257, 68210, -272091, -100307, -256950, -188755, -8845, -145964, -257216, -243909, -68562, -84179, -24358, -35612, 27316, 37687, -108232, -72645, -361436, -279792, -63636, -266259, -24681, 78253, 1124, -117720, -199586, -175752, -311630, -129097, 156068, 39650, 70331, -50139, -14463, -50821, -330910, -167174, -135038, 9927, -2487, -67292, 261671, 204149, 50943, -21581, -109393, -294344, -204794, -343951]
2298c43951n919K01792K32248l6855q4669J87415j31171j91193J04089R3298j85210
2287a60126m0059N55763q7170j64302k37083J301L23646m82377o1786J70718j03398
2276b84873K36302J76936j58627J87663n0013p9172n2931o7367L5952k29325K52932
2265c2523K84680r2836K569Q311l34080J09206N5182L03284J16816j30323l11904
2254b1618J57050j04377k0637O24841n4084k01868k27833p9854j51986l2579j1617
2243a24562L60713r3911J36528N2230q6076K92244k17669P4102Q9740R2592j61613
2232D14318O7274M07301j70712j32329j73675J69311j856R441M7387J89020j11747
2221G13733M3760k48863L54401J77338l65396j94548K20813M00112k55639o4352
$$ y = [-343951, -349870, -148078, 84170, 47315, -37354, 150061, 18890, -172303, -68214, 25084, -160126, -200185, 355578, 268408, 104106, -132977, -131676, 191970, -290407, -352193, -181475, -284873, -48571, 128365, -30262, 157401, 107388, 28216, -24715, -92082, -56130, -285455, -32523, 252157, 159321, 161890, 170201, -163879, -54673, 509, 303793, 420609, 290286, -21618, 135432, 31055, 10418, 635259, 581175, 379307, 151474, 71620, -80366, -112945, -124562, 236151, 142240, 278768, 330998, 244922, 537166, 319497, 393599, 483339, 575931, 414318, 481592, 888893, 718181, 585852, 412177, 581488, 579632, 589073, 636460, 825480, 713733, 757493, 508630, 863031, 1040369, 674973, 480425, 701238, 1101350, 845711, 781359]
2211G81359Q1528J12662k45447J54430P2324k59907K70993K56550l6479O9471
2201A257484q2172L6006l3824J46472m0630r3192M83589j18885l3429P8495K26431
2190A826345j15289p9226L8653K1618M5874K76235L69812l14500P1239M4596M4551
2179B229908j1520K17091N3796j98389R2051K9735M5162o3159K20623M07167J6938
2168C039403j37867p2042L53358L4631L2239J7950K42391q5380p5555N75738J13852
2157D038718N49K18178N08677J55018l18912K44822J34863k32256K78568J42512
2147E170737K84469O41291J43412J45714L45670K19537Q4242J96184K58821L78126
2137G868203N04048Q30485N54154j0724K13639L78888L10234M53271N93692K10778
$$ y = [781359, 862887, 975549, 730102, 884532, 956856, 696949, 967942, 1224492, 1188013, 1257484, 1175312, 1211318, 1177494, 1323966, 1283336, 1190144, 1673733, 1554848, 1521419, 1599914, 1826345, 1711056, 1631830, 1670483, 1692101, 1737975, 2014210, 2384022, 2069522, 2140761, 2185357, 2229908, 2218388, 2435479, 2489275, 2290886, 2382937, 2412672, 2457834, 2394675, 2615298, 3022465, 3039403, 2901536, 2829494, 3182852, 3217483, 3249722, 3267672, 3510063, 3424683, 3349128, 3924866, 4038718, 4039267, 4257445, 4766122, 4921140, 4602228, 4847050, 4981913, 4749657, 5028225, 5170737, 5455206, 6096497, 6239909, 6385623, 6731293, 6950830, 7035072, 7231256, 7490077, 7868203, 8372251, 9202736, 9756890, 9746166, 9959805, 10338693, 10648927, 11102198, 11695890, 11906668]
2127A1906668P86628Q48929P77202R37984J393617J216296J688704K046153J847799
2118B3449980J306604J065107J013727K037120L110763M035343M665882N641146
2110D6325672P214356Q496054J1810648J7798232K5061227K8099838J0328533
2103A55134560k1895874l3462920k5326039j5860292j1061612q924391o447678
2096C2155754m475993l387746k353753j785777r19927r15772p02597r80765j331513
2087A5301911j143956j104285q25673j019031q98551p98869o94540n14605j45252
2078H157149m93692o16781n38658k15842l95051m99678j8767k67952m48240j45056
2068D517432n5712k37450k25487j62342n6598L9564O9425l18804m45856k84929
$$ y = [11906668, 12693296, 13542225, 14319427, 15257411, 16651028, 17867324, 19556028, 21602181, 23449980, 24756584, 25821691, 26835418, 28872538, 31983301, 36018644, 40684526, 46325672, 53540028, 62036082, 73846730, 91644962, 116706189, 144806027, 155134560, 133238686, 99775766, 74449727, 58589435, 47527823, 38603432, 32155754, 27679761, 24292015, 21938262, 20152485, 19232558, 18316786, 17614189, 16633424, 15301911, 14157955, 13053670, 12227997, 11208966, 10310415, 9511546, 8817006, 8302401, 8157149, 7663457, 7046676, 6508018, 6292176, 5897125, 5397447, 5378680, 5110728, 4662488, 4517432, 4461720, 4224270, 3998783, 3836441, 3779843, 3819407, 3888832, 3570028, 3124172, 2839243]
2058B839243K18748k155p7859k93877J28716n8369l45484J40124J67219q4412
2048B631894n9847j74314m02455n6335j62640k02696J88990k58365j80752K79705
2038A603185O3252l69375J53901o1313j90362Q523m56489L02446M3849M399l0717
2027A071299j33248J18462r5782k31667P4061J8743l78738J76643j6434l03693
2017B99646Q6747L6539J29917l9167O447J29053K86801l68633M8975m45667P0829
2006B41487K64301Q1130J39096l96342m3520O0067l43759J2418J38017k4675L6923
1995A65143J48847K61816P4208j60620l20141J8258M1912N2610k14555K6615k44158
1984a50065L69174j04958N1523j62659K6525J21050j67483o9128q9613K64054
$$ y = [2839243, 3057991, 3055836, 2977977, 2684100, 2812816, 2754447, 2408963, 2549087, 2716306, 2631894, 2572047, 2397733, 1995278, 1938943, 1776303, 1573607, 1762597, 1504232, 1323480, 1603185, 1666437, 1297062, 1450963, 1389650, 1199288, 1207811, 751322, 1053768, 1097617, 1102016, 1071299, 938051, 1056513, 960731, 729064, 803125, 821868, 443130, 619773, 603339, 299646, 386393, 422932, 552849, 513682, 520129, 649182, 935983, 567350, 616325, 170658, 241487, 505788, 586918, 726014, 329672, 286152, 346219, 2460, 14878, 152895, 128220, 165143, 313990, 575806, 650014, 489394, 169253, 187511, 229423, 282033, 67478, 94093, -150065, 219109, 114151, 165674, 3015, 29540, 150590, -16893, -86021, -175634, 88420]
1974H8420J57526j20614O1127L98988m45213J36164J30892J0798j61115l25068
1964f8095J70180j88434M610J08037K24088j59280K9928k0807j93831K25326K01155
1953C32877p6423o2754j57153j53555J12955k71426J13215J76919j53287J8288
1943a20344J08574j00639O2240P3647K69603l04472o4167J12749L3598j33890
1933f3101N1350J35654N4267J30742J93054k23202K4310J4317Q6118n3897o8776
1922B80836k38262j01021k3019q7965j41480M799J87060j0294q0879K12214K13815
1911B15804l9115K4067j91387o5438k08802k2166K08025l8884j3353J55651l45413
1900c21011J64250J27504O2586n2154J46687j33526J9444J8699J02365J39735
$$ y = [88420, 245946, 125332, 186459, 585447, 140234, 276398, 407290, 418088, 256973, -68095, 102085, -86349, -81739, 26298, 250386, 91106, 121034, 100227, -93604, 131722, 332877, 256454, 193700, 36547, -117008, -4053, -275479, -162264, 14655, -138632, -120344, -11770, -112409, -50169, 23478, 293081, -11391, -75558, 37191, 70789, -63101, -11751, 123903, 178170, 308912, 501966, 278764, 303074, 317391, 403509, 349612, 280836, 42574, -58447, -81466, -169431, -310911, -306112, -119052, -129346, -210225, 1989, 215804, 176689, 200756, 9369, -56069, -264871, -287037, -79012, -117896, -131249, 24402, -321011, -156761, -29257, 33329, -18825, 127862, -5664, 13780, 32479, 134844, 274579]
1890B74579M5817j27290j96846k34807L1853L06855k43104j59635K36688j65562
1880b31452J28945K77935j96036j97528k01264K68435K9214L5795J8306p4249
1870a41899k33014j66541K0722P7650K23513k35177j75944k17023K63960K78940
1860c04813o2855J69201j60864R831K99924J50925l17948j67308M14601R7504
1850A28198J37808k9874l90976K1035K07074J50568j69667l37476K77402J13740
1840A07832l7466j35320j78767L35953L7647L73298J99049j95097j13841j20654
1830B72634j45272l27529Q23P6341M29J14754K4280q1292K17238k70761j47593
1819b65948p2697L11551J2609k03588N4114J2313O6668l6382l66208K81642j05948
$$ y = [274579, 320396, 193106, -3740, -238547, -206694, 100161, -142943, -302578, -65890, -231452, -102507, 175428, -20608, -218136, -419400, -150965, -121751, -85956, -67650, -141899, -374913, -541454, -520732, -443082, -219569, -454746, -630690, -847713, -583753, -304813, -367668, -198467, -359331, -349500, -49576, 101349, -216599, -383907, 30694, 128198, 266006, 236132, -154844, -133809, 73265, 223833, 54166, -283310, -5908, 107832, 70366, -64954, -243721, 92232, 129879, 503177, 702226, 507129, 393288, 272634, 127362, -200167, -199344, -123003, -122574, -7820, 16460, -64832, 152406, -118355, -265948, -338645, -27094, -14485, -218073, -163959, -151646, -84978, -121360, -487568, -205926, -311874]
1808c11874j83314J45904L15293n009R9157k13502p7955k21549L0159O03202j22406
1797E8106L56826k94256l16771K63019m6432k5504J16995m48882q4293L04765
1787a16427O1919M4310J71805l06948k1823L4953q9378j98995J1160M23466j51771
1776a37729l47076J96402J27327J70686l79191m3662j6898K97995J0012m0528
1766a62662j70278J25635r0334J5156J2614j5043M5285J14438q8359j42166L08775
1755d6939L16854j51265j30498l68610Q7551k5994j25209J55691O350L97883O3919
1744A79733k33958k52601R4914j38280K11704L76327l3590j79961K9597J0018
1734F3903m07624p4207L03361q7265K55318K1258l09529Q5164K57409J01685k11001
$$ y = [-311874, -495188, -349284, -33991, -39000, 60157, -153345, -231300, -452849, -422690, 180512, 58106, 414932, 120676, -196095, 66924, 20492, -5012, 111983, -336899, -421192, -116427, -54508, -10198, 161607, -145341, -167164, -132211, -221589, -420584, -409424, 14042, -137729, -484805, -288403, -161076, 9610, -369581, -413243, -430141, -132146, -122134, -162662, -332940, -207305, -297639, -282483, -269869, -284912, -239627, -125189, -213548, -355714, -46939, 269915, 118650, -11848, -380458, -292907, -318901, -444110, -288419, -282069, 115814, 179733, -54225, -306826, -211912, -350192, -138488, 237839, 204249, 24288, 53885, 63903, -343721, -417928, -114567, -201832, 53486, 74744, -234785, -149621, 107788, 209473, -1528]
1723a528j26755J18807j22946J04259K8036k14652l4285O6961j56785K06109q3643
1712b16422l79894M48369j84531p1433K56421j48928j16801j61483L55685J13338
1702a05679m7373J06156j3643l24782R409k1699K79878K72047k63734p7576R8528
1691h8468k62254o8749J02840P1843q1045L47979J25153l16185r9624K03868J91519
1680A26877j44128j43516J57136j26810L02626N6682j66585R4525O1157k12710
1670E254k96111P3859L62219j9404R0117j41850l31852j62682j09459J84174J95107
1659a50628j10134L48626J11339k61681m5891p5211k46808Q1303p3021l10375
1649g32481J59187j3205M29055p278K427l5165k21411j16284N10985k47234O9097
$$ y = [-1528, -128283, -9476, -132422, -28163, -127, -214779, -249064, -182103, -338888, -132779, -216422, -596316, -147947, -332478, -403911, -147490, -296418, -413219, -574702, -219017, -105679, -153052, -46896, -60539, -385321, -375912, -397611, -117733, 154314, -109420, -186996, -88468, -350722, -419471, -316631, -244788, -325833, 22146, 147299, -168886, -268510, -64642, 126877, -17251, -160767, -3631, -130441, 172185, 228867, 62282, 156807, 217964, 5254, -290857, -216998, 145221, 125817, 215934, 74084, -257768, -420450, -529909, -345735, -150628, -260762, 87864, 199203, -62478, -108369, -183580, -430388, -349085, -422106, -732481, -573294, -586499, -157444, -164722, -162295, -197460, -418871, -535155, -24170, -271404, -202307]
1638b02307K7262k67335j80904K75804M28299k03136J81660j09305n1291Q6745
1628a4508j27001J52593k24942l01852Q2762R7247J0198P9646o3038j04795J06105
1617c07585R2990J3150N180o7592q9287K4024P1768J58420J67002j00422l26489
1606c58841M8406L5231k2922q1980j22647L13759L00731k75756k76363K55176
1596a85206m1998L1228J31451k47291n2913K0648R9445l5669m4002Q6429m5828
1585b83706j0645M6505K57268J75944J14595m63490r3898J35208q3996J50279
1575e5936l9028l3784k35051K73317J52093j49534m8936j36891J85642J0678k30663
1564c08093K07724j13268k19022K05058j21058l146O8601N4577o0726Q2074N7835
$$ y = [-202307, -175045, -442380, -623284, -347480, 80819, -122317, 59343, -49962, -101253, -14508, -141509, 11084, -213858, -515710, -432948, -335701, -325503, -245857, -308895, -413690, -307585, -214595, -201445, -196265, -263857, -353144, -329120, -257352, -98932, 68070, -32352, -358841, -310435, -275204, -298126, -380106, -502753, -188994, 111737, -164019, -440382, -185206, -227204, -195976, -64525, -311816, -364729, -344081, -244636, -280305, -324307, -237878, -283706, -294351, -247846, 9422, 185366, 299961, -163529, -257427, -122219, -206215, -55936, -94964, -128748, -363799, -90482, 61611, -87923, -136859, -273750, -88108, -77430, -308093, -100369, -213637, -432659, -227601, -348659, -351805, -283204, -228627, -289353, -207279, -149444]
1553a49444K468q9082K77499l9027j99911M0670n6590K61860k0232l503r9603
1542g4895j17150o0499m5934J34705p5805J39725K44546o0859J29443r7889j12098
1531C290j85223p9318Q5207j5634L5789j29231J1284k17563L96897J77685l86724
1520c03541M8635N6402L0456J88883N2830l5677Q0578k72445J84598J57343j15178
1509G2884j85587M1925k349l25591O3971O7010k5178O3427j27584j70427j0899
1498e38398j1694K17248J23144o2758m3232J34038k10525K56016L45523j62210
1488D7152J67163l98433m54692K09296M39796m9497j20336p8836J17312M0370
1478h0705J4395K2528J83371l45139m7769J21340j6007j48209P7207r2589n0333
$$ y = [-149444, -146976, -236058, 41441, 2414, -197497, -156827, -213417, 48443, 28211, 24708, -74895, -192045, -252544, -298478, -163773, -239578, -99853, 144693, 83834, 213277, 115388, 3290, -181933, -261251, -176044, -191678, -155889, -285120, -273836, -491399, -94502, 83183, -303541, -254906, -198504, -168048, 20835, 73665, 37988, 118566, -153879, 30719, 188062, 72884, -112703, -70778, -73127, -398718, -334747, -267737, -292915, -229488, -357072, -527499, -538398, -550092, -332844, -209700, -272458, -315690, -181652, -392177, -136161, 209362, 47152, 214315, -184118, -638810, -429514, 10282, -39215, -159551, -238387, -121075, -80705, -66310, -43782, 139589, -205550, -253319, -131979, -147986, -296195, -218988, -311577, -361910]
1467c61910k824K4971K35779J66581n9958k90317K04858J7724k38550J90580L02689
1456A89623Q518k70131o3919r6208J11688N1300k23061M9668m6142J31033l5536
1445a93167l9671n7327L1501J79545J48331l39773K23190l96420K1836j69232
1435e91187J27815L08859J17323k6922k81331R2539R1974o9979j31570J84808
1425a77671o5198l10990K00647J96402k2804L4609n43616J62517K93477J36045
1415i6582J67815j26497k14863r1544K4833r8181K11581P7640r7531O1642j85221
1404c66908M15499j16345j4741m1636J4916k26646K19450j68498l60077K83913
1394c61073j10095N67637P7959k70899l2209J28720r6065m09164j06584L24774
$$ y = [-361910, -364734, -339763, -103984, 62597, 2639, -287678, -82820, -65096, -303646, -113066, 189623, 198141, -71990, -135909, -232117, -120429, -69129, -292190, -242522, -288664, -157631, -193167, -232838, -290165, -258664, -79119, 69212, -270561, -47371, -443791, -421955, -591187, -463372, -154513, -37190, -64112, -345443, -252904, -160930, -230909, -362479, -177671, -242869, -553859, -353212, -156810, -179614, -145005, -688621, -526104, -232627, -96582, 71233, -55264, -270127, -361671, -336838, -435019, -223438, -145798, -243329, -181687, -366908, 48591, -67754, -82495, -124131, -109215, -335861, -116411, -284909, -644986, -361073, -471168, 96469, 174428, -96471, -128680, 40, -96025, -505189, -611773, -286999]
1384b86999J40169J14761o2886j7805j26174l19385K15037j53372k01051N6256
1374f41449J87465L05424J73492K50187j91325l50932m4418P5908j1087k33181
1364d79916K3457J27283L7278P7510j13436p3434k0016Q9068N5411J82534J85242
1353I0981l43215m0217L81944l5684L5813j92629M3845l41522J27314K32667K15237
1342A74534N4933k79344N714N6872j9081j80669M4913m9731k26601K94301K52956
1331A28797k17465L37042j93755k4132m7152k19946L4632L2552L789L46269j78611
1320B020j27336J62846q9576j68962J79596M8614j00133k91174j26780K37187
1310b73698J87992J46948j61221J8935J21725J2655k29680k8905N83408q2385
$$ y = [-286999, -146830, -32069, -94955, -112760, -238934, -558319, -343282, -496654, -697705, -641449, -453984, -148560, 24932, 275119, 83794, -267138, -311556, -235648, -246735, -479916, -456459, -329176, -291898, -214388, -327824, -401258, -421274, -332206, -276795, -94261, 90981, -252234, -292451, 89493, 53809, 89622, -103007, -59162, -400684, -273370, -40703, 174534, 229467, -49877, -44163, 12709, -6372, -187041, -142128, -191859, -418460, -124159, 128797, -88668, 248374, 54619, 30487, -16665, -236611, -201979, -169427, -165638, 180631, 2020, -125316, 37530, -52046, -221008, -41412, 7202, -92931, -384105, -510885, -273698, -85706, 61242, -99979, -81044, 40681, 53336, -176344, -205249, 378159, 295774]
1300B95774k86715K73374q6315j70537k27898J34936j43867k87769J98270K65472
1290c5275o2033L3825k40739K13386J34495r7812n1871j03006J63687j53869L69946
1279A70734J34947j91799o2118K6013j71882l41435L9835L69456M03289n8036
1269C19004m59643k39690J69013J38455N18476j10370o1461l30248r3255l70068
1259e19787J8079L68976O26J35471j62202K31642j8520k04653m6356j71187N6172
1248c11739K08940M76546j4524k20306J89661J7542o9134j86297l7538j33716
1238h0565R458n1619j51885J15361L32597k64905M8689l33953J64777P7817m21825
1227e56053O5828J67536l3000K4975q4634K61519j24873Q8181K73335k38242N7039
$$ y = [295774, 9059, 282433, 196118, 25581, -202317, -67381, -211248, -499017, -300747, -35275, -97308, -63483, -304222, -90836, 43659, -54153, -106024, -209030, -45343, -199212, 170734, 305681, 113882, 51764, 77777, -94105, -435540, -395705, -26249, 377040, 319004, -140639, -380329, -211316, -72861, 445615, 335245, 273784, -56464, -149719, -519787, -501708, -132732, -132106, 3365, -158837, 72805, 54285, -150368, -196724, -367911, -311739, -102799, 373747, 359223, 138917, 328578, 346120, 276986, 90689, 53151, -80565, -71107, -122726, -274611, -159250, 173347, -91558, -42869, -376822, -212045, -134228, -556053, -490225, -322689, -355689, -330714, -415348, -153829, -278702, -190521, 82814, -155428, -98389]
1216i8389l2184L97538j5526j05788K92l66966Q4447K37882R9950m9487l02043
1205a50274j74084K58130n7234j55750K9464N6039J65356J246j76646N595o3308
1194b61466J25577P2243l03332K81629K62485O4511j57191k36875J43999K4755
1184A6335J11412j70955q5710j95344n4747k16645K18776O2606J16975J65930
$$ y = [-98389, -130573, 266965, 251439, 145651, 145943, -221023, -136576, 101306, 201256, 151769, -150274, -324358, -66228, -123462, -279212, -249748, -193709, -28353, -27107, -203753, -198158, -261466, -135889, -63646, -366978, -85349, 177136, 241647, 84456, -152419, -8420, 16335, 127747, -43208, -128918, -324262, -379009, -595654, -376878, -314272, -197297, -31367]
$$ [...]
##END NTUPLES=NMR SPECTRUM
##END=
