##TITLE=1H_CA-9162-3
 CDCl3
 8 sc, 
 13.6.2023
##JCAMPDX= 6.0         $$ Bruker NMR JCAMP-DX V2.0
##DATA TYPE= NMR SPECTRUM
##DATA CLASS= NTUPLES
##ORIGIN= UXNMR, Bruker Analytische Messtechnik GmbH
##OWNER= root
$$ XWIN-NMR		Version 3.5
$$ Tue Jun 13 13:56:16 2023 Russian Standard Time (UT+4h)  she@DPX200
##.OBSERVE FREQUENCY= 200.13135
##.OBSERVE NUCLEUS= ^1H
##.ACQUISITION MODE= SIMULTANEOUS
##.ACQUISITION SCHEME= undefined
##.AVERAGES= 8
##.DIGITISER RES= 18
##SPECTROMETER/DATA SYSTEM= spect
##.PULSE SEQUENCE= zg30
##.SOLVENT NAME= CDCl3
##.SHIFT REFERENCE= (INTERNAL, CDCl3, 0, 15.6301)
##AUDIT TRAIL= $$ (NUMBER, WHEN, WHO, WHERE, WHAT)
$$ ##TITLE= Audit trail, XWIN-NMR		Version 3.5
$$ ##JCAMPDX= 5.01
$$ ##ORIGIN= Bruker BioSpin GmbH
$$ ##OWNER= she
$$ F:/spectra/data/she/nmr/H-F/1/pdata/1/auditp.txt
$$ ##AUDIT TRAIL=  $$ (NUMBER, WHEN, WHO, WHERE, WHAT)
(   1,<2023-06-13 13:54:46.71 +0400>,<she>,<DPX200>,
      <created by zg, POWCHK disabled, PULCHK disabled
       configuration hash MD5:
       00 E9 B6 7A A2 85 ED C7 34 08 36 98 17 FE 4E 26
       data hash MD5: 16K
       73 64 D2 8B 3B A7 97 A9 C7 A3 B3 37 E4 9D 72 7F>)
(   2,<2023-06-13 13:54:48.87 +0400>,<she>,<DPX200>,
      <Start of raw data processing
       efp BC_mod = 2 LB = 0.24 FT_mod = 6 PKNL = 1 PHC0 = -20337.91 PHC1 = 7.65272 SI = 16K 
       data hash MD5: 16K
       02 08 26 B9 E1 2E 7A A8 2F 39 D7 CA 7A 5D 06 3C>)
(   3,<2023-06-13 13:55:19.20 +0400>,<she>,<DPX200>,
      <pk PHC0 = -2.726945 PHC1 = 2.2 
       data hash MD5: 16K
       9C C0 86 9E 87 E8 C4 DD AC 36 E2 74 BF FF 0D 73>)
(   4,<2023-06-13 13:55:22.68 +0400>,<she>,<DPX200>,
      <abs ABSG = 5 
       data hash MD5: 16K
       64 77 92 DF DE B4 96 E6 97 C2 43 FD CE A2 0B CB>)
$$ ##END=
$$ 
$$ hash MD5
$$ 6C 76 19 A2 8A 4C A0 87 C2 00 05 CE 27 7D 6D D4
##$RELAX= 
##$RELAX= 
##$RELAX= 
##$RELAX= 
##$RELAX= 
##$RELAX= 
$$ Bruker specific parameters
$$ --------------------------
##$DU= <F:/spectra>
##$EXPNO= 1
##$NAME= <H-F>
##$PROCNO= 1
##$TYPE= <nmr>
##$USER= <she>
##$AMP= (0..31)
100 100 100 100 100 100 100 100 100 100 100 100 100 100 100 100 100 100 
100 100 100 100 100 100 100 100 100 100 100 100 100 100 
##$AQSEQ= 0
##$AQ_mod= 1
##$AUNM= <au_zg>
##$AUTOPOS= <>
##$BF1= 200.13
##$BF2= 200.13
##$BF3= 200.13
##$BF4= 200.13
##$BF5= 200.13
##$BF6= 200.13
##$BF7= 200.13
##$BF8= 200.13
##$BYTORDA= 1
##$CFDGTYP= 0
##$CFRGTYP= 5
##$CHEMSTR= <none>
##$CNST= (0..31)
1 1 145 1 1 1 1 1 1 1 1 1 1 1 1 1 1 1 1 1 1 1 1 1 1 1 1 1 1 1 1 1 
##$CPDPRG= <>
##$CPDPRG1= <>
##$CPDPRG2= <>
##$CPDPRG3= <>
##$CPDPRG4= <mlev>
##$CPDPRG5= <mlev>
##$CPDPRG6= <mlev>
##$CPDPRG7= <mlev>
##$CPDPRG8= <mlev>
##$CPDPRGB= <>
##$CPDPRGT= <>
##$D= (0..31)
0 1.2 0 0 0 0 0 0 0 0.06 0 0.03 0 0 0 0 0.0002 0 0 0 0 0 0 0 0 0 0 0 0 
0 0 0 
##$DATE= 1686650086
##$DBL= (0..7)
120 120 120 120 120 120 120 120 
##$DBP= (0..7)
150 150 150 150 150 150 150 150 
##$DBP07= 0
##$DBPNAM0= <>
##$DBPNAM1= <>
##$DBPNAM2= <>
##$DBPNAM3= <>
##$DBPNAM4= <>
$$ [...]
##$SUBNAM3= <"">
##$SUBNAM4= <"">
##$SUBNAM5= <"">
##$SUBNAM6= <"">
##$SUBNAM7= <"">
##$SUBNAM8= <"">
##$SUBNAM9= <"">
##$SW= 18.05172834244
##$SWIBOX= (0..15)
0 0 2 0 0 0 0 0 0 0 0 0 0 0 0 0 
##$SW_h= 3612.71676300578
##$TD= 16384
##$TD0= 1
##$TE= 0
##$TE2= 300
##$TE3= 300
##$TEG= 300
##$TL= (0..7)
0 120 120 120 120 120 120 120 
##$TP= (0..7)
150 150 150 150 150 150 150 150 
##$TP07= 0
##$TPNAME0= <>
##$TPNAME1= <>
##$TPNAME2= <>
##$TPNAME3= <>
##$TPNAME4= <>
##$TPNAME5= <>
##$TPNAME6= <>
##$TPNAME7= <>
##$TPOAL= (0..7)
0.5 0.5 0.5 0.5 0.5 0.5 0.5 0.5 
##$TPOFFS= (0..7)
0 0 0 0 0 0 0 0 
##$TUNHIN= 0
##$TUNHOUT= 0
##$TUNXOUT= 0
##$USERA1= <user>
##$USERA2= <user>
##$USERA3= <user>
##$USERA4= <user>
##$USERA5= <user>
##$V9= 5
##$VALIST= <valist>
##$VCLIST= <CCCCCCCCCCCCCCC>
##$VD= 0
##$VDLIST= <DDDDDDDDDDDDDDD>
##$VPLIST= <PPPPPPPPPPPPPPP>
##$VTLIST= <TTTTTTTTTTTTTTT>
##$WBST= 1024
##$WBSW= 4
##$XGAIN= (0..3)
0 0 0 0 
##$XL= 0
##$YL= 0
##$YMAX_a= 43621
##$YMIN_a= -40101
##$ZGOPTNS= <>
##$ZL1= 120
##$ZL2= 120
##$ZL3= 120
##$ZL4= 120
##$ABSF1= 15.71604
##$ABSF2= -2.33581
##$ABSG= 5
##$ABSL= 3
##$ALPHA= 0
##$AQORDER= 0
##$ASSFAC= 0
##$ASSFACI= 0
##$ASSFACX= 0
##$ASSWID= 0
##$AUNMP= <proc_1d>
##$AZFE= 0.1
##$AZFW= 0.1
##$BCFW= 0
##$BC_mod= 2
##$BYTORDP= 0
##$COROFFS= 0
##$CY= -3
##$DATMOD= 1
##$DC= 0
##$DFILT= <>
##$DTYPP= 0
##$F1P= 0
##$F2P= 0
##$FCOR= 1
##$FTSIZE= 16384
##$FT_mod= 6
##$GAMMA= 0
##$GB= 0
##$INTBC= 1
##$INTSCL= 3.70164e-10
##$ISEN= 128
##$LB= 0.24
##$LEV0= 0
##$LPBIN= 0
##$MAXI= 10000
##$MC2= 0
##$MEAN= 0
##$ME_mod= 0
##$MI= 1.114404
##$NCOEF= 0
##$NC_proc= -9
##$NLEV= 6
##$NOISF1= 3.799351
##$NOISF2= 2.8
##$NSP= 0
##$NTH_PI= 0
##$NZP= 0
##$OFFSET= 15.6301
##$PC= 1
##$PHC0= -20340.64
##$PHC1= 9.85272
##$PH_mod= 1
##$PKNL= yes
##$PPARMOD= 0
##$PSCAL= 0
##$PSIGN= 0
##$REVERSE= no
##$SF= 200.130028305803
##$SI= 16384
##$SIGF1= 3
##$SIGF2= 2
##$SINO= 5.538805
##$SIOLD= 16384
##$SREGLST= <1H.CDCl3>
##$SSB= 0
##$STSI= 16384
##$STSR= 0
##$SW_p= 3612.71676300578
##$SYMM= 0
##$S_DEV= 0
##$TDeff= 16384
##$TDoff= 0
##$TI= <>
##$TILT= no
##$TM1= 0
##$TM2= 0
##$TOPLEV= 0
##$USERP1= <user>
##$USERP2= <user>
##$USERP3= <user>
##$USERP4= <user>
##$USERP5= <user>
##$WDW= 1
##$XDIM= 16384
##$YMAX_p= 318926927
##$YMIN_p= -646003
$$ End of Bruker specific parameters
$$ ---------------------------------
##NTUPLES= NMR SPECTRUM
##VAR_NAME=  FREQUENCY,     SPECTRUM/REAL,   SPECTRUM/IMAG
##SYMBOL=    X,             R,               I
##VAR_TYPE=  INDEPENDENT,   DEPENDENT,       DEPENDENT
##VAR_FORM=  AFFN,          ASDF,            ASDF
##VAR_DIM=   16384,         16384,           16384
##UNITS=     HZ,            ARBITRARY UNITS, ARBITRARY UNITS
##FACTOR=    0.220516191357247, 1,           1
##FIRST=     3128.0524055039, 0,             0
##LAST=      -484.664357501882, 0,           0
##MIN=       -484.664357501882, -646003,     0
##MAX=       3128.0524055039, 318926927,     0
$$ Real data points
##PAGE= N=1
##DATA TABLE= (X++(R..R)), XYDATA
$$ [...]
7587e2672j3238m1998o643J0195j6508O9148J9438j6534m9611n525j6451m4019
$$ -52672 -65910 -107908 -114551 -104356 -120864 -51716 -32278 -48812 -98423 -103948 -120399 -164418
7575a64418N6841J1675n182K0933o588N1786k9004j8013L5359M8961q73p7585
$$ -164418 -107577 -95902 -101084 -80151 -86739 -34953 -63957 -81970 -46611 2350 1477 -76108
7563g6108L1961l9261L2815O2292l4979m5485L2056j4108J5342l1379O8248O6049
$$ -76108 -44147 -83408 -50593 11699 -23280 -68765 -36709 -50817 -35475 -66854 1394 67443
7551F7443L0164m9953k2921l7568j9376R168k913m5359j5296j9311M5559L3835
$$ 67443 97607 47654 24733 -12835 -32211 -23043 -25956 -71315 -86611 -105922 -60363 -26528
7539b6528n2831J8489R39L956m6500N6080l779l2687l2525R9890K4352j0206p02
$$ -26528 -79359 -60870 -59931 -55975 -102475 -46395 -50174 -82861 -115386 -15496 8856 -1350 -2052
7526b052m6898k4506K4233M0357R061m9745R860P81k0154N8638M4082m1331J667
$$ -2052 -48950 -73456 -49223 -8866 195 -49550 -39690 -38909 -59063 -425 43657 2326 3993
7513C993O6553r9527m6522p256l647k1323j3520Q7188N7108p2202l2040K3062
$$ 3993 70546 -28981 -75503 -82759 -86406 -107729 -121249 -34061 23047 -49155 -81195 -58133
7501e8133l299L4471J8632Q938l0494j4030J0095P3164K262Q637J2984o316k5946
$$ -58133 -61432 -26961 -8329 609 -29885 -43915 -33820 39344 41606 50243 63227 56911 30965
7488C0965j5791L5503L972L4273o2990l0970N8399K3992L705k1167O956J6392
$$ 30965 15174 50677 54649 88922 25932 -5038 53361 77353 81058 59891 66847 83239
7476H3239o086l2340j1020j7758J6819O669N244J8194O076N2875j7715j8018O1265
$$ 83239 77153 44813 33793 16035 32854 39523 44767 62961 69037 121912 104197 86179 147444
7463A47444m8511j7207j6733n546M329o9067k4435j5328Q285j2145K8648l0924
$$ 147444 98933 81726 64993 59447 63776 -5291 -29726 -45054 -36769 -48914 -20266 -51190
7451e1190K329J6897m3845l628l9671M8118M1093m1203j1962P731J9439N0300
$$ -51190 -48861 -31964 -75809 -79437 -119108 -70990 -29897 -71100 -83062 -75331 -55892 -5592
7439e592l5731r861k6125L1475J5071j8640K9190N2444n2584k5485M9183l3643
$$ -5592 -41323 -51184 -77309 -45834 -30763 -49403 -20213 32231 -20353 -45838 3345 -30298
7427c0298l3777J7389N8922m972J1475l0148m093k9836K4418o042j2326j1786
$$ -30298 -64075 -46686 12236 7264 18739 -11409 -15502 -45338 -20920 -26962 -39288 -51074
7415e1074j7525N8507j389M8314j8873L490K8884k4160J4137J7050n812j6936
$$ -51074 -68599 -10092 -11481 36833 17960 21450 50334 26174 40311 57361 51549 34613
7403C4613J2579J6198j6250L6306j3754J5556M8770J5436M6528l6875l2824j3432
$$ 34613 47192 63390 47140 83446 69692 85248 134018 149454 195982 159107 126283 112851
7391A12851R027j2428K428n981N073K3869J2940J3231m2368k3815j7218M2724
$$ 112851 121878 109450 111878 105897 110970 134839 147779 161010 118642 94827 77609 120333
7379A20333Q353l1844l3479m1865R6395K883l3038n6314p839m3743J6718K3844
$$ 120333 128686 96842 63363 21498 117893 120776 87738 31424 23585 -20158 -3440 20404
7367B0404n6196J457M0740K8565m309J2193M1621L185l6271n2134k6553K8204
$$ 20404 -35792 -34335 6405 34970 30661 42854 84475 87660 51389 -745 -27298 906
7355I06K975l1618k2461n256J1722M357n6314l270M1488k6701l4884J5348O0086
$$ 906 3881 -27737 -50198 -55454 -43732 -39375 -95689 -98959 -57471 -84172 -119056 -103708 -43622
7342d3622n9110j7978L593k2036K3180L2327L805l1169K7317k6803O4959n2062
$$ -43622 -102732 -120710 -117117 -139153 -115973 -83646 -79841 -111010 -83693 -110496 -45537 -97599
7330i7599J2100P387k5909m647J6575J2978l1385J6701K4444l64J1981J4212j3904
$$ -97599 -85499 -78112 -104021 -108668 -92093 -79115 -110500 -93799 -69355 -69719 -57738 -43526 -57430
7317e7430J3113m0010k5511M5384K9237j2521J6452p1248q258N6682M5582j8184
$$ -57430 -44317 -84327 -109838 -64454 -35217 -47738 -31286 -102534 -110792 -54110 -8528 -26712
7305b6712o978R8271l2828j01686l464m645M3003k4974j841J9998m5669J0388
$$ -26712 -33690 64581 31753 -69933 -73397 -78042 -35039 -60013 -61854 -41856 -87525 -77137
7293g7137Q771Q643J8158P941L0039m1660n3368J4765q771M4370K1957O4875l6407
$$ -77137 -68366 -59723 -41565 -33624 -3585 -45245 -98613 -83848 -92619 -48249 -26292 38583 2176
7280B176p8o860r677K5245j5755L872j1120L2044m128K8095P179l0232j0140o006
$$ 2176 2098 -4762 -14439 10806 -4949 -1077 -12197 19847 15719 43814 50993 20761 10621 4615
7266D615k904k0616o430M2980l8325K7981J3520J6621p761l914k7657l050J6693
$$ 4615 1711 -18905 -25335 17645 -20680 7301 20821 37442 29681 25767 -1890 -4940 11753
7253A1753m7627N286p37j3234j5518o666J1444r002K4854M510j1137L0267k6514
$$ 11753 -35874 -30588 -31325 -44559 -60077 -66743 -55299 -64301 -39447 -34937 -46074 -15807 -42321
7240d2321L0479M0846j16214l7182L5231k0025L2599j0652R778j7535J6087K5199
$$ -42321 -11842 29004 -87210 -124392 -89161 -109186 -76587 -87239 -77461 -94996 -78909 -53710
7228e3710p150k0468M7046L1335P642m7000o659k1396l9925J4888J06995L3908
$$ -53710 -60860 -81328 -34282 -2947 4695 -42305 -48964 -70360 -110285 -95397 11598 45506
7216D5506l5375J8484j6212k6875R276Q2047k563j2926K3366j7091L2007k1295
$$ 45506 10131 28615 12403 -14472 -5196 76851 74288 61362 84728 67637 99644 78349
7204G8349o721J8604l1970L3682M5725J6501L3670K2174m1525l1158J2627m6080
$$ 78349 71628 90232 58262 91944 137669 154170 187840 210014 168489 137331 149958 103878
7192A03878k1200k853M7482j1771m2348p9819J9986L3028J695N5146j5294k6356
$$ 103878 82678 79825 127307 115536 73188 -6631 13355 46383 48078 103224 87930 61574
7180F1574o902J3941l0049r600j3296J2422k3515R079L9653l688o2716L9762l7116
$$ 61574 54672 68613 38564 28964 15668 28090 4575 13654 53307 49619 -13097 26665 -10451
7167a0451M2939K0467n4389l2268J2992K2117N0423l564j9130P096M681M9477
$$ -10451 32488 52955 -1434 -33702 -20710 1407 51830 48266 29136 36232 40913 90390
7155I0390K0690K776j1924M3502K8392M958j6413K5992J2858N5120q0224n9908
$$ 90390 111080 113856 101932 145434 173826 178784 162371 188363 201221 256341 176117 116209
7143A16209O2052n512k9402j8359j0064p743Q433O6836n395o4038l5960J7440
$$ 116209 178261 172749 143347 124988 114924 107181 115614 182450 177055 113017 77057 94497
7131I4497l5259j9350o965L693J7763q523K8320j0438o494o5044M5355J1287k4143
$$ 94497 59238 39888 32923 36616 54379 45856 74176 63738 57244 -7800 37555 48842 24699
7118B4699o2733O3391j0555l4238M3575K3052k912k2298l5352j1152K866K7507
$$ 24699 -38034 25357 14802 -19436 24139 47191 44279 21981 -13371 -24523 -21657 5850
7106E850P974r6M1224n5245j3982l6617P4836J2310j0512k5816j4426j3339K7686
$$ 5850 13824 13728 54952 -293 -14275 -50892 23944 36254 25742 -74 -14500 -27839 -153
7093a53M2833k3701J228K7409n1599K149L0283L227K0966j3881P946j3307K1808
$$ -153 42680 18979 20207 47616 -3983 -1834 28449 31676 52642 38761 46707 33400 55208
7080E5208k7598M4802j9033k5651m1437k2189M5424P9771Q00k9407r058L60l53
$$ 55208 27610 72412 53379 27728 -13709 -35898 9526 89297 90097 60690 51632 51992 51639
7067E1639J7657m1040j3317J3315L7941J0023o747L865k4258M2619k2053m7422
$$ 51639 69296 28256 14939 28254 66195 76218 69471 73336 49078 91697 69644 22222
7055B2222k140Q458k3946L1840j3415k5312l637l057m0333m4080K5568O1874m8373
$$ 22222 20082 28540 4594 36434 23019 -2293 -5930 -8987 -49320 -93400 -67832 -5958 -54331
7042e4331J7889O776Q330J3217J7341l504Q728p379L525k4945k2698j6675Q37
$$ -54331 -36442 -29666 -21336 -8119 9222 5718 14446 7067 10592 -14353 -37051 -53726 -52889
7029e2889R295j0922p806L264K8865L0661R43J1786L1305J5432l8621J2935n3308
$$ -52889 -43594 -54516 -62322 -59058 -30193 468 1411 13197 44502 59934 21313 34248 -19060
7016a9060J2587M4392K141l528k5295N524j4057O065R097N7098L9414k8717j110
$$ -19060 -6473 37919 40060 36532 11237 16761 2704 8769 17866 74964 114378 85661 84551
7003H4551j8023k2737k7394J3849l6204o2153N7116K1609l9702L69K2962J0585
$$ 84551 66528 43791 16397 30246 -5958 -68111 -10995 10614 -29088 -28719 -5757 4828
6991D828k6456l6998J4542K2041O2730k5690k4856k9395K3559M1831M9943m8840
$$ 4828 -21628 -58626 -44084 -22043 40687 14997 -9859 -39254 -15695 26136 76079 27239
6979B7239M0429n3470Q22j6614l7598J8846L6950M1506K6946n0999N549J1789
$$ 27239 67668 14198 15020 -1594 -39192 -20346 16604 58110 85056 34057 39606 51395
6967E1395J2309k9065J6032L2962o030K1407k1962J58l8325J8086M1951J385r076
$$ 51395 63704 34639 50671 83633 77603 99010 77048 77206 38881 56967 98918 100303 91227
6954I1227K256k3955Q639K6652L5024k5647J4768O622J4388n5813k1452j211O143
$$ 91227 93483 69528 78167 104819 139843 114196 128964 135586 149974 94161 72709 71498 77641
6941G7641j8557L0799j5117M0003J4928q215L5392M7932Q314o978m4994k9458
$$ 77641 59084 89883 74766 114769 129697 121482 156874 204806 213120 206142 161148 131690
6929A31690j2569J9034M0333M7474l867K1043K3067L3256L0444o0394M7608O5700
$$ 131690 119121 138155 178488 225962 222095 243138 266205 299461 329905 269511 317119 382819
6917C82819N6433j0271l4363M01L495J5411N2030m532l4042l1511L8483n5729
$$ 382819 439252 428981 394618 395019 398514 413925 465955 461423 427381 395870 434353 378624
6905C78624M0593N0099l0908m0755k0389R068J2502K5882J4021n1680l3072n1644
$$ 378624 419217 469316 438408 397653 377264 386332 398834 424716 438737 387057 353985 302341
6893C02341m7481L3209q195n9395J04374J5793m3883L8047k156j07261k9226N0531
$$ 302341 254860 288069 279874 220479 324853 340646 296763 334810 332654 225393 196167 246698
6881B46698J1922n5670J1343j3588K7000J10261m9645r144M9155K1354K9664K5577
$$ 246698 258620 202950 214293 200705 227705 337966 288321 279177 328332 349686 379350 404927
6869D04927n6375q618j5519K5835J2865k7672j0729L7536l7718j0181J3405m472
$$ 404927 348552 339934 324415 350250 363115 335443 324714 362250 324532 314351 327756 323284
6857C23284k3990j5797k6640j1891j6010R401n8355k8077j2251q181k3211N5235
$$ 323284 299294 283497 256857 244966 228956 238357 180002 151925 139674 131493 108282 163517
6845A63517J1872J4030m7973k5085n260M563K7996k0804o4006n3443M3491j7404
$$ 163517 175389 189419 141446 116361 111101 115664 143660 122856 58850 5407 48898 31494
6833C1494k415K4547j0850L2818k7715j5098K463J9414L0370j04092J3429O5386
$$ 31494 29079 53626 42776 75594 47879 32781 35244 54658 85028 -19064 -5635 59751
6821E9751M0750j5624n0121r133J5641l5790K9227K6346O648L101n384m2422j9613
$$ 59751 100501 84877 34756 25623 41264 5474 34701 61047 67695 70796 65412 22990 3377
6808C377l6294M8702O594J1247m3964J3715K3206J0468n477k7422j6032L16L7286
$$ 3377 -32917 15785 22379 33626 -10338 3377 26583 37051 31574 4152 -11880 -11564 25722
6795B5722K9835m1295K4453J3015p462m3759J8926O8988l6286p4748K7741j1692
$$ 25722 55557 14262 38715 51730 44268 509 19435 88423 52137 -22611 5130 -6562
6783f562M2327R809k4227K5493o013L3053m0677j3277L6095K3465o1010n3640
$$ -6562 35765 45574 21347 46840 40827 73880 33203 19926 56021 79486 18476 -35164
6771c5164k7653J02563l931k304j815j2624k2304q45j1834j162j162N2061l5595
$$ -35164 -62817 39746 35815 33511 31696 19072 -3232 -4077 -15911 -17073 -18235 33826 -1769
6758a769l0513j5210N2861O05o4503K2951L6077J0240K4762L417k9171r529J739
$$ -1769 -32282 -47492 5369 5974 -58529 -35578 499 10739 35501 38918 9747 218 1957
6745A957k3178J0096j4687j6205L6702J731K5837J5632K8865o044K4101n5541
$$ 1957 -21221 -11125 -25812 -42017 -5315 -3584 22253 37885 66750 60706 84807 29266
6733B9266k9806L7522J4178M6627m9147l1634j5929J3126J8134m809K7132l2778
$$ 29266 -540 36982 51160 97787 48640 17006 1077 14203 32337 27528 54660 21882
6721B1882j4449L335L9044p719N5669m2572p1599J5414K8153K3494j8134k0338
$$ 21882 7433 10768 49812 42093 97762 55190 -16409 -995 27158 50652 32518 12180
6709A2180l5189M462K246K4405K2352j8773N35R14o531l667M3251k0707k3591
$$ 12180 -23009 -18547 -16301 8104 30456 11683 12218 13132 6601 2934 46185 25478 1887
6696A887K3263P267o929j1161M9058M8034n2255k2987r051p0354N3810K3178Q044
$$ 1887 25150 32417 25488 14327 63385 111419 59164 36177 27126 -43228 10582 33760 41804
6683D1804j6727J0766l1424J7860K3798K3144q269k7173k2455j9120Q7555j9613
$$ 41804 25077 35843 4419 22279 46077 69221 60952 33779 11324 -7796 79759 60146
6671F0146o141j2644o766j790N612K3777K8547j5732k3018p574n5638k9884J3592
$$ 60146 54005 41361 34595 32805 38417 62194 90741 75009 51991 44417 -11221 -41105 -27513
6658b7513K2620r807j5289L8822o1182k8496N7272K6944k9794J9423K1817l8877
$$ -27513 -4893 -14700 -29989 8833 -52349 -80845 -23573 3371 -26423 -7000 14817 -24060
6646b4060o323r248J7155r943L8019M0056l0533k6985Q730J3575l2640q104J32
$$ -24060 -30383 -39631 -22476 -32419 5600 45656 15123 -11862 -3132 10443 -22197 -30301 -30169
6633c0169Q54J5504J447N3341L0987n849K5481k1626K6918P893r863j2084k4473
$$ -30169 -29315 -13811 -12364 40977 71964 66115 91596 69970 96888 104781 94918 82834 58361
6620E8361k1634q091p1308M5246J0283L894K2060l5094K7970m9500K5387m095
$$ 58361 36727 28636 -42672 2574 12857 16751 38811 3717 31687 -17813 7574 3479
6608C479m305J7497m042J7710j3064L9211K8032O238l7900L636N003J924J0207
$$ 3479 -826 16671 12629 30339 17275 56486 84518 90756 52856 56492 61495 63419 73626
6595G3626o940J8538l6722L9322l2878k7611J4106K4482j4226K2096L5112l896
$$ 73626 66686 85224 48502 87824 54946 27335 41441 65923 51697 73793 108905 105009
6583A05009o6518q079J7951Q0070k1074m9641j161L2245l3082n9257L9597p638
$$ 105009 38491 30412 48363 128433 107359 57718 56557 88802 55720 -3537 36060 28422
6571B8422L5903O0752l469N4007J7420q2656j2942l262N2933m801m216p8282m6343
$$ 28422 64325 125077 121608 175615 193035 110379 97437 94175 147108 142307 138091 59809 13466
6558A3466L9653N1885K4115J2964M068j9589Q892j3449m6732r940j1915M2938
$$ 13466 53119 105004 129119 142083 146151 126562 135454 122005 75273 65333 53418 96356
6546I6356p730j6467l2874l3469l8212M8868l3636j0148O2647l3119j3277q663
$$ 96356 88626 72159 39285 5816 -32396 16472 -17164 -27312 35335 2216 -11061 -19724
6534a9724M5665J6724m4327Q759K8032K3706n653n607K7622n2468j0418N869M0705
$$ -19724 25941 42665 -1662 7097 35129 58835 53182 47575 75197 22729 12311 18180 58885
6521E8885j6811l684J8337K2215j0568o79N5388L7150j5064l9629L5322M6357
$$ 58885 42074 38390 56727 78942 68374 67695 123083 160233 145169 105540 140862 187219
6509A87219j0397m2602J4425j1898n7479M3869M148l336m7214K764R12M2113J50
$$ 187219 176822 134220 148645 136747 79268 123137 127285 123949 76735 79499 80411 122524 122674
6496A22674K3047m6607j2586K8343l5771p022J2923M9553l6986L3070j1781o1922
$$ 122674 145721 99114 86528 114871 79100 72078 85001 134554 97568 130638 118857 56935
6484E6935K4696P275m5870O2881J7241k0037j7083K0564O2072j0701j1800Q952
$$ 56935 81631 88906 43036 105917 123158 103121 86038 106602 168674 157973 146173 155125
6472A55125o1039L5903k666j6376K681J3983j7317J203p409j0822L3047p385j8077
$$ 155125 94086 129989 127323 110947 113628 127611 110294 111497 104088 93266 126313 118928 100851
6459A00851m2179J3606O4808J2562l5188k5573J0402J8964j5278j1268l2877M6132
$$ 100851 58672 72278 137086 149648 114460 88887 99289 118253 102975 91707 58830 104962
6447A04962K9348J5018L2734l1475j0740J7434j0686J8626J6677k8404k0463k6022
$$ 104962 134310 149328 182062 150587 139847 157281 146595 165221 181898 153494 133031 107009
6435A07009j6689P845K2168l3255M5827j762k9877O5286k2098P502m4682q080
$$ 107009 90320 98165 120333 87078 132905 131143 101266 166552 144454 151956 107274 99194
6423I9194J5970M2590j6693L4792J226j01049l4774J6790J05270L4205n8848m2337
$$ 99194 115164 157754 141061 175853 177079 76030 41256 58046 163316 197521 138673 96336
6411I6336J1831L5027L7283j1171k5306p3n7397K2986M8261k178k6790R434J8983
$$ 96336 108167 143194 180477 169306 144000 143927 86530 109516 157777 155599 128809 138243 157226
6398A57226l5192k481O7567J5730l0487r038j7326K6887l141m025N752l968O290
$$ 157226 122034 119553 187120 202850 172363 163325 145999 172886 169745 165720 171472 167504 173794
6385A73794J3829l2024M9664L600J5987k8380J1611n052j0745k5403J7279J3329
$$ 173794 187623 155599 205263 208863 224850 196470 208081 203029 192284 166881 184160 197489
6373A97489J2884k7247K0221k0816l66k996j4539L5230j8310k9145M299p704J9698
$$ 197489 210373 183126 203347 182531 182165 179169 164630 199860 181550 152405 156704 149000 168698
6360A68698L5937J1103n0326n2268P6759K5444k5214Q265j3046M9266j4747K399
$$ 168698 204635 215738 165412 113144 189903 215347 190133 198398 185352 234618 219871 222270
6348B22270K8964L763K4754k7587M8769k9800N2276j2153j1174K9059k6714m618
$$ 222270 251234 254997 279751 252164 300933 271133 323409 311256 300082 329141 302427 297809
6336B97809P3727m9500J0555K2356L7537m4940K6239k5639K490O4212m92k9812
$$ 297809 371536 322036 332591 354947 392484 347544 373783 348144 350634 414846 414354 384542
6324C84542j7110K1906N4760M1745l1280l2473k2388j8495o0570L1588J529k7175
$$ 384542 367432 389338 444098 485843 454563 422090 399702 381207 320637 352225 353754 326579
6312C26579o616N255j2675p1969N6704j2887K9822J9309m6400l9764L990R797
$$ 326579 319963 325218 312543 240574 297278 284391 314213 333522 287122 247358 251348 261145
6300B61145L3466K6418k6615j809n245J536k7164q3217K6070K8433R506J6717
$$ 261145 294611 321029 294414 292605 287360 288896 261732 178515 204585 233018 242524 259241
6288B59241o4501J8299k8268M9672M3876n2525J855k4548K0207K5614l0482K9366
$$ 259241 194740 213039 184771 234443 278319 225794 227649 203101 223308 248922 218440 247806
6276B47806m7239r821Q0080M302m6485J2562k3030L1307K6081K6603o057J0713
$$ 247806 200567 190746 270826 275128 228643 241205 218175 249482 275563 302166 296109 306822
6264C06822l2566M117n0088L4728l3427l391J8475l3997l2288N5898K8461l0432
$$ 306822 274256 278373 228285 263013 229586 226195 244670 210673 178385 234283 262744 232312
6252B32312j5668k3035N2976J527p080j7980o861j3258K1937J0508N1492j6991
$$ 232312 216644 193609 246585 248112 241032 223052 216191 202933 224870 235378 286870 269879
6240B69879r725L0825l690J1757m9699J5940K5733P7K350m1524R75N0656k2538
$$ 269879 260154 290979 287289 299046 249347 265287 291020 291097 293447 251923 252898 303554 281016
6227B81016J4754j1608o208J0986j8600K1327m353K8530j090k4264k6104K254
$$ 281016 295770 284162 277954 288940 270340 291667 287314 315844 314754 290490 264386 266640
6215B66640N8532l2034l8748J5310L2800J2496l57K3810P125O581J433j0468N4932
$$ 266640 325172 293138 254390 269700 302500 314996 314639 338449 345574 352155 353588 343120 398052
6202C98052J7603j2079L4987Q622J5617L7958K1320o8763J0391j1928N229M7704
$$ 398052 415655 403576 438563 447185 462802 500760 522080 453317 463708 451780 457009 504713
6190E04713O061K4307j3763K105Q1015L8352l072n574k6832q3045j676K341l5885
$$ 504713 510774 535081 521318 523423 604438 642790 639718 634144 607312 524267 522591 524932 489047
6177D89047j8032m2095m311k9730L6185J7863n7613l7213R230N1974n6861M1797
$$ 489047 471015 428920 424609 394879 431064 448927 391314 354101 363331 415305 358444 400241
6165D00241k0463l3138K059J4224m7580J2148M0947K2357k410o3975k1052J9815
$$ 400241 379778 346640 348699 362923 315343 327491 368438 390795 388385 324410 303358 323173
6153C23173j0136L244J9028P236j2097k3570k896N8971K7749o7931R97K0150j8267
$$ 323173 313037 316281 335309 342545 330448 306878 303982 362953 390702 322771 323768 343918 325651
6140C25651L374L4397J4205k5911L9476p538l5915K5804J2547j3847r556K4244
$$ 325651 329025 363422 377627 351716 391192 383654 347739 373543 386090 372243 362687 386931
6128C86931K2233n1860j6871M5680J1534k2090j2162O000J0300k3874M9112j1008
$$ 386931 409164 357304 340433 386113 397647 375557 363395 369395 379695 355821 404933 393925
6116C93925k5215N6773l2359O336l507j3358l3470K4275l716J003K108L6017l5641
$$ 393925 368710 425483 393124 399460 395953 382595 349125 373400 369684 370687 372795 408812 373171
6103C73171j4328M9051K7747k2602M6932o2572j0846m3628Q839L0947J549M0142
$$ 373171 358843 407894 435641 413039 459971 397399 386553 342925 351764 382711 384260 424402
6091D24402N439J1696o2849m0247k2917O6816M0585l6435l260Q527M5240k6838
$$ 424402 429841 441537 378688 338441 315524 382340 422925 386490 383230 391757 436997 410159
6079D10159k6817J4873j5547P818P5281q103J96M6480K3424m0851o460L861J695
$$ 410159 383342 398215 382668 390486 465767 457664 457860 504340 527764 486913 480453 484314 486009
6066D86009j1263o668P501n4339M8254N5188o4475R270M9855l3255K9785M555
$$ 486009 474746 468078 475579 421240 469494 524682 460207 469477 519332 486077 515862 520417
6054E20417l3159j3584K4065q85m0914j1366J5397K0957L8763M794P16N267r698
$$ 520417 487258 473674 497739 496854 455940 444574 459971 480928 519691 524485 525201 530468 520770
6041E20770l238j738k2582m6933K8269O1432R920l4319j8871M764k7189L7643
$$ 520770 517532 515794 493212 446279 474548 535980 545900 511581 492710 497474 470285 507928
6029E07928J3372K6038j9804M6723q403p026J5200l1299K4107M6176R782k9912
$$ 507928 521300 547338 527534 574257 565854 558828 574028 542729 566836 613012 622794 592882
6017E92882j2999k6542N82P5462J6712p728L376l596L2739K8998j7055J4912m5522
$$ 592882 579883 553341 553923 629385 646097 638369 641745 638149 670888 699886 682831 697743 652221
6004F52221m3671N6830L137J6035L5722J4532N9230p0773m311k7253L712N2168
$$ 652221 608550 665380 668517 684552 720274 734806 794036 723263 718952 691699 695411 747579
5992G47579q034n674r258R626n990l4810k300p994n729l7181Q098M0910l5419
$$ 747579 739545 733871 724613 734239 728249 693439 691139 683145 677416 640235 648333 689243 653824
5979F53824R034l525R287N1013o99l0699N0287j3520Q296N8441J22j6757m129
$$ 653824 662858 659333 668620 719633 718934 688235 738522 725002 733298 791739 791861 775104 770975
5966G70975K0413K3864O2700o3380k9935l078p0634O2202P334J9726k9414L635
$$ 770975 791388 815252 877952 814572 784637 781559 710925 773127 780461 800187 770773 774408
5954G74408N5846Q377r285K8703K2157K4708J0157m8607r483J9474J7204p078
$$ 774408 830254 838631 829346 858049 880206 904914 915071 866464 856981 876455 893659 886581
5942H86581j0L8873l6081O382q546k2058L2340o984J1927K2065l5262K5491M1339
$$ 886581 886571 925444 889363 895745 887199 865141 897481 890497 902424 924489 889227 914718 956057
5929I56057p4r742J7766j083J3229n150J7258l845o571K1980k0734m2363l0158
$$ 956057 955983 946241 964007 962924 976153 971003 988261 984416 977845 999825 979091 936728 906570
5916I06570J6608M062K78k1336P312K9048j6984L60J9764k2485k9633O4533M9785
$$ 906570 923178 927240 927518 906182 913494 942542 925558 925918 945682 923197 893564 958097 1007882
5903A007882l7779m9510J2542J4322L847M6872M4882Q264K4187M1345J9634k0257
$$ 1007882 970103 920593 933135 947457 951304 998176 1043058 1051322 1075509 1116854 1136488 1116231
5891A116231J0682l131n47N4952K1092J3999L8924n511l8263q711J6539J4639
$$ 1116231 1126913 1123782 1123235 1178187 1199279 1213278 1252202 1246691 1208428 1199717 1216256 1230895
5879A230895M7239m9005j8209P884L1727L9690O241k6021l9627R0810L2251M0593
$$ 1230895 1278134 1229129 1210920 1218804 1250531 1290221 1296462 1270441 1230814 1321624 1353875 1394468
5867A394468k1122N9735K1870o242J2494L6630k3248m8859J2536j1115J8874K1137
$$ 1394468 1373346 1433081 1454951 1448709 1461203 1497833 1474585 1425726 1438262 1427147 1446021 1467158
5855A467158K5912M6974l082m3489j7134J4316L2925K5984n0313K3800n918J7866
$$ 1467158 1493070 1540044 1536962 1493473 1476339 1490655 1523580 1549564 1499251 1523051 1517133 1534999
5843A534999O6836J5770J2229j0849j0275n029k0731o9254K6008K9617N6306P938
$$ 1534999 1601835 1617605 1629834 1618985 1608710 1603681 1582950 1513696 1539704 1569321 1625627 1633565
5831A633565n0200J6787J5044L4106J9270M97l821K1374J8544M0486O253L61K163
$$ 1633565 1583365 1600152 1615196 1649302 1668572 1669069 1665248 1686622 1705166 1745652 1751905 1752266 1754429
5818A754429Q046K6605j594O931J945k3660j898J8727L4230r135J7511O590P578
$$ 1754429 1762475 1789080 1787486 1794417 1796362 1772702 1770804 1789531 1823761 1814626 1832137 1838727 1846305
5805A846305p5282N291Q274j6560j7986N662L3166J9866m0799j72M9179j3220
$$ 1846305 1771023 1776314 1784588 1768028 1750042 1755704 1788870 1808736 1767937 1767765 1816944 1803724
5793A803724M1165l2976K0352Q72P6191k1895L6047K4421L0734M4035K7269M0182
$$ 1803724 1844889 1811913 1832265 1833137 1909328 1887433 1923480 1947901 1978635 2022670 2049939 2090121
5781B090121O522K0893N8310N7132O0274K5278M2481N6199l230m462O8873N9175
$$ 2090121 2096643 2117536 2175846 2232978 2293252 2318530 2361011 2417210 2413980 2409518 2478391 2537566
5769B537566P1219O3504J00958L7871Q3013J46728m008K0784Q0254Q9660N2723
$$ 2537566 2608785 2672289 2773247 2811118 2894131 3040859 3036851 3057635 3137889 3227549 3280272
5758C280272J06828J13977Q5021R1065k206Q1388J08405O5149L9675p55K2849
$$ 3280272 3387100 3501077 3586098 3677163 3674957 3756345 3864750 3929899 3969574 3968819 3991668
5747C991668K1423J3033K0238k9387k47M1285J2225j4299L4473J16841N7552J14673
$$ 3991668 4013091 4026124 4046362 4016975 4016728 4058013 4070238 4055939 4090412 4207253 4264805 4379478
5735D379478J02913J10039J05867N4080k0350K0459o3020o3500o6060p1881q6096
$$ 4379478 4482391 4592430 4698297 4752377 4732027 4752486 4689466 4625966 4559906 4488025 4401929
5724D401929p0321p66k9399m775j5401L5055N2374l4142J7984N8135M8156M1980
$$ 4401929 4331608 4330842 4301443 4296668 4281267 4316322 4368696 4334554 4352538 4410673 4458829 4500809
5712D500809P5734Q4329Q2404J04244J39140P7546J17157J34313J60330K08631
$$ 4500809 4576543 4660872 4743276 4847520 4986660 5064206 5181363 5315676 5476006 5684637
5702E684637J82303J97051K17488K04803K67427L76265L33865L10197L47254L68324
$$ 5684637 5866940 6063991 6281479 6486282 6753709 7129974 7463839 7774036 8121290 8489614
5692H489614M16595M26954M03676M26468M21688K87571K57487K16443J35492R3209
$$ 8489614 8906209 9333163 9736839 10163307 10584995 10872566 11130053 11346496 11481988 11575197
5682A1575197k2780M8145K695O7858J05895J48053J59398K13712K92295K41206
$$ 11575197 11552417 11600562 11603257 11671115 11777010 11925063 12084461 12298173 12590468 12831674
5672A2831674K86927K84835K89475K54188J68234P4337l4777o5649o8642k53556
$$ 12831674 13118601 13403436 13692911 13947099 14115333 14189670 14154893 14089244 14020602 13767046
5662A3767046k80234l67446m06056m59082m33292m26574l87818l44948l75191
$$ 13767046 13486812 13119366 12713310 12254228 11820936 11394362 11006544 10661596 10286405
5653A0286405k81432l05926k20798j59391j26573j62656k2663q532k9369k4808
$$ 10286405 10004973 9699047 9478249 9318858 9192285 9029629 9006966 8998434 8969065 8944257
5643H944257R3869J34938Q9908J33316J35205K16975K63015K27911L17078K91447
$$ 8944257 9038126 9173064 9262972 9396288 9531493 9748468 10011483 10239394 10556472 10847919
5633A0847919K42277K96639K45855J07371N4724n3272j88365k50623l92030m72801
$$ 10847919 11090196 11386835 11632690 11740061 11794785 11741513 11553148 11302525 10910495 10437694
5623A0437694m23640l96118m42345l74716l20153l12734k98002k30200j72130
$$ 10437694 10014054 9617936 9175591 8800875 8480722 8167988 7869986 7639786 7467656
5614G467656j66647j78265j13803p5201j35941j07301j00173o3160p5091o9754
$$ 7467656 7301009 7122744 7008941 6933740 6797799 6690498 6590325 6527165 6452074 6382320
5604F382320k8488k6707K0015K3613l5663L1732p536m847N6351j0709K0951N8526
$$ 6382320 6353832 6327125 6347140 6370753 6335090 6366822 6359286 6354439 6410790 6400081 6421032 6479558
5592F479558K4186M389N5472J34208L8737R7204J42425J04379J57005J92742J73663
$$ 6479558 6503744 6508133 6563605 6697813 6736550 6833754 6976179 7080558 7237563 7430305 7603968
5581G603968K15011K11049K30899K41430K09188L12493L27853L37418L26262L45487
$$ 7603968 7818979 8030028 8260927 8502357 8711545 9024038 9351891 9689309 10015571 10361058
5571A0361058L31608L40051L28862K60693K16723J64865J8920j1340k6054l2216
$$ 10361058 10692666 11032717 11361579 11622272 11838995 12003860 12022780 12011440 11985386 11953170
5561A1953170j59964j05143j07449j22242o795m6561o5474n0395p4490j8828P27
$$ 11953170 11793206 11688063 11580614 11458372 11451577 11405016 11339542 11289147 11214657 11195829 11196556
5550A1196556J0185J10343J04730N5846J35840N9523Q4231R1993J17498J10401
$$ 11196556 11206741 11317084 11421814 11477660 11613500 11673023 11757254 11849247 11966745 12077146
5540A2077146J2566O9622L1055Q7058J35406Q8368O7199O5509J15528J41240J66386
$$ 12077146 12089712 12159334 12190389 12277447 12412853 12501221 12568420 12633929 12749457 12890697 13057083
5529A3057083J20297J49392K26121J75933J59155J48156J37835J22898J09891
$$ 13057083 13177380 13326772 13552893 13728826 13887981 14036137 14173972 14296870 14406761
5520A4406761J78431J17818J68949J38368J61954K03920J68667K34135K22816
$$ 14406761 14585192 14703010 14871959 15010327 15172281 15376201 15544868 15779003 16001819
5511A6001819K37440K42478J99938J36506J15138J04546J61167K00174J34272
$$ 16001819 16239259 16481737 16681675 16818181 16933319 17037865 17199032 17399206 17533478
5502A7533478J38888K28141J93562K19966K87422L56073L20595L42724M15308
$$ 17533478 17672366 17900507 18094069 18314035 18601457 18957530 19278125 19620849 20036157
5493B0036157M30897N02663N33072M86823O00323O19129O23243P13993P01763
$$ 20036157 20467054 20969717 21502789 21989612 22589935 23209064 23832307 24546300 25248063
5484B5248063P85045Q00755Q34675R67018J052433J124199J247764J359967J524470
$$ 25248063 26033108 26833863 27668538 28635556 29687989 30812188 32059952 33419919 34944389
5475C4944389J644799J784952K001763K195815K428618K758612L026818L369250
$$ 34944389 36589188 38374140 40375903 42571718 45000336 47758948 50785766 54155016
5467E4155016L836562M159657M709638N148218N573713N876035O056422O111952
$$ 54155016 57991578 62151235 66860873 72009091 77582804 83458839 89515261 95627213
5459I5627213O080810N972337N791396N550409N017061M104965K535864N79033
$$ 95627213 101708023 107680360 113471756 119022165 124039226 128144191 130680055 131259088
5451A31259088j400212l036133m226372m967711n336029n682362o028761o255945
$$ 131259088 129858876 126822743 122596371 117628660 112292631 106610269 100581508 94325563
5443I4325563o349864o320963o093695n723978n235320m884946m399828l933307
$$ 94325563 87975699 81654736 75561041 69837063 64601743 59716797 55316969 51383662
5435E1383662l483106l103081k863621k528689k368342k210171j936071j839563
$$ 51383662 47900556 44797475 41933854 39405165 37036823 34826652 32890581 31051018
5427C1051018j621384j497139j352032j225739j145366r96257r58257q82424p82776
$$ 31051018 29429634 27932495 26580463 25354724 24209358 23213101 22254844 21372420 20589644
5418B0589644o77936p15264o22511n46771n50042m43777m68999n07570m02012
$$ 20589644 19911708 19196444 18573933 18027162 17477120 17033343 16564344 16056774 15654762
5409A5654762m00705l65741l31845l10601l81308k71035k02035j40648o9845j64092
$$ 15654762 15254057 14888316 14556471 14245870 13864562 13593527 13391492 13250844 13180999 13016907
5399A3016907k76495m34144n55092m38028m29702l73937l00209k27804k47411
$$ 13016907 12740412 12306268 11751176 11313148 10883446 10509509 10209300 9981496 9734085
5390I734085k92791j82876j78563j90840j73331j55493j25734j38122j61356j63213
$$ 9734085 9441294 9258418 9079855 8889015 8715684 8560191 8434457 8296335 8134979 7971766
5380G971766j36573j03272j05789j26376j25804l9049r7045q4745l0344O258p36
$$ 7971766 7835193 7731921 7626132 7499756 7373952 7334903 7237858 7153113 7122769 7129027 7128291
5369G128291J06776Q9184r1633l05091l42443l10679k71410j47360j53435j62775
$$ 7128291 7235067 7324251 7232618 6927527 6585084 6274405 6002995 5855635 5702200 5539425
5359E539425j67853q6992j09204j17224o9851j34848p3105m8688j38390o4845
$$ 5539425 5371572 5284580 5175376 5058152 4988301 4853453 4780348 4731660 4593270 4528425
5349D528425m4669r3312m9162m1255m6102o1909q4305K60r086k2585n039J6833
$$ 4528425 4483756 4390444 4341282 4300027 4253925 4192016 4107711 4107971 4098885 4076300 4071261 4088094
5337D088094J7916K1588m2642j66590j36840j05039n4928p9694p4787o9206M106
$$ 4088094 4106010 4127598 4084956 3918366 3781526 3676487 3621559 3541865 3467078 3397872 3401978
5326C401978m6984q7101n6488l8659L2352k6745M590m4970r888n4098n3838J7216
$$ 3401978 3354994 3267893 3211405 3172746 3205098 3178353 3182943 3137973 3128085 3073987 3020149 3037365
5314C037365l8051n2416k2023k2711N5632o54q0406m0815R507k9826m3882m0526
$$ 3037365 2999314 2946898 2924875 2902164 2957796 2957142 2876736 2835921 2845428 2815602 2771720 2731194
5302B731194n1278J6579R140l754n6937J3450o5339o2876O2806p370J6681m566
$$ 2731194 2679916 2696495 2705635 2701881 2644944 2658394 2593055 2530179 2592985 2585615 2602296 2597730
5290B597730L9826r40L8911k5575m8425k920O6554K7709m8822R115j3942M9225
$$ 2597730 2637556 2636616 2675527 2649952 2601527 2598607 2665161 2692870 2644048 2653163 2639221 2688446
5278B688446l0173j01478M0920p459j0589L792k4231l657r464j6406n2199k3341
$$ 2688446 2658273 2556795 2597715 2590256 2579667 2583459 2559228 2555571 2546107 2529701 2477502 2454161
5266B454161k4899l3433l7119j9018j534M4086M0953J8140p3220q2977J6434N0911
$$ 2454161 2429262 2395829 2358710 2339692 2338158 2382244 2423197 2441337 2368117 2285140 2301574 2352485
5254B352485m1998m9942j5423l5715m183J8644m2686n3755l6270k9736l4127J2412
$$ 2352485 2310487 2260545 2245122 2209407 2205224 2223868 2181182 2127427 2091157 2061421 2027294 2039706
5242B039706j2588N2143L6432l5403o1337M1585J4534k0898n6559m4301m8207
$$ 2039706 2027118 2079261 2115693 2080290 2018953 2060538 2075072 2054174 1997615 1953314 1905107
5231A905107J8448J5275L6997m621m7699j4845O833N334j3798r69n107k2198J2355
$$ 1905107 1923555 1938830 1975827 1971206 1923507 1908662 1915495 1920829 1907031 1906062 1900955 1878757 1891112
5218A891112k0337q594P4019J2820n994n1217K7771P420J7127k906m3560o348
$$ 1891112 1870775 1862181 1936200 1949020 1943026 1891809 1919580 1927000 1944127 1941221 1897661 1891313
5206A891313L1914m5484J9001j044k9416N8380J3145k1209k8170j3771j760n245
$$ 1891313 1923227 1877743 1896744 1895700 1866284 1924664 1937809 1916600 1888430 1874659 1872899 1867654
5194A867654n7013M701j1653K3786j809k0744M3897K4918k2650m75K4566m1643
$$ 1867654 1810641 1815342 1803689 1827475 1825666 1804922 1848819 1873737 1851087 1850612 1875178 1833535
5182A833535l2039J1334K1135k4094l1231n180J3138K6116O0954L2203j7736J5945
$$ 1833535 1801496 1812830 1833965 1809871 1778640 1773460 1786598 1812714 1873668 1905871 1888135 1904080
5170A904080K9370O793j1843l0594O0693n038M3610P522L3894L5869L3138J2652
$$ 1904080 1933450 1940243 1928400 1897806 1958499 1953461 1997071 2004593 2038487 2074356 2107494 2120146
5158B120146K5280K5276j5099K7271N7211P5237J0191R06L1367O6091N4703k9344
$$ 2120146 2145426 2170702 2155603 2182874 2240085 2315322 2325513 2326419 2357786 2423877 2478580 2449236
5146B449236K4952k5305m1545l4339k5853K1644M609j9823m9232N4669L2817L0124
$$ 2449236 2474188 2448883 2407338 2372999 2347146 2368790 2373399 2353576 2304344 2359013 2391830 2421954
5134B421954J7124L9882K6671R9240J37741R0407K03657L56606M63303N08065
$$ 2421954 2439078 2478960 2505631 2604871 2742612 2833019 3036676 3393282 3856585 4364650
5124D364650L09227j79855n98592n78999m06329k65745k26021j92413j24337j20237
$$ 4364650 4673877 4494022 3895430 3316431 2910102 2644357 2418336 2225923 2101586 1981349
5114A981349r4822k4070m9898m2945m5055k1652k9813m5325K533k3162K6183l1112
$$ 1981349 1886527 1862457 1812559 1769614 1724559 1702907 1673094 1627769 1630302 1607140 1633323 1602211
5102A602211p326J0938j5436J9833k4295k5208O0080l2762n6841P371l2064N966
$$ 1602211 1594885 1605823 1590387 1610220 1585925 1560717 1620797 1588035 1531194 1538565 1506501 1512467
5090A512467J9580o148j790j5620J372L80K143o8823J2672M8455m6044j8897o477
$$ 1512467 1532047 1525899 1524109 1508489 1509861 1510241 1512384 1443561 1456233 1504688 1458644 1439747 1433270
5077A433270N4029j1043j3794p79K8975P662k9223k5175k5457K2091m3926o45
$$ 1433270 1487299 1476256 1462462 1461683 1490658 1498320 1469097 1443922 1418465 1440556 1396630 1395985
5065A395985K0857n5590k5480N9348j8649l1315J953L2299k339m3548j6443O516
$$ 1395985 1416842 1361252 1335772 1395120 1376471 1345156 1347109 1379408 1377069 1333521 1317078 1323594
5053A323594m430P79O942J0010j8299P641K9982l0839o589Q186L5318N382q860
$$ 1323594 1319164 1319943 1326885 1336895 1318596 1326237 1356219 1325380 1318791 1326977 1362295 1367677 1358817
5040A358817K4809k303k7946n5936o4959L5685o9826P12M2523J6537N2277k6632
$$ 1358817 1383626 1381323 1353377 1297441 1232482 1268167 1198341 1199053 1241576 1258113 1310390 1283758
5028A283758J0378l342k58r208k1934k3416p7174j0709K6790J1257M62l4378J4309
$$ 1283758 1294136 1290794 1290536 1281328 1259394 1235978 1158804 1148095 1174885 1186142 1186604 1152226 1166535
5015A166535j2944q945M0J7464N61J127O224J0831j0287k3357N3404m4469r750
$$ 1166535 1153591 1144646 1144686 1162150 1162711 1163838 1170062 1180893 1170606 1147249 1200653 1156184 1146434
5002A146434O2462k9836m6926j024P9924j6870m3319j003l5292J7618O7377L7489
$$ 1146434 1208896 1179060 1132134 1131110 1211034 1194164 1150845 1149842 1114550 1132168 1199545 1237034
4990A237034P816k5419j3492l7219l7605M3891L243L9482l8008j6380k7644L0569
$$ 1237034 1244850 1219431 1205939 1168720 1131115 1175006 1178249 1217731 1179723 1163343 1135699 1166268
4978A166268K8947K1284R670j7947l4447P652J7217j8704K5502m1314Q696L9115
$$ 1166268 1195215 1216499 1226169 1208222 1173775 1181427 1198644 1179940 1205442 1164128 1172824 1211939
4966A211939k0541J4324j2391m0643q478J5230J6845L2405q783j0677J9033m9524
$$ 1211939 1191398 1205722 1193331 1152688 1144210 1159440 1176285 1208690 1199907 1189230 1208263 1158739
4954A158739K7789M647o7109L1450L5477j3932L3305J1150n8549m930N3084O2657
$$ 1158739 1186528 1191175 1124066 1155516 1190993 1177061 1210366 1221516 1162967 1158037 1211121 1273778
4942A273778j3640n729J6563j0830j8724O0965k5777j1473K7701n1024K4613J2029
$$ 1273778 1260138 1254409 1270972 1260142 1241418 1302383 1276606 1265133 1292834 1241810 1266423 1278452
4930A278452K1257o725k9259K7241L6542L041l4015J8879Q8318J375L040j8755
$$ 1278452 1299709 1292984 1263725 1290966 1327508 1330549 1296534 1315413 1403731 1405106 1408146 1389391
4918A389391P0310n8151m0868O771K9177M9207k9455l0145K4939Q3745O548l6179
$$ 1389391 1459701 1401550 1360682 1367453 1396630 1445837 1416382 1386237 1411176 1494921 1501469 1465290
4906A465290m3471K5511M5224N5916l278L0972L21J8163Q604j5409N3303k3157
$$ 1465290 1421819 1447330 1492554 1548470 1545192 1576164 1576485 1594648 1603252 1587843 1641146 1617989
4894A617989p523q001k0710J3186j87j0221j6928j5681J170m5275K4977O5468
$$ 1617989 1610466 1602465 1581755 1594941 1594754 1584533 1567605 1551924 1553094 1507819 1532796 1598264
4882A598264m4221m6623N1188k4011k6639j0421Q0523L7526k2146r666J606o60
$$ 1598264 1554043 1507420 1558608 1534597 1507958 1497537 1578060 1615586 1593440 1583774 1585380 1584720
4870A584720m572r062j3037J2681k6228p268l526M1231l795j5749J2888Q1104
$$ 1584720 1580148 1571086 1558049 1570730 1544502 1537234 1533708 1574939 1571144 1555395 1568283 1649387
4858A649387M9227m1700l8366m9574k716K7755Q793N6249M2950n7109k2498J7600
$$ 1649387 1698614 1656914 1618548 1568974 1566258 1594013 1602806 1659055 1702005 1644896 1622398 1639998
4846A639998N1106k8961J1279K8452J4632j9387J1649L611K8767n748Q454L2670
$$ 1639998 1691104 1662143 1673422 1701874 1716506 1697119 1708768 1712379 1741146 1735398 1743852 1776522
4834A776522N6436p2792k3602R2981m5216Q418K9712R6430n4373M8599L4087n7709
$$ 1776522 1832958 1760166 1736564 1829545 1784329 1792747 1822459 1918889 1864516 1913115 1947202 1889493
4822A889493M213k3817L9857N0754L8237P7945R3450O1227j9788l136K2141m523
$$ 1889493 1893706 1869889 1909746 1960500 1998737 2076682 2170132 2231359 2211571 2208435 2230576 2226053
4810B226053m5710M4409k4601J7532J0395j9987K3815J4532Q930m4503j7076K7301
$$ 2226053 2180343 2224752 2200151 2217683 2228078 2208091 2231906 2246438 2255368 2210865 2193789 2221090
4798B221090J6539l5305K170L0750K9600j9546m226J6492k3967O7945N8323j5290
$$ 2221090 2237629 2202324 2204494 2235244 2264844 2245298 2241072 2257564 2233597 2301542 2359865 2344575
4786B344575j472j5084J3664J1682N5516L2117M0389O5228M4549L3139K9762J32072
$$ 2344575 2343103 2328019 2341683 2353365 2408881 2440998 2481387 2546615 2591164 2624303 2654065 2786137
4774B786137O6919J5757j7869O4039L8773N6293L8321N8211R8950J7671M5745
$$ 2786137 2853056 2868813 2850944 2914983 2953756 3010049 3048370 3106581 3205531 3223202 3268947
4763C268947Q6106R1064O5364L5675N9855J33317R7576R4328J20925Q4685R9208
$$ 3268947 3355053 3446117 3511481 3547156 3607011 3740328 3837904 3932232 4053157 4137842 4237050
4752D237050J17309J00437J41241J45535J59698J99573J81957J98690J56623J79925
$$ 4237050 4354359 4454796 4596037 4741572 4901270 5100843 5282800 5481490 5638113 5818038
4742E818038J16050J14573R2957R5711k8614j31139r3478p4596R883J8336J3808
$$ 5818038 5934088 6048661 6141618 6237329 6208715 6077576 5984098 5909502 5919385 5937721 5951529
4731E951529M4396m4920k6228q3634q7308l2654k0067O4634K6765K8212K0106
$$ 5951529 5995925 5951005 5924777 5841143 5753835 5721181 5701114 5765748 5792513 5820725 5840831
4720E840831J9904L9787O7076O8009O3626N0088N0377M5563J36910J10282P8704
$$ 5840831 5860735 5900522 5967598 6035607 6099233 6149321 6199698 6245261 6382171 6492453 6571157
4709F571157O9946R7602N4699R8559P0951R4842O0535P4880O4727J26287J01049
$$ 6571157 6641103 6738705 6793404 6891963 6962914 7057756 7118291 7193171 7257898 7384185 7485234
4698G485234P6623R8112J54668J20708R5790J38985Q2787J09021J50890J06757
$$ 7485234 7561857 7659969 7814637 7935345 8031135 8170120 8252907 8361928 8512818 8619575
4688H619575J99016J20395J33534J91720J36607J66301J40553J22049J65745J13422
$$ 8619575 8818591 8938986 9072520 9264240 9400847 9567148 9707701 9829750 9995495 10108917
4678A0108917J37886J27033J08696J16458J03003J37746J11529J77712J52371
$$ 10108917 10246803 10373836 10482532 10598990 10701993 10839739 10951268 11128980 11281351
4669A1281351J96908J26018J55049K29268K22826J83418K45142K51066L10346
$$ 11281351 11478259 11604277 11759326 11988594 12211420 12394838 12639980 12891046 13201392
4660A3201392L36243L76755L32383L48353K83888L20782K79735J85030K26598
$$ 13201392 13537635 13914390 14246773 14595126 14879014 15199796 15479531 15664561 15891159
4651A5891159K04365K33995K18259K69760L14506L00943L51971L98507M31392
$$ 15891159 16095524 16329519 16547778 16817538 17132044 17432987 17784958 18183465 18614857
4642A8614857M80738N10417N89621N86052O66138O82183Q16679Q94673R29085
$$ 18614857 19095595 19606012 20195633 20781685 21447823 22130006 22946685 23841358 24770443
4633B4770443R91516J046539J140097J278853J335843J368850J544970J638538
$$ 24770443 25761959 26808498 27948595 29227448 30563291 31932141 33477111 35115649
4625C5115649J707048J774165J714193J702710J458593J195161R32063N76381
$$ 35115649 36822697 38596862 40311055 42013765 43472358 44667519 45599582 46175963
4617D6175963L03734K5403j17304j80990j62771j23284l4997J32468M44920O43935
$$ 46175963 46479697 46505100 46387796 46206806 46044035 45920751 45885754 46018222 46463142 47107077
4607D7107077P98709J033276J270720J534975J852515K067676K267095K522890
$$ 47107077 47905786 48939062 50209782 51744757 53597272 55664948 57932043 60454933
4599F0454933K734203L042285L156442L169566L056412K707117K078272J117636
$$ 60454933 63189136 66231421 69387863 72557429 75613841 78320958 80399230 81516866
4591H1516866o2784j327197k548601l356932l491964l330630k938021k498177
$$ 81516866 81454082 80126885 77578284 74221352 70729388 67398758 64460737 61962560
4583F1962560j961897j355601r49605n77477k53355L4848K55121M54251O43395
$$ 61962560 60000663 58645062 57695457 57117980 56864625 56899473 57154594 57608845 58252240
4574E8252240Q52937R78729J065135J085885R95041O74653J47193l31312j047459
$$ 58252240 59105177 60083906 61149041 62234926 63229967 63904620 64051813 63720501 62673042
4565F2673042j707686k219390k493676k747945k743057k611957k344062k062538
$$ 62673042 60965356 58745966 56252290 53504345 50761288 48149331 45805269 43742731
4557D3742731j786165j566974j359982j123195r53596p60185o16057n31690m47757
$$ 43742731 41956566 40389592 39029610 37906415 36952819 36192634 35576577 35044887 34597130
4548C4597130m45708m00152l20567l29857l27334l69035l47202l36255l50878
$$ 34597130 34151422 33751270 33430703 33100846 32773512 32404477 32057275 31721020 31370142
4539C1370142l22831k98777k84499k77496k60351k72652k56652k62313j80766
$$ 31370142 31047311 30748534 30464035 30186539 29926188 29653536 29396884 29134571 28953805
4530B8953805j30561j13038m3860m6081l473M8327J52879J57709J07476J03597
$$ 28953805 28823244 28710206 28666346 28620265 28616792 28665119 28817998 28975707 29083183 29186780
4520B9186780J35970Q6643N3636J51300J16993J17600J89751K18647K67587L13117
$$ 29186780 29322750 29409393 29463029 29614329 29731322 29848922 30038673 30257320 30524907 30838024
4510C0838024M06720M05376M85195N54363N30299M84508N41128L98430L69004
$$ 30838024 31244744 31650120 32135315 32689678 33219977 33704485 34245613 34644043 35013047
4501C5013047L08530K52157J93508J02805J40556J15314J20839J69340K77203
$$ 35013047 35321577 35573734 35767242 35870047 36010603 36125917 36246756 36416096 36693299
4492C6693299L11375L87880L75596M61929N67979O22898O74599P52477Q22081
$$ 36693299 37004674 37392554 37768150 38230079 38798058 39420956 40095555 40848032 41670113
4483D1670113R58886J030429J057755J229512J254417J357582J391820J481976
$$ 41670113 42628999 43659428 44717183 45946695 47201112 48558694 49950514 51432490
4475E1432490J605183J610954J689799J682885J766386J722864J764489J816549
$$ 51432490 53037673 54648627 56338426 58021311 59787697 61510561 63275050 65091599
4467F5091599J936281J958087J993021K075340K283940K379085K541522L042154
$$ 65091599 67027880 68985967 70978988 73054328 75338268 77717353 80258875 83301029
4459H3301029L388182L897764M385253M922166N492020O135853O848384P780021
$$ 83301029 86689211 90586975 94972228 99894394 105386414 111522267 118370651 126150672
4451A26150672Q787964J0130947J1725855J3744941J6196656J8831565K1115353
$$ 126150672 134938636 145069583 156795438 170540379 186737035 205568600 226683953
4444B26683953K1811666J8993180J1361740K908j1404917j8667574k0787565j9533639
$$ 226683953 248495619 267488799 278850539 278853447 267448530 248780956 227993391 208459752
4436B08459752j6949593j4178348j1520835r369375p625556o287492n247772m514756
$$ 208459752 191510159 177331811 165810976 156441601 148816045 142528553 137280781 132766025
4428A32766025l935072l443605k981778k649002k255187j885728j501625j033935
$$ 132766025 128830953 125387348 122405570 119756568 117501381 115615653 114114028 113080093
4420A13080093p28103k33123J70105N15718J010395J500663J893515K203884K470502
$$ 113080093 112351990 112118867 112288972 112804690 113815085 115315748 117209263 119413147 121883649
4411A21883649K720036L046293L279661L323283L277383L249799L166688L073778
$$ 121883649 124603685 127649978 130929639 134252922 137530305 140780104 143946792 147020570
4403A47020570L318581L545562L822717M028437L749649K704970J249679l73799
$$ 147020570 150339151 153884713 157707430 161735867 165485516 168190486 169440165 169066366
4395A69066366k162316l977151n146705n275014m642719l622104k292005q99249
$$ 169066366 166904050 162926899 157780194 152505180 147862461 144240357 141948352 141049103
4387A41049103M63978J678116K749205L827777M896642O129096P622444R385958
$$ 141049103 141513081 143191197 145940402 149768179 154664821 160793917 168416361 177802319
4379A77802319J1651153J4729691J8464598K2134167K4169728K2554522J7103524
$$ 177802319 189453472 204183163 222647761 244781928 268951656 291506178 308609702
4372C08609702R335981R81244p510585j5953336k2566711k5656223k5300794k2915131
$$ 308609702 317945683 318926927 311416342 295463006 272896295 247240072 221939278 199024147
4364A99024147k0029103j7423413j4920263j2807275j0941249r329764q061255
$$ 199024147 178995044 161571631 146651368 133844093 122902844 113573080 105511825
4357A05511825p085950o264472n579435m988544m479393m097725l646560l371629
$$ 105511825 98425875 92161403 86581968 81593424 77114031 73016306 69369746 65998117
4349F5998117l103740k874372k602655k450727k287223k098748j957850j865079
$$ 65998117 62894377 60020005 57417350 54966623 52679400 50580652 48622802 46757723
4341D6757723j708165j531210j434312j344475j323678j234769j048176r71524
$$ 46757723 45049558 43518348 42084036 40739561 39415883 38181114 37132938 36161414
4333C6161414r44799r15933q62762p65330p63151p98573q04884p94064q11794
$$ 36161414 35216615 34300682 33437920 32672590 31909439 31110866 30305982 29511918 28700124
4324B8700124q06618p91686p74019p54468o85835o66224n95299n23541o20367
$$ 28700124 27893506 27101820 26327801 25573333 24887498 24221274 23625975 23102434 22482067
4315B2482067n60216m88139m87728m95936n55824m61255m51033n04666m56076
$$ 22482067 21921851 21433712 20945984 20450048 19894224 19432969 18981936 18477270 18021194
4306A8021194l78055m31896l86524l91460l55156k72533l11497k91819l00091
$$ 18021194 17643139 17211243 16824719 16433259 16078103 15805570 15494073 15202254 14902163
4297A4902163k73118k22520k37692j85873j28914k36424j99283j62760q7099j05776
$$ 14902163 14629045 14406525 14168833 13982960 13854046 13617622 13418339 13255579 13168480 13062704
4287A3062704j34139j70512j38811j90751j97187j84455j64945j99453j25605
$$ 13062704 12928565 12758053 12619242 12428491 12231304 12046849 11881904 11682451 11556846
4278A1556846j66300j53176j54139k04285j29544j81221j34854j25980j75626
$$ 11556846 11390546 11237370 11083231 10878946 10749402 10568181 10433327 10307347 10131721
4269A0131721j97981j54579j50168q9476k8368m6110p5946j2808j19994m4609
$$ 10131721 9933740 9779161 9628993 9539517 9511149 9465039 9389093 9376285 9256291 9211682
4259I211682j00075p1137r7925r6874p7465j54429j04732j52725j26839o3618
$$ 9211682 9111607 9040470 8942545 8845671 8768206 8613777 8509045 8356320 8229481 8165863
4249H165863j14106j48281k1438l4053l2907l2108L88J663j3967l624o1829J6696
$$ 8165863 8051757 7903476 7882038 7847985 7815078 7782970 7783358 7785021 7771054 7767430 7705601 7722297
4237G722297N2898J27799R3619O2857P0488M8051j5906l6842n5498j12738j39423
$$ 7722297 7775195 7902994 7996613 8059470 8129958 8178009 8162103 8125261 8069763 7957025 7817602
4226G817602j16213j26666j16219j47159j86523q8618j12663p0705m387j3420
$$ 7817602 7701389 7574723 7458504 7311345 7124822 7036204 6923541 6852836 6848449 6835029
4216F835029j6770k9454l8179r960o1078n6611J9898P387P122k0542K4832L8685
$$ 6835029 6818259 6788805 6750626 6740666 6679588 6622977 6642875 6650262 6657384 6636842 6661674 6700359
4204F700359O365o5063J0766r3325j46670j52298j01837n9989o1033p3567l4805
$$ 6700359 6706724 6641661 6652427 6559102 6412432 6260134 6158297 6098308 6037275 5963708 5928903
4193E928903l0616l1663K4886L0647m2549j3025o655Q210P641M9485p4882q6133
$$ 5928903 5898287 5866624 5891510 5922157 5879608 5866583 5859928 5868138 5875779 5925264 5850382 5764249
4181E764249j0616l3736K8694Q649R9666M0878J1415P5748O1856N2703O269m8787
$$ 5764249 5753633 5719897 5748591 5757240 5856906 5897784 5909199 5984947 6046803 6099506 6105775 6056988
4169F056988n5308j26615m8284m5882m348j12667m5220k52o6848L9212O1443j130
$$ 6056988 6001680 5875065 5826781 5780899 5776551 5663884 5618664 5618412 5551564 5590776 5652219 5651089
4157E651089K3703k0609k7054Q3575R3723N6109M7074J21065P4700J6583J34724
$$ 5651089 5674792 5654183 5627129 5710704 5804427 5860536 5907610 6028675 6103375 6119958 6254682
4146F254682Q2426Q3963J55608J77534J54976K41894K18344J64409J29738J56271
$$ 6254682 6337108 6421071 6576679 6754213 6909189 7151083 7369427 7533836 7663574 7819845
4136G819845J02359M9959N3985M5709K0395Q4887Q5938P1982J53698K05813K02611
$$ 7819845 7922204 7972163 8026148 8071857 8092252 8177139 8263077 8335059 8488757 8694570 8897181
4125H897181K78762K22691K37477K24868J70600K78661L28233M46398N99323O17946
$$ 8897181 9175943 9398634 9636111 9860979 10031579 10310240 10638473 11084871 11684194 12302140
4115A2302140O53274Q22918Q97289R87334J191741J385550J676276K070323K749645
$$ 12302140 12955414 13778332 14675621 15662955 16854696 18240246 19916522 21986845 24736490
4106B4736490L642631N558957Q555023J1926605J0890021K046628j0206573j4127880
$$ 24736490 28379121 33938078 42493101 54419706 65309727 67356355 57149782 43021902
4098D3021902r588892o213492m408952l193150k204253j737049j220715p90080
$$ 43021902 33433010 27219518 22810566 19617416 17413163 15676114 14455399 13665319
4090A3665319n77441m65117k80507k28092k80111k42157k37195l65209l59873
$$ 13665319 13087878 12622761 12342254 12114162 11834051 11591894 11354699 10989490 10629617
4081A0629617k95028k48842j97370j74814j04472n9799l7659L1497j3577L1507
$$ 10629617 10334589 10085747 9888377 9713563 9609091 9549292 9511633 9543130 9529553 9561060
4071I561060P4285J58236J41737K57219K84878L07154J95372P3365M3202l2971
$$ 9561060 9635345 9793581 9935318 10192537 10477415 10784569 10979941 11053306 11096508 11063537
4061A1063537K1343L8199Q6531Q3726Q7539J47173J95266J40154J26395J76497
$$ 11063537 11084880 11123079 11209610 11293336 11380875 11528048 11723314 11863468 11989863 12166360
4051A2166360J14208Q7003Q7449N7374J6596P3764N3244j843K6715J03564P1157
$$ 12166360 12280568 12367571 12455020 12512394 12528990 12602754 12655998 12654155 12680870 12784434 12855591
4040A2855591L6068P1759M4077l7628l4756p8646k34997k01306k15791k16759
$$ 12855591 12891659 12963418 13007495 12969867 12935111 12856465 12621468 12420162 12204371 11987612
4030A1987612k04345j61250j49774j43235j73365j24911j01103j70655k05932
$$ 11987612 11783267 11622017 11472243 11329008 11155643 11030732 10929629 10758974 10553042
4021A0553042k38993k50630l22119l10245k68892k58977j92904k48139k95756
$$ 10553042 10314049 10063419 9741300 9431055 9162163 8903186 8710282 8462143 8166387
4012H166387k67907k33221k17336j70080k36935k76906k40128k38490k59464k79309
$$ 8166387 7898480 7665259 7447923 7277843 7040908 6764002 6523874 6285384 6025920 5746611
4002E746611k80546k29095j67208j79443j85770k01296j40889r1960j55777j19898
$$ 5746611 5466065 5236970 5069762 4890319 4704549 4503253 4362364 4270404 4114627 3994729
3992C994729j16532j61719j35254n5664r0002q3114l3728o5524n5832q9456j12668
$$ 3994729 3878197 3716478 3581224 3525560 3435558 3352444 3318716 3253192 3197360 3107904 2995236
3981B995236l7053o4513m4635n8730n3070n9063q668p3918o4508k2052j4318j853
$$ 2995236 2958183 2893670 2849035 2790305 2737235 2678172 2669504 2595586 2531078 2509026 2494708 2492855
3969B492855q3182K8438M3575n2949j2468j589l7825J16p6013k2776J4719l4890
$$ 2492855 2409673 2438111 2481686 2428737 2416269 2414680 2376855 2376971 2300958 2278182 2292901 2258011
3957B258011m6844o1351k9218L0794k1748k5190N6763m070j1256n3146K0432p3632
$$ 2258011 2211167 2149816 2120598 2151392 2129644 2104454 2161217 2157147 2145891 2092745 2113177 2039545
3945B039545o0024l1172p9764k4496m4106J4736P007K429o9004o857L0913m5019
$$ 2039545 1979521 1948349 1868585 1844089 1799983 1814719 1821726 1824155 1755151 1748294 1779207 1734188
3933A734188L318n0005m1661O436p831p5594q7810n6623j0243L2538o351J4686
$$ 1734188 1737506 1687501 1645840 1652276 1644445 1568851 1481041 1424418 1414175 1446713 1440362 1455048
3921A455048l723k621k2750j0350m3316j8162m6052k7454r3734K3215k056m8474
$$ 1455048 1451325 1448704 1425954 1415604 1372288 1354126 1308074 1280620 1186886 1210101 1208045 1159571
3909A159571N311K0876K9555Q063l6515K5670j912m5006j4718K4381q029k9213
$$ 1159571 1164882 1185758 1215313 1223376 1186861 1212531 1210619 1165613 1150895 1175276 1167247 1138034
3897A138034L614p2963M617K20J040J0113j4214m3717J0245j6683K7755l1188
$$ 1138034 1141648 1068685 1073302 1073522 1074562 1084675 1070461 1026744 1036989 1020306 1048061 1016873
3885A016873j6036J05992j4077n0062J8710j355N4125k3671R725O437o125L7897
$$ 1016873 1000837 1106829 1092752 1042690 1061400 1060045 1114170 1090499 1100224 1106661 1100536 1138433
3873A138433K3651m6257J5609M2354J1374l8673r7763k038k8694L71M3215K154
$$ 1138433 1162084 1115827 1131436 1173790 1185164 1146491 1048728 1046690 1017996 1018367 1061582 1063736
3861A063736n1003K516m3820k353N8223O918m63k1332p571J1051j4549n0948p508
$$ 1063736 1012733 1015249 971429 969076 1027299 1034217 1033754 1012422 1004851 1015902 1001353 950405 942897
3848I42897L6412k1951j0422K6451n519l8122j3921K9589P521J0998l4861j3829
$$ 942897 979309 957358 946936 973387 967868 929746 915825 945414 952935 963933 929072 915243
3836I15243K0676J0792n0181k7953J8095J4134J8470m8147p373l4590K9035K6360
$$ 915243 935919 946711 896530 868577 886672 900806 919276 871129 863756 829166 858201 884561
3824H84561j5424j5133l6939l770M0293N390j2978N5825R1560p1876K0273L7775
$$ 884561 869137 854004 817065 813295 853588 858978 846000 901825 993385 921509 941782 979557
3812I79557l7328J21l426M849m5495l5893l6540j8381L496L2556j7153l746l9482
$$ 979557 942229 942350 938924 943773 898278 862385 825845 807464 810960 843516 826363 822617 783135
3799G83135k3143N7166O6130r658l4660k1696j4677k221M6567L1321R759N1320
$$ 783135 759992 817158 883288 873630 838970 817274 802597 800376 846943 878264 888023 939343
3787I39343Q2570Q636K7531Q1227n5095q2502n1502p3327k2615m8097m8108M6098
$$ 939343 1021913 1030549 1058080 1139307 1084212 1001710 950208 876881 854266 806169 758061 804159
3775H04159j230J8582r25n1500m5917m4614K8870j2188M9680m001j9056o166j91
$$ 804159 802929 821511 820586 769086 723169 678555 707425 695237 744917 740916 721860 715694 715503
3762G15503l183j0023r0513J4432M9707L0669J8916m9572j430J0455n446N6532
$$ 715503 712320 702297 611784 626216 675923 706592 725508 675936 674506 684961 679515 736047
3750G36047k886p8056K2187k7459j0273R743J4946M9503K8923m5435j7528l9154
$$ 736047 733161 655105 677292 649833 639560 649303 664249 713752 742675 697240 679712 640558
3738F40558L2145P024m1928M0362k2921l1484M6336R173O736m215J2862l637K7980
$$ 640558 672703 679727 637799 678161 655240 623756 670092 679265 686001 681786 694648 691011 718991
3725G18991M961K3514L3173n8736k293L2115k1603L1519l4976M141l7926k8420
$$ 718991 723952 747466 780639 721903 719610 751725 730122 761641 726665 730806 692880 664460
3713F64460J42J0933K7432j188K2976Q421L3520J4297q19K4684o2047m4609R162
$$ 664460 664602 675535 702967 701779 724755 733176 766696 780993 780174 804858 742811 698202 707364
3700G07364J4322q058l403M8408R662p8048p649O775J3072K6721j5345M428n7251
$$ 707364 721686 713628 710225 758633 768295 690247 682598 689373 702445 729166 713821 718249 660998
3687F60998j8106j3030l6073K4761K593r625M2019L3459l1540l8130K7856K6240
$$ 660998 642892 629862 593789 618550 621143 611518 653537 686996 655456 617326 645182 671422
3675F71422j8601K3380q078J3818K0983N474k7262m314K6202J3912j615N5223
$$ 671422 652821 676201 668123 681941 702924 708398 681136 676822 703024 716936 715321 770544
3663G70544Q628p2933p142k7624K6782r644k2719o136L4380L1091L801J7697K7233
$$ 770544 779172 706239 699097 671473 698255 688611 665892 659756 694136 725227 729028 746725 773958
3650G73958J0226k753K0725k1794p7821N3490k5000M5620k4972J7192l4334o9106
$$ 773958 784184 781431 802156 780362 702541 756031 731031 776651 751679 768871 734537 665431
3638F65431J8623M8485L2724P464j700Q538K6321J6468l0796l0910k7021p090
$$ 665431 684054 732539 765263 772727 771027 779565 805886 822354 791558 760648 733627 726537
3626G26537k0779L0073R0402M0335n8634M0246J3344O440R022p1626K2599K593
$$ 726537 705758 735831 826233 866568 807934 848180 861524 867964 876986 805360 827959 830552
3614H30552K9648j830j9832K5863L5380l4009J9682L5405J2060k8307M1970j7726
$$ 830552 860200 858370 838538 864401 899781 865772 885454 920859 932919 904612 946582 928856
3602I28856k7792P0197m886n0573K6381O387o1140P4501k3957l0974K5049Q843
$$ 928856 901064 971261 966375 915802 942183 948570 887430 961931 937974 907000 932049 940892
3590I40892L3101j5124k7333K901N8988J7381N989L634m4241J8904L7793k2040
$$ 940892 973993 958869 931536 934437 993425 1010806 1016795 1020429 976188 995092 1032885 1010845
3578A010845L2209L986R84m41j3342j6689j6203K0831K9774J2734N8117k6829
$$ 1010845 1043054 1047040 1048024 1047583 1034241 1017552 1001349 1022180 1051954 1064688 1122805 1095976
3566A095976n370k9416K130j7104Q571J1826k0944k7824j2056K8109M2906n2975
$$ 1095976 1090606 1061190 1063320 1046216 1054787 1066613 1045669 1017845 1005789 1033898 1076804 1023829
3554A023829l8083K904q248L5836k1420o4405j3148L796R35O7158j8985l6441
$$ 1023829 985746 988650 980402 1016238 994818 930413 917265 921061 921996 989154 970169 933728
3542I33728K3440P200O466L1650L2126l9247K0912Q609L2471k322o691O0085j6241
$$ 933728 957168 964368 970834 1002484 1034610 995363 1016275 1024884 1057355 1055033 1048342 1108427 1092186
3529A092186j2785K9169J9123J1184J8356j4225n30J6620J565j9368M9185k0522
$$ 1092186 1079401 1108570 1127693 1138877 1157233 1143008 1142478 1159098 1160663 1141295 1190480 1169958
3517A169958P5146L5908o3147r404N6524l1503n1297L5854J6843L9802K4758j6212
$$ 1169958 1245104 1281012 1217865 1208461 1264985 1233482 1182185 1218039 1234882 1274684 1299442 1283230
3505A283230l2378J7319p065P9943P815m014l28L8686L4783j5157K3952P018m0467
$$ 1283230 1250852 1268171 1261106 1341049 1348864 1344850 1344522 1383208 1417991 1402834 1426786 1433804 1393337
3492A393337k4984K6972M1888Q888J7824M5593J7213L6303M3817k229j3325J7736
$$ 1393337 1368353 1395325 1437213 1446101 1463925 1509518 1526731 1563034 1606851 1604622 1591297 1609033
3480A609033j8822k6931L2265M0186R2454N7224M345J6636K9219J8637J9140K5895
$$ 1609033 1590211 1563280 1595545 1635731 1728185 1785409 1789754 1806390 1835609 1854246 1873386 1899281
3468A899281m0158J0466J8516K7056L9701N7599o497K8156M3271M5266K2504J9967
$$ 1899281 1859123 1869589 1888105 1915161 1954862 2012461 2005964 2034120 2077391 2122657 2145161 2165128
3456B165128N4816N5905n0722J4292M2527Q2399R057l1929N0225K9012J9404O2133
$$ 2165128 2219944 2275849 2225127 2239419 2281946 2364345 2373402 2341473 2391698 2420710 2440114 2502247
3444B502247L3483K8587N3181L7733K4778P8073Q555j5745N289M5789K5441L1373
$$ 2502247 2535730 2564317 2617498 2655231 2680009 2758082 2766637 2750892 2756181 2801970 2827411 2858784
3432B858784O3250N6416J00235R197J08677N8742M1623M9576M4786J04043O1469
$$ 2858784 2922034 2978450 3078685 3087882 3196559 3255301 3296924 3346500 3391286 3495329 3556798
3421C556798K5210M0119O5453K8087Q9977J23249M9259J7713L5288M6694L5573
$$ 3556798 3582008 3622127 3687580 3715667 3805644 3928893 3978152 3995865 4031153 4077847 4113420
3410D113420Q8325P0101M5544P6292O6589P0989L2956O8734O6527J7767N6552
$$ 4113420 4201745 4271846 4317390 4393682 4460271 4531260 4564216 4632950 4699477 4717244 4773796
3399D773796P0693P3142P1874P8685J59091J19342J17050J59276M5949Q5043J03072
$$ 4773796 4844489 4917631 4989505 5068190 5227281 5346623 5463673 5622949 5668898 5753941 5857013
3388E857013J28263R5140J18888J93143J67833J53298J42064J24061J75587J31247
$$ 5857013 5985276 6080416 6199304 6392447 6560280 6713578 6855642 6979703 7155290 7286537
3378G286537J01442J59259J38297J08858J12847P8653J43404J78235J60348J59284
$$ 7286537 7387979 7547238 7685535 7794393 7907240 7985893 8129297 8307532 8467880 8627164
3368H627164J56880J74525J09370J70679K24774K11363J62083J82120K17560K21096
$$ 8627164 8784044 8958569 9067939 9238618 9463392 9674755 9836838 10018958 10236518 10457614
3358A0457614K18160K32461K83392K97845L32233L20711L75033M01688M37882
$$ 10457614 10675774 10908235 11191627 11489472 11821705 12142416 12517449 12919137 13357019
3349A3357019M24387M64336N07939N71378O14009O38826O90376P20127P86748
$$ 13357019 13781406 14245742 14753681 15325059 15939068 16577894 17268270 17988397 18775145
3340A8775145R02842Q95667R67849J055247J077768J147976J148532J086394J041137
$$ 18775145 19677987 20573654 21541503 22596750 23674518 24822494 25971026 27057420 28098557
3331B8098557R44300R69972R45882Q53758Q40609P81768P39522O80738N49821
$$ 28098557 29042857 30012829 30958711 31812469 32653078 33434846 34174368 34855106 35404927
3322C5404927M56462M72512M15246M17939M22789M60448M83322M56051M50540
$$ 35404927 35861389 36333901 36749147 37167086 37589875 38050323 38533645 38989696 39440236
3313C9440236M66065M79086M48782M00765M02193L39570M54126N34985N06905
$$ 39440236 39906301 40385387 40834169 41234934 41637127 41976697 42430823 42965808 43472713
3304D3472713O73046P79012R12526J130134J207060J359606J402766J368556J322455
$$ 43472713 44145759 44924771 45837297 46967431 48174491 49534097 50936863 52305419 53627874
3295E3627874J224419J020629P86745N57909L08798J76682J5730k8585l7421J3610
$$ 53627874 54852293 55872922 56659667 57217576 57526374 57703056 57718786 57690201 57652780 57666390
3285E7666390m1993l81395n82428p81864r01947j011083j141199j408599j638381
$$ 57666390 57624397 57243002 56660574 55878710 54976763 53965680 52824481 51415882 49777501
3276D9777501j797683k006420k098062k171327k140233k045873j919606j854809
$$ 49777501 47979818 45973398 43875336 41704009 39563776 37517903 35598297 33743488
3268C3743488j685604j573555j407184j244253j219823j110566r87039q74359
$$ 33743488 32057884 30484329 29077145 27832892 26613069 25502503 24515464 23641105
3260B3641105q25233q18788p82608o90317o90935o75157o66836n76644m71205
$$ 23641105 22815872 21997084 21214476 20524159 19833224 19158067 18491231 17914587 17443382
3251A7443382n17909m73023m51202l66852l18879l42108k92411k45743j72235
$$ 17443382 16925473 16452450 16001248 15634396 15315517 14973409 14680998 14435255 14263020
3242A4263020j85766k52899j30535j97026j50942j15517o3432p5834j49643p2691
$$ 14263020 14077254 13824355 13693820 13496794 13345852 13230335 13166903 13091069 12941426 12868735
3232A2868735q5345q0257R868l5253k3355j043O029O8633N5158Q5689J25510K56479
$$ 12868735 12783390 12703133 12713001 12677748 12654393 12653350 12659379 12728012 12783170 12868859 12994369 13250848
3220A3250848L18188K91891J12236n2035j24019q7140J8208J1939L6923O4446
$$ 13250848 13569036 13860927 13973163 13921128 13797109 13709969 13728177 13740116 13777039 13841485
3210A3841485M0718K9258j132l7390n9675J0411o7496j5531K7081k707O8075O9386
$$ 13841485 13882203 13911461 13910329 13872939 13813264 13823675 13756179 13740648 13767729 13765022 13833097 13902483
3198A3902483J04113J15015K13770K38780K28525L32603M06850M55033M74275
$$ 13902483 14006596 14121611 14335381 14574161 14802686 15135289 15542139 15997172 16471447
3189A6471447O70250O95361N21897J58920k22151l61678k63695j47714j13231
$$ 16471447 17141697 17837058 18358955 18517875 18295724 17934046 17670351 17522637 17409406
3180A7409406r3118l9116L3429J04446J03336Q1292K02555L07396K26293L36988
$$ 17409406 17316288 17277172 17310601 17415047 17518383 17599675 17802230 18109626 18335919 18672907
3170A8672907L84337M01607M88132N44816O16514O34454O36729O88631P52127
$$ 18672907 19057244 19458851 19946983 20491799 21108313 21742767 22379496 23068127 23820254
3161B3820254P49369P73778P65112P38233P42179P87223P10791M07601J84391
$$ 23820254 24569623 25343401 26108513 26846746 27588925 28376148 29086939 29494540 29678931
3152B9678931J68886K58599K59138K58050L96913M17528N26551O93464P73892
$$ 29678931 29847817 30106416 30365554 30623604 31020517 31438045 31964596 32658060 33431952
3143C3431952Q81913J088775J148213J316937J440240J533741J598943J534353
$$ 33431952 34313865 35402640 36550853 37867790 39308030 40841771 42440714 43975067
3135D3975067J512407J410112J192889J035602Q10357O06328L55848J42326j41727
$$ 43975067 45487474 46897586 48090475 49126077 49936434 50542762 50898610 51040936 50899209
3126E0899209l82280n61582p35746q78856r21852r15755r45207q44142p66479
$$ 50899209 50516929 49955347 49219601 48340745 47418893 46503138 45557931 44713789 43947310
3117D3947310p32254o55171n86300n26801n50848n62124n94158o49105p69917
$$ 43947310 43215056 42559885 41973585 41446784 40895936 40333812 39739654 39090549 38320632
3108C8320632r04640r72122j156794j234400j332573j363790j346365j350234
$$ 38320632 37415992 36443870 35287076 34052676 32720103 31356313 30009948 28659714
3100B8659714j326750j296344j276503j204665j123041j014078r22478q50983
$$ 28659714 27332964 26036620 24760117 23555452 22432411 21418333 20495855 19644872
3092A9644872q06330p17669o90465o04455n49149m63673m13900l79250l71759
$$ 19644872 18838542 18120873 17430408 16825953 16276804 15813131 15399231 15019981 14648222
3083A4648222l65230k99568k68424l04450k32148j83619k44087k50364j51160
$$ 14648222 14282992 13983424 13715000 13410550 13178402 12994783 12750696 12500332 12349172
3074A2349172j19714j35377j23224r5102o5063q1781n5019m0153j6825j9721O220
$$ 12349172 12229458 12094081 11970857 11875755 11810692 11728911 11673892 11633739 11616914 11597193 11603413
3063A1603413J0575J06897J9293R0520J31536Q1589R4047M1057k8309k5929n7911
$$ 11603413 11613988 11720885 11740178 11830698 11962234 12043823 12137870 12178927 12150618 12124689 12066778
3052A2066778j71088k63920k83016l95046l25355l66952l89481l60972l82787
$$ 12066778 11895690 11631770 11348754 10953708 10628353 10261401 9871920 9510948 9128161
3043I128161k98928l14093k79762k80888k51688k11867j82677j32747j76402j20413
$$ 9128161 8829233 8515140 8235378 7954490 7702802 7490935 7308258 7175511 6999109 6878696
3033F878696j24465j07289p3956j32355j04928o2378p2743j21232n1008j363j08415
$$ 6878696 6754231 6646942 6572986 6440631 6335703 6273325 6200582 6079350 6028342 6026979 5918564
3022E918564m4901J402j06577J99o2072o1034L1503l0968l5742N351l8883l077
$$ 5918564 5873663 5875065 5768488 5768687 5706615 5645581 5677084 5646116 5610374 5615725 5576842 5573765
3010E573765K0438l3673L6645N7681P068k0688k8098m456o535M8224L5149M6535
$$ 5573765 5594203 5560530 5597175 5654856 5661924 5641236 5613138 5608682 5602147 5650371 5685520 5732055
2998E732055q067L9879M5672N5629R6148k5089K6111K1164Q0919M2909j096j1910
$$ 5732055 5723988 5763867 5809539 5865168 5961316 5936227 5962338 5983502 6064421 6107330 6106234 6094324
2986F094324K0465P1032L1036M8074J8092J11669N2886P1715J19272J16817J43553
$$ 6094324 6114789 6185821 6216857 6264931 6283023 6394692 6447578 6519293 6638565 6755382 6898935
2975F898935N9395J07716J59800J58915J45330J74402J71866J37937J37943J67425
$$ 6898935 6958330 7066046 7225846 7384761 7530091 7704493 7876359 8014296 8152239 8319664
2965H319664J86500J46084J32527K15188J81756J79482K51654J92298K83501K59282
$$ 8319664 8506164 8652248 8784775 8999963 9181719 9361201 9612855 9805153 10088654 10347936
2955A0347936K90595K41702K96047L37020L33000L13888L52387L77397M14249
$$ 10347936 10638531 10880233 11176280 11513300 11846300 12160188 12512575 12889972 13304221
2946A3304221M66196M36635M80068N09891N25637O02614N79038N95333O49303
$$ 13304221 13770417 14207052 14687120 15197011 15722648 16325262 16904300 17499633 18148936
2937A8148936O69199P10775P50552Q35985Q88962R88055J028339J027502J127794
$$ 18148936 18818135 19528910 20279462 21115447 22004409 22992464 24020803 25048305 26176099
2928B6176099J185486J173992J314664J470564J631683J786005K059721K329945
$$ 26176099 27361585 28535577 29850241 31320805 32952488 34738493 36798214 39128159
2920C9128159K648551K993493L288419L611982L995759M428720N026817N604759
$$ 39128159 41776710 44770203 48058622 51670604 55666363 60095083 65121900 70726659
2912G0726659O343472P194774Q019032Q550748Q461423P210565M529873P22031
$$ 70726659 77070131 84264905 92283937 100834685 109296108 116506673 121036546 121758577
2904A21758577l517452o885979q808863r312999q895323p957931o913072n816514
$$ 121758577 118241125 111355146 102546283 93233284 84337961 76380030 69466958 63650444
2896F3650444m945011m138024l484548k920635k403234k151241j790328j660354
$$ 63650444 58705433 54567409 51082861 48162226 45758992 43607751 41817423 40157069
2888D0157069j843795k153837k361364k344493k100159j968580j664464j459346
$$ 40157069 38313274 36159437 33798073 31453580 29353421 27384841 25720377 24261031
2880B4261031j352889j140189j056913r21153q76003q37834p78446o58397o90457
$$ 24261031 22908142 21767953 20711040 19789887 18913884 18076050 17297604 16639207 15948750
2871A5948750o10006m90179n73430m66180m82684l81573l69700l99255l85507
$$ 15948750 15338744 14848565 14275135 13808955 13326271 12944698 12574998 12175743 11790236
2862A1790236l10214l11515l02927l60116l21461k85195k55978k63228k81257
$$ 11790236 11480022 11168507 10865580 10505464 10184003 9898808 9642830 9379602 9098345
2853I098345k55748k56051k13920k59771k29986k79043j84239k21308k05751k03412
$$ 9098345 8842597 8586546 8372626 8112855 7882869 7603826 7419587 7198279 6992528 6789116
2843F789116j93108k29838k14493k02511j71871j45903j21464j01808j18040j34501
$$ 6789116 6596008 6366170 6151677 5949166 5777295 5631392 5509928 5408120 5290080 5155579
2833E155579j05357j22168r9489l9230m3985q6287j24649o9509k8959q8276k4824
$$ 5155579 5050222 4928054 4828565 4789335 4745350 4659063 4534414 4464905 4435946 4347670 4322846
2822D322846K836r9605p4563o7360q9449j15348m2402q3717q2849k4890n6764
$$ 4322846 4325682 4226077 4151514 4084154 3994705 3879357 3836955 3753238 3670389 3645499 3588735
2811C588735q6014p3491q5336n0243k5110l0666m5780n4413m8925K0749m091l7100
$$ 3588735 3502721 3429230 3343894 3293651 3268541 3237875 3192095 3137682 3088757 3109506 3105415 3068315
2799C068315k9126Q973k8390p9786r9879j16175q0789m2909o0196o3060n4328
$$ 3068315 3039189 3048162 3019772 2939986 2840107 2723932 2643143 2600234 2540038 2476978 2422650
2788B422650k0275k2857k9042m0464k4391j4511J9923m1401l8332K289O507l0653
$$ 2422650 2402375 2379518 2350476 2310012 2285621 2271110 2291033 2249632 2211300 2213589 2220096 2189443
2776B189443p7502J457L3275o5944n3369m1057o5026n8132l9887j3390j0654k5819
$$ 2189443 2111941 2113398 2146673 2080729 2027360 1986303 1921277 1863145 1823258 1809868 1799214 1773395
2764A773395j705o8102j16115k7339R845l9201o3848r723m7539K9361m5120j5103
$$ 1773395 1771690 1703588 1587473 1560134 1569979 1530778 1466930 1457207 1409668 1439029 1393909 1378806
2752A378806n0516K2089j8295k143n1446k1029P656K9026K2377l1915k223N2812
$$ 1378806 1328290 1350379 1332084 1329941 1278495 1257466 1265122 1294148 1316525 1284610 1282387 1335199
2740A335199O7148q1409j54M905L0850j9911n8790k2046p7751M3802K5347j1094
$$ 1335199 1402347 1320938 1320784 1325689 1356539 1336628 1277838 1255792 1178041 1221843 1247190 1236096
2728A236096l4855Q268m8706N405J2672O756m2965k2613j6500l498q007j5618
$$ 1236096 1201241 1209509 1160803 1166208 1178880 1185636 1142671 1120058 1103558 1100060 1092053 1076435
2716A076435k1798P953J3110K6102n3476l1318J0718K1558k7845k4159j0544p7359
$$ 1076435 1054637 1062590 1075700 1101802 1048326 1017008 1027726 1049284 1021439 997280 986736 909377
2704I09377m5453l278L2195l2892q868l9659K8487J8579k4357l3489L0971n3709
$$ 909377 863924 860646 892841 859949 851081 811422 839909 858488 834131 800642 831613 777904
2692G77904j6434m41Q802k7144Q744j0732k4037j3106L2303q271N333n6580l907
$$ 777904 761470 761029 769831 742687 751431 740699 716662 703556 735859 727588 732921 676341 672434
2679F72434p135Q22K9097k4911R041P839k7244n250L4289m27j4477J4199m8611
$$ 672434 665299 666121 695218 670307 679348 687187 659943 654693 688982 688555 674078 688277 639666
2666F39666j14P0688J3572k1069m2162K3985J074k1857L7426K733k118l3180J0924
$$ 639666 639552 710240 723812 702743 660581 684566 685640 663783 701209 703942 701824 668644 679568
2653F79568K5858m8905N120J6286l0774j4018M3682k6486k2391m6035L4021m986
$$ 679568 705426 656521 661641 677927 647153 633135 676817 650331 627940 581905 615926 610940
2641F10940l9379R1109K8384N345j1210J4944k3718M2536J3403R254J7333L8248
$$ 610940 571561 662670 691054 696399 685189 700133 676415 718951 732354 741608 758941 797189
2629G97189O0917p242L5052P8569n873M6037j0548k667Q288k6837l1251l1693
$$ 797189 858106 850864 885916 964485 958612 1004649 994101 991434 999722 972885 941634 909941
2617I09941m5767j2202k0650m2184p749m3859M418m5843l636j7519n88n021l8026
$$ 909941 864174 851972 831322 789138 781389 737530 741948 696105 692469 674950 674362 669341 631315
2604F31315M335j8265n1449j6613k6612m40L931m952m5866M645M9545r104j0540
$$ 631315 635650 617385 565936 549323 522711 522271 526202 521250 475384 480029 529574 520470 509930
2591E09930k0461p7545L8381K5642p337m3524k3222k0494K5271J6258k2147j6749
$$ 509930 489469 411924 450305 475947 468610 425086 401864 381370 406641 422899 400752 384003
2579C84003k3612m203K5069P129j3704N967K5199k9270n6774k0482M946L0437
$$ 384003 360391 356188 381257 388386 374682 380649 405848 376578 319804 299322 304268 334705
2567C34705o599l3065k5760K2120O1134p391l7001l6531L4956K7002k8186J0419
$$ 334705 328106 295041 269281 291401 352535 345144 308143 271612 306568 333570 305384 315803
2555C15803L5416j6650j0373l8617j6606K1506K3714K2211j7921m0226J9118P6051
$$ 315803 351219 334569 324196 285579 268973 290479 314193 336404 318483 278257 297375 373426
2543C73426p4342k8701Q290K9210N2363o5311n2756K1660M2345j3181k0469J548
$$ 373426 299084 270383 278673 307883 360246 294935 242179 263839 306184 293003 272534 274082
2531B74082K885K2054m4341K008j319k7330K0923j6878l4095J4909n208R865m49
$$ 274082 276967 299021 254680 256688 255369 228039 248962 232084 197989 212898 207690 217555 217106
2518B17106j8262K7092k084K7717j8029k1526M1686Q790J7807j8297N374M5790
$$ 217106 198844 225936 223852 251569 233540 212014 253700 262490 280297 262000 267374 313164
2506C13164l682n7957K3791L4275j5578k2391j4993P666P740k9427K1306J5138
$$ 313164 309482 251525 275316 309591 294013 271622 256629 264295 272035 242608 263914 279052
2494B79052l7230j4541l2870N3944L1427l9141m1918j83j4636l580K8962n3249
$$ 279052 241822 227281 194411 248355 279782 240641 198723 198540 183904 180324 209286 156037
2482A56037l447K4108R831K3110k3824L2301J1979J0293j8043j7561k0013k6442
$$ 156037 152590 176698 186529 209639 185815 218116 230095 240388 222345 204784 184771 158329
2470A58329J8096Q471j860m18K2721J2403Q421n2613K145L476r272J585l0342
$$ 158329 176425 184896 183036 182618 205339 217742 226163 173550 175695 179171 169899 171484 141142
2457A41142k4023L6563J3128k0535j0455O0766K2127l8641m7388J540q182j8383
$$ 141142 117119 153682 166810 146275 135820 196586 218713 180072 132684 134224 126042 107659
2445A07659L1128L0263J6301j2773J3876r971K1097L139j7213L9216k8368n1755
$$ 107659 138787 169050 185351 172578 186454 176483 197580 200719 183506 222722 194354 142599
2433A42599J4491k30N105k483j076N392K927m896L4146K752l1162l6603K732o495
$$ 142599 157090 156860 161965 159482 158406 163798 166725 161829 195975 198727 167565 130962 133694 127199
2419A27199K4541L4542K274j7292n5994l182Q727j9518q246J3178N314Q6892l9048
$$ 127199 151740 186282 188556 171264 115270 112088 120815 101297 93051 106229 111543 198435 159387
2406A59387j7599m182K8270J4373o8940m046o938J8836K9721K950j5832j5815
$$ 159387 141788 137606 165876 180249 111309 107263 100325 119161 148882 151832 136000 120185
2394A20185M4195J8861k9138j6394k0564l2669K5823j6871l2749J5280j8468N7737
$$ 120185 164380 183241 154103 137709 117145 84476 110299 93428 60679 75959 57491 115228
2382A15228L8920k3173p659k294J3189O148j5042j8302m332L0550L6694j2505
$$ 115228 154148 130975 123316 121022 134211 140359 125317 107015 102683 133233 169927 157422
2370A57422j3738m520j3832m2190K8230j1462j291j3190J9581K1775k4721N520
$$ 157422 143684 139164 125332 83142 111372 99910 98619 85429 105010 126785 102064 107584
2358A07584N442p091k4412j8696o488L9474L8154k0542o977M5451m643k2609k9348
$$ 107584 113026 105935 81523 62827 56339 95813 133967 113425 106448 151899 147256 124647 95299
2345I5299k0029M644J6987l7173N1013J3332j904J5327j036k063Q426p957k0835
$$ 95299 75270 79914 96901 59728 110741 124073 122169 137496 136460 134397 142823 134866 114031
2332A14031j3225J5513j3433l9127j8596k94M3241J1448m7283N429n777N3184
$$ 114031 100806 116319 102886 63759 45163 44869 88110 99558 52275 57704 51927 105111
2320A05111j2318j569M4971N7381k1932l1872j9423l930J0856k9041l7775K25
$$ 105111 92793 91224 136195 193576 171644 139772 120349 116419 127275 98234 60459 60684
2308F0684R582K4629l137J7676L4757Q963N711l947k6073N4924M8255m1163l3724
$$ 60684 70266 94895 91758 109434 144191 153154 158865 154918 128845 183769 232024 190861 157137
2295A57137K4829K1671L1946k4301j7602n732n1527M8805J6804K1604k2512K2350
$$ 157137 181966 203637 235583 211282 193680 187948 136421 185226 202030 223634 201122 223472
2283B23472K3089j03987j2806K447L3297L6092k8184J5882K1311J0637n0829k4629
$$ 223472 246561 142574 129768 132215 165512 201604 173420 189302 210613 221250 170421 145792
2271A45792R064N6440l0701P769J199l1713m533P859M9934N0242n6056n794n515
$$ 145792 154856 211296 180595 188364 189563 157850 153317 161176 211110 261352 205296 199502 193987
2258A93987J6808K1522R5380p5707m095N8014l7160k8307l8109L7293N7400J1645
$$ 193987 210795 232317 327697 251990 247895 305909 268749 240442 202333 239626 297026 308671
2246C08671l4568Q376J7262j9059J5234J5902K2493j5007L4191J3538N0710M2032
$$ 308671 274103 282479 299741 280682 295916 311818 334311 319304 353495 367033 417743 459775
2234D59775J7904K8458K7181K9952m2713p459J6120N5006j0631Q37O1922q880
$$ 459775 477679 506137 533318 563270 520557 513098 529218 584224 573593 574430 636352 627472
2222F27472M4596P7827J9458q000Q034N0883M4646J06343O3551Q2632O8678K9083
$$ 627472 672068 749895 769353 761353 769387 820270 864916 971259 1034810 1117442 1186120 1215203
2210A215203P7850J42246J28145J41405J60765J85407K70091M17099M51838P27162
$$ 1215203 1293053 1435299 1563444 1704849 1865614 2051021 2321112 2738211 3190049 3917211
2200C917211J073426J473695J100616j45917j411889j572638j005505o37663m83268
$$ 3917211 4990637 6464332 7564948 7419031 6007142 4434504 3428999 2791336 2308068
2191B308068m07310k80569k43486j03391r7276j12556n2431k626m073q1168o5386
$$ 2308068 1900758 1620189 1376703 1273312 1176036 1063480 1011049 1008423 1004350 923182 857796
2180H57796k4165j06287q7451j7885j402m2916k7935m8296n3698J8204K568n7865
$$ 857796 833631 727344 639893 622008 620606 577690 549755 501459 447761 465965 468533 410668
2168D10668m8414k3491J14j0212j5063N345J4902j874q004k1917L0747m2829n4781
$$ 410668 362254 338763 338877 328665 313602 318947 333849 331975 323971 302054 332801 289972 235191
2155B35191l1357K8615K8525k7706o578j227K0066M3928N142n8059m209N510L577
$$ 235191 203834 232449 260974 233268 226690 225463 245529 289457 294599 236540 232331 237841 241418
2142B41418m1989j1313O594j4033N340j2657J1937L9692p2201p282J8112j7667
$$ 241418 199429 188116 194710 180677 186017 173360 185297 224989 152788 145506 163618 145951
2130A45951N5410k1745n0019J9648J1102j7217k7061k133k563J1436M5186j546
$$ 145951 201361 179616 129597 149245 160347 143130 116069 113936 111373 122809 167995 166449
2118A66449m4958J6629j8245k1701p76l8174N0885R964k2369N166p28n6471Q7194
$$ 166449 121491 138120 119875 98174 97398 59224 110109 120073 97704 102870 102142 45671 132865
2105A32865M1511m607L1356k3429o4320l2134O664p638L6201M8572J4204j3618
$$ 132865 174376 169769 201125 177696 113376 81242 87906 80268 116469 165041 179245 165627
2093A65627l6544l7314M9530L3698l9335r144j8317l4771P98L8312K9191K0254
$$ 165627 129083 91769 141299 174997 135662 126518 108201 73430 74228 112540 141731 161985
2081A61985J8888k7278j3687j4426J2133Q80O356j6060K5582J7225n0753r7440
$$ 161985 180873 153595 139908 125482 137615 138495 144851 128791 154373 171598 120845 23405
2069B3405L2675o124m446M3584L1587k7710k3699J2010k1068L2178M5260j7486
$$ 23405 56080 49956 45510 89094 120681 92971 69272 81282 60214 92392 137652 120166
2057A20166k8693k7920j6780k7081J8608j1993k1150J5818K7842k2938j0955N51
$$ 120166 91473 63553 46773 19692 38300 26307 5157 20975 48817 25879 14924 15475
2045A5475m440K4460q855K6809J3794p162K125J5270O590k4332L2156k4018k1202
$$ 15475 11035 35495 26640 53449 67243 60081 62206 77476 84066 59734 91890 67872 46670
2032D6670j809k303l1803Q153N3769k3718j4349j8120N8418k4256K3679k3416
$$ 46670 44861 42558 10755 18908 72677 48959 34610 16490 74908 50652 74331 50915
2020E0915j4405K6901J8821J7432m6605J4224K7857l5771l9950J9135P6323m1343
$$ 50915 36510 63411 82232 99664 53059 67283 95140 59369 19419 38554 114877 73534
2008G3534l0562l4675K3964J4150K990n795N2499j0025l0818K1586K2627n975
$$ 73534 42972 8297 32261 46411 49401 43606 96105 86080 55262 76848 99475 93500
1996I3500j1781k1156k1874m3192Q00k514N2195M5445l0687j3180K1085l6673
$$ 93500 81719 60563 38689 -4503 -3703 -6217 45978 91423 60736 47556 68641 31968
1984C1968k5993J4285l562M9846K0024J3104K1189l3176j3965K2261L2702j8760
$$ 31968 5975 20260 16698 66544 86568 99672 120861 87685 73720 95981 128683 109923
1972A09923o049l6536o4749M2410K5465P3736l7027l0881N600K424k0892J0403
$$ 109923 103874 67338 2589 44999 70464 144200 107173 76292 81892 84316 63424 73827
1960G3827j0968k1590n333J7203n1773m7324M5835J0699p680J0014k5587L6242
$$ 73827 62859 41269 35936 53139 1366 -45958 -123 10576 2896 12910 -12677 23565
1948B3565j0333l1660m3462M4347l071Q957m5133K2227j7762n0987O8909l2406
$$ 23565 13232 -18428 -61890 -17543 -20614 -11657 -56790 -34563 -52325 -103312 -34403 -66809
1936f6809J8272k5444N5729J0514l4951M0171J2660q817j1064j7181m602j7610
$$ -66809 -48537 -73981 -18252 -7738 -42689 -2518 10142 1325 -9739 -26920 -31522 -49132
1924d9132P626L5691J3679k725J5747K6945p279k3019j9266O028O3876n7410q959
$$ -49132 -41506 -5815 7864 5139 20886 47831 40552 17533 -1733 4295 68171 10761 1802
1911A802J2325l0650K5046j1011k3046l177O2860K7474n1767J9318j9140l614
$$ 1802 14127 -16523 8523 -2488 -25534 -28711 34149 61623 9856 29174 10034 6420
1899F420J8918m30k4942l5531N0423J0373j2735L282j379j000J147K7975k1001
$$ 6420 25338 24908 -34 -35565 14858 25231 12496 15778 14399 13399 14546 42521 21520
1886B1520Q277R257q5023K3361O4401L5189n222J8460o4395L3540J857J9292J0849
$$ 21520 29797 39054 -45969 -22608 41793 76982 71760 90220 25825 59365 61222 80514 91363
1873I1363j7396m8446k9939L8266j9834R0807K5463o5955J3810k6490K480J1479
$$ 91363 73967 25521 -4418 33848 14014 104821 130284 64329 78139 51649 54129 65608
1861F5608K5500l0269j2980K712L8240n714j00308k1727K9584M2506N292q9549
$$ 65608 91108 60839 47859 50571 88811 83097 -17211 -38938 -9354 33152 38444 -51105
1849e1105l3345P2237M1592K1989k5565J5243p844L7000m8989J6535K3729o3480
$$ -51105 -84450 -12213 29379 51368 25803 41046 33202 70202 21213 37748 61477 -2003
1837b003k9002M2332n3227P983j5235j2050j2903K78J5335k3259j0111l7239N1326
$$ -2003 -31005 11327 -41900 -33917 -49152 -61202 -74105 -73827 -58492 -81751 -91862 -129101 -77775
1824g7775j5960L0312J1494m423N0224j2590j7541m1611K9871K9004O617n2177
$$ -77775 -93735 -63423 -51929 -56352 -6128 -18718 -36259 -77870 -47999 -18995 -12378 -64555
1812f4555K2775M5620M1077k7257j1295J6940j7481L2888K0619J5108l0663R162
$$ -64555 -41780 3840 44917 17660 6365 23305 5824 38712 59331 74439 43776 52938
1800E2938j0605K3323J8943m9581p673M1772Q183p2999m5210P790L8182K6378
$$ 52938 42333 65656 84599 35018 27345 69117 77300 4301 -40909 -33119 5063 31441
1788C1441p80j5043M9715j0848o749K678j8808L1240j541k5312J5558j6568K0981
$$ 31441 30661 15618 65333 54485 47736 50414 31606 62846 61305 35993 51551 34983 55964
1775E5964j4067k8423K942l2170J1886J5501k714J3388Q4350k6584o6773J1446
$$ 55964 41897 13474 16416 -15754 -3868 11633 8919 22307 106657 80073 13300 24746
1763B4746K9461j1732m4924L6825N672m0432n582m1139J0279l797J974J7739j5603
$$ 24746 54207 42475 -2449 34376 40048 -384 -5966 -47105 -36826 -40623 -38649 -20910 -36513
1750c6513K9942J0264n3347K6904R399M7714K6663k0304L672j9679n3952N1558
$$ -36513 -6571 3693 -49654 -22750 -13351 34363 61026 40722 44394 24715 -29237 22321
1738B2321j7249k3390o378o637J1005K3269j7622J475K8233l0629j4582k9886
$$ 22321 5072 -18318 -24696 -31333 -20328 2941 -14681 -13206 15027 -15602 -30184 -60070
1726f0070K6091J5200n6320L5300J913j5021L6467L5971r620k186O530k131l3000
$$ -60070 -33979 -18779 -75099 -39799 -37886 -52907 -16440 19531 9911 7725 14255 12124 -20876
1713b0876k8566M7667n403k3948k1601J4526k667j1357J9067K7928m1114j8718
$$ -20876 -49442 -1775 -7178 -31126 -52727 -38201 -40868 -52225 -33158 -5230 -46344 -65062
1701f5062O5844L7403K2391o742k3417l3881m520L7090J9298L1607p1063m7183
$$ -65062 782 38185 60576 53834 30417 -3464 -7984 29106 48404 80011 8948 -38235
1689c8235J7387j193O2426K1412n1471k6168O9543J7241k0339K215j3559K3278
$$ -38235 -20848 -22041 40385 61797 10326 -15842 53701 70942 50603 52818 39259 62537
1677F2537k0378p547m7859j8391N4130J0272k4991j43o78l8718m943M5480j3387
$$ 62537 42159 34612 -13247 -31638 22492 32764 7773 7630 6952 -31766 -36709 8771 -4616
1664d616m3797M0300k6979j3842L3109l643j5691L29o764J4310K904L6314N1315
$$ -4616 -48413 -8113 -35092 -48934 -15825 -19468 -35159 -34830 -41594 -27284 -24380 11934 63249
1651F3249K184m3501k8666m2489k142O1336n3792P234k0057L5095O2660k7432
$$ 63249 65433 21932 -6734 -49223 -51365 9971 -43821 -36587 -56644 -21549 41111 13679
1639A3679k0013r258l6004K6744M8054j1190l3573j0832M2457J7962j7071M250
$$ 13679 -6334 -15592 -51596 -24852 23202 12012 -21561 -32393 10064 28026 10955 15205
1627A5205J2009R466j4152K4195L938o3033J1226M2855k4883K1385R900k4475
$$ 15205 27214 36680 22528 46723 50661 -12372 -1146 41709 16826 38211 48111 23636
1615B3636o1713J8557m8979K1399K4631J4126k8889j155K7963k5577N625j0160
$$ 23636 -38077 -19520 -68499 -47100 -22469 -8343 -37232 -38387 -10424 -36001 -30376 -40536
1603d0536L2558J3995j7360R559K1610m4434L5117p425O301l0131k1802j114n567
$$ -40536 -7978 6017 -11343 -1784 19826 -24608 10509 3084 9385 -20746 -42548 -43662 -49229
1590d9229O4092o601l3699O93L3523L715n9480l6090K8916k4360R287L0662O471
$$ -49229 14863 8262 -25437 -24744 8779 12494 -46986 -83076 -54160 -78520 -69233 -38571 -32100
1577c2100J1566k1898P746n3634M4072q105J1072j1668M3133K9541k6158J1581
$$ -32100 -20534 -42432 -34686 -88320 -44248 -52353 -41281 -52949 -9816 19725 -6433 5148
1565E148m024J15j5677q96j0528k609M188j0289J3251j7139k3991L9089n9621
$$ 5148 1124 1239 -14438 -15334 -25862 -28471 -24283 -34572 -21321 -38460 -62451 -23362 -82983
1552h2983L0895j713J1420l8863L5032k626K8646o792O548J717r421J641O513
$$ -82983 -52088 -53801 -42381 -81244 -46212 -48838 -20192 -26984 -20436 -18719 -28140 -26499 -19986
1539a9986J0006m2296M9570J4878K8910n3388M7738l0502j21j2598j7064l6177
$$ -19986 -9980 -52276 -2706 12172 41082 -12306 35432 4930 4809 -7789 -24853 -61030
1527f1030M9479L0062M499j548l1126M8218J3550m5648N3310j2567M4039k3481
$$ -61030 -11551 18511 23010 21462 -9664 38554 52104 6456 59766 47199 91238 67757
1515F7757j4423m6888Q459K2558p9840M3810l011L559J1974k8933K1140m903r274
$$ 67757 53334 6446 14905 37463 -42377 1433 -1578 1981 13955 -14978 6162 1259 -8015
1502h015L1946j7643n7477J2074j8066J8744L5990l2497j0983j5714J7102J0894
$$ -8015 23931 6288 -51189 -39115 -57181 -38437 -2447 -34944 -45927 -61641 -44539 -33645
1490c3645K6184J7595j8551J4893K0331n9314K170P0583k811l5603O37q446L0736
$$ -33645 -7461 10134 -8417 6476 26807 -32507 -30337 40246 37435 1832 2469 -5977 24759
1477B4759O972J2688j0900K4840j4835m8166l6045J3635J6381N527n0894n582
$$ 24759 31731 44419 33519 58359 43524 -4642 -40687 -27052 -10671 -5144 -56038 -61620
1465f1620j9061M6883J5567M966k2475j0535K6856J2534J8760J3627m0666J1137
$$ -61620 -80681 -33798 -18231 -13265 -35740 -46275 -19419 -6885 11875 25502 -15164 -4027
1453d027K2846j8484J2540O1026k9914m7794m7143j4358L0522L7683K7263K2958
$$ -4027 18819 335 12875 73901 43987 -3807 -50950 -65308 -34786 2897 30160 53118
1441E3118J1859k6796m8673n3487m095O435J2654O4240k0766Q013K2385K0485
$$ 53118 64977 38181 -10492 -63979 -68074 -61639 -48985 15255 -5511 2502 24887 45372
1429D5372M5103l0605J0356j1238l5331n302j9249l9653K2329q70L9687K697p7606
$$ 45372 90475 59870 70226 58988 23657 18355 -894 -40547 -18218 -19088 20599 23296 -54310
1416e4310K7409N291L662P615k4634P0608m0577j599K8902M4435l8860k3049M964
$$ -54310 -26901 -21610 -17948 -10333 -34967 35641 -4936 -6535 22367 66802 27942 4893 9857
1403I857J2464P46n3573J8493q10L2562k7757m1766J01496j6355l0186J9157j2927
$$ 9857 22321 23067 -30506 -12013 -12823 19739 -8018 -49784 51712 35357 5171 24328 11401
1390A1401M5259L9308m5961m8187n0741K4756K4351K0906L7076J7627K0835p244
$$ 11401 56660 95968 50007 1820 -48921 -24165 186 21092 58168 75795 96630 89386
1378H9386k1362o3568l4278J6352O087O016n17N2576J2403m3222k1541m4514J2705
$$ 89386 68024 4456 -29822 -13470 -7383 -1367 -1884 50692 63095 19873 -1668 -46182 -33477
1365c3477m297Q130K2776k0897J9548K76J75j2284J8735p599K5414j3228J2131
$$ -33477 -37774 -29644 -6868 -27765 -8217 -7941 -7766 -20050 -1315 -8914 16500 3272 15403
1352A5403M668q6796K6494m917J0876J8482k381J0269j3871j7772j0518J3915
$$ 15403 20071 -66725 -40231 -45148 -34272 -15790 -18171 -7902 -21773 -39545 -50063 -36148
1340c6148Q478M2298j6280j2165M9375m0385J0907k8229K1281J4558l0850J1454
$$ -36148 -27670 14628 -1652 -13817 35558 -4827 6080 -22149 -868 13690 -17160 -5706
1328e706m463k2563J8961J3373l2306J0827o695j837q048K5455J7174L566m8389
$$ -5706 -10169 -32732 -13771 -398 -32704 -21877 -28572 -30409 -38457 -13002 4172 7738 -40651
1315d0651j2583M0896K772j4512R557k0981m8335L4973R697l7371M0447j2420
$$ -40651 -53234 -12338 -9566 -24078 -14521 -35502 -83837 -48864 -39167 -76538 -36091 -48511
1303d8511J4951L3161q476k2877j2078K1459J68o355K0769k4437j4161M2856K1132
$$ -48511 -33560 -399 -8875 -31752 -43830 -22371 -22203 -28558 -7789 -32226 -46387 -3531 17601
1290A7601n9848L73J1502l5399O0008l291K216l4140N4348J2203m9968n057j1383
$$ 17601 -42247 -41874 -30372 -65771 -5763 -9054 -6838 -40978 13370 25573 -24395 -29452 -40835
1277d0835K1787q489N28n808O82j2969k7437N4095J879k1089j678R751J4266m1082
$$ -40835 -19048 -27537 -27009 -32817 -32135 -45104 -72541 -18446 -16567 -37656 -39334 -29583 -15317 -56399
1263e6399j1346J513l8388N9123K1885R042M6977O2242j5752m9414n4553M1189
$$ -56399 -67745 -66232 -104620 -45497 -23612 -14570 32407 94649 78897 29483 -25070 16119
1251A6119l5443o1171M2753N4326j383j2479j5930K6908L5737o7415j2219O658
$$ 16119 -19324 -80495 -37742 16584 15201 2722 -13208 13700 49437 -17978 -30197 -23539
1239b3539j0351k1098K2041l3850J4610M1995o6642j0167M9096Q927j0971K5847
$$ -23539 -33890 -54988 -32947 -66797 -52187 -10192 -76834 -87001 -37905 -28978 -39949 -14102
1227a4102J7510K2484j2920l5484k1037N216L6945j1518J5131j2086J0952M457
$$ -14102 3408 25892 12972 -22512 -43549 -38333 -1388 -12906 2225 -9861 1091 5548
1215E548l0205K4897N1564j681l735N743L283n0584p28r340q82N786k5918k9238
$$ 5548 -24657 240 51804 50123 46388 52131 55414 4830 4102 -5238 -6120 -334 -26252 -55490
1201e5490N5903K8423n4912L7016j8575o7907L5445Q8549j5741k4027P037L831
$$ -55490 413 28836 -26076 10940 -7635 -75542 -40097 48452 32711 8684 15721 19552
1189A9552L672j1271m9838J5945L1204K330k5057j6498K4568k0524L5728j6627
$$ 19552 23224 11953 -37885 -21940 9264 11594 -13463 -29961 -5393 -25917 9811 -6816
1177f816K3689L602o411r424k3655K3975j5681M910M775J9664l008n0311N95K3809
$$ -6816 16873 20475 14064 4640 -19015 4960 -10721 -5811 -1036 18628 15620 -34691 -34096 -10287
$$ [...]
##END NTUPLES=NMR SPECTRUM
##END=
