##TITLE=1H_CA-9162-2
 CDCl3
 8 sc, 
 13.6.2023
##JCAMPDX= 6.0         $$ Bruker NMR JCAMP-DX V2.0
##DATA TYPE= NMR SPECTRUM
##DATA CLASS= NTUPLES
##ORIGIN= UXNMR, Bruker Analytische Messtechnik GmbH
##OWNER= root
$$ XWIN-NMR		Version 3.5
$$ Tue Jun 13 13:47:37 2023 Russian Standard Time (UT+4h)  she@DPX200
##.OBSERVE FREQUENCY= 200.13135
##.OBSERVE NUCLEUS= ^1H
##.ACQUISITION MODE= SIMULTANEOUS
##.ACQUISITION SCHEME= undefined
##.AVERAGES= 8
##.DIGITISER RES= 18
##SPECTROMETER/DATA SYSTEM= spect
##.PULSE SEQUENCE= zg30
##.SOLVENT NAME= CDCl3
##.SHIFT REFERENCE= (INTERNAL, CDCl3, 0, 15.716)
##AUDIT TRAIL= $$ (NUMBER, WHEN, WHO, WHERE, WHAT)
$$ ##TITLE= Audit trail, XWIN-NMR		Version 3.5
$$ ##JCAMPDX= 5.01
$$ ##ORIGIN= Bruker BioSpin GmbH
$$ ##OWNER= she
$$ F:/spectra/data/she/nmr/H-F/1/pdata/1/auditp.txt
$$ ##AUDIT TRAIL=  $$ (NUMBER, WHEN, WHO, WHERE, WHAT)
(   1,<2023-06-13 13:46:03.59 +0400>,<she>,<DPX200>,
      <created by zg, POWCHK disabled, PULCHK disabled
       configuration hash MD5:
       00 E9 B6 7A A2 85 ED C7 34 08 36 98 17 FE 4E 26
       data hash MD5: 16K
       21 6D 15 8C C4 94 A9 39 37 9F 99 6B D3 22 09 DB>)
(   2,<2023-06-13 13:46:14.98 +0400>,<she>,<DPX200>,
      <Start of raw data processing
       efp BC_mod = 2 LB = 0.24 FT_mod = 6 PKNL = 1 PHC0 = -20259.71 PHC1 = 13.05272 SI = 16K 
       data hash MD5: 16K
       DB 18 EA 20 EC FF 0E 97 C7 72 8C A4 F7 70 41 71>)
(   3,<2023-06-13 13:46:36.65 +0400>,<she>,<DPX200>,
      <pk PHC0 = -78.19454 PHC1 = -5.4 
       data hash MD5: 16K
       B8 D8 CC 27 B7 1F 3F 3B 24 8A 6E 5A 68 DE CC BA>)
(   4,<2023-06-13 13:46:40.26 +0400>,<she>,<DPX200>,
      <abs ABSG = 5 
       data hash MD5: 16K
       B4 D1 58 82 E4 CB 95 AF 0E B6 8C 3F 4B B6 20 9A>)
$$ ##END=
$$ 
$$ hash MD5
$$ 99 F2 74 0B E7 D2 D8 93 85 5A E9 EA EC 5E 0B 6D
##$RELAX= 
##$RELAX= 
##$RELAX= 
##$RELAX= 
##$RELAX= 
##$RELAX= 
$$ Bruker specific parameters
$$ --------------------------
##$DU= <F:/spectra>
##$EXPNO= 1
##$NAME= <H-F>
##$PROCNO= 1
##$TYPE= <nmr>
##$USER= <she>
##$AMP= (0..31)
100 100 100 100 100 100 100 100 100 100 100 100 100 100 100 100 100 100 
100 100 100 100 100 100 100 100 100 100 100 100 100 100 
##$AQSEQ= 0
##$AQ_mod= 1
##$AUNM= <au_zg>
##$AUTOPOS= <>
##$BF1= 200.13
##$BF2= 200.13
##$BF3= 200.13
##$BF4= 200.13
##$BF5= 200.13
##$BF6= 200.13
##$BF7= 200.13
##$BF8= 200.13
##$BYTORDA= 1
##$CFDGTYP= 0
##$CFRGTYP= 5
##$CHEMSTR= <none>
##$CNST= (0..31)
1 1 145 1 1 1 1 1 1 1 1 1 1 1 1 1 1 1 1 1 1 1 1 1 1 1 1 1 1 1 1 1 
##$CPDPRG= <>
##$CPDPRG1= <>
##$CPDPRG2= <>
##$CPDPRG3= <>
##$CPDPRG4= <mlev>
##$CPDPRG5= <mlev>
##$CPDPRG6= <mlev>
##$CPDPRG7= <mlev>
##$CPDPRG8= <mlev>
##$CPDPRGB= <>
##$CPDPRGT= <>
##$D= (0..31)
0 1.2 0 0 0 0 0 0 0 0.06 0 0.03 0 0 0 0 0.0002 0 0 0 0 0 0 0 0 0 0 0 0 
0 0 0 
##$DATE= 1686649563
##$DBL= (0..7)
120 120 120 120 120 120 120 120 
##$DBP= (0..7)
150 150 150 150 150 150 150 150 
##$DBP07= 0
##$DBPNAM0= <>
##$DBPNAM1= <>
##$DBPNAM2= <>
##$DBPNAM3= <>
##$DBPNAM4= <>
$$ [...]
##$SUBNAM3= <"">
##$SUBNAM4= <"">
##$SUBNAM5= <"">
##$SUBNAM6= <"">
##$SUBNAM7= <"">
##$SUBNAM8= <"">
##$SUBNAM9= <"">
##$SW= 18.05172834244
##$SWIBOX= (0..15)
0 0 2 0 0 0 0 0 0 0 0 0 0 0 0 0 
##$SW_h= 3612.71676300578
##$TD= 16384
##$TD0= 1
##$TE= 0
##$TE2= 300
##$TE3= 300
##$TEG= 300
##$TL= (0..7)
0 120 120 120 120 120 120 120 
##$TP= (0..7)
150 150 150 150 150 150 150 150 
##$TP07= 0
##$TPNAME0= <>
##$TPNAME1= <>
##$TPNAME2= <>
##$TPNAME3= <>
##$TPNAME4= <>
##$TPNAME5= <>
##$TPNAME6= <>
##$TPNAME7= <>
##$TPOAL= (0..7)
0.5 0.5 0.5 0.5 0.5 0.5 0.5 0.5 
##$TPOFFS= (0..7)
0 0 0 0 0 0 0 0 
##$TUNHIN= 0
##$TUNHOUT= 0
##$TUNXOUT= 0
##$USERA1= <user>
##$USERA2= <user>
##$USERA3= <user>
##$USERA4= <user>
##$USERA5= <user>
##$V9= 5
##$VALIST= <valist>
##$VCLIST= <CCCCCCCCCCCCCCC>
##$VD= 0
##$VDLIST= <DDDDDDDDDDDDDDD>
##$VPLIST= <PPPPPPPPPPPPPPP>
##$VTLIST= <TTTTTTTTTTTTTTT>
##$WBST= 1024
##$WBSW= 4
##$XGAIN= (0..3)
0 0 0 0 
##$XL= 0
##$YL= 0
##$YMAX_a= 48595
##$YMIN_a= -35673
##$ZGOPTNS= <>
##$ZL1= 120
##$ZL2= 120
##$ZL3= 120
##$ZL4= 120
##$ABSF1= 15.71731
##$ABSF2= -2.334539
##$ABSG= 5
##$ABSL= 3
##$ALPHA= 0
##$AQORDER= 0
##$ASSFAC= 0
##$ASSFACI= 0
##$ASSFACX= 0
##$ASSWID= 0
##$AUNMP= <proc_1d>
##$AZFE= 0.1
##$AZFW= 0.1
##$BCFW= 0
##$BC_mod= 2
##$BYTORDP= 0
##$COROFFS= 0
##$CY= -3
##$DATMOD= 1
##$DC= 0
##$DFILT= <>
##$DTYPP= 0
##$F1P= 0
##$F2P= 0
##$FCOR= 1
##$FTSIZE= 16384
##$FT_mod= 6
##$GAMMA= 0
##$GB= 0
##$INTBC= 1
##$INTSCL= 3.70164e-10
##$ISEN= 128
##$LB= 0.24
##$LEV0= 0
##$LPBIN= 0
##$MAXI= 10000
##$MC2= 0
##$MEAN= 0
##$ME_mod= 0
##$MI= 1.114404
##$NCOEF= 0
##$NC_proc= -10
##$NLEV= 6
##$NOISF1= 3.799351
##$NOISF2= 2.8
##$NSP= 0
##$NTH_PI= 0
##$NZP= 0
##$OFFSET= 15.71604
##$PC= 1
##$PHC0= -20337.91
##$PHC1= 7.65272
##$PH_mod= 1
##$PKNL= yes
##$PPARMOD= 0
##$PSCAL= 0
##$PSIGN= 0
##$REVERSE= no
##$SF= 200.13001110637
##$SI= 16384
##$SIGF1= 3
##$SIGF2= 2
##$SINO= 5.538805
##$SIOLD= 16384
##$SREGLST= <1H.CDCl3>
##$SSB= 0
##$STSI= 16384
##$STSR= 0
##$SW_p= 3612.71676300578
##$SYMM= 0
##$S_DEV= 0
##$TDeff= 16384
##$TDoff= 0
##$TI= <>
##$TILT= no
##$TM1= 0
##$TM2= 0
##$TOPLEV= 0
##$USERP1= <user>
##$USERP2= <user>
##$USERP3= <user>
##$USERP4= <user>
##$USERP5= <user>
##$WDW= 1
##$XDIM= 16384
##$YMAX_p= 382064414
##$YMIN_p= -974279
$$ End of Bruker specific parameters
$$ ---------------------------------
##NTUPLES= NMR SPECTRUM
##VAR_NAME=  FREQUENCY,     SPECTRUM/REAL,   SPECTRUM/IMAG
##SYMBOL=    X,             R,               I
##VAR_TYPE=  INDEPENDENT,   DEPENDENT,       DEPENDENT
##VAR_FORM=  AFFN,          ASDF,            ASDF
##VAR_DIM=   16384,         16384,           16384
##UNITS=     HZ,            ARBITRARY UNITS, ARBITRARY UNITS
##FACTOR=    0.220516191357247, 1,           1
##FIRST=     3145.25119122219, 0,            0
##LAST=      -467.465571783587, 0,           0
##MIN=       -467.465571783587, -974279,     0
##MAX=       3145.25119122219, 382064414,    0
$$ Real data points
##PAGE= N=1
##DATA TABLE= (X++(R..R)), XYDATA
$$ [...]
5594D8648264O69922N13816L62576J00287j37545l67031m88650p46804r20725
5585D7634110j009422j049530j233977j207582j147519j080293j170521r12944
5577C8822322q72118q54973o69152o05129m22484m01963l29171l48648j98325
5568C4120359j87931m17979l84689l36859l79404l36635k95036l58241l51544
5559C1072041j50591M4089l1997k0382J79512J06755K61633K71499K23096K8072
5549C1983727j68278r3167m59243o63817r51781j001231j064276j138961r75343
5540B5467630j073334r82771q96902q34422q04206p20511n97573n45751m43025
5531A8569135m60900l90717l28701l90302k85154l03876k72803j79196q5412k21350
$$ y = [48648264, 49318186, 49832002, 50194578, 50294865, 50157320, 49790289, 49301639, 48554835, 47634110, 46624688, 45575158, 44341181, 43133599, 41986080, 40905787, 39735266, 38822322, 37950204, 37095231, 36426079, 35820950, 35398466, 34996503, 34667332, 34318684, 34120359, 33932428, 33514449, 33129760, 32792901, 32413497, 32076862, 31781826, 31423585, 31072041, 30921450, 30965539, 30933542, 30913160, 31092672, 31199427, 31461060, 31732559, 31955655, 31983727, 31815449, 31722282, 31263039, 30599222, 29647441, 28646210, 27581934, 26442973, 25467630, 24394296, 23411525, 22514623, 21680201, 20875995, 20155484, 19557911, 19012160, 18569135, 18108235, 17717518, 17388817, 16998515, 16713361, 16409485, 16136682, 15957486, 15872074, 15650724]
5521A5650724k35658j08029j42234j22631j82803q0319j82984k16385p6363l20011
5511A3983307j25328k17372l32515j84134j88840k85120j92008j21403j74022
5502A2162565j60981r9936k08771j28725j85946n0806j63505L2715L7099j40745
5492A1092964p4797K7883K7819J2273n9563j95191K4293Q5448L9071J4524j5177
5481A0979547m7712P5010R0334J06684q8590J34165J38882L8044J2832N1804L8372
5470A1529372Q0789O0472J20465J11019Q504N3948Q4703J55194J12781K8582J7442
5459A2363271J45905K97238R5249K4921J78929J1877R9745J72804J20705P4821
5449A3585465J920J18591o1752j03726O4684L5926J30105J06309R693M6448J05235
$$ y = [15650724, 15415066, 15307037, 15164803, 15042172, 14859369, 14779050, 14596066, 14379681, 14303318, 13983307, 13857979, 13640607, 13308092, 13123958, 12935118, 12649998, 12457990, 12336587, 12162565, 12001584, 11901648, 11692877, 11564152, 11378206, 11327400, 11163895, 11196610, 11233709, 11092964, 11018167, 11046050, 11073869, 11086142, 11026579, 10831388, 10855681, 10941129, 10980200, 10994724, 10979547, 10931835, 11006845, 11097179, 11203863, 11115273, 11249438, 11388320, 11426364, 11439196, 11491000, 11529372, 11610161, 11670633, 11791098, 11902117, 11910621, 11964569, 12049272, 12204466, 12317247, 12345829, 12363271, 12509176, 12806414, 12901663, 12926584, 13105513, 13117390, 13217135, 13389939, 13510644, 13585465, 13587385, 13705976, 13644224, 13540498, 13605182, 13641108, 13771213, 13877522, 13887215, 13933663, 14038898]
5438A4038898N5617J00032J89729Q6093K50310K01208J19307L20730K87649L01446
5428A5951019L78663M49661M34608M66720N00911M39974M84364O96113O46967
5419B0449000O80488P85227Q38172R04093Q30862R38745R21160R19672R50788
5410B8218207P88617O76746N30596L25646K60687O8768k06091k53431k47673m82586
5400B9679486n00740n07986n05153n66180n99858m36946k70065l05413l08882
5391B5678263l10621j29062n1486L2002R8002R9088K91540L49357L24230N28764
5381B6910077N56310L76614M98753N50684O51113P47146J041119J098513J305706
5372C3736035J576167J687963J926587K144369K225503K421035K562530K582676
$$ y = [14038898, 14094515, 14194547, 14384276, 14470369, 14720679, 14921887, 15041194, 15361924, 15649573, 15951019, 16329682, 16779343, 17213951, 17680671, 18181582, 18621556, 19105920, 19802033, 20449000, 21129488, 21914715, 22752887, 23656980, 24487842, 25426587, 26347747, 27267419, 28218207, 29006824, 29683570, 30214166, 30539812, 30800499, 30869267, 30663176, 30409745, 30162072, 29679486, 29178746, 28670760, 28165607, 27599427, 26999569, 26562623, 26292558, 25987145, 25678263, 25367642, 25238580, 25187094, 25219096, 25317098, 25416186, 25707726, 26057083, 26381313, 26910077, 27466387, 27843001, 28341754, 28892438, 29543551, 30290697, 31331816, 32430329, 33736035, 35312202, 37000165, 38926752, 41071121, 43296624, 45717659, 48280189, 50862865]
5364E0862865K691740K770568K735442K523366K232226J710731J094836O81219
5356F7302993M24330J64914N6739k7369j25298k43917m03048p12346q77178j081866
5346F4477954j524554j631440j762101j942874k137485k191103k268598k352148
5338D8667651k159760k102245k052606j799859j633451j551852j411623j381265
5330C4574990j058708r59980r77561o99055n38884l98939l61494k66879r3724
5321B9219766n8222K31399K26466L66383M19848O05211O33814O94157Q99058Q98577
5311C4136457J092358J136276J276226J121034J264809J228014P46523P08749
5303D2710446M56621R1294j96872m68816q65653j096614j085716j343154j525539
$$ y = [50862865, 53554605, 56325173, 59060615, 61583981, 63816207, 65526938, 66621774, 67302993, 67727323, 67892237, 67948976, 67921607, 67796309, 67552392, 67149344, 66436998, 65559820, 64477954, 62953400, 61321960, 59559859, 57616985, 55479500, 53288397, 51019799, 48667651, 46507891, 44405646, 42353040, 40553181, 38919730, 37367878, 35956255, 34574990, 33516282, 32556302, 31578741, 30879686, 30340802, 29941863, 29580369, 29313490, 29219766, 29161544, 29392943, 29619409, 29985792, 30405640, 31010851, 31644665, 32338822, 33237880, 34136457, 35228815, 36365091, 37641317, 38762351, 40027160, 41255174, 42001697, 42710446, 43167067, 43258361, 43061489, 42592673, 41727020, 40630406, 39544690, 38201536, 36675997]
5294C6675997j523044j539357j552765j479785j504886j407125j346145j065894
5286B5256996j114348j143728r25456q17506o83796o67346p08034n75478n33672
5277A8087632l51908m38587m76150n35934m62002k31698k32871l40261j93873
5268A4824348k68897j72953j18848p9309o7445r0201o2928o6985P6881O7795J93244
5257A4234702K70386J91573J93847K32937K38796L73623N17494M90574N01908
5248A7245840L76380L74320L92943L13362M76393K58447R0491n7244k10631k59295
5238A9001006l53329m47610m90554o70920m66618o62958p45162n96940n63072
5229A4003843n27981m85306l93692m11350m10092k55169l26637l11851j71566
$$ y = [36675997, 35152953, 33613596, 32060831, 30581046, 29076160, 27669035, 26322890, 25256996, 24142648, 22998920, 22073464, 21255958, 20572162, 19904816, 19196782, 18621304, 18087632, 17735724, 17297137, 16820987, 16285053, 15823051, 15591353, 15358482, 15018221, 14824348, 14555451, 14382498, 14263650, 14184341, 14116896, 14026695, 13963767, 13896782, 13973663, 14041458, 14234702, 14505088, 14696661, 14890508, 15123445, 15362241, 15735864, 16253358, 16743932, 17245840, 17622220, 17996540, 18389483, 18702845, 19179238, 19437685, 19528176, 19470932, 19260301, 19001006, 18647677, 18200067, 17709513, 17038593, 16571975, 15909017, 15163855, 14566915, 14003843, 13475862, 12990556, 12596864, 12185514, 11775422, 11520253, 11193616, 10881765, 10710199]
5220A0710199k73352j52557k24792k73329j36590j67092k72344j76371j71041
5211H862731j63922j88812j45592j7264q8915n7903j26271q1488k3548o5137j86052
5200G717827m6241m5284O5602O5966N564k9286m5181j07734j24009L5392L6986
5189G529602o5643J3522L3115m0515L9588m9792o7149n0686l9454J997j2931j08213
5177G183441k1766Q3473o0938o5608j86150j09894n0036j07069J7846r9224m6519
5166F537556j10539O0655R3508J4531l5821J4737r695N7330K0338L6227R4988
5155F773815M2122J28943Q7040J34293J23594K27460L9732J69784J50748J91824
5145H069355J11785J86987K54237P9761J48710R7501M0463p2974J00421J06939
$$ y = [10710199, 10436847, 10284290, 10059498, 9786169, 9649579, 9482487, 9210143, 9033772, 8862731, 8698809, 8509997, 8364405, 8347141, 8258226, 8200323, 8074052, 7992564, 7969016, 7903879, 7717827, 7671586, 7626302, 7691904, 7757870, 7763434, 7734148, 7688967, 7581233, 7457224, 7492616, 7529602, 7463959, 7477481, 7510596, 7470081, 7509669, 7459877, 7392728, 7342042, 7302588, 7304585, 7291654, 7183441, 7161675, 7245148, 7184210, 7118602, 6932452, 6822558, 6772522, 6665453, 6683299, 6584075, 6537556, 6427017, 6487672, 6581180, 6595711, 6559890, 6574627, 6564932, 6622262, 6642600, 6678827, 6773815, 6815937, 6944880, 7031920, 7166213, 7289807, 7517267, 7556999, 7726783, 7877531, 8069355, 8181140, 8368127, 8622364, 8702125, 8850835, 8948336, 8988799, 8915825, 9016246, 9123185]
5135I123185q8146r6105j27779j70590n5158k15716j99255n3342O366n3721j3694
5124H056045n7043l225L3691J577K29523J83353K38634J92760p8125l43654l48001
5113H105535k57363k99954k66358k30739j10888j97889j13493j29170j43265j90167
5103F166249j81355q6765j3449j14070j02815r48j95532n7188N1299j1617j99114
5092E254695j6889k6289p9732J15019M4854q5263r0752k2819n0795n9889Q061
5081D990201K96j6140M701j50003j1038R1920N6394n0104n1970l6063m9944J9010
5069D797260O5394n9641k8106p832M3126k9247M8632j07119P8712K2734p8734
5058D745179l1668M6423M0602L3012o0345r7853J41211j4241K9908L949j01068
$$ y = [9123185, 9035039, 8938934, 8811155, 8640565, 8585407, 8369691, 8170436, 8117094, 8123460, 8069739, 8056045, 7999002, 7995777, 8029468, 8031045, 8260568, 8443921, 8682555, 8875315, 8797190, 8453536, 8105535, 7848172, 7548218, 7281860, 7051121, 6940233, 6742344, 6628851, 6499681, 6356416, 6166249, 5984894, 5898129, 5884680, 5770610, 5667795, 5666847, 5471315, 5414127, 5465426, 5453809, 5254695, 5237806, 5211517, 5131785, 5246804, 5291658, 5206395, 5115643, 5092824, 5042029, 4982140, 4990201, 4990497, 4974357, 4979058, 4829055, 4818017, 4909937, 4966331, 4916227, 4864257, 4828194, 4778250, 4797260, 4862654, 4803013, 4774907, 4767075, 4810201, 4780954, 4829586, 4722467, 4801179, 4823913, 4745179, 4713511, 4759934, 4800536, 4833548, 4773203, 4675350, 4816561, 4802320, 4832228, 4836177, 4735109]
5047D735109j03859k5166K0622k8668k8453M83l5749O8781K5894Q7629M3090O4415
5035D824128N5333L829r819q3945j23124j92843r8308n7446k11830L9237M8499
5024D193711k0070j66966J9627M1978k9693l4158J02626j7641P990J70k8707P3000
5012D141867K4830j89314j03716R5990O777p5863M3668Q3727O1994R4596p7261
5001D107295Q2838P3545J49490O1942L0946j9343O428j1564j54268m2525j43134
4990D141650n0761m4591j01704j9484j0884N5386m1630l9862M1309n594L9812
4979C963647L3512r5206j00828O1074r4436P2359M0618J5086l4610r778m2159
4968C809279j16791N8440k9445j3758L6523J47407n6025m1125R97j419P3198P7701
$$ y = [4735109, 4631250, 4606084, 4626706, 4598038, 4569585, 4570068, 4534319, 4603100, 4628994, 4716623, 4759713, 4824128, 4879461, 4883290, 4873471, 4789526, 4666402, 4473559, 4375251, 4317805, 4105975, 4145212, 4193711, 4173641, 4006675, 4026302, 4068280, 4038587, 4004429, 4107055, 4089414, 4097404, 4097574, 4068867, 4141867, 4166697, 3977383, 3873667, 3969657, 3976434, 3900571, 3944239, 4027966, 4089960, 4184556, 4107295, 4190133, 4263678, 4413168, 4475110, 4506056, 4486713, 4493141, 4481577, 4327309, 4284784, 4141650, 4090889, 4046298, 3944594, 3925110, 3914226, 3969612, 3927982, 3888120, 3929429, 3923835, 3963647, 3997159, 3901953, 3801125, 3862199, 3767763, 3840122, 3880740, 3895826, 3861216, 3851438, 3809279, 3692488, 3750928, 3721483, 3707725, 3744248, 3891655, 3835630, 3794505, 3795502, 3794083, 3867281, 3944982]
4956C944982k9404q5472j02873q8511K0399O2401j5620N5714L5607n810l6219
4945C755194L6732M0808J3993K0325J9635Q8000J12486r447J1460p8194j1533
4934C999459R5357j6440j0283m5374j1636K0779O5572j47599l0674R1384N6899
4923D067444N7022j15065j08968N2103J25292m3951l914N3361J4551l5676n9574
4912D002625L7812Q0795J7900j29370J1171N3972j25275j02785Q9388K8755j2523
4901C952465R8537k2169j8746o6151k5395J34181Q4688M7895J1117m6760O0164
4890D209826m006p4390k00659J42465M5065o8869l2538J1736n180M2833r277m4290
4878D012716j630N6996L6732j7699o3070M214j4931n9134k096O0116O522L7258
$$ y = [3944982, 3915578, 3830106, 3727233, 3638722, 3659121, 3721522, 3705902, 3761616, 3797223, 3791413, 3755194, 3791926, 3832734, 3846727, 3867052, 3886687, 3974687, 4087173, 4077726, 4089186, 4010992, 3999459, 4094816, 4078376, 4068093, 4022719, 4011083, 4031862, 4097434, 3949835, 3919161, 4010545, 4067444, 4124466, 4009401, 3900433, 3952536, 4077828, 4033877, 4029963, 4083324, 4097875, 4062199, 4002625, 4040437, 4121232, 4139132, 4009762, 4020933, 4074905, 3949630, 3846845, 3936233, 3964988, 3952465, 4051002, 4028833, 4010087, 3943936, 3918541, 4052722, 4137410, 4185305, 4196422, 4149662, 4209826, 4205820, 4131430, 3930771, 4073236, 4118301, 4049432, 4016894, 4028630, 4023450, 4066283, 4057006, 4012716, 4011086, 4068082, 4104814, 4087115, 4024045, 4028259, 4013328, 3954194, 3952098, 4012214, 4018736, 4055994]
4866D055994m613j09074P4653K7038j3382M819O8843k4937l2038P3638K9245J71534
4854D321720P9689k7123k3001p007L3222j10735J32912K2701m787P2381R921N7803
4842D557696J25909N5670N9630K07857J45076O6275P0275K4608P6320j14598R4647
4831E369365m6977r9145M2267J61693r795J30101J09238L8091K2840M0569j998
4820E756249O0019O1903P0822N1419Q8987R7018Q7898J22422K9429P7435J23468
4809F627069K05209J91233P2487J24037Q0585M3781k2764J07603Q7334P4056J34602
4798G725232O9045O3626J32554J42372J32383J62190K87244J22049L6616P3210
4788H946521R0416J94974L8207K24528J58551J96501R0188J87464K21339K11413
$$ y = [4055994, 4051381, 3942307, 4016960, 4043998, 4030616, 4035435, 4104278, 4079341, 4047303, 4120941, 4150186, 4321720, 4401409, 4374286, 4351285, 4344278, 4377500, 4266765, 4399677, 4422378, 4417591, 4489972, 4499893, 4557696, 4683605, 4739275, 4798905, 5006762, 5151838, 5218113, 5288388, 5312996, 5389316, 5274718, 5369365, 5322388, 5223243, 5265510, 5427203, 5417408, 5547509, 5656747, 5694838, 5717678, 5758247, 5756249, 5816268, 5878171, 5948993, 6000412, 6089399, 6186417, 6274315, 6396737, 6426166, 6503601, 6627069, 6832278, 7023511, 7095998, 7220035, 7300620, 7344401, 7321637, 7429240, 7516574, 7590630, 7725232, 7794277, 7857903, 7990457, 8132829, 8265212, 8427402, 8714646, 8836695, 8873311, 8946521, 9036937, 9231911, 9270118, 9494646, 9653197, 9849698, 9939886, 10127350, 10348689, 10560102]
4778A0560102J97641J60951K51647K60384J25355J41493K22022K61132K21576
4769A2402303K24635L56473M16830K85363K88958M73778M47999M47452M31391
4760A5775182J63659K93119K29646K90487L25593M28844M81508M21549N03331
4751A8912918N98590N80183P00023P42060P14832P15841Q93295J035326R58829
4742B5851897J022424J312602J350685J577854J789493K057906K445396K900897
4734D0309154L219730L887115M903495O125429Q333890J1566870J6785864K3038685
4726A18170232K4721983J8857317O692136o925021j7250984k0537877j7534881
4719A06192905j3745138j0676249q766916o924848n425430m500860l648471k890604
$$ y = [10560102, 10757743, 10918694, 11170341, 11430725, 11556080, 11697573, 11919595, 12180727, 12402303, 12626938, 12983411, 13400241, 13685604, 13974562, 14448340, 14896339, 15343791, 15775182, 15938841, 16231960, 16461606, 16752093, 17077686, 17506530, 17988038, 18409587, 18912918, 19511508, 20091691, 20791714, 21533774, 22248606, 22964447, 23857742, 24893068, 25851897, 26874321, 28186923, 29537608, 31115462, 32904955, 34962861, 37408257, 40309154, 43528884, 47415999, 52319494, 58444923, 66778813, 78345683, 95131547, 118170232, 142892215, 161749532, 168441668, 161516647, 144265663, 123727786, 106192905, 92447767, 81771518, 73004602, 66079754, 60654324, 56153464, 52504993, 49614389]
4711D9614389k187691j665988j240281r94434o94161m92208k20032K7209K81060
4702D2427863M38605M61335Q88614J098150J337760J683828J941866K488288L102935
4693E5869244L757034M786066O511688R087726J3258178J9406311K1913672J7278646
4685A51868565R335395K161031o176966j5568966j9367455j6958294j3251407
4678I2041903j0348703q633193p102775n761900m544529l730879l110851k408637
4670D6400436k059687j792177j485157j352667j243305j005420r58207p16933
4662C5786883n57335m57381m78207l66132k21965k29857l26353m35756m02450
4653C2311447l43490l97352k95693l86791m91399l97228l37989k21659j63898
$$ y = [49614389, 47426698, 45760710, 44520429, 43525995, 42831834, 42339626, 42119594, 42146803, 42427863, 42866468, 43327803, 44216417, 45314567, 46652327, 48336155, 50278021, 52766309, 55869244, 59626278, 64412344, 70924032, 80011758, 93269936, 112676247, 134589919, 151868565, 161203960, 163364991, 157188025, 141619059, 122251604, 105293310, 92041903, 81693200, 73060007, 65957232, 60195332, 55650803, 51919924, 48809073, 46400436, 44340749, 42548572, 41063415, 39710748, 38467443, 37462023, 36503816, 35786883, 35229548, 34772167, 34293960, 33927828, 33705863, 33476006, 33149653, 32713897, 32311447, 31967957, 31570605, 31274912, 30888121, 30396722, 29999494, 29661505, 29439846, 29275948]
4644B9275948j48838j97120p3164j36502k09044o4760J0504p8217r8337j68583
4634B8111887J3066R1534O4733J21501J66867J44375L26536K57566J44905M39717
4624B9882687M47844L54397M68303M45269L76737M08656K79777K24753K27299
4615C3115722m1261l4144j25647j44684k25896m63195k52388k67913m18427l94923
4605C0747244k68825l34994j54804j92863j91727j4445j00356J930O8077J5362
4595B9574599l6382M7822J10910J30851J19298J42020J86293J37624K22809J61323
4585C0797167J00301J65949J60709J43367J14902O7716M9230K2053R9336Q2514
4575C1803244n5941J26119J79129J4966J40580K11714L07623K68982K90746L31853
$$ y = [29275948, 29127110, 28929990, 28856826, 28720324, 28511280, 28446520, 28457024, 28378807, 28280470, 28111887, 28124953, 28216487, 28281220, 28402721, 28569588, 28713963, 29040499, 29298065, 29442970, 29882687, 30330531, 30684928, 31153231, 31598500, 31975237, 32383893, 32663670, 32888423, 33115722, 33074461, 33040317, 32914670, 32769986, 32544090, 32080895, 31828507, 31560594, 31142167, 30747244, 30478419, 30143425, 29988621, 29795758, 29604031, 29589586, 29489230, 29491160, 29559237, 29574599, 29538217, 29586039, 29696949, 29827800, 29947098, 30089118, 30275411, 30413035, 30635844, 30797167, 30897468, 31063417, 31224126, 31367493, 31482395, 31550111, 31599341, 31621394, 31720730, 31803244, 31747303, 31873422, 32052551, 32067517, 32208097, 32419811, 32727434, 32996416, 33287162, 33619015]
4565C3619015L90150M45228M27751M51964M89372M98103N30162M87304N02091
4556C7841140M24823M53622N78680N65127O11180O27373N79313N06347P17082
4547D2904687P79307Q76599J075164J279129J456433J372856J522759J535474
4539E2802408J240077P70289M56913J39269j12957j06346q4941O1415J22866K40058
4529E5529051L40216M25727O44760P69664P86040R31511P51949O50154O52627
4520F1481699M28316K78338j55498l11643m88837n73833p85234r29387q85320
4511E8058601o28776o06886n85478k51030j30405m2764J30538K90456K07200K47898
4501E6689354L47048L83495M58657N89301O19064N61364L73730L71178L81074
$$ y = [33619015, 34009165, 34454393, 34882144, 35334108, 35823480, 36321583, 36851745, 37339049, 37841140, 38265963, 38719585, 39298265, 39863392, 40474572, 41101945, 41681258, 42187605, 42904687, 43683994, 44560593, 45635757, 46914886, 48371319, 49744175, 51266934, 52802408, 54042485, 54812774, 55269687, 55408956, 55295999, 55189653, 55104712, 55166127, 55288993, 55529051, 55869267, 56294994, 56939754, 57709418, 58495458, 59426969, 60178918, 60829072, 61481699, 61910015, 62188353, 62032855, 61721212, 61232375, 60658542, 59873308, 58943921, 58058601, 57429825, 56822939, 56237461, 55986431, 55856026, 55813262, 55943800, 56234256, 56441456, 56689354, 57036402, 57419897, 57878554, 58467855, 59086919, 59648283, 60022013, 60393191, 60774265]
4492F0774265J79002o211j30184r5129j62538k13906r6846j49073k0002J24966
4482F0204344J60643O7574P4886J07223J61891J76553j02571r7148k2318j23209
4472F0607868k05674k48011l13291k07850j09953j02793O3829J78463J14136K82053
4462F0058777N00490L35305M03090M66685L94439L55611K35817M93637N90264
4453F3834115L70408N95900O44247N97182R33375P89433P97064R00046J076333
4444G0538103J040513Q94317J033019Q48061Q21758P46973Q52287O90852O24653
4435G8090536N63636O67354N39731N37003N68869N20030L29004O3411j06514j45999
4425H1627061l73528n39869n02999n97788o60160o70501o06426o61930p72527
$$ y = [60774265, 60953267, 60947056, 60816872, 60721743, 60559205, 60345299, 60248453, 60099380, 60079378, 60204344, 60364987, 60432561, 60507447, 60614670, 60776561, 60953114, 60850543, 60753395, 60731077, 60607868, 60402194, 60154183, 59840892, 59633042, 59523089, 59420296, 59484125, 59662588, 59776724, 60058777, 60559267, 60894572, 61297662, 61764347, 62158786, 62514397, 62750214, 63243851, 63834115, 64204523, 64800423, 65444670, 66041852, 66975227, 67764660, 68561724, 69461770, 70538103, 71578616, 72472933, 73505952, 74354013, 75175771, 75922744, 76775031, 77465883, 78090536, 78654172, 79321526, 79861257, 80398260, 80967129, 81487159, 81816163, 81879574, 81773060, 81627061, 81253533, 80713664, 80210665, 79612877, 78952717, 78282216, 77675790, 77013860, 76241333]
4416G6241333o60045n63203o07598m39312k22090k34719l12291k03659K6568R8947
4406G3123931j6464J50557L92787N41750N56153P07302R49635J036540R91040
4397G8433231J041459R97591Q15787N64206K39838K4239n4842j16246p3339j51356
4387H1720568j84573k54999l20063l21482l44077j69548j71808J6875N7209k7608
4377H0000494J56060P3597K40508M54246M26807O26286R99574J002615J197620
4368H5177807J233073J540491J782547K099828K506133K989733L614987M369903
4360A05314502N487449O596815P803969Q972232R581046Q642243N873462J686277
4352A59957995k252045m627401n588818n475206n089169m577063l996554l392682
$$ y = [76241333, 75581288, 75018085, 74410487, 73971175, 73749085, 73514366, 73202075, 72998416, 73024984, 73123931, 73107467, 73258024, 73650811, 74192561, 74748714, 75456016, 76405651, 77442191, 78433231, 79474690, 80472281, 81288068, 81852274, 82092112, 82116351, 82061509, 81945263, 81871924, 81720568, 81535995, 81280996, 80960933, 80639451, 80295374, 80125826, 79954018, 79970893, 80028102, 80000494, 80156554, 80230151, 80470659, 80924905, 81351712, 81977998, 82977572, 83980187, 85177807, 86410880, 87951371, 89733918, 91833746, 94339879, 97329612, 100944599, 105314502, 110801951, 117398766, 125202735, 134174967, 143756013, 152398256, 158271718, 159957995, 157705950, 153078549, 147489731, 142014525, 136925356, 132348293, 128351739, 124959057]
4344A24959057l122262k850282k606018k271886j805361j371375j167866o95144
4336A09068863O891L03491N96979J079346J431502J796234K159641K305530K666208
4327A21414685K985644L213132L493530M217669N120623N872670O769960Q032949
4319A61120862R516099J1280876J3024850J4686047J5255694J4223056J1281476
4312B50388960O919240J861226k851327p043643r899912j1012565j0463540q368964
4304B09529475n692900l182800j135277l70254q68092k072127m089337o371015
4296A85747673q367420r640191j0106961r641415q484926p394846o505462o096020
4288A19510432n567104n214192n050927m692067m329829m287566l881384l461166
$$ y = [124959057, 121836795, 118986513, 116380495, 114108609, 112303248, 110931873, 109764007, 109068863, 109075754, 109379245, 109976224, 111055570, 112487072, 114283306, 116442947, 118748477, 121414685, 124400329, 127613461, 131106991, 135324660, 140445283, 146317953, 153087913, 161120862, 170636961, 181917837, 194942687, 209628734, 224884428, 239107484, 250388960, 257308200, 259169426, 256318099, 249274456, 239374544, 228361979, 217898439, 209529475, 203836575, 200653775, 199518498, 199148244, 198280152, 196208025, 192118688, 185747673, 177380253, 167740062, 157633101, 147991686, 139506760, 132111914, 125606452, 119510432, 113943328, 108729136, 103678209, 98986142, 94656313, 90368747, 86487363, 83026197]
4280H3026197l312291k976723k505343k072378k079165j791919j635876j374045
4272F5278457j282766j166853j091298j012756q60434p22725q08673q37735p68579
4263E6726638n82434n38837n14651n04493m65434l43750l47316k82240l02035
4254E2845448j78209j25228q9785J4231k1652J87539K82884L20186M47254N69813
4244E4252481P67142Q26888J004518J152941J328579J454986J496788J489308
4236F3773631J631343J892446K149094K598834K853186L236858L832220M529955
4228H6497567N191930N905515O872754P930679Q818796R928229J0472576J0511945
4220A52129991R559369P194897L534209o17146m491623p253749q948151r720682
$$ y = [83026197, 79713906, 76737183, 74231840, 72159462, 70080297, 68288378, 66652502, 65278457, 63995691, 62828838, 61737540, 60724784, 59864350, 59141625, 58332952, 57495217, 56726638, 56144204, 55605367, 55090716, 54586223, 54120789, 53777039, 53429723, 53147483, 52845448, 52667239, 52542011, 52452226, 52466457, 52444805, 52632344, 52915228, 53235414, 53682668, 54252481, 55019623, 55846511, 56851029, 58003970, 59332549, 60787535, 62284323, 63773631, 65404974, 67297420, 69446514, 72045348, 74898534, 78135392, 81967612, 86497567, 91689497, 97595012, 104467766, 112398445, 121217241, 131145470, 141618046, 152129991, 161689360, 168884257, 172418466, 171801320, 167309697, 160055948, 151107797, 141387115]
4212A41387115r709435r237488q465336p804563p117313o399337n518331m878518
4204H2256794m421477l922712l375948l105501k748483k208920j957712j935655
4196E8580386j458859j385559j103823q98033p98241o37767p77301q21357p62081
4187D9937365p71255q11695o59066o59260n43054m69985m02554k46867k53769
4178D5119860k06547j94745j06093m24436p47402r05295j007175j300523j240588
4169C8987056j211046j222865j098043q76445q97079q50053p08197n55917n72014
4160C0995397o04430m57424m17185m60022m63237k15934l48592m32317l78644
4151B7217612m46326l39802m77975m70333l17402l53170m74953m48616l36966
$$ y = [141387115, 131677680, 122440192, 113974856, 106170293, 99052980, 92653643, 87135312, 82256794, 77835317, 73912605, 70536657, 67431156, 64682673, 62473753, 60516041, 58580386, 57121527, 55735968, 54632145, 53734112, 52935871, 52298104, 51520803, 50699446, 49937365, 49166110, 48354415, 47695349, 47036089, 46493035, 46023050, 45620496, 45373629, 45119860, 44913313, 44718568, 44612475, 44188039, 43440637, 42535342, 41528167, 40227644, 38987056, 37776010, 36553145, 35455102, 34578657, 33681578, 32831525, 32123328, 31567411, 30995397, 30390967, 29933543, 29516358, 29056336, 28593099, 28377165, 28028573, 27596256, 27217612, 26771286, 26431484, 25953509, 25483176, 25165774, 24812604, 24337651, 23889035, 23552069]
4142B3552069k67529k29512j6531J3172J4661k5551r0015k09892l26398m83211
4132B1931263m69208l43139m40043l35425l42939k25341l0450L6773p9379M2377
4122A9744489l4780j48170l41216l73379m08306k10454l64626k98840k92410m04610
4112A6867698k40550k19776k52452l46305j92208j33410j98944j95080k09552
4103A4879421j42234k03976j94054j66600j54799j58491m8439j43569k16396j45906
4093A3304957j58359j07415j77939j85110r7684m3767j39306p3605m2179l9219
4083A2240374j22725j5925q3108o6021n8522j9367J4988j1129M6572o8944p1709
4072A1784484L3442L2990o833M5602R1135N9051r897J89445L233Q8878Q2947j3335
$$ y = [23552069, 23284540, 23055028, 23038497, 23051669, 23066330, 23040779, 22950764, 22740872, 22414474, 21931263, 21462055, 21118916, 20678873, 20343448, 20000509, 19775168, 19744718, 19781491, 19702112, 19744489, 19709709, 19561539, 19220323, 18846944, 18438638, 18228184, 17863558, 17564718, 17272308, 16867698, 16627148, 16407372, 16154920, 15808615, 15616407, 15482997, 15284053, 15088973, 14879421, 14737187, 14533211, 14339157, 14172557, 14017758, 13859267, 13810828, 13667259, 13450863, 13304957, 13146598, 13039183, 12861244, 12676134, 12578450, 12534683, 12395377, 12321772, 12279593, 12240374, 12117649, 12101724, 12018616, 11952595, 11894073, 11874706, 11889694, 11878565, 11925137, 11856193, 11784484, 11817926, 11850916, 11844083, 11889685, 11980820, 12039871, 12029974, 12219419, 12222652, 12311530, 12394477, 12381142]
4060A2381142j732K587J8856P8592o2982O5884J67185N3071M7376J54641Q9390
4049A2994010O6699M8387Q9123J22532R6559J12390K44484m870J29279K96141
4039A4194734J77524J02620K50876O5614Q7005J23876J40106K28272J54406L08823
4029A5833856J56820O0969J72257K02753J79742J47871n533R1152J18534J22097
4019A7080518K07624K76834J50676K77650K22084J87230J92169L17629J48575
4010A9060989K19638L15663N13505L86658L17564L40385N45841O00626N05888
4001B2806757M98251O01442M99353P02316N40416N51221O31064O51002P48961
3992B8230783P45569P29285Q25819O84726O77410N70926M18591N13628M84214
$$ y = [12381142, 12379410, 12381997, 12400853, 12479445, 12416463, 12482347, 12649532, 12702603, 12749979, 12904620, 12994010, 13060709, 13109096, 13198219, 13320751, 13417310, 13529700, 13774184, 13769314, 13898593, 14194734, 14372258, 14474878, 14725754, 14791368, 14878373, 15002249, 15142355, 15370627, 15525033, 15833856, 15990676, 16051645, 16223902, 16426655, 16606397, 16754268, 16748735, 16839887, 16958421, 17080518, 17288142, 17564976, 17715652, 17993302, 18215386, 18402616, 18594785, 18912414, 19060989, 19280627, 19596290, 20109795, 20496453, 20814017, 21154402, 21700243, 22300869, 22806757, 23305008, 23906450, 24405803, 25108119, 25648535, 26199756, 26830820, 27481822, 28230783, 28976352, 29705637, 30531456, 31216182, 31893592, 32464518, 32883109, 33396737, 33880951]
3983C3880951L32976K96904L30026M98197M47087L82949N62463L93092L89170
3974C7513815L41249L51693O2394r1943k29874k15854j84535l03912j73972j96434
3964C6872627n1756P9438O7503l1411r4911j85364m71065n86735q69885q73240
3954C3855201r55280j138597r61528r66972r52013q77154q78706q62032p80858
3945B5482061p25682p21785p37350q24797p15250o60122o26891p01974n82240
3936A9185970o35038o08066n86887m71966l91631l43924l51241l90768l42056
3927A5064393l38205j67838o1649n8373j30038m0306l17952m22215k70703m86262
3917A2770852m56168m24814l85311l06237m09678l85539l17627l98690l17024
$$ y = [33880951, 34213927, 34510831, 34840857, 35339054, 35786141, 36169090, 36731553, 37124645, 37513815, 37855064, 38206757, 38269151, 38177208, 37947334, 37731480, 37546945, 37243033, 37069061, 36872627, 36820871, 36900309, 36967812, 36936401, 36841490, 36656126, 36185061, 35598326, 34728441, 33855201, 32899921, 31761324, 30799796, 29832824, 28880811, 28003657, 27124951, 26262919, 25482061, 24756379, 24034594, 23297244, 22472447, 21757197, 21097075, 20470184, 19768210, 19185970, 18550932, 17942866, 17355979, 16884013, 16492382, 16148458, 15797217, 15406449, 15064393, 14726188, 14558350, 14496701, 14438328, 14308290, 14267984, 13950032, 13527817, 13257114, 12770852, 12314684, 11889870, 11504559, 11198322, 10788644, 10403105, 10085478, 9686788, 9369764]
3908I369764j80018k48766k57732j93679k22992k46199l03839j03801q2472j07997
3898G422269k44733k61639k49129j90594n4288p6056n038r2548r6581R3600j83822
3887F061441j35791j30816p3029p9006L7229j07748q3200j5079j65700m0086o4001
3876E204214j2624l1744j65156j72623j19417l197m5042k8303p889o0841l0243
3865D527135p8354o7081N5247M842k2474j7352q8715j38435O0126M2651p2248
3854D205342k8612j09165L9035q8423r4353j40802o2213M354l0230l1369m3235
3843C620329n3056K8148j02853j78988m3295L2779N7443p3128m8839j16156p0229
3832C052155R9983K9130Q7007j24709m2271R1560J1965l2928l9860j5122m5843
$$ y = [9369764, 9189746, 8940980, 8683248, 8489569, 8266577, 8020378, 7716539, 7612738, 7530266, 7422269, 7177536, 6915897, 6666768, 6476174, 6421886, 6345830, 6340792, 6248244, 6151663, 6245263, 6061441, 5925650, 5794834, 5721805, 5642799, 5680028, 5572280, 5489080, 5474001, 5308301, 5268215, 5204214, 5191590, 5159846, 4994690, 4822067, 4702650, 4699453, 4654411, 4626108, 4618219, 4557378, 4527135, 4448781, 4381700, 4436947, 4441789, 4419315, 4401963, 4313248, 4174813, 4234939, 4277590, 4205342, 4176730, 4067565, 4106600, 4018177, 3923824, 3783022, 3720809, 3725163, 3694933, 3663564, 3620329, 3567273, 3595421, 3492568, 3313580, 3270285, 3303064, 3360507, 3287379, 3238540, 3122384, 3052155, 3152138, 3181268, 3268275, 3143566, 3101295, 3192855, 3204820, 3171892, 3132032, 3116910, 3071067]
3821C071067o0653K7628N6025j08949n967O3229p6237k1146j057K7865k6488m8504
3809B896813m7722n6795n3271M9194n3076j1562M7732n4443j7978l7531O8383
3798B729744J14458j07518m0407o0196J2030r0791N6704O0982M0080m6019o4707
3787B604360O4603n1024q3512O679J6788j39510p3957J07893m2282L672Q1266
3776B494976j56072O53k5803L0370R625k2442l7817n3131M6465j9733o4019L7326
3764B240398o4826j04050L2766M1467l9339j06901J1196n0185M0667J06425k8532
3753B079086q6335J4392q6105K1306K3774q8213k3430m474k8346J890l3026j8146
3741A772373k1859k2676R4210n3633l0692l8355n2846M0016Q414Q9467R0979q7003
$$ y = [3071067, 3010414, 3038042, 3094067, 2985118, 2979151, 3042380, 2966143, 2944997, 2943940, 2971805, 2945317, 2896813, 2849091, 2792296, 2739025, 2788219, 2735143, 2723581, 2771313, 2716870, 2698892, 2661361, 2729744, 2844202, 2736684, 2696277, 2636081, 2648111, 2557320, 2614024, 2675006, 2715086, 2669067, 2604360, 2668963, 2617939, 2534427, 2541106, 2557894, 2418384, 2344427, 2452320, 2410038, 2413710, 2494976, 2338904, 2339557, 2313754, 2344124, 2353749, 2331307, 2293490, 2240359, 2286824, 2267091, 2203072, 2240398, 2175572, 2071522, 2104288, 2145755, 2106416, 1999515, 2010711, 1960526, 2001193, 2107618, 2079086, 1992751, 2007143, 1921038, 1942344, 1966118, 1877905, 1854475, 1850001, 1821655, 1823545, 1790519, 1772373, 1750514, 1727838, 1822048, 1768415, 1737723, 1699368, 1646522, 1686538, 1694952, 1784419, 1875398, 1788395]
3729A788395R2989J5625l1085L5459m6986J5772M7146J4812m4929K6932K8917
3718A943047M3140N7966j37428l319k7205P3070N4922n2880n5422o7391N0059
3707A878559O4342M8980M7060p2861l806p5042P0182N0304K8690m8745R9145k0377
3695B066431j03462N3899l4545l2876J08174P223L2044M0220j7827l9651j6755
3684B062875Q585k9258O9750k2686l7670Q287P9066K7720P886J09489m8560q4958
3672B150526j4866O9201r2229j14660J01466J2400Q4711p8819q9913P9327o7329
3661B039815o517N3225N3575J3322K9321o7446p2973M837Q2180k993q7881n2233
3649A986232k4180Q6535L7074l5467n1373K8056m2514R0087p7496M2762K3784
$$ y = [1788395, 1881384, 1897009, 1865924, 1901383, 1854397, 1870169, 1917315, 1932127, 1887198, 1914130, 1943047, 1986187, 2044153, 1906725, 1903406, 1876201, 1949271, 2004193, 1951313, 1895891, 1828500, 1878559, 1942901, 1991881, 2038941, 1966080, 1962274, 1887232, 1957414, 2007718, 2036408, 1987663, 2086808, 2066431, 1962969, 2016868, 1982323, 1949447, 2057621, 2064844, 2096888, 2137108, 2119281, 2079630, 2062875, 2071460, 2042202, 2111952, 2089266, 2051596, 2059883, 2138949, 2166669, 2174555, 2284044, 2235484, 2150526, 2135660, 2204861, 2112632, 1997972, 2099438, 2111838, 2196549, 2117730, 2027817, 2107144, 2039815, 2033298, 2086523, 2140098, 2153420, 2182741, 2115295, 2042322, 2047159, 2129339, 2126346, 2038465, 1986232, 1962052, 2048587, 2085661, 2050194, 1998821, 2026877, 1984363, 2074450, 1996954, 2039716, 2063500]
3638B063500m0717K2683l1031l5591k4478L3143J2096k4684l8123m0210Q4156
3627A980744R3021l5992j0569J2850J00759M905l6862M8574K090R8280L2292O4227
3615B354319N8689P8935m0334o6437m2748j398Q8200R5740M1419o4737k8438J09066
3603B582276r274J0923m6724O6591J21577j5195k8821m0189L2728k3552o3022
3592B587318n031l2118M6199N4016j5460j8678k657O337N4873J09261k4806k7075
3580B732179L3726K5203r550r535j2796q3347K9037k5010k6007Q2551J8977N3478
3568B808906m4504J1055m0295p114N5426L6393k2519r22K2577K4823k6819L1119
3556B848126R9422L8103n3937M5201K0265J8306Q7531J30984L1097K6614N4931
$$ y = [2063500, 2022783, 2045466, 2014435, 1978844, 1954366, 1987509, 1999605, 1974921, 1936798, 1896588, 1980744, 2073765, 2037773, 2027204, 2040054, 2140813, 2145718, 2108856, 2157430, 2159520, 2257800, 2290092, 2354319, 2413008, 2491943, 2451609, 2385172, 2342424, 2341026, 2429226, 2524966, 2566385, 2501648, 2473210, 2582276, 2573002, 2583925, 2537201, 2603792, 2725369, 2710174, 2681353, 2641164, 2673892, 2650340, 2587318, 2582287, 2550169, 2596368, 2650384, 2634924, 2616246, 2613589, 2619926, 2674799, 2784060, 2759254, 2732179, 2765905, 2791108, 2781558, 2772023, 2759227, 2675880, 2704917, 2679907, 2653900, 2736451, 2755428, 2808906, 2764402, 2775457, 2735162, 2728048, 2783474, 2819867, 2797348, 2796426, 2819003, 2843826, 2817007, 2848126, 2947548, 2985651, 2931714, 2976915, 2997180, 3015486, 3103017, 3234001, 3265098, 3291712, 3346643]
3545C346643j23436K3911k1925q3190Q8115J13411M2590P4344R1144J31769p7575
3534C605801k9267J13095j28509n0354J00438J23986L7325k858O3822M979p020
3523C831438o0554P1645J5219J47176N7634j12838N3794R2961P9086P9125l4339
3512D220347J5396k4025m1415J86204P6584l7773K7453M0120J48011O4834J76393
3501D852129k8937M56J41668j9582Q9802L8644q4149q26N6431j29347J06214l1870
3489D990633P9477O7481J25494k3155N9187K053n5266K639R9418J04411o1576
3478E390796O8354P9214q161k727J57643J6423P3337N0318R261M6733J10685q3542
3466E908334m1585P5484J17219Q2980l637J03909l7825N1338O9121n207p3444
$$ y = [3346643, 3223207, 3247118, 3225193, 3142003, 3230118, 3343529, 3386119, 3460463, 3551607, 3683376, 3605801, 3576534, 3689629, 3561120, 3510766, 3611204, 3735190, 3772515, 3769657, 3833479, 3838458, 3831438, 3770884, 3842529, 3857748, 4004924, 4062558, 3949720, 4003514, 4096475, 4175561, 4254686, 4220347, 4235743, 4211718, 4170303, 4356507, 4433091, 4395318, 4422771, 4462891, 4610902, 4675736, 4852129, 4823192, 4823648, 4965316, 4945734, 5035536, 5074180, 4990031, 4989205, 5045636, 4916289, 5022503, 4990633, 5070110, 5137591, 5263085, 5239930, 5299117, 5301170, 5245904, 5248543, 5347961, 5452372, 5390796, 5459150, 5538364, 5530203, 5527476, 5685119, 5701542, 5774879, 5825197, 5834458, 5881191, 5991876, 5908334, 5866749, 5942233, 6059452, 6142432, 6138795, 6242704, 6204879, 6256217, 6325338, 6320131, 6246687]
3455F246687P4388O5417J74787J7057Q9438J9242o6676J13304J12193J50808l761
3444F992884J16887K02735R3456R5330J17793J00406J39247J96205J08780J12826
3434H276549J52400K39703K13900K80069K08867J33428J62881L31381K15691N8324
3424A0273193J51319K42479K07341K05846K08507J33697Q8669j9459R0389P802
3414A1589783J13164Q4209K656r8740M1509K5426M1892M57p9923k9136j7506j14966
3402A1558825j27413j91605j9113j72023k29501j3699j16881j04245j4831j40075
3392A0429439l5004o0412R976j6699r6247o0845r003J61720m8618M4720P5118
3381A0394145L4265Q2080j6421M0665M5841J09935M3330N7685O9344J00177J39957
$$ y = [6246687, 6321075, 6386492, 6561279, 6578336, 6667774, 6687016, 6620340, 6733644, 6845837, 6996645, 6992884, 7109771, 7312506, 7405962, 7501292, 7619085, 7719491, 7858738, 8054943, 8163723, 8276549, 8428949, 8668652, 8882552, 9162621, 9371488, 9504916, 9667797, 9999178, 10214869, 10273193, 10424512, 10666991, 10874332, 11080178, 11288685, 11422382, 11511051, 11491592, 11581981, 11589783, 11702947, 11787156, 11789812, 11691072, 11732581, 11758007, 11799899, 11800356, 11720433, 11691297, 11673791, 11558825, 11431412, 11239807, 11220694, 11048671, 10819170, 10805471, 10688590, 10584345, 10569514, 10429439, 10394435, 10334023, 10343999, 10327300, 10231053, 10170208, 10161205, 10322925, 10274307, 10319027, 10394145, 10428410, 10510490, 10494069, 10534734, 10580575, 10690510, 10733840, 10791525, 10860869, 10961046, 11101003]
3370A1101003K8671Q2107N3173K11734J32789k9887Q7218M5899J35517J79374
3360A2027598J37006K0945J84501J51728N4344R6356J09748P7627K25571J72785
3350A3258209J30710J99631J41212J72479K21407L51055J72181J54187L32020
3341A5133091J90927L01146M63036K48457L15904L16394L23404M15258L55104
3332A8062721M06504M18857M12000M18053L32063M55384L60348M05063M11159
3323B1682152M65146M47046L85872N42310N10172M07207L85735L76978L92541
3314B5595159M19552K80660M18295L16003L16462L75468M85816L35401M68486
3305B9011302M64476L71096M67192M63838N60416M78439N10813M96943N90089
$$ y = [11101003, 11129674, 11211781, 11264954, 11476688, 11609477, 11579590, 11666808, 11712707, 11848224, 12027598, 12164604, 12185549, 12370050, 12521778, 12576122, 12672478, 12782226, 12859853, 13085424, 13258209, 13388919, 13588550, 13729762, 13902241, 14123648, 14474703, 14646884, 14801071, 15133091, 15324018, 15625164, 16088200, 16336657, 16652561, 16968955, 17292359, 17707617, 18062721, 18469225, 18888082, 19300082, 19718135, 20050198, 20505582, 20865930, 21270993, 21682152, 22147298, 22594344, 22980216, 23522526, 24032698, 24439905, 24825640, 25202618, 25595159, 26014711, 26295371, 26713666, 27029669, 27346131, 27721599, 28207415, 28542816, 29011302, 29475778, 29846874, 30314066, 30777904, 31338320, 31816759, 32327572, 32824515, 33414604]
3296C3414604N28962O63650N96870P15915Q35543Q18448P21024Q88610R49603
3287D0133229R84546J016908J006649J135415J247339J286421J341534J424638
3279D9576679J710688J640668J665676J907663J950929K104173K233674K266946
3271F5057096K549329K760738K916284L142181L239399L660903L895344L998823
3263I1220097M271465M420868M530559M491962M503267M220686L771659L325319
3255A24755882L031292K760155K426609K239195K172038K023319J994731K124108
3247A43527329K145012K267125K379797K552984K937725K991335L013479L178772
3239A64993558L390126L581241L435002L568674L700911L617839L355555L011600
$$ y = [33414604, 33943566, 34607216, 35204086, 35920001, 36755544, 37573992, 38295016, 39183626, 40133229, 41117775, 42134683, 43141332, 44276747, 45524086, 46810507, 48152041, 49576679, 51287367, 52928035, 54593711, 56501374, 58452303, 60556476, 62790150, 65057096, 67606425, 70367163, 73283447, 76425628, 79665027, 83325930, 87221274, 91220097, 95491562, 99912430, 104442989, 108934951, 113438218, 117658904, 121430563, 124755882, 127787174, 130547329, 132973938, 135213133, 137385171, 139408490, 141403221, 143527329, 145672341, 147939466, 150319263, 152872247, 155809972, 158801307, 161814786, 164993558, 168383684, 171964925, 175399927, 178968601, 182669512, 186287351, 189642906, 192654506]
3231A92654506K521302J980862J240670O09614r4664o66324r36147j130079j165478
3222A95014262j187576j031456j152074j313355j616935k154742k865336l529131
3214A80163657m321747n199325n774823o161851o414590o570180o308454o120161
3206A33292526n934403n525732n219376m916501m276931m010900l792028l627095
3198I5989560l225651l017077k808163k510090k452953k150758k030770j963952
3190G5830146j781952j847595j947606j753457j586294j583732j477477j263122
3182F2588911j324479j091865j062505j029455r72473q92753p77631q75346o68468
3173E3893936n44750n91876n20994n05691l87872l01199l49286j55093p8113r3842
$$ y = [192654506, 195175808, 197156670, 198397340, 199006954, 198912290, 198245966, 197309819, 196179740, 195014262, 193826686, 192795230, 191643156, 190329801, 188712866, 186558124, 183692788, 180163657, 175841910, 170642585, 164867762, 158705911, 152291321, 145721141, 139412687, 133292526, 127358123, 121832391, 116613015, 111696514, 107419583, 103408683, 99616655, 95989560, 92763909, 89746832, 86938669, 84428579, 81975626, 79824868, 77794098, 75830146, 74048194, 72200599, 70252993, 68499536, 66913242, 65329510, 63852033, 62588911, 61264432, 60172567, 59110062, 58080607, 57108134, 56215381, 55437750, 54562404, 53893936, 53349186, 52757310, 52236316, 51730625, 51342753, 51041554, 50692268, 50537175, 50459062, 50365220]
3163E0365220L175J8489R5056K97988L19376N2184k63940k25437k17741j16299
3153E0328071j91666Q0296L3167O0020J01482J40910K63578J71447L02232M98502
3143E1788039L47415M03936L59846M47573M19428K72476M01304L19065K90942
3134E5050024L60468K62136K29258K18796K14175K64178K12521J23505M6750L0950
3124E7012761j03062j36953j74033p3714r4204q6298o6301j57640j83110m1973
3114E5895473l7390J8208M6061J02556J73773L81864K33716K61193M65865M60106
3104E8001425N49321O53537Q20752Q61244R07128J012547J301587J440569J453244
3095F7001354J649905J772153J971117J994947K093137K150834K368438K490604
$$ y = [50365220, 50368395, 50386884, 50481940, 50779928, 51099304, 51151488, 50887548, 50662111, 50444370, 50328071, 50136405, 50216701, 50249868, 50309888, 50411370, 50552280, 50815858, 50987305, 51289537, 51788039, 52135454, 52539390, 52899236, 53346809, 53766237, 54038713, 54440017, 54759082, 55050024, 55410492, 55672628, 55901886, 56120682, 56334857, 56599035, 56811556, 56935061, 56981811, 57012761, 56909699, 56772746, 56598713, 56524999, 56430795, 56344497, 56278196, 56120556, 55937446, 55895473, 55858083, 55876291, 55922352, 56024908, 56198681, 56580545, 56814261, 57075454, 57541319, 58001425, 58550746, 59204283, 60025035, 60886279, 61793407, 62805954, 64107541, 65548110, 67001354, 68651259, 70423412, 72394529, 74389476, 76482613, 78633447, 81001885, 83492489]
3087H3492489K481919K495482K610966K693327K700723K565095K605669K637777
3079A04283447K608787K895206K830793K825786K941066K964263K947691K987347
3071A27284386K977457K977853K978743L044806K857123K792016K659627K341211
3063A49913222K122651K077777J865647J462892J401444J018269O86771K39592
3055A60788265j18134o39667j128112j490315j983510k407650k861149l273221
3047A46886507l419426l511281l782750l991421l957284l771477l798377l734255
3039A16920236l592689l653352l659486l631992l489524l572163l398511l392612
3031H8529907l415244l207539l056534k992147k788852k692572k592529k403130
$$ y = [83492489, 85974408, 88469890, 91080856, 93774183, 96474906, 99040001, 101645670, 104283447, 106892234, 109787440, 112618233, 115444019, 118385085, 121349348, 124297039, 127284386, 130261843, 133239696, 136218439, 139263245, 142120368, 144912384, 147572011, 149913222, 152035873, 154113650, 155979297, 157442189, 158843633, 159861902, 160548673, 160788265, 160670131, 160030464, 158902352, 157412037, 155428527, 153020877, 150159728, 146886507, 143467081, 139955800, 136173050, 132181629, 128224345, 124452868, 120654491, 116920236, 113327547, 109674195, 106014709, 102382717, 98893193, 95321030, 91922519, 88529907, 85114663, 81907124, 78850590, 75858443, 73069591, 70377019, 67784490, 65381360]
3023F5381360k136848k113829j865642j721102j711247j462313j280649j198200
3015E1891530j140786j017179r83951q18958p22489o87992o11111m67047m69538
3006D4972479l13739m09527k31745r7345o1773n1726q3103j9360l6366n8093N3695
2995D3663397j524L9071o845n1531j15731j39564k26141k58291l58299l75381
2985D2169161n93157p06584n57710o78166p99306r48500r00272q00120r15691
2976C5269655j058238r21560r64381p60467p94094p03639o17750o59756n56157
2967B8233613m97612n51740o66326m50831m31916l91512n24581k10424l09040
2958B4199631l72309k26228j27604j65218k05075j06837j39164j30840k6360j58015
$$ y = [65381360, 63244512, 61130683, 59265041, 57543939, 55832692, 54370379, 53089730, 51891530, 50750744, 49733565, 48749614, 47930656, 47208167, 46520175, 45909064, 45442017, 44972479, 44658740, 44249213, 44017468, 43920123, 43858350, 43806624, 43723521, 43704161, 43667795, 43609702, 43663397, 43661873, 43700944, 43694099, 43642568, 43526837, 43387273, 43161132, 42902841, 42544542, 42169161, 41576004, 40869420, 40311710, 39633544, 38834238, 37885738, 36985466, 36185346, 35269655, 34211417, 33289857, 32325476, 31565009, 30770915, 30067276, 29449526, 28789770, 28233613, 27736001, 27184261, 26517935, 26067104, 25635188, 25243676, 24719095, 24508671, 24199631, 23827322, 23601094, 23473490, 23308272, 23103197, 22996360, 22857196, 22726356, 22699996, 22541981]
2948B2541981r5609r7079j45647r6236K6529j6882P4478P5216K3820L665k8275
2937B2265961m8605p89J11627R0358J28308P2663K65368J79554R9547O3584R0681
2926B3318257J21662K44418J41346J27618K45034K53005K97780L40841L38499
2917B5428460K68134K80842L31989K58072K25757L72168L90651N17281N14291
2908B8587645O51173O91853N69258M68698M39610M65142M78325M88217M87325
2899C3327246M63343N27755P87709P46630R09605R73623R40622Q15740Q80377
2890D0372650J028140J208230J087083J176532J127925J162121J374215J524861
2882E0061757J460764J610632J561611J666300J850575J829555J909571J931256
$$ y = [22541981, 22446372, 22349293, 22203646, 22107410, 22133939, 22117057, 22191535, 22266751, 22290571, 22294236, 22265961, 22217356, 22216567, 22328194, 22418552, 22546860, 22619523, 22884891, 23064445, 23163992, 23227576, 23318257, 23439919, 23684337, 23825683, 23953301, 24198335, 24451340, 24749120, 25089961, 25428460, 25696594, 25977436, 26309425, 26567497, 26793254, 27165422, 27556073, 28073354, 28587645, 29238818, 29930671, 30499929, 30968627, 31408237, 31873379, 32351704, 32839921, 33327246, 33790589, 34318344, 35106053, 35852683, 36762288, 37735911, 38676533, 39492273, 40372650, 41400790, 42609020, 43696103, 44872635, 46000560, 47162681, 48536896, 50061757, 51522521, 53133153, 54694764, 56361064, 58211639, 60041194, 61950765, 63882021]
2874F3882021J770619J980477K258009K260324K306211K281855K357905K584680
2866H1682101K620572K770256K913883L095896L254454L441859L733526L883126
2858A07395673M352061M822262N583501O325710O888646P511644Q215351Q761746
2850A59856594R330034J0163639J1435699J3436659J5911673J8931589K2160293
2843B61226180K5210081K7128161K6797565K2972856J4869620L859951p226483
2836C74837931j5945602k1335280k3567657k3689184k2659468k0885946j8828431
2829B27926363j6613919j4597047j2997242j1416020j0265571r164143q310234
2822A44562187p494370o708807o017740n471940n165185m988644m567960m323236
$$ y = [63882021, 65652640, 67633117, 69891126, 72151450, 74457661, 76739516, 79097421, 81682101, 84302673, 87072929, 89986812, 93082708, 96337162, 99779021, 103512547, 107395673, 111747734, 116569996, 122153497, 128479207, 135367853, 142879497, 151094848, 159856594, 169186628, 179350267, 190785966, 204222625, 220134298, 239065887, 261226180, 286436261, 313564422, 340361987, 363334843, 378204463, 382064414, 374837931, 358892329, 337557049, 313989392, 290300208, 267640740, 246754794, 227926363, 211312444, 196715397, 183718155, 172302135, 162036564, 152872421, 144562187, 137067817, 130359010, 124341270, 118869330, 113704145, 108715501, 104147541, 99824305]
2814I9824305m036563l952124l793024l683503l675471l682901l473764l234872
2806G0292083l177122k857670k685181k626338k441362k201259k036058j825660
2798E0441433j730033j683391j293812j380111j323987j235711j129248j055891
2790C9609249j095776j002038p77451p47711q99036o95453o21329m69847n66745
2781C2733863o55959l55112l05326l02388j91439o7856J56275J79464K96378O13982
2771C2101882P13658Q90977Q38152P72113K08835n91501j003632j294270j338512
2762C1297702j347538j148986r36618p06889p70605m56975j67598q4437R1873
2753B5769929L37687N22127P62939P98517N76976n6779o48182j073358j291521
$$ y = [99824305, 95787742, 91835618, 88042594, 84359091, 80683620, 77000719, 73526955, 70292083, 67114961, 64257291, 61572110, 58945772, 56504410, 54303151, 52267093, 50441433, 48711400, 47028009, 45734197, 44354086, 43030099, 41794388, 40665140, 39609249, 38513473, 37511435, 36733984, 35986273, 35087237, 34391784, 33770455, 33300608, 32733863, 32077904, 31722792, 31417466, 31115078, 30923639, 30855783, 31012058, 31191522, 31487900, 32101882, 32815540, 33706517, 34544669, 35316782, 35525617, 34934116, 33930484, 32636214, 31297702, 29950164, 28801178, 27864560, 27157671, 26387066, 25930091, 25762493, 25678056, 25769929, 26107616, 26629743, 27392682, 28191199, 28768175, 28711396, 28063214, 26989856, 25698335]
2744B5698335j501621j446188j121958j013643j025035r22276q67240o31657o18077
2735A6550640n64653m47034m25573l96058n00614m18674l41295k98715k45331
2726A2912693k74081j69103j93856k25563j89373k15293j96936k91417j52537
2717A1004534p7071j80522l31068j29395j94638k08830j81319k30047j96979q6397
2707I188268r5089j30588j39785j05666k07632q9741n6088k11805m3603j50807
2697G957464j11561r9480Q806j06810q8931j22258o9619l1524k8621k07346j16852
2686F983268j61016j36172j976j81090k46439r3296k4353n3163L5877j44151j78301
2675E799188m6498n7572r3415J1354p383p9722k1796M4825r7148M138r9822n8194
$$ y = [25698335, 24196714, 22750526, 21628568, 20614925, 19589890, 18667614, 17800374, 17168717, 16550640, 15985987, 15538953, 15113380, 14717322, 14216708, 13798034, 13456739, 13158024, 12912693, 12638612, 12469509, 12275653, 12050090, 11860717, 11645424, 11448488, 11157071, 11004534, 10927463, 10746941, 10415873, 10286478, 10091840, 9883010, 9701691, 9471644, 9274665, 9188268, 9093179, 8962591, 8822806, 8717140, 8509508, 8419767, 8363679, 8151874, 8108271, 7957464, 7845903, 7746423, 7755229, 7648419, 7559488, 7437230, 7367611, 7336087, 7307466, 7100120, 6983268, 6822252, 6686080, 6684104, 6503014, 6256575, 6163279, 6138926, 6085763, 6121640, 5977489, 5799188, 5752690, 5695118, 5601703, 5613057, 5605674, 5525952, 5504156, 5548981, 5451833, 5455971, 5356149, 5297955]
2663E297955r001j78j53196m0406m3806p0830j689m9592k03949J5631q4716r1689
2651D564534j19705r5406K8157l3590o7745R9017n2204l7040L1120j6823j25775
2640D174540n7219o973R2226l7480j39977j01095M9773M3001j41565N1696j18250
2629C808677n0036K9577P765q0564o3608m418k631n5381j12293M4910M1419o1418
2617C501999m1068l385l0306r0868r845P6265p1971j77687L825L6301J24781j19776
2605C198265n1172n4030k6819j02527L3949j14635O5476P0523o2748k8245N411
2594B933448o7333k2531L7428j6611j8522M0234k167L3433j06603K6423J7795
2583B854994n567j7173M2185P3442p423M7240O7217o4826P6185k5060q8209O4784
$$ y = [5297955, 5288954, 5288776, 5135580, 5095174, 5051368, 4980538, 4978849, 4929257, 4725308, 4740939, 4656223, 4564534, 4444829, 4349423, 4377580, 4343990, 4276245, 4375262, 4323058, 4286018, 4317138, 4300315, 4174540, 4117321, 4110348, 4202574, 4165094, 4025117, 3924022, 3973795, 4016796, 3875231, 3926927, 3808677, 3758641, 3788218, 3795983, 3715419, 3651811, 3647393, 3644762, 3589381, 3477088, 3521998, 3563417, 3501999, 3460931, 3457546, 3427240, 3336372, 3326527, 3402792, 3330821, 3153134, 3156959, 3193260, 3318041, 3198265, 3147093, 3093063, 3066244, 2963717, 2997666, 2883031, 2948507, 3019030, 2956282, 2928037, 2933448, 2866115, 2843584, 2881012, 2864401, 2845879, 2886113, 2883946, 2917379, 2810776, 2837199, 2854994, 2849427, 2832254, 2874439, 2947881, 2940458, 2987698, 3054915, 2990089, 3066274, 3041214, 2953005, 3017789]
2571C017789R0397Q0679l2570L0655j20462P7202L1401P1018J51088J32077N2312
2560C581586M5267l7283Q4108K11068L6041j03506j9079n7573n6080r2558k14353
2549C377638j25581k1837j59492j15626l8516q9760l1338j11675r6628o5286l7099
2538B484800j35085L4474l4441k8017m1657o4075J37753q0507l3633j16115o295
2527B117202k1179O6662q8793J0286o7200l2296r4017j46844Q6746O324j8655
2516A818236j8535J9260P355q041O5806p5727L9385p1645m1914l9389p756j0473
2504A676562P968M0295j29556l5405N0301R947p5387R8698R998m7520K9921L5660
2492A671482j2014m5925J4921N7137o2046N9223p481k2937O222q8958N5447k3532
$$ y = [3017789, 3108186, 3188865, 3156295, 3186950, 3066488, 3143690, 3175091, 3246109, 3397197, 3529274, 3581586, 3626853, 3589570, 3673678, 3884746, 3920787, 3817281, 3798202, 3740629, 3684549, 3591991, 3377638, 3252057, 3230220, 3070728, 2955102, 2916586, 2826826, 2795488, 2683813, 2587185, 2521899, 2484800, 2349715, 2384189, 2349748, 2321731, 2280074, 2215999, 2353752, 2273245, 2239612, 2123497, 2117202, 2096023, 2162685, 2073892, 2084178, 2016978, 1984682, 1890665, 1743821, 1830567, 1836891, 1818236, 1799701, 1818961, 1826316, 1818275, 1884081, 1808354, 1847739, 1776094, 1734180, 1694791, 1687035, 1676562, 1684530, 1724825, 1595269, 1559864, 1610165, 1620112, 1544725, 1643423, 1653421, 1605901, 1635822, 1671482, 1659468, 1613543, 1628464, 1685601, 1623555, 1682778, 1675297, 1652360, 1658582, 1569624, 1625071, 1601539]
2480A601539q7366J058k2141L0004p6366j0199n4441j50464L4326o5416M7703
2469A248237N6815k4624m4032R296p5532K0353N6709o5502n0894P5601m7822j3683
2457A144922K1496k7769N5195m0198l4917q1837M1590M0535Q8456M3005j0509
2446A239969o9115p1945o7215k032q5158J72426r0429M1917l9892q2186o131l1719
2434I08490R2676n1099m8209m1765o2070L120l8248m3382Q8293N2494K5491P5761
2422I61552J7735q9272N1529J1671K4712j3076L9612P7279l6527n0602Q194j0070
2410I92737J15273q232q081K2j00508l152O5618p6103K0788k7251J9464N7257
2398A047832j58534q1701K6765J14649n751L486J9524k6852N9349M1641p2953
$$ y = [1601539, 1514173, 1515231, 1493090, 1523094, 1446728, 1436529, 1382088, 1231624, 1265950, 1200534, 1248237, 1305052, 1280428, 1236396, 1245692, 1170160, 1190513, 1247222, 1181720, 1130826, 1206427, 1158605, 1144922, 1166418, 1138649, 1193844, 1153646, 1118729, 1036892, 1078482, 1119017, 1207473, 1250478, 1239969, 1170854, 1098909, 1031694, 1029662, 944504, 1116930, 1026501, 1068418, 1028526, 946340, 940209, 908490, 1001166, 950067, 901858, 860093, 798023, 801143, 762895, 719513, 807806, 860300, 885791, 961552, 979287, 890015, 941544, 953215, 977927, 964851, 1004463, 1081742, 1045215, 994613, 1002807, 992737, 1108010, 1099778, 1091697, 1091719, 991211, 988059, 1053677, 977574, 998362, 971111, 990575, 1047832, 889298, 807597, 834362, 949011, 943260, 946746, 966270, 939418, 998767, 1040408, 967455]
2387I67455L9981p2628j10976K5908N860k5656q7795n2132K6258n5261K4314P4876
2375G60204p885l6030o9660L8876J949m2856J08136j2169k2060k7510m5850j1796
2363F33349L8684k660l897L1582o8725K1570j7938M839l0932P0192K1608l6099
2351F61573j0323l3772N6642m7223L9865O325r0500J08747Q4647k3467j6934n1928
2339F83652N2186m9434k1063L725p8337k6473l165K5601p622n0694J02223k2341
2327F08258q457R7411J9343P199j41487Q1694j9309K647J3293m2919P0698j5406
2315F72965p3297L5803O6594J7053r7145k7722p8628q295O6652L0397q1691Q0791
2303F03477O2542q2658J887K5775P1021j10749o0907k465J5789N1821Q5953M4955
$$ y = [967455, 1007436, 934808, 823832, 849740, 855600, 829944, 742149, 690017, 716275, 661014, 685328, 760204, 752319, 716289, 646629, 685505, 687454, 644598, 752734, 740565, 718505, 690995, 645145, 633349, 672033, 669373, 665476, 697058, 628333, 649903, 631965, 636804, 605872, 676064, 697672, 661573, 651250, 617478, 674120, 626897, 666762, 673087, 582587, 691334, 775981, 752514, 735580, 683652, 735838, 686404, 665341, 669066, 590729, 564256, 561091, 586692, 579070, 528376, 630599, 608258, 599801, 697212, 716555, 723754, 582267, 663961, 644652, 647299, 660592, 617673, 688371, 672965, 599668, 635471, 702065, 719118, 621973, 594251, 515623, 507328, 573980, 604377, 522686, 603477, 666019, 583361, 585248, 611023, 682044, 571295, 510388, 507923, 523712, 575533, 661486, 706441]
2291G06441j11517j20829J45822K1255k4454M8659m4888j7298j04931k1938O6028
2280E42350l5393P4323l4271P549M4921j8677M921L6840j39349l9920N2069M7746
2268E43109J9520j2125R4271j0156n8156N53j9148j01336M2998Q6083k155l8489
2256E44969p4792O280Q8592N6097K7763j03519M3865J2926o8468K1877L6001o0507
2244E31084k9214k7371M221M1624j22146P3213Q4321j31453O9249K3543j6446
2233E00625r1230Q5883J59204j5599q7826k976m2045j6364J2665J2752J1360p2156
2221D54293K679N3082o2409j7994J34045J2739k5119n0700j2024r903R761o1317
2209D27133M9388L2741m0710J2875M7671P0775o010m342j2686J3066j8226Q011
$$ y = [706441, 594924, 474095, 619917, 641172, 616718, 665377, 620489, 603191, 498260, 476322, 542350, 506957, 581280, 547009, 554558, 599479, 580802, 585723, 622563, 483214, 443294, 495363, 543109, 562629, 550504, 644775, 634619, 576463, 577016, 557868, 456532, 499530, 585613, 583458, 544969, 470177, 476457, 565049, 621146, 648909, 545390, 589255, 602181, 533713, 555590, 591591, 531084, 501870, 474499, 478720, 520344, 398198, 471411, 555732, 424279, 493528, 517071, 500625, 409395, 495278, 654482, 638883, 551057, 548081, 506036, 489672, 502337, 515089, 526449, 454293, 456972, 510054, 447645, 429651, 563696, 576435, 551316, 500616, 488592, 478689, 488450, 427133, 476521, 509262, 468552, 481427, 529098, 599873, 593863, 589521, 576835, 589901, 571675, 579686]
2197E79686O9900l3632m4717M0909K01N4738n3524o5350N8526k3013l6844J35325
2185F82205O0359q1249J6358p6536P3636l3770o4526O0729q019K9563P7924l7162
2173F99512k5171L6669j3270M0162m268O3835J2798n3485j7493J04750K6039P4043
2161I44121N1770k8532k4073p8834K3935P2216k4190K5330J3861R6886J70951
2150A243441k5649R0385N000j2852j14176J49991K8936l1124J00287J81571J96761
2139A812571L8892J57049K54151J44521J07055n6689J75137K11480J63428K33452
2129C241047M96670M23523N82164P99454J145807J852892K858148K943712J139245
2120A5482662j441222k630675k000343j457093j036354r71609q21600p12392o24657
$$ y = [579686, 649586, 615954, 571237, 612146, 612347, 667085, 613561, 548211, 606737, 583724, 546880, 682205, 742564, 661315, 677673, 601137, 674773, 641003, 576477, 637206, 629187, 658750, 736674, 699512, 674341, 711010, 697740, 737902, 733634, 797469, 810267, 756782, 739289, 844039, 870078, 944121, 995891, 967359, 943286, 864452, 888387, 960603, 936413, 961743, 975604, 1072490, 1243441, 1217792, 1308177, 1313177, 1300325, 1186149, 1336140, 1365076, 1333952, 1434239, 1615810, 1812571, 1851463, 2008512, 2262663, 2407184, 2514239, 2457550, 2632687, 2844167, 3007595, 3241047, 3737717, 4161240, 4743404, 5542858, 6688665, 8541557, 11399705, 14343417, 15482662, 14041440, 11410765, 9410422, 7953329, 6916975, 5945366, 5123766, 4411374, 3786717]
2111C786717l88853k21927j08818k45382j52087r2074r5211k45337k77085m4720
2101A915223p3950q6453n5910p5685j00558k8427p466k243j90740l6113q3330
2090A174348r8943k3635L0634q4329o0246p1976L8618q2807O0423l8407l7925
2079H05755n6553L0620k7596n8395K671l4883j14156m9187j3679l265J10674K4251
2067F16257K3285L7245m8702l4690j7740R309J1465p3038k3606J8206r4250o09
2055D23132J33053N1582j31258p3500r086N9112J09353j5650k2412j6177n2178
2044D55971k0724p18P0073J4578p5679K3879j9414k295n535l5248l6712P8344
2032D46520j9382J4457M559j31269O5311J73494o3761o0410q4547k5116K0825
$$ y = [3786717, 3397864, 3175937, 3067119, 2821737, 2669650, 2577576, 2482365, 2237028, 1959943, 1915223, 1841273, 1754820, 1698910, 1623225, 1522667, 1494240, 1486774, 1484531, 1293791, 1257678, 1174348, 1075405, 1051770, 1082404, 998075, 937829, 865853, 904471, 821664, 882087, 843680, 805755, 749202, 779822, 752226, 693831, 696502, 661619, 547463, 498276, 484597, 481332, 592006, 616257, 639542, 676787, 628085, 593395, 575655, 584964, 596429, 523391, 499785, 517991, 423741, 423132, 556185, 607767, 476509, 403009, 393923, 453035, 562388, 546738, 524326, 508149, 455971, 435247, 434529, 504602, 519180, 443501, 467380, 447966, 445671, 440136, 404888, 368176, 446520, 427138, 441595, 446154, 314885, 380196, 553690, 489929, 429519, 344972, 319856, 340681]
2021C40681N962m1921J2626O190M1096N2705q8781m410L6644K2323j2341l1616
2009C39158N4630J8875q0698k1120L2549L0787l3080k0547M1133n9262J3986j7175
1997B99236K9799J3441k0998M3481P6221n4279k8404N6102J2630o4828j2560l9308
1985C10533j2027j6215L6587l1297j217M201o2805Q465M5634k7230J6487J11543
1973C82659L8584L9864l4123m9259k7175N7174k7820o7806K530M7565Q8418l4844
1961D15767m1292o2320j6802M0572p0638K4473L7897m6099m319j13248M0628N9177
1949B63796K7714J06346M5860n139j05292p765l4460n3830m1309K2856O7813o2617
1937B23973l5684r0944J9567J33439O3221m0089p4258Q728J3849J916j1410Q339
$$ y = [340681, 346643, 304722, 317348, 323538, 364634, 417339, 328558, 324148, 360792, 383115, 370774, 339158, 393788, 412663, 331965, 310845, 343394, 374181, 341101, 320554, 361687, 302425, 316411, 299236, 329035, 342476, 321478, 364959, 441180, 386901, 358497, 414599, 427229, 362401, 349841, 310533, 298506, 282291, 318878, 287581, 286364, 290565, 227760, 236225, 281859, 254629, 271116, 382659, 421243, 461107, 426984, 377725, 350550, 407724, 379904, 312098, 314628, 362193, 450611, 415767, 374475, 312155, 295353, 335925, 265287, 289760, 327657, 281558, 277239, 163991, 204619, 263796, 291510, 397856, 443716, 438577, 333285, 325520, 291060, 237230, 195921, 218777, 286590, 223973, 188289, 97345, 116912, 250351, 313572, 273483, 199225, 207953, 221802, 223718, 212308, 220647]
1925B20647l6386j8919J7578n0420l4195M5470K4723l341k8155K6309m9000j5083
1913I9228Q5974k8398L5353J1102M3639q0827n7375l1884N1909o2854L2129Q8541
1901A86537p9452k9963J7500N2351p0235J3111L393L0668m5951Q6472M2870J1500
1889B18801q6019j3663M74M2507N205j13278k0557J07785Q9070Q411m8002J35464
1877C26198m7742j80280K5067Q1119n4007L7121k6802k7842K2604m914j5637j68770
1865c3885o539L2448J1775J2721K9506L1106M4599J22164p0780p1168K6131Q3341
1853B11419j7823l7274m2317m9126j4379Q689M2980l2778k0984O7695p2721l3787
1841I594J59365n1502P466K339q1367K5904P3826l0000j1811O4168J01190j20902
$$ y = [220647, 184261, 165342, 182920, 132500, 98305, 143775, 168498, 165157, 137002, 163311, 114311, 99228, 185202, 156804, 192157, 203259, 246898, 166071, 108696, 76812, 128721, 65867, 97996, 186537, 107085, 77122, 94622, 146973, 76738, 89849, 93242, 123910, 77959, 164431, 207301, 218801, 132782, 119119, 119593, 162100, 167305, 54027, 33470, 141255, 230325, 238736, 190734, 326198, 278456, 98176, 123243, 204362, 150355, 187476, 160674, 132832, 155436, 150522, 134885, -33885, -40424, -7976, 3799, 16520, 46026, 77132, 121731, 243895, 173115, 101947, 128078, 211419, 193596, 156322, 114005, 64879, 50500, 59189, 102169, 69391, 48407, 116102, 43381, 9594, 168959, 117457, 124923, 127262, 45895, 71799, 145625, 115625, 103814, 167982, 269172, 148270]
1829A48270q0357R2825P364l0768N4997j574M2075P1786r373J4461J4002K7544
1817C51252N0350K664n383r7829L991N5852k6604J622m6024j0939K8537P4600
1805C82089r1814o7262K0644m2741o4370N4032L2731P2832O6239p9175j35701
1794A47504o6544Q6198M3510O9408n8114M6451O6568o396l3739o5467j7010K2430
1782B34799n549J0535j33924M1190J4614P3786o231j23025r731J3519J383n5875
1770E5491Q7868n3587j2150N4497o0644k7271l9331J1754k6750j2806J09850l2168
1758E4753j4850l3419J8497P1076k9873L6572j01224j2832J09176L3397L7129
1747A68402O2783l8513R902P5164p1337j4767P2346r931K44o6092o1821Q3742
$$ y = [148270, 67913, 160738, 168102, 137334, 192331, 190757, 232832, 304618, 295245, 309706, 323708, 351252, 401602, 404266, 398883, 301054, 305045, 360897, 334293, 335915, 289891, 278952, 307489, 382089, 290275, 223013, 243657, 200916, 136546, 190578, 223309, 296141, 362380, 283205, 147504, 80960, 167158, 210668, 280076, 221962, 268413, 334981, 328585, 294846, 229379, 212369, 234799, 229250, 239785, 105861, 147051, 161665, 235451, 229220, 106195, 96464, 109983, 111366, 55491, 143359, 89772, 77622, 132119, 71475, 44204, 4873, 16627, -10123, -22929, 86921, 54753, 39903, 6484, 24981, 96057, 66184, 102756, 1532, -11300, 97876, 131273, 168402, 231185, 192672, 202574, 277738, 206401, 191634, 263980, 254049, 254293, 188201, 126380, 210122]
1735B10122o5068J0690M7661m5841K4807M382N778J38090l5161m8611K2765L0753
1723C00367o1612p5745M3276K5327K6584j1728k3903o7433o4540o9603O6842J01984
1711A89816j2665m0480J1531k0978m6608K0293k4702j4789J6891M7929q9530L2689
1699F9397J6359k8564Q0243K8089R963o7814J2966l5272m1442j21963k4124J01967
1687a95l2649J7015M4549l7200J17434N449j4836N7201l9465m1055j6522Q1907
1675A41633o0928n6965L3773R7969n3265O444L1190q353j3610J24440r8747p5093
1663F8488L6454J648J04942K4308j0062o2721j4237j6299m5123j9870k1295M3615
1651H9848m7232Q0786P6849J9691P3345j27878L6759L6548k0717J00318k1796
$$ y = [210122, 145054, 155744, 203405, 157564, 182371, 186753, 192531, 330621, 295460, 246849, 269614, 300367, 238755, 163010, 206286, 231613, 258197, 246469, 222566, 155133, 90593, 20990, 87832, 189816, 177151, 136671, 148202, 127224, 80616, 100909, 76207, 61418, 78309, 126238, 36708, 69397, 85756, 57192, 137435, 165524, 175487, 107673, 120639, 85367, 43925, -78038, -102162, -195, -32844, -15829, 28720, -8480, 108954, 114403, 99567, 156768, 117303, 76248, 59726, 141633, 80705, 23740, 57513, 155482, 102217, 108661, 139851, 131498, 117888, 242328, 143581, 68488, 104942, 106590, 211532, 235840, 225778, 163057, 148820, 132521, 87398, 67528, 46233, 89848, 42616, 123402, 200251, 219942, 293287, 165409, 202168, 238716, 217999, 318317, 296521]
1640B96521j16320n0697M0825K1334N0883j8641l1747N2848j8842p0741M7082
1629B02505M9181q3729N5837p2621k769O3796q9447l7061m2176K6165N9944r853
1617A19772p1677P4342R4412p3165p6255n3213J2482J4916k2691l215K266k4285
1605f311k7722p087J0735l6678l0545O7305K9627J1832r243r9911K8023J3986
1593e5989p2888L204K6757Q0288J23379L0644k6632o3432j00574j17317J40008
1582c2552J4581L2963Q12O027j0053m1257l3997o782N290l2205P2439R007J7805
1569B078k3107q3997P5170O5910n4271m3541O1145O157K6027M178p4106J36788
1557I8431p460k9078m1088J2365N477n81Q066P0266K3090j07532q6537K0988J51988
$$ y = [296521, 180201, 129504, 170329, 191663, 242546, 223905, 192158, 245006, 226164, 155423, 202505, 251686, 167957, 223794, 151173, 148404, 212200, 122753, 85692, 43516, 69681, 129625, 119772, 48095, 122437, 216849, 143684, 67429, 14216, 26698, 41614, 18923, 15708, 17974, -6311, -34033, -41120, -30385, -67063, -97608, -30303, -676, 11156, 1913, -97998, -69975, -55989, -128877, -125673, -98916, -18628, 104751, 135395, 108763, 45331, -55243, -172560, -32552, -17971, 14992, 15804, 21831, 11778, -29479, -63476, -70258, -64968, -97173, -24734, -15727, 2078, -21029, -105026, -29856, 36054, -18217, -61758, -613, 5544, 31571, 35749, -38357, 98431, 90971, 61893, 20805, 33170, 38647, 38066, 46132, 116398, 139488, 31956, -54581, -33593, 118395]
1544A18395k2293j2364n202J4909p064M8556J03159j16825j1503N1551p7321j16493
1532c2495L7260M672J11921K4070o7204J1220l0112M5776j907l7947M8735l4696
1520G9293Q3203p1794j14166L3770N8834L35j0196L2804l802J03580k4485q411
1508A58965m421m3631j9543l7026p0039R1284O0053K0129l6932O0411n8090o9972
1496E1188J950m5353q243j214L3233r962J6814J4862k5021M4313n9089R8288l9718
1483G2048m9287m373j17524Q8191p2384m0569j554N2682J0729p92q2959k1785
1471a67577j5179l6567J5107m1125K2046P3575P4958L2657r4095K110j3204q9985
1459b37279P8301R4140m3682p7521Q7665l705m2625R0666j18053p5554J04802
$$ y = [118395, 96102, 83738, 78536, 93445, 86381, 134937, 238096, 121271, 109768, 161319, 83998, -32495, 4765, 9437, 121358, 145428, 78224, 89444, 59332, 105108, 103201, 65254, 113989, 79293, 162496, 90702, -23464, 10306, 69140, 69475, 59279, 92083, 88281, 191861, 167376, 158965, 154544, 110913, 91370, 54344, -15695, 75589, 135642, 155771, 118839, 179250, 121160, 51188, 53138, 7785, -458, -1672, 31561, 21599, 38413, 53275, 28254, 72567, 13478, 111766, 72048, 22761, 18388, -99136, -10945, -83329, -123898, -125452, -72770, -62041, -62833, -145792, -167577, -182756, -219323, -204216, -245341, -223295, -149720, -74762, -42105, -136200, -134090, -147294, -237279, -158978, -64838, -108520, -186041, -98376, -102081, -144706, -54040, -172093, -247647, -142845]
1448a42845L6929J7147O4044J4925K3346m7425K1068o7779N144J2948M7680R4958
1436H0140N3956l6705j76646N4925P9114M7019k5798J0867K8153j8923K7066O3437
1424A86605m9527n4735Q8656N751N8371J7736o9785r2647l5240Q5779M2230J3716
1412A96910j7234o733o6660O7399k3790o2576k0352K6426L1189l8006L5433P2653
1400A94659Q370m1229p8499M9553m4485m0771l220r6865j7453R997L1462R934
1388a8547M9612K5856j15667J1309L5603N7209j0950l499k8062n8846j1174n3877
1376a21033l2273J21710N73j11113l0627J2879O1169k0456J6947M2055J1793N0229
1364A853N414q9371O3951N1973P8599m2243o9538j1827K0111j00685J5489J06162
$$ y = [-142845, -105916, -88769, -24725, -9800, 13546, -33879, -12811, -80590, -75446, -62498, -14818, 80140, 134096, 97391, -79255, -24330, 54784, 101803, 76005, 86872, 115025, 96102, 123168, 186605, 137078, 82343, 170999, 176750, 235121, 252857, 183072, 90425, 55185, 140964, 183194, 196910, 179676, 172943, 106283, 173682, 149892, 87316, 66964, 93390, 124579, 86573, 122006, 194659, 203029, 161800, 83301, 132854, 88369, 47598, 44378, -52487, -69940, -59943, -28481, -18547, 31065, 56921, -58746, -47437, -11834, 45375, 34425, 30926, 2864, -55982, -67156, -121033, -153306, -31596, -31023, -142136, -172763, -159884, -98715, -119171, -102224, -60169, -48376, 1853, 7267, -82104, -18153, 33820, 112419, 70176, 638, -11189, 8922, -91763, -76274, 29888]
1352B9888L8697M6338n0822r3356J4537P4028m8076k1690O8010N1869m6261K641
1340F5803j2627J0810R952p5434N3007J0290L4430k97Q4151n2796l8397l9693
1328D9199m2219J01702J4948m5099N81n1245k3951L9548P2739o8289m0005M449
1316A2358K404M2838M5074m8673q7676Q4041N6991K399M5501k0466r6603m7185
1304h997p08Q3899M6676k9026j4664R0404p7702r4364Q5839l855j21873P715k2133
1291e8789k2616J3255J12480p8225n5090J1602J29782L478o4304m8749K4204j2380
1279d5352R9049Q7014j63474k806O7847J7705L0968p8026n3246J6468L8842J3963
1267B8952n897o9495N6270K302J5611L029p0582J4306q132M7814n9062j9130k6664
$$ y = [29888, 68585, 114923, 64101, -29255, -14718, 59310, 11234, -10456, 57554, 109423, 63162, 65803, 53176, 63986, 73938, -1496, 51511, 61801, 96231, 95934, 180085, 127289, 88892, 49199, 6980, 108682, 123630, 78531, 79112, 27867, 3916, 43464, 116203, 47914, 7909, 12358, 14762, 57600, 102674, 54001, -33675, 50366, 107357, 109756, 155257, 134791, 38188, -8997, -9705, 74194, 120870, 91844, 77180, 167584, 89882, -4482, 81357, 77502, -44371, -36656, -58789, -81405, -68150, 44330, -33895, -88985, -77383, 52399, 55877, -8427, -57176, -32972, -45352, 53697, 140711, -22763, -25569, 42278, 59983, 90951, 12925, -40321, -23853, 14989, 28952, 23055, -46440, 9830, 12132, 27743, 30772, -39810, -25504, -33636, 14178, -44884, -64014, -90678]
1254i0678L5334L615o1180j1587l4222M1806J09043l4063r319k8462K6097p3351
1242a26967M9267N8702j02494M702J0820p5953J4432K8374Q8461O1250k9144J9412
1230H62M7493m3097p9758N0362j0062m722K7447j0854o6803m4929l91R5717m450
1217d3185M5051M0841k5248q001q0040k0554L5726J1724L7619J07012K7398k4063
1205A04280n1144K0162j07767M087J1451J5914q8948l398Q2823J06413P150l6102
1193F4921K7403q7248J2769L8944o8628n2367R2381O0295O3400n8202p6066K0160
1181C7762N552L7426K6187n111r6460n1056M5298Q2432o186k3685O131m2185L0372
1168D6477q947p7309L8858O0483P1724m3788j00526J277J35253K1808m3797o1443
$$ y = [-90678, -55344, -51729, -112909, -124496, -158718, -116912, -7869, -41932, -51251, -79713, -53616, -126967, -77700, -18998, -121492, -116790, -105970, -181923, -167491, -139117, -50656, 10594, -18550, 862, 48355, 5258, -74500, -24138, -34200, -38922, -11475, -22329, -89132, -134061, -134452, -38735, -43185, 1866, 42707, 17459, 9458, -70582, -91136, -55410, -43686, -6067, 100945, 128343, 104280, 53136, 73298, -34469, -30382, -18931, -3017, -91965, -95363, -12540, 93873, 101023, 64921, 92324, 5076, 17845, 56789, -11839, -64206, 28175, 88470, 151870, 93668, 17602, 37762, 43314, 80740, 106927, 101816, 5356, -45700, -402, 82030, 75844, 52159, 58290, 16105, 46477, 37530, -39779, -921, 59562, 131286, 87498, -13028, -11751, 123502, 145310, 101513, 40070]
1156D0070k7872J7259q2105M2455O3492m011k5414O3039L9574n7544o490k4243
1144C8210r9556J21916O1275k0117q828O4636q999j03175j23997p961l176M6412
1132d3360R3032M7758l9625r6454N1973J98097l8017p1565n0124j0204n1139k7759
1120c7387J4951Q5560n4256p1280J36943j5119L31l3090p527k1066K018n1821
1108e1743m0761J42883n5380L6044l402q8298K0023n2078K3594M2830N3202j40963
1096a14049n2055N9603O7456O9425j19834j6175j2542K5679K0857K2691n279p4208
1084a28431N6409N6328k3294J6391R6931o0167j438m4715N5011K8800j9942l3623
1072a740N0813J4750n2027j8966L2220J2184n9164O987k9848j9740q8444M0348
$$ y = [40070, 12198, 29457, -52648, -10193, 53299, 49288, 23874, 86913, 126487, 68943, 62453, 38210, -61346, 60570, 121845, 101728, 92900, 157536, 148537, 45362, -78635, -86596, -89772, -43360, 49672, 97430, 57805, -38649, 13324, 211421, 173404, 101839, 51715, 41511, -9628, -37387, -22436, 63124, 8868, -62412, 74531, 59412, 59743, 26653, 19126, -1940, 78, -51743, -92504, 50379, -5001, 31043, 27641, -60657, -40634, -92712, -69118, -26288, 26914, -114049, -166104, -106501, -39045, 30380, -89454, -105629, -118171, -92492, -71635, -48944, -54223, -128431, -72022, -15694, -38988, -22597, 74334, 14167, 12729, -31986, 23025, 51825, 31883, -1740, 49073, 63823, 11796, -7170, 25050, 37234, -21930, -14943, -44791, -64531, -152975, -112627]
1060a12627N4001K4891J26616m8893j661r3116o4512M3477p0220k1560L8929M896
1048a19779P2406L2729K4400q1699m0179Q4193l264K5891J0859K7009n5409j30687
1036a53530N7227M8665j9532K7211o634j7329Q097K4034j17908j02782p509O8958
1024a91032J31593M2392k9506j4839q291m7218P5892L5105q2251J3882L2055M6545
1012D327N3221j4845k8641J2578r1223J6502O5473l583L9981k1915L3121N1236
1000A16232J828r8406k4378j5513n2932K1207J2526p931K3548M6267j8967K0390
988B3871K9276O5512o0620J4177J2629Q0819o6411k3454R5870P4239j44839k8901
976G2168Q0170m7450o4716L2303J6964Q9768n8719p5795K6165k1581m61r5626
$$ y = [-112627, -58626, -33735, 92881, 43988, 42327, -50789, -115301, -71824, -142044, -163604, -124675, -119779, -47373, -14644, 9756, -71943, -112122, -27929, -31193, -5302, 5557, 32566, -22843, -153530, -96303, -47638, -67170, -39959, -46593, -63922, -55825, -31791, -149699, -252481, -259990, -191032, -59439, -17047, -46553, -61392, -69683, -116901, -41009, -5904, -88155, -74273, -42218, 4327, 57548, 42703, 14062, 26640, -64583, -48081, 17392, 13809, 53790, 31875, 64996, 116232, 118060, 19654, -4724, -20237, -73169, -51962, -39436, -47367, -23819, 22448, 3481, 23871, 53147, 118659, 58039, 72216, 84845, 165664, 99253, 75799, 171669, 245908, 101069, 72168, 152338, 104888, 40172, 72475, 89439, 179207, 120488, 44693, 70858, 49277, 48816, -46810]
964d6810M3887o2099O5988N3140O8973o4255p4196J8433j26129J9746O8507L5294
952D79M8580o508n0143l1133r641o0955M4016n337l6604L1620P3735m2855J9861
939b4885j9604M1037j2623O7410j07995n9091N1004k4390n1844J5106Q8271K7605
927i999l6298n388M2232j53841N5297N4497r613J9547O9652M6282n0659n8294
915c6585J36653l3043r6356l5018Q729L6105J3190m2854m1184Q6105n1934J4732
903d1460Q528o3868J20150m4742o9605M9062L5895o0909J1142p2509n7122k935
891a88373J07869R2833j04158r8513J2427J0251P3897j1940j29457M0747K6891
880a67526k7743L3867J33760j3341M6268K874r6647M5440R6772L1138k9476j18531
$$ y = [-46810, -2923, -65022, 966, 54106, 123079, 58824, -15372, 3061, -123068, -103322, -34815, 479, 49059, 42551, -7592, -38725, -48366, -109321, -65305, -70642, -107246, -75626, -1891, -44746, -24885, -44489, -3452, -16075, 51335, -56660, -115751, -64747, -89137, -140981, -125875, -37604, -9999, -46297, -51685, -9453, -163294, -107997, -53500, -63113, -43566, 26086, 72368, 21709, -36585, 100068, 67025, -29331, -64349, -55620, -19515, -6325, -49179, -90363, -4258, -56192, -41460, -32932, -96800, 23350, -21392, -90997, -41935, -6040, -66949, -55807, -128316, -185438, -188373, -80504, 12329, -91829, -190342, -177915, -167664, -93767, -105707, -235164, -194417, -167526, -195269, -161402, -27642, -40983, 5285, 8159, -88488, -43048, 53724, 84862, 55386, -63145]
868f3145j10532m1103J22854J31785M9443j26437j06083m992J21173m1581L610
857f5008q9540M8023J10560k4652n411j2673P7560j0537l1661J15446k8910j01402
845a8205Q3040L1752n5638j32784j8530Q7863o2956o4939J00806M4967j2520J3409
833c735N0929l2810k1520K9167K444j8559N9180o1382L3460L5288J5553K3216
821A11231j1540N4202O422j02500n4109n8899m130J348P4714k6560k0761k8009
809e8591O4444L3080n6303K6473p55R529k9021j02989M7763N3729o1654J4636
797e9659n0392L1511J8051L0687j4439L3714m7960P1794O9954p5789l481R8129
785A02120j8112m389j1630r8996k7037J41594n4652o238l2399j11103N0651O4619
$$ y = [-63145, -173677, -214780, -91926, 39859, 89302, -37135, -143218, -148210, -27037, -68618, -65008, -154548, -106525, 4035, -20617, -26028, -38701, 38859, 28322, -3339, 112107, 83197, -18205, 64835, 96587, 40949, -91835, -110365, -22502, -85458, -150397, -49591, -4624, -17144, -3735, 47194, 14384, -7136, 22031, 24475, 5916, 65096, 3714, 37174, 72462, 88015, 111231, 99691, 153893, 160315, 57815, 3706, -55193, -59323, -57975, 16739, -9821, -30582, -58591, 5853, 38933, -17370, 9103, 8348, 17877, -11144, -114133, -66370, -12641, -74295, -59659, -110051, -78540, -60489, -29802, -44241, -10527, -58487, 13307, 83261, 7472, 3991, 102120, 84008, 79619, 67989, -31007, -58044, 83550, 28898, 22660, -9739, -120842, -70191, -5572]
773e572J06168l9430K1198m8868O6096R33j40109j79366N8068J06847n0536O6191
761c8380J6958r4566P1157l8162J03361K4918K9284j01999m9420J03120m1865
750a5594n9964j2945Q6784m3801J4823l1834N543l7024J50230n7632q3862L2808
738e2468j5792R9578N4733J1698l2405N889O6282j55276o4254K089Q8739r14M0329
725D8228m947l3986O422m1088K7222J575O2196j4055K7529o4358r1804j0053O2755
712b4364k1974k8466l0914k9527P989N9025K3179J839L4929l9489J8530o5490
700i4733p180J26368j0912J5494k3467j20368J08835l6973k0089P9171j5472R311
688I985j13774k1173l5305J08667J9533P1791N9781l2137j6408o4161k247K202
$$ y = [-5572, 100596, 61166, 82364, 33496, 99592, 100525, -39584, -218950, -160882, -54035, -104571, -38380, -21422, -115988, -44831, -82993, 20368, 45286, 74570, -27429, -76849, 26271, -15594, -75558, -88503, -1719, -45520, -30697, -62531, -56988, -94012, 56218, -1414, -85276, -52468, -68260, 31318, 86051, 97749, 65344, 71233, 137515, -17761, -82015, -79926, 8813, 7899, 48228, 43281, 9295, 15717, -25371, 1851, 3426, 65622, 51567, 79096, 14738, -77066, -87119, -24364, -46338, -74804, -105718, -135245, -127256, -68231, -45052, -43213, -8284, -47773, -29243, -94733, -101913, 24455, 13543, 29037, 5570, -114798, -5963, -42936, -63025, 16146, 674, 9985, -103789, -124962, -160267, -51600, -32067, 39724, 99505, 67368, 50960, -13201, -15448, -13246]
676a3246m9966k1076J8248k4638k5325j7153N771j0047Q4674J43402k4522n6931
664I191l0365l2861j5791n921O7609o9566K7585l1562K1165p974K9931P825m351
651c5085j661M5658K9985o7656r2529k94P2107K7604R0436q6123n2766P760K6382
638c6182j5809J817J09075j2r382k0869j5338k0593Q0023n6713k0009l6060m7396
625h7448k2447m6431O9185j9798N9276k3767Q939J19955j8105l4154m3757j3578
613e2130K8358o2346k214j4745O1177N6275l99L0554N9001O895m6900q3604Q9882
600F9804p7380j22073M3129N9308o3907m0503J1845J40902K4645p0124J2294l093
588a5153k1169m0211k2976J04500k8228m1365J8666m747M2201n4416j3771L0338
$$ y = [-13246, -63212, -84288, -66040, -90678, -116003, -133156, -127385, -137432, -52758, 90644, 66122, 9191, -21174, -54035, -69826, -75747, -8138, -77704, -50119, -81681, -60516, -68490, -38559, -30734, -35085, -36746, 8912, 38897, -28759, -121288, -121582, -49475, -21871, 68565, -17558, -70324, -62564, -36182, -51991, -50174, 58901, 58889, 49507, 28638, 13300, -7293, 72730, 16017, -3992, -40052, -87448, -109895, -156326, -87141, -106939, -47663, -71430, -62491, 57464, 39359, 5205, -38552, -52130, -23772, -86118, -88332, -103077, -41900, 14375, 13976, 44530, 103531, 110426, 63526, -20078, 69804, -7576, -129649, -86520, -27212, -91119, -131622, -119777, 21125, 45770, -24354, -12060, -15153, -36322, -76533, -99509, 4991, -23237, -64602, -45936, -50683, -8482, -62898, -76669, -46331]
576d6331O5751l3888k247o3426N1094J7777m196L8681l799j05096j0379M3401
564e2658M3308N675o3729M1281R459n2538q6762K7927J06553J9720K4514O8356
552I1106j24895O4888p7435p5012Q6573O997k1866n068o5267k9885J4459l9985
540a75390J15303J4093k2987R4332p9150K999Q0884q7684N9261j879j6184j2491
528b8893m4071N399k5162M1053N938L556J6833P2765N7839j49149l7763Q6111
516D456J02335j2586K9265p4750p4891j673N3055K5755p4077L9088N6591j01129
504b8561O4181K0962M8372o3970r1783m3242Q6239L2004J0643N5418n8821j4171
492A7271r3285L7086p825J13635j5491l124J0385j9859O8626m7166p2253J0166
$$ y = [-46331, 19420, -14468, -16715, -80141, -29047, -11270, -15466, 23215, 19416, -85680, -96059, -52658, -9350, -3675, -67404, -26123, -16664, -69202, -155964, -128037, -21484, -1764, 22750, 91106, -33789, 31099, -46336, -121348, -34775, -27778, -49644, -54712, -119979, -149864, -135405, -175390, -60087, -45994, -68981, 25351, -53799, -50800, 30084, -57600, 1661, -218, -16402, -28893, -72964, -67565, -92727, -51674, -45736, -42180, -25347, 47418, 105257, -43892, -81655, 4456, 106791, 94205, 123470, 48720, -26171, -27844, 25211, 50966, -23111, 15977, 72568, -28561, 35620, 56582, 104954, 40984, -50799, -94041, -7802, 24202, 34845, 90263, 31442, 17271, -76014, -38928, -46753, 66882, 51391, 48267, 58652, 38793, 107419, 60253, -12000, -1834]
480a834R437k984k5221K7682N2282k0666n3260p0803J1405m1316J4438O9262M0787
467I209k4413O0228L6522k1789j04898Q4481j0989p1152P3457k1318q260l8145
455c7067N7809p6072O3102N2063k0936q2910n6919P0270L5688Q1834Q004L3008
443A27874j02792m8896O6553k5368M1419m1776M0995o3459k7821O1454P4532P5017
431A77732j6607k08973o625J0362j11959K2178N8592M1085P3883O1772L882l6186
419F9136j1776o0151M5525k8036k6055R6480j14710L6676L601R9278K6672m2180
407I4460K8644p0540n0318n2289N0912n2919j2308O2986n4976R5839j7694l1335
395i538k3425K4097k6021K7712K0056N9517l1600M0667l2391l2007J801p2484
$$ y = [-1834, 7603, 4619, -20602, 7080, 59362, 38696, -14564, -85367, -73962, -115278, -100840, -31578, 9209, -15204, 45024, 81546, 59757, -45141, 39340, 28351, -42801, 30656, 9338, 1078, -37067, 20742, -55330, 7772, 59835, 38899, -44011, -100930, -30660, 5028, 86862, 94866, 127874, 25082, -23814, 42739, 17371, 58790, 17014, 58009, -5450, -33271, 28183, 102715, 177732, 161125, -47848, -54473, -44111, -156070, -133892, -75300, -34215, 39668, 101440, 105322, 69136, 57360, -2791, 42734, 14698, -11357, 85123, -29587, 7089, 10690, 109968, 136640, 94460, 123104, 52564, 2246, -50043, 869, -52050, -64358, -1372, -56348, 39491, 21797, -9538, -32963, -8866, -34887, -7175, 12881, 72398, 40798, 81465, 49074, 17067, 18868, -53616]
383e3616P6209M7362j38677r1925J00515q9996M6742J3980J59572O230N7144q2506
371E1034K0985M6610k8768j00120N5934N4337K105K9552r4639M842M8462o4169
359B6165r9036J08591J8787p3086J5997O5901l2618K8451j2962L2761K0233p8281
347B0903m8402O4505n7711m3573q53j3382Q2761J2854j20222J41905K7027o1973
335C839O3903N5638p9752p0760M3976r929p5326p735p104o354O3059P5509m6590
322B374J6264k1452k6314O5730M7171P385j2448k7870P0458K9449m4507k6439
310G9801P6701l6763o1731o076l8233K7553l2883m0111L240O3194k2184j33065
298a20557J3874R4498l937p1210O1079J9264J20661M5261j57766M7160m4445m3890
$$ y = [-53616, 22593, 69955, -68722, -160647, -60132, -150128, -103386, -89406, 70166, 76396, 133540, 51034, 72019, 118629, 89861, -10259, 45675, 100012, 102117, 131669, 37030, 41872, 90334, 26165, -72871, 35720, 54507, -18579, -2582, 63319, 30701, 59152, 46190, 78951, 99184, 20903, -27499, 37006, -20705, -64278, -65131, -78513, 4248, 17102, -103120, 38785, 65812, 3839, 67742, 123380, 43628, -27132, 16844, 6915, -68411, -76146, -83250, -89604, -26545, 48964, 2374, 18638, -2814, -29128, 36602, 83773, 91158, 78710, 50840, 121298, 150747, 106240, 79801, 156502, 119739, 58008, 51932, 13699, 41252, 8369, -31742, -28502, 34692, 12508, -120557, -106683, -12185, -16122, -87332, -26253, -6989, 113672, 158933, 1167, 48327, 3882, -40008]
286d0008M537J5576K9535N9138j19223o9936J57550l1937l010l1977k3400N1969
274a186n9581n508N7493L7323o8059J4002N8415N152l0861L8951l9298J00799
262A07642L2639k3711q9610j05059P9733N1958O3275N7018j02803j659P4661n5326
250H8758M3777m7089k9388L0783q4285R9317n2682J7377J8942l7743l4265Q5257
238I8759l0162K9547M168r0702m299j0280K8294k0502M2035J7040K2751J3764
226A00413l1375p6604K6271j9053P0184j4348n3629N7109m4814r017M3963N6729
214A05829L0788j41897M0833O4083j8438r1689M9762N4980k4441M0398j45126
203c4918L2237N1847l1017n715j3928L4531l4552l4305Q1878j4756q0776q5014
$$ y = [-40008, -35471, -19895, 9640, 68778, -50445, -120381, 37169, 5232, 2222, -29755, -53155, -1186, -60767, -66275, -8782, 28541, -39518, -25516, 32899, 38051, 7190, 46141, 6843, 107642, 140281, 116570, 26960, -78099, 1634, 53592, 116867, 173885, 71082, 69423, 144084, 88758, 132535, 85446, 56058, 86841, 2556, 101873, 49191, 66568, 85510, 47767, 13502, 98759, 68597, 98144, 102312, 11610, 7311, -2969, 25325, 4823, 46858, 63898, 86649, 100413, 69038, -7566, 18705, -348, 69836, 55488, 1859, 58968, 14154, 5137, 49100, 105829, 136617, -5280, 35553, 99636, 81198, -10491, 39271, 94251, 69810, 110208, -34918, -2681, 49166, 18149, 12434, -1494, 33037, -1515, -35820, 46058, 31302, -49474, -134488]
191a34488k3513P8232J35132L0218j04372Q0376m411j23923L3671l5691J7627
180e1142R5316R777j8741j35225j5967M7286J5702n7841P063L173J46630j05962
168e9931K2803J03154l8176r913n0444J4753l744N8603L3971P634j03032K7462
156C140q871j7721O3039Q850K029j4306j8735n2717p0331J5028L8718Q8143J20997
143A57263m4795r764n990o6629J7568j5079M7473K3725l7222N2694J6578k621
131A33201K000K5397N18n5050J2139P874q4094r9066Q8590j0464l0713K8958Q339
118B7629Q8771r4294P3606l2796J5690k7819l4111M8561Q666L4547o2411J4438
106F0477M3015m7192k6568Q4782p680J6633l2732M3936j6708q0555q1414P3453
$$ y = [-134488, -158001, -79769, 55363, 85581, -18791, 61585, 57174, -66749, -33078, -68769, -51142, 44174, 53951, 35210, -100015, -115982, -68696, -52994, -110835, -103772, -100599, 46031, -59931, -37128, 66026, 27850, 17937, -32507, -17754, -21498, 37105, 71076, 78710, -24322, 3140, -5731, -23452, 39587, 48437, 50466, 36160, 17425, -35292, -105623, -90595, -51877, 36266, 157263, 112468, 102704, 96714, 30085, 47653, 32574, 80047, 103772, 66550, 119244, 135822, 133201, 135201, 160598, 161116, 106066, 118205, 126079, 41985, -57081, 31509, 21045, -9668, 19290, 27629, 116400, 22106, 95712, 62916, 78606, 50787, 16676, 65237, 73903, 108450, 46039, 60477, 103492, 56300, 29732, 114514, 106834, 123467, 90735, 134671, 117963, 37408, -44006, 29447]
94B9447J4196M3045N32o8572L0648m5901r731j0632m5395K8311K3020m7874Q4882
81B5976J2076m5852J3280K4137L4901M8932M4472m2468j8973r7155N6193J739
69E7258M5783j1779n2923K2960k0115n233n6015Q712K2112j7481p5834Q5689K5499
56B8633j6560j5717p458j5708k1607l6907L3876O7736j9075N6566k4179l2068
44b468K0500L5005K4920l6511O284k4376l7737N2855l7428L4609O1889j0911n3315
31C3316K59K2068Q234n971K9840j0059r857k4184k7333M018k0864K3686j6625
18F528P1788Q845K5734j3590m3679L2461J0367m3399P2179p6240j06036Q9129
6C4087R8869j7834o3004m0949k9876l4972
$$ y = [29447, 43643, 86688, 87220, 18648, 49296, 3395, -6336, -16968, -62363, -34052, -11032, -58906, 25976, 38052, -7800, 5480, 29617, 64518, 113450, 157922, 115454, 96481, -674, 55519, 57258, 103041, 91262, 38339, 61299, 41184, 35951, -20064, -11352, 10760, -6721, -82555, 3134, 28633, 12073, -3644, -11102, -26810, -48417, -85324, -51448, 16288, -2787, 53779, 29600, -2468, 18032, 53037, 77957, 41446, 47730, 23354, -14383, 38472, 1044, 35653, 97542, 86631, 33316, 33575, 55643, 63877, 57906, 87746, 77687, 67830, 43646, 16313, 20331, -533, 23153, 6528, 78316, 87161, 112895, 99305, 55626, 88087, 98454, 55055, 127234, 50994, -55042, 34087, 132956, 115122, 52118, 11169, -18707, -53679]
0e3679
$$ y = [-53679]
$$ Imaginary data points
##PAGE= N=2
##DATA TABLE= (X++(I..I)), XYDATA
16383c238206o104j9265J3451J89257L3236r279K6955n2104J69991M9197L5571
16372b807300O8766j1870P5699O2375o3452N2022Q9052O7790N0236K1790J0543
16361b384349O953L0704J29837Q7088N7818l483j486J09841M2055M2679J04739
16350a777604O8236J4699J0274k0530J05644P4204k0243m6877J41761J03489J5154
16339a331793R7461O4598o109n4736J39917N5446o0428N6556N2690M4702M0616
16328i01080j220J334P3220P9138K8406O1796J23271L8266n9063J6354J05603
16317d33975N3779M2786P5500J7761o3277J09539J26417R7911l2597j7931J8906
16306e181k921M8746N6231L1983L845J31950M4440N3362J0402L6485K9412j5076
$$ y = [-3238206, -3244310, -3263575, -3250124, -3060867, -3027631, -3036910, -3009955, -3062059, -2892068, -2842871, -2807300, -2738534, -2750404, -2674705, -2612330, -2675782, -2623760, -2534708, -2466918, -2416682, -2394892, -2384349, -2377396, -2346692, -2216855, -2129767, -2071949, -2075432, -2076918, -1967077, -1925022, -1882343, -1777604, -1709368, -1694669, -1684395, -1704925, -1599281, -1525077, -1545320, -1592197, -1450436, -1346947, -1331793, -1234332, -1169734, -1175843, -1230579, -1090662, -1035216, -1095644, -1039088, -986398, -941696, -901080, -902300, -900966, -827746, -748608, -720202, -658406, -535135, -496869, -555932, -539578, -433975, -380196, -337410, -261910, -244149, -307426, -197887, -71470, 26441, -6156, -24087, -5181, -8102, 40644, 96875, 128858, 132703, 264653, 309093, 362455, 372857, 409342, 438754, 423678]
16294D23678R0912J9215J5136L4275R9726P6450j2204l1771l5390M0786p669L5311
16282G48455K8442J14108J6832M1465L4400J577J6084J13071P6765j9352N3127
16271A224974J4645q531k3891J44797K252L3612Q551P6464K4552p6122R434P7618
16259A508355M5087P4909K5146K0385O8714O3480o2410j1378R9348n1308J02571
16248A882899j5833J0054M5140j3022o176R8657O0096K8065o951l6244L4073N6370
16236B137128O7519L2109n2730j9095R0172o6610N1743J41836L646M248P9363
16225B469329M6134J272L1788J0609o0902J0956P2119n258M6252k2955O7489K2648
16213B689481r4148R3589O5972Q9926R008m4261J0507l2853J7255k6572n0132
$$ y = [423678, 514590, 533805, 548941, 583216, 682942, 759392, 747188, 715417, 680027, 720813, 713144, 748455, 776897, 891005, 907837, 949302, 983702, 985279, 1001363, 1114434, 1191199, 1171847, 1224974, 1239619, 1231088, 1207197, 1351994, 1354246, 1387858, 1396409, 1472873, 1497425, 1421303, 1430737, 1508355, 1553442, 1628351, 1653497, 1673882, 1742596, 1806076, 1743666, 1732288, 1831636, 1780328, 1882899, 1867066, 1877120, 1922260, 1909238, 1903062, 2001719, 2061815, 2089880, 2082929, 2046685, 2080758, 2137128, 2204647, 2236756, 2184026, 2164931, 2255103, 2188493, 2240236, 2382072, 2385718, 2389966, 2469329, 2515463, 2516735, 2548523, 2559132, 2498230, 2509186, 2581305, 2576047, 2622299, 2599344, 2666833, 2689481, 2595333, 2688922, 2754894, 2844820, 2853828, 2809567, 2820074, 2787221, 2804476, 2777904, 2727772]
16202B727772J01069J16087N6414n217o7698R286P4613K1458P281j8124N0043
16191C072984J10311O3454m3977P1558k5012j216p2287n1662L3256P5485K870
16180C235764l2940N3115n7703j4543M7553J27988k9528o5749l123j1053O6189
16169C315970l7486k6780J42568R2194l6093l8953Q3972p5394Q3831Q6299o3138
16158C526990j4365k3764j0225j8745l069j2455P428O8741n7933k764Q7805K772
16146C550416K2756N3596N4762J09851o8162j03095J9637k9296q1351K8035Q1924
16135C639073R0870k56p8185J9053R7835m8541k3182J7482o1658N277j4056L5249
16123C678961j8180K5154J47239o0581o129j0727K345n5746R0725J32482o9248
$$ y = [2727772, 2828841, 2944928, 3001342, 2996125, 2928427, 2937713, 3012326, 3033784, 3041065, 3022941, 3072984, 3183295, 3246749, 3202772, 3274330, 3249318, 3248102, 3175815, 3124153, 3157409, 3232894, 3235764, 3202824, 3255939, 3198236, 3183693, 3231246, 3359234, 3329706, 3263957, 3260834, 3249781, 3315970, 3278484, 3251704, 3394272, 3486466, 3450373, 3411420, 3495392, 3419998, 3503829, 3590128, 3526990, 3512625, 3488861, 3478636, 3459891, 3456822, 3444367, 3451795, 3520536, 3462603, 3459839, 3547644, 3550416, 3573172, 3626768, 3681530, 3791381, 3723219, 3620124, 3639761, 3610465, 3529114, 3557149, 3639073, 3729943, 3729687, 3651502, 3670555, 3768390, 3719849, 3696667, 3714149, 3652491, 3657768, 3643712, 3678961, 3660781, 3685935, 3833174, 3772593, 3766464, 3755737, 3758082, 3702336, 3793061, 3925543, 3856295]
16112C856295l1873M7477m7819k1110M8744l7744k0368k2286J02342N1496k3288
16101C901866K239l7979M7817k7435n2120o4382n727L8307l7168P435M8428L2244
16089C853525o5857L5728N2406r2922J6104O5230m2794Q9844k2587N8088K6315
16078C973080k3180j58638J00182k5795J4467J38099j36109k686J15200n7929
16068C936691r1846R1938q4434Q2351m1888j03989M0780M3983R9609o1J1532l2541
16056C952125j5365k1911N6059k0556q5478M3901J12004Q3976j33560j11772p1371
16045C788052J88697K1242r6328K3693j2907M3620q8752J21387M0693m3905O690
16034C992182p4077j13689J30586K9718L8463k5893m6283K9311j0606k4387o382
$$ y = [3856295, 3824422, 3871899, 3824080, 3802970, 3851714, 3813970, 3793602, 3771316, 3873658, 3925154, 3901866, 3904105, 3866126, 3913943, 3886508, 3834388, 3770006, 3764279, 3802586, 3765418, 3772853, 3821281, 3853525, 3787668, 3823396, 3875802, 3782880, 3798984, 3864214, 3821420, 3911264, 3888677, 3946765, 3973080, 3949900, 3791262, 3891444, 3865649, 3880116, 4018215, 3882106, 3879420, 3994620, 3936691, 3844845, 3936783, 3852349, 3934700, 3892812, 3788823, 3829603, 3873586, 3973195, 3973134, 3984666, 3952125, 3936760, 3914849, 3970908, 3950352, 3864874, 3908775, 4020779, 4104755, 3971195, 3859423, 3788052, 3976749, 3997991, 3901663, 3925356, 3912449, 3956069, 3867317, 3988704, 4029397, 3985492, 3992182, 3918105, 3804416, 3935002, 3964720, 4003183, 3977290, 3931007, 3960318, 3949712, 3925325, 3918943]
16023C918943m3107l1975L8445L3554P6607K6583n7498L0948J5547q0330p5840
16012C851877J4487P6166Q047M4701j7041M5615K5161r4537M9543n9818n6298
16001C887903j3592L2668J08171o2624q817r777P591m1875N2854M2248m9654l3544
15989C911552P3637K4172p2701l3405M0170J6244L6916q7358O7523Q8800o9393
15978C996157L234L5551j00139Q2574J32331n5184M4277m223j4226j9082M566
15967D105836l0137M675k805j17893J5380Q5383o0861O5581J6386q4178K860o1173
15955C939054J5958K9524K4460q31J5093Q608K8108Q1416J19363j55838n4078
15944D050837m2924J0593J12893k9574n4380k6906m049j7314O3030K4462j12044
$$ y = [3918943, 3875836, 3843861, 3882306, 3915860, 3992467, 4019050, 3961552, 3992500, 4008047, 3927717, 3851877, 3866364, 3942530, 3950577, 3995278, 3978237, 4023852, 4049013, 3954476, 4004019, 3944201, 3887903, 3874311, 3906979, 4015150, 3952526, 3943709, 3933932, 3941523, 3899648, 3952502, 3994750, 3945096, 3911552, 3985189, 4009361, 3936660, 3903255, 3943425, 3959669, 3996585, 3909227, 3976750, 4065550, 3996157, 3999391, 4034942, 3934803, 4017377, 4149708, 4094524, 4138801, 4134578, 4120352, 4101270, 4105836, 4075699, 4080374, 4077569, 3959676, 3975056, 4060439, 3999578, 4065159, 4081545, 3997367, 4000227, 3939054, 3955012, 3984536, 4008996, 4008165, 4023258, 4031866, 4059974, 4141390, 4260753, 4104915, 4050837, 4007913, 4018506, 4131399, 4101825, 4047445, 4020539, 4016490, 3999176, 4062206, 4086668, 3974624]
$$ [...]
##END NTUPLES=NMR SPECTRUM
##END=
