##TITLE=1H_CA-9162-2-3
 CDCl3
 8 sc, 
 16.6.2023
##JCAMPDX= 6.0         $$ Bruker NMR JCAMP-DX V2.0
##DATA TYPE= NMR SPECTRUM
##DATA CLASS= NTUPLES
##ORIGIN= UXNMR, Bruker Analytische Messtechnik GmbH
##OWNER= root
$$ XWIN-NMR		Version 3.5
$$ Fri Jun 16 14:23:46 2023 Russian Standard Time (UT+4h)  she@DPX200
##.OBSERVE FREQUENCY= 200.13135
##.OBSERVE NUCLEUS= ^1H
##.ACQUISITION MODE= SIMULTANEOUS
##.ACQUISITION SCHEME= undefined
##.AVERAGES= 8
##.DIGITISER RES= 18
##SPECTROMETER/DATA SYSTEM= spect
##.PULSE SEQUENCE= zg30
##.SOLVENT NAME= CDCl3
##.SHIFT REFERENCE= (INTERNAL, CDCl3, 0, 15.7138)
##AUDIT TRAIL= $$ (NUMBER, WHEN, WHO, WHERE, WHAT)
$$ ##TITLE= Audit trail, XWIN-NMR		Version 3.5
$$ ##JCAMPDX= 5.01
$$ ##ORIGIN= Bruker BioSpin GmbH
$$ ##OWNER= she
$$ F:/spectra/data/she/nmr/H-F/1/pdata/1/auditp.txt
$$ ##AUDIT TRAIL=  $$ (NUMBER, WHEN, WHO, WHERE, WHAT)
(   1,<2023-06-16 14:22:01.95 +0400>,<she>,<DPX200>,
      <created by zg, POWCHK disabled, PULCHK disabled
       configuration hash MD5:
       00 E9 B6 7A A2 85 ED C7 34 08 36 98 17 FE 4E 26
       data hash MD5: 16K
       97 F3 23 9A 51 E5 66 41 53 46 D8 3B 77 56 C6 15>)
(   2,<2023-06-16 14:22:04.12 +0400>,<she>,<DPX200>,
      <Start of raw data processing
       efp BC_mod = 2 LB = 0.24 FT_mod = 6 PKNL = 1 PHC0 = -20625.54 PHC1 = 8.25272 SI = 16K 
       data hash MD5: 16K
       EF 39 CF 8E F2 75 3D 1D 0B A6 8F AC DA 70 F6 37>)
(   3,<2023-06-16 14:22:29.84 +0400>,<she>,<DPX200>,
      <pk PHC0 = 0.7949196 PHC1 = 1.6 
       data hash MD5: 16K
       A4 C0 02 30 8E 15 86 FE E4 76 AC 39 A9 11 B8 1C>)
(   4,<2023-06-16 14:22:33.60 +0400>,<she>,<DPX200>,
      <abs ABSG = 5 
       data hash MD5: 16K
       69 EE EA BE 32 90 48 65 3F 96 3F 87 A6 02 C6 71>)
(   5,<2023-06-16 14:22:55.85 +0400>,<she>,<DPX200>,
      <pk PHC0 = 5.1316 PHC1 = -7.200001 
       data hash MD5: 16K
       C2 64 BA 4B 66 2D 85 F4 12 D8 FA B8 32 29 8D D7>)
(   6,<2023-06-16 14:22:59.12 +0400>,<she>,<DPX200>,
      <abs ABSG = 5 
       data hash MD5: 16K
       3D 27 E1 A8 67 0B 5E 61 73 F8 54 B2 1D 0B 9D A9>)
$$ ##END=
$$ 
$$ hash MD5
$$ D3 DC 52 D8 22 C5 14 47 F0 4E E7 58 5C 0D 20 91
##$RELAX= 
##$RELAX= 
##$RELAX= 
##$RELAX= 
##$RELAX= 
##$RELAX= 
$$ Bruker specific parameters
$$ --------------------------
##$DU= <F:/spectra>
##$EXPNO= 1
##$NAME= <H-F>
##$PROCNO= 1
##$TYPE= <nmr>
##$USER= <she>
##$AMP= (0..31)
100 100 100 100 100 100 100 100 100 100 100 100 100 100 100 100 100 100 
100 100 100 100 100 100 100 100 100 100 100 100 100 100 
##$AQSEQ= 0
##$AQ_mod= 1
##$AUNM= <au_zg>
##$AUTOPOS= <>
##$BF1= 200.13
##$BF2= 200.13
##$BF3= 200.13
##$BF4= 200.13
##$BF5= 200.13
##$BF6= 200.13
##$BF7= 200.13
##$BF8= 200.13
##$BYTORDA= 1
##$CFDGTYP= 0
##$CFRGTYP= 5
##$CHEMSTR= <none>
##$CNST= (0..31)
1 1 145 1 1 1 1 1 1 1 1 1 1 1 1 1 1 1 1 1 1 1 1 1 1 1 1 1 1 1 1 1 
##$CPDPRG= <>
##$CPDPRG1= <>
##$CPDPRG2= <>
##$CPDPRG3= <>
##$CPDPRG4= <mlev>
##$CPDPRG5= <mlev>
##$CPDPRG6= <mlev>
##$CPDPRG7= <mlev>
##$CPDPRG8= <mlev>
$$ [...]
##$SUBNAM3= <"">
##$SUBNAM4= <"">
##$SUBNAM5= <"">
##$SUBNAM6= <"">
##$SUBNAM7= <"">
##$SUBNAM8= <"">
##$SUBNAM9= <"">
##$SW= 18.05172834244
##$SWIBOX= (0..15)
0 0 2 0 0 0 0 0 0 0 0 0 0 0 0 0 
##$SW_h= 3612.71676300578
##$TD= 16384
##$TD0= 1
##$TE= 0
##$TE2= 300
##$TE3= 300
##$TEG= 300
##$TL= (0..7)
0 120 120 120 120 120 120 120 
##$TP= (0..7)
150 150 150 150 150 150 150 150 
##$TP07= 0
##$TPNAME0= <>
##$TPNAME1= <>
##$TPNAME2= <>
##$TPNAME3= <>
##$TPNAME4= <>
##$TPNAME5= <>
##$TPNAME6= <>
##$TPNAME7= <>
##$TPOAL= (0..7)
0.5 0.5 0.5 0.5 0.5 0.5 0.5 0.5 
##$TPOFFS= (0..7)
0 0 0 0 0 0 0 0 
##$TUNHIN= 0
##$TUNHOUT= 0
##$TUNXOUT= 0
##$USERA1= <user>
##$USERA2= <user>
##$USERA3= <user>
##$USERA4= <user>
##$USERA5= <user>
##$V9= 5
##$VALIST= <valist>
##$VCLIST= <CCCCCCCCCCCCCCC>
##$VD= 0
##$VDLIST= <DDDDDDDDDDDDDDD>
##$VPLIST= <PPPPPPPPPPPPPPP>
##$VTLIST= <TTTTTTTTTTTTTTT>
##$WBST= 1024
##$WBSW= 4
##$XGAIN= (0..3)
0 0 0 0 
##$XL= 0
##$YL= 0
##$YMAX_a= 791996
##$YMIN_a= -1038549
##$ZGOPTNS= <>
##$ZL1= 120
##$ZL2= 120
##$ZL3= 120
##$ZL4= 120
##$ABSF1= 15.7557
##$ABSF2= -2.296149
##$ABSG= 5
##$ABSL= 3
##$ALPHA= 0
##$AQORDER= 0
##$ASSFAC= 0
##$ASSFACI= 0
##$ASSFACX= 0
##$ASSWID= 0
##$AUNMP= <proc_1d>
##$AZFE= 0.1
##$AZFW= 0.1
##$BCFW= 0
##$BC_mod= 2
##$BYTORDP= 0
##$COROFFS= 0
##$CY= -3
##$DATMOD= 1
##$DC= 0
##$DFILT= <>
##$DTYPP= 0
##$F1P= 0
##$F2P= 0
##$FCOR= 1
##$FTSIZE= 16384
##$FT_mod= 6
##$GAMMA= 0
##$GB= 0
##$INTBC= 1
##$INTSCL= 3.70164e-10
##$ISEN= 128
##$LB= 0.24
##$LEV0= 0
##$LPBIN= 0
##$MAXI= 10000
##$MC2= 0
##$MEAN= 0
##$ME_mod= 0
##$MI= 1.114404
##$NCOEF= 0
##$NC_proc= -6
##$NLEV= 6
##$NOISF1= 3.799351
##$NOISF2= 2.8
##$NSP= 0
##$NTH_PI= 0
##$NZP= 0
##$OFFSET= 15.71383
##$PC= 1
##$PHC0= -20619.61
##$PHC1= 2.652719
##$PH_mod= 1
##$PKNL= yes
##$PPARMOD= 0
##$PSCAL= 0
##$PSIGN= 0
##$REVERSE= no
##$SF= 200.130011547603
##$SI= 16384
##$SIGF1= 3
##$SIGF2= 2
##$SINO= 5.538805
##$SIOLD= 16384
##$SREGLST= <1H.CDCl3>
##$SSB= 0
##$STSI= 16384
##$STSR= 0
##$SW_p= 3612.71676300578
##$SYMM= 0
##$S_DEV= 0
##$TDeff= 16384
##$TDoff= 0
##$TI= <>
##$TILT= no
##$TM1= 0
##$TM2= 0
##$TOPLEV= 0
##$USERP1= <user>
##$USERP2= <user>
##$USERP3= <user>
##$USERP4= <user>
##$USERP5= <user>
##$WDW= 1
##$XDIM= 16384
##$YMAX_p= 355690780
##$YMIN_p= -936425
$$ End of Bruker specific parameters
$$ ---------------------------------
##NTUPLES= NMR SPECTRUM
##VAR_NAME=  FREQUENCY,     SPECTRUM/REAL,   SPECTRUM/IMAG
##SYMBOL=    X,             R,               I
##VAR_TYPE=  INDEPENDENT,   DEPENDENT,       DEPENDENT
##VAR_FORM=  AFFN,          ASDF,            ASDF
##VAR_DIM=   16384,         16384,           16384
##UNITS=     HZ,            ARBITRARY UNITS, ARBITRARY UNITS
##FACTOR=    0.220516191357247, 1,           1
##FIRST=     3144.80897819665, 0,            0
##LAST=      -467.907784809131, 0,           0
##MIN=       -467.907784809131, -936425,     0
##MAX=       3144.80897819665, 355690780,    0
$$ Real data points
##PAGE= N=1
##DATA TABLE= (X++(R..R)), XYDATA
$$ [...]
5569B1621145m39464l29262k20029l50846j84351k73897l25917j81559k00480
5560A9115340k25285k97383k59390k39189k25726j22862k45723j95702j15878
5551A7188202k28493o1758j48767j72364j49527k17950m1706j71709j48932j22512
5541A5724484j17572j54972j46938k18275J6535P6528j32940n1250q3594O4724
5531A4976730j4486n3846j17448n6791l6471j28737L7267J18881O2043j52202
5521A4634940O0646J49466j0798L2782j21900l7720R7626Q2465J33473n1166n2992
5510A4916822K13575k9640j8731K3019O6490Q6914P1763l2788O3514R2679M6247
5499A5499864O8173K00J4536J11000J14470P1719l702p4039N4473K62463n3012
$$ plain form
5569 21621145 21181681 20852419 20632390 20281544 20097193 19823296 19497379 19315820 19115340
5560 19115340 18890055 18592672 18333282 18094093 17868367 17745505 17499782 17304080 17188202
5551 17188202 16959709 16897951 16749184 16576820 16427293 16209343 16167637 15995928 15846996 15724484
5541 15724484 15606912 15451940 15305002 15086727 15103262 15179790 15046850 14995600 14912006 14976730
5531 14976730 14962244 14908398 14790950 14734159 14697688 14568951 14606218 14725099 14787142 14634940
5521 14634940 14695586 14845052 14834254 14867036 14745136 14707416 14805042 14887507 15020980 14969814 14916822
5510 14916822 15130397 15100757 15082026 15105045 15171535 15258449 15330212 15297424 15360938 15453617 15499864
5499 15499864 15568037 15568237 15582773 15693773 15808243 15879962 15876260 15802221 15856694 16119157 16066145
5488A6066145L6607J75388J64168J54607R0274J67523K46392J90580J35911K20918
5478A7648513L06579K05877O0183K44262K97568L69310M64862M18383K67149L48372
5468B0631058L43693L00696L54456M40971L77633K86221L42994K83531L85421
5459B3746674N63688M81189L26101K37909M07970J37347K28890L06215K34877
5450B6670860K24427K57277K59142J01993K37338K45843K77951K18019L55917
5441B8848767L78518M43390L60858N26800O30883O15840N21239O98758P41173
5432C3766226P09104P53997O05599P23668O94144P21245N49850N53447N07186
5423C9584466N01633N52790K81051K69597J75912j7596m7852j27578k18626l85027
$$ plain form
5488 16066145 16102752 16278140 16442308 16596915 16687189 16854712 17101104 17291684 17427595 17648513
5478 17648513 17955092 18160969 18221152 18465414 18762982 19132292 19597154 20015537 20282686 20631058
5468 20631058 20974751 21275447 21629903 22070874 22448507 22734728 23077722 23361253 23746674
5459 23746674 24310362 24791551 25117652 25355561 25763531 25900878 26129768 26435983 26670860
5450 26670860 26895287 27152564 27411706 27513699 27751037 27996880 28274831 28492850 28848767
5441 28848767 29227285 29670675 30031533 30558333 31189216 31805056 32326295 33025053 33766226
5432 33766226 34475330 35229327 35834926 36558594 37252738 37973983 38523833 39077280 39584466
5423 39584466 40086099 40638889 40919940 41189537 41365449 41347853 41300001 41172423 40953797 40568770
5413D0568770k53036l13450j98977j70431k10048r1389J56639K69140J29244L96294
5403D0282756M68803N84186P69821O52116Q42211J246753J328017J428185J701060
5394D9303908J788236K058851K359116K465055K834414K952714L223059L218797
5386G0204150L368775L372782L216853L125469K851150K501558K018440J101096
5378I1760273J00043n64787j381577j783347j935196j920391j882657j739331
5370H0653030j598601j350948j072736q74720o15435m13350l27076k06886l32826
5361G3860452l50734o22535q40011j011675r76050j282632j118724j236840j046211
5352F5375040r98091r73127q48577q34041o09813n81247n93178p08954p36572
$$ plain form
5413 40568770 40315734 40002284 39803307 39632876 39422828 39331439 39488078 39757218 39886462 40282756
5403 40282756 40751559 41335745 42105566 42757682 43599893 44846646 46174663 47602848 49303908
5394 49303908 51092144 53150995 55510111 57975166 60809580 63762294 66985353 70204150
5386 70204150 73572925 76945707 80162560 83288029 86139179 88640737 90659177 91760273
5378 91760273 91860316 91295529 89913952 88130605 86195409 84275018 82392361 80653030
5370 80653030 79054429 77703481 76630745 75756025 75140590 74727240 74400164 74193278 73860452
5361 73860452 73509718 72887183 72047172 71035497 70059447 68776815 67658091 66421251 65375040
5352 65375040 64376949 63403822 62555245 61721204 61111391 60530144 59936966 59228012 58491440
5343E8491440r20509j145745j384885j499351j677854j760283j879909j780334
5335D6442570j914211j791356j605869j643382j429863j484467j327978r89634
5327C4255810j036148p61287q20129o91014o11713n88435n84940m97894l65610
5318B8298640m34419l62880o71557o01435n40757p62423o36748o92011o84635
5309B2911775n69967n81755o88340o33834n24413m70642n14033m54936l97169
5300A8076686k99729l44223k61068j90036j27014j47570j26191m1158k9263R0214
5290A6600648l0507J07068N1857l4921l633O9144j58139j44448m3910p4531k50298
5279A6088330k70967k04155l66830k07194l29703k85791k26856l91656l03675
$$ plain form
5343 58491440 57570931 56425186 55040301 53540950 51863096 50102813 48222904 46442570
5335 46442570 44528359 42737003 41131134 39487752 38057889 36573422 35245444 34255810
5327 34255810 33219662 32458375 31638246 30947232 30335519 29747084 29162144 28664250 28298640
5318 28298640 27864221 27501341 26829784 26228349 25687592 24925169 24288421 23596410 22911775
5309 22911775 22341808 21760053 21071713 20437879 19913466 19442824 18928791 18473855 18076686
5300 18076686 17776957 17432734 17171666 16981630 16854616 16707046 16580855 16539697 16510434 16600648
5290 16600648 16570141 16677209 16729066 16694145 16690512 16759656 16601517 16457069 16413159 16338628 16088330
5279 16088330 15817363 15613208 15246378 15039184 14709481 14423690 14196834 13805178 13501503
5270A3501503j64609k74293p9010j26281k27205j39606q2280K1235k3406r6727
5260A2309321K3270l0420M2319k514o4645q7540n1547o5305o9998r0620k00480
5249A1711841j62560j22781j70358k72757j44878o6784r2713j68484J5682J17101
5239A0643309j35982o2297r9612Q241O6300L0729j13339m7740r2413m8501m5970
5228A0102725k9680j92191j30486J1771j55913j58137k59299j43485p5412j64288
5218H805605j93518P5577k0951j17290q8623j3935m4946O7802J7311q8647N950
5207H404335O8779n4292O5769O6472P4353P171n655O3209J00804j82437j54888
5196H453620m3176O5995R0269R106J0441j20794J13069J15220k156p0140j16972
$$ plain form
5270 13501503 13336894 13062601 12983591 12857310 12630105 12490499 12408219 12429454 12406048 12309321
5260 12309321 12332591 12302171 12344490 12341976 12277331 12189791 12138244 12072939 12002941 11912321 11711841
5249 11711841 11549281 11426500 11256142 10983385 10838507 10771723 10679010 10510526 10526208 10643309
5239 10643309 10507327 10445030 10345418 10353659 10419959 10450688 10337349 10289609 10197196 10148695 10102725
5228 10102725 10073045 9880854 9750368 9762139 9606226 9448089 9188790 9045305 8969893 8805605
5218 8805605 8612087 8687664 8666713 8549423 8460800 8446865 8401919 8469721 8487032 8398385 8404335
5207 8404335 8473114 8418822 8484591 8551063 8625416 8632587 8626932 8690141 8790945 8608508 8453620
5196 8453620 8410444 8476439 8566708 8575814 8586255 8465461 8578530 8693750 8691594 8621454 8504482
5185H504482N3189L8393J67616J10093R849L4707K19379O9814J47361J17238q6377
5174I385744J37606J38627J25215K12602K98322J16773K15994K71717K39145L09159
5164A1450904L25492J24790Q254j4107j8164j20740j56641j16188j24504j43079
5154A1216017j47022r9918j59851l3905r8430L7403P0733p749J38879K02855O4129
5143A1183141J92599L71642K07953K10249L02883L98393K44260L47637K99873
5134A3758630L38260L31744K29037J93714n096P0757N4806k06036k81537k14562
5124A4269717k78266l33800k91198j63046j80945k37737j79286q0392k85963l66940
5114A1872144l96257m60319l29488m18297l67818l21934l10213k54959k80329
$$ plain form
5185 8504482 8557671 8596064 8763680 8873773 8883622 8918329 9137708 9207522 9354883 9472121 9385744
5174 9385744 9523350 9661977 9787192 9999794 10298116 10414889 10630883 10902600 11141745 11450904
5164 11450904 11776396 11901186 11909440 11895333 11877169 11756429 11599788 11483600 11359096 11216017
5154 11216017 11068995 10969077 10809226 10775321 10676891 10714294 10785027 10777278 10916157 11119012 11183141
5143 11183141 11375740 11747382 11955335 12165584 12468467 12866860 13111120 13458757 13758630
5134 13758630 14096890 14428634 14657671 14851385 14846289 14917046 14971852 14765816 14484279 14269717
5124 14269717 13991451 13657651 13366453 13203407 13022462 12784725 12605439 12525047 12239084 11872144
5114 11872144 11475887 11015568 10686080 10267783 9899965 9578031 9267818 9012859 8732530
5105H732530k16014j47331k16637k01865K0046n1228k08326j67820j64484j14879
5095G263992j01210j25706j92884j10944j27520m0844l7963L8468o493n1542L1926
5084F539280M0304k2397j04580N0100J1769j01009N4962P5783o3876n729L5549
5073F510156O7450p3188n4333K4492J74501L19502J7423m7360j57003k8047J49868
5062F903461l4830j19786o7968j44783m5489R3379o3877l6615m5132o023n2514
5051F379823M3091j7470r8525M2329q1420j26596j17032p9804j2180k7994j61719
5040E742503P827J9019j10499o7842L8518O3265j88769o144J05375p8568j09183
5029E415502l6984J37890O1464k7931Q6625O5060m0550j384j16253M7204N0776
$$ plain form
5105 8732530 8516516 8369185 8152548 7950683 7970729 7919501 7711175 7543355 7378871 7263992
5095 7263992 7162782 7037076 6844192 6733248 6605728 6564884 6526921 6565389 6558896 6507354 6539280
5084 6539280 6579584 6557187 6452607 6502707 6514476 6413467 6468429 6544212 6480336 6474607 6510156
5073 6510156 6577606 6504418 6450085 6474577 6649078 6968580 6986003 6938643 6781640 6753593 6903461
5062 6903461 6868631 6748845 6680877 6536094 6490605 6583984 6520107 6483492 6438360 6432337 6379823
5051 6379823 6422914 6405444 6306919 6349248 6267828 6141232 6024200 5944396 5932216 5904222 5742503
5040 5742503 5750330 5769349 5658850 5591008 5629526 5692791 5504022 5497878 5603253 5524685 5415502
5029 5415502 5378518 5516408 5577872 5549941 5636566 5701626 5661076 5659692 5543439 5590643 5641419
5018E641419m018Q1872n6068n9096O756p8517n4364N6319N4734j7798j97863j6258
5006E357118J30261M0115J15729p928j00145Q4149m8378j6507k5681J07583R1045
4995E727361j597N7252J0313m0058Q2562P6864J0936N5195o3212L8040K142N5109
4983F010907l2105j82210Q0862m7329m3612k2505j41449J27515J420N1203P9088
4972E881785j12421Q5225j08351l2999Q8922O5089r3857J9533R043Q9765P4287
4961E966021L0697P9161n6713O7665M6799l9147P6553N0776p4149K1380k1057
4950F147986O6268l0294j00153K0275p824p7460N7741k6674o9940K9912J19129
4939F128966Q1045J732K1169m6430j59831R2961Q8138k415J4503N5698J04583
$$ plain form
5018 5641419 5637401 5719273 5663205 5604109 5610865 5532348 5477984 5534303 5589037 5571239 5373376 5357118
5006 5357118 5487379 5527494 5643223 5635295 5535150 5619299 5570921 5554414 5528733 5636316 5727361
4995 5727361 5725764 5783016 5793329 5753271 5835833 5912697 5923633 5978828 5915616 5953656 5955798 6010907
4983 6010907 5978802 5796592 5877454 5830125 5786513 5764008 5622559 5750074 5751494 5802697 5881785
4972 5881785 5769364 5854589 5746238 5713239 5802161 5867250 5773393 5792926 5801969 5891734 5966021
4961 5966021 5996718 6075879 6019166 6086831 6133630 6094483 6171036 6221812 6147663 6169043 6147986
4950 6147986 6214254 6183960 6083807 6104082 6096258 6018798 6076539 6049865 5979925 6009837 6128966
4939 6128966 6210011 6211743 6232912 6186482 6026651 6119612 6207750 6205335 6219838 6275536 6380119
4928F380119J9430J8129J23272O0002M1329j30544p2503K8494J02159K3463P8978
4917F672328J10753R1974J30118J4250n1113Q8601J30159N5011K0565p576J84507
4906G439577M5658R3208R2940J7827J31616K02205N2261P3207N0092R5832R3798
4895H388221P7615k92169K2093O5454j56102j29305o7635M9448l0909Q4965r9768
4884G911908n9191o896L0288Q3614L6244J21531J40611N4869j43521j18613K01132
4873H251976K9116m5832j8940r206p5754M0813J16423J23884K24246j12019J46189
4862H670896l543J19901J70241J15837L91233J69828J59503K28322M2834N7422
4852A0122474J06153r07l4763L0888J48541j37882l9583M4598k7034N6843M8453
$$ plain form
4928 6380119 6399549 6417678 6540950 6600952 6642281 6511737 6439234 6467728 6569887 6593350 6672328
4917 6672328 6783081 6875055 7005173 7019423 6968310 7056911 7187070 7242081 7262646 7255070 7439577
4906 7439577 7485235 7578443 7671383 7689210 7820826 8023031 8075292 8148499 8198591 8294423 8388221
4895 8388221 8465836 8173667 8195760 8261214 8105112 7975807 7908172 7957620 7926711 8011676 7911908
4884 7911908 7852717 7845821 7876109 7959723 7995967 8117498 8258109 8312978 8169457 8050844 8251976
4873 8251976 8281092 8235260 8216320 8207114 8131360 8172173 8288596 8412480 8636726 8524707 8670896
4862 8670896 8667353 8787254 8957495 9073332 9464565 9634393 9793896 10022218 10065052 10122474
4852 10122474 10228627 10227720 10192957 10223845 10372386 10234504 10194921 10239519 10212485 10269328 10317781
4841A0317781R7597J8729N8368O8703O5352M8396O269J76813J24910O0899J38472
4830A1182289K52752Q0114J22227J94410J71829J57579M5363j9805K9394P7823
4820A2293975O6290K8918M9159N6399R7820J5152J44595J04600J63061Q6876J03036
4809A3209881J97122J63057J83680J86501J65923J15869Q0291K38029K79797P2247
4799A4892397J42334J36311K43602K12853J82859K24907K15209K57778J33340
4790A6641590J84520L11999L30471J97717J81855K95889L75577K60338L04901
4781A9084857M63335N01833M35007M16467N64550M61746O72428P51649P99009
4772B4150881Q74956J145447J216017J325182J477489J554595J866415K300403
$$ plain form
4841 10317781 10415378 10434107 10492475 10561178 10626530 10674926 10681195 10858008 10982918 11043817 11182289
4830 11182289 11435041 11515155 11637382 11831792 12003621 12161200 12206563 12186758 12216152 12293975
4820 12293975 12360265 12389183 12438342 12494741 12592561 12607713 12752308 12856908 13019969 13106845 13209881
4809 13209881 13407003 13570060 13753740 13940241 14106164 14222033 14302324 14540353 14820150 14892397
4799 14892397 15034731 15171042 15414644 15627497 15810356 16035263 16250472 16508250 16641590
4790 16641590 16826110 17138109 17468580 17666297 17848152 18144041 18519618 18779956 19084857
4781 19084857 19548192 20050025 20485032 20901499 21466049 21927795 22600223 23351872 24150881
4772 24150881 25025837 26171284 27387301 28712483 30189972 31744567 33610982 35911385
4764C5911385K699036L268980M008113N272768O535660P761457Q115606O301025
4756G9874030K826543j520901o012227q271817q387735p266951n647492m198532
4748D1394918k912210k138829j558537j155639r76720q07482n18082m49882m19512
4739C0458025j69525r3806m3392o256m8246L5391k6803K6893J81574K92234K43795
4728C0849884M20693N97226N92343P25362R59431R18489J040457J190470J361103
4719C8655458J436088J559428J902984K220152K693654L208488M085573N038958
4711F0800783O082371P239791P091157M863400K055191q13949m698461p281942
4703G5338341p868245p213128n973994m433159l296150k445832j982320j375399
$$ plain form
4764 35911385 38610421 41879401 45887514 51160282 57695942 65457399 73573005 79874030
4756 79874030 82700573 81179672 75167445 66895628 58507893 51240942 45593450 41394918
4748 41394918 38482708 36343879 34785342 33629703 32652983 31845501 31327419 30877537 30458025
4739 30458025 30288500 30194694 30151302 30145046 30096800 30132191 30105388 30132281 30313855 30606089 30849884
4728 30849884 31270577 31867803 32460146 33185508 34144939 35063428 36103885 37294355 38655458
4719 38655458 40091546 41650974 43553958 45774110 48467764 51676252 55761825 60800783
4711 60800783 66883154 74122945 81214102 86077502 88132693 87318744 82620283 75338341
4703 75338341 67470096 60256968 54282974 49849815 46553665 44107833 42125513 40750114
4695D0750114j122036r36130p08526n36405l09096j61873o1550j80792M422j42851
4685C6595277j37107r7758j78702k49573j11483Q6621p6527j98145m5852l4340
4675C5552411Q537O1294J02659J64419J04533J81128P3989n1068J17332P141K67017
4664C6589392N954l1020J75078J17808J02176J73015L44379L54380K47707K75675
4654C8354544L20016M27832L41717N01482L94545L70222L61662M00924M49206
4645D1922150L10528K91328K47935L05523J40379L2693O0316J33841n3118J41749
4635D3533324J92105J22156L5051N2959K07137J47450P6341p639J44293K00593
4625D4703770K30111L27684K83620M36214L26461M15923N27145O56970M75431
$$ plain form
4695 40750114 39628078 38691948 37983422 37447017 37137921 36976048 36914498 36733706 36738128 36595277
4685 36595277 36458170 36360412 36181710 35932137 35820654 35907275 35830748 35632603 35586751 35552411
4675 35552411 35560948 35622242 35724901 35889320 35993853 36174981 36248970 36197902 36315234 36322375 36589392
4664 36589392 36595346 36564326 36739404 36857212 36959388 37132403 37476782 37831162 38078869 38354544
4654 38354544 38674560 39102392 39444109 39945591 40340136 40710358 41072020 41472944 41922150
4645 41922150 42232678 42524006 42771941 43077464 43217843 43250536 43310852 43444693 43391575 43533324
4635 43533324 43725429 43847585 43882636 43935595 44142732 44290182 44366523 44358884 44503177 44703770
4625 44703770 44933881 45261565 45545185 45981399 46307860 46723783 47250928 47907898 48383329
4616D8383329O88101P40269P81405P32615N98210O87930M32413O02065O80769
4607E4327106N15689N41790N26367O62377O57267O25080O59246O14922N67736
4598E9697580M37028N13303M52207L09267N04491L74310L22618O03879M81886
4589F3696569O01514Q07322R71932J051966J111814J391136J576059J522879J857423
4580G4588614K049560K375875K277806K396128K631063K521878K105918J684068
4572I2630910J018498K78053j26178k45365l05523n8507M67724Q93929J377437
4563I5930978J743194J984872K172290K478162K403401K021546J549540J259771
4555A11543754N80200J58327j32936l72889m96166o59003r52232q74996q50609
$$ plain form
4616 48383329 49071430 49811699 50593104 51325719 51923929 52611859 53044272 53646337 54327106
4607 54327106 54842795 55384585 55910952 56573329 57230596 57855676 58514922 59129844 59697580
4598 59697580 60134608 60647911 61100118 61409385 61913876 62288186 62610804 63214683 63696569
4589 63696569 64298083 65105405 66077337 67129303 68241117 69632253 71208312 72731191 74588614
4580 74588614 76638174 79014049 81291855 83687983 86319046 88840924 90946842 92630910
4572 92630910 93649408 93927461 93801283 93555918 93250395 93191888 93659612 94553541 95930978
4563 95930978 97674172 99659044 101831334 104309496 106712897 108734443 110283983 111543754
4555 111543754 112123954 112282281 112149345 111776456 111280290 110621287 109669055 108794059 107943450
4546A07943450j175565j148617j420744j478141j404581j364159j354426j312547
4538I7284670j265868j089316q76971q64337p33767o59360o76073p49800p96619
4529H9572559r39885j093744j131756j141992j372249j326499j256613j223756
4521H0086065j280951j277910j211725j217691r99959j043715q99154o55653o20490
4512G0878817l98786l38399q6305O2398R4006J75971L07647L12767M77023N38502
4502G2023641N84885O09100O25649N93337O00455N20340M86267L29090K25889
4493G6598653L17685K00998K29584L39128L92282M55314N85993O90908Q14906
4484H0625451P93532Q53566O83391P23915N89968O42926N38973L78090L71110
$$ plain form
4546 107943450 106767885 105619268 104198524 102720383 101315802 99951643 98597217 97284670
4538 97284670 96018802 94929486 94052515 93188178 92454411 91795051 91118978 90369178 89572559
4529 89572559 88632674 87538930 86407174 85265182 83892933 82566434 81309821 80086065
4521 80086065 78805114 77527204 76315479 75097788 74097829 73054114 72154960 71499307 70878817
4512 70878817 70480031 70141632 70055327 70117725 70211731 70387702 70695349 71008116 71485139 72023641
4502 72023641 72608526 73217626 73843275 74436612 75037067 75557407 76043674 76372764 76598653
4493 76598653 76916338 77117336 77346920 77686048 78078330 78533644 79119637 79810545 80625451
4484 80625451 81418983 82272549 82955940 83679855 84269823 84912749 85451722 85829812 86200922
4475H6200922K86339R3349o8369j55778j06624l75939o39899o02984o39024q79046
4465H3112947q58493r47411r41065q16426q64134p84511r11844p46979o15343
4456G5626741o89328n87537m48401l87000k94983l72567k22109J3536J3632J42875
4446G2794859J89772L56206O22145N95112P39941J185173J420091J513375J688934
4437H1105608J434080Q91456J65555q0668j04441n6166R1503R3889l2694J2880
4427H3521002k8437j38276p6880K01992P356M9441R666r7575K96061N46708P21496
4416H5012554R36311J314267J275552J126215Q36714L96468K23534n3554j72177
4407I0895884k5700L6868K70126J78724J84724L85828M22927L76278L94218M55060
$$ plain form
4475 86200922 86487261 86580610 86512241 86356463 86249839 85873900 85234001 84631017 83991993 83112947
4465 83112947 82254454 81307043 80365978 79549552 78685418 77900907 76989063 76242084 75626741
4456 75626741 74937413 74349876 73901475 73514475 73219492 72846925 72624816 72638352 72651984 72794859
4446 72794859 72984631 73340837 73962982 74558094 75298035 76483208 77903299 79416674 81105608
4437 81105608 82539688 83431144 83596699 83516031 83411590 83355424 83446927 83540816 83508122 83521002
4427 83521002 83492565 83354289 83277409 83479401 83486757 83536198 83545864 83448289 83744350 84291058 85012554
4416 85012554 85948865 87263132 88538684 89664899 90501613 90898081 91121615 91068061 90895884
4407 90895884 90870184 90907052 91177178 91355902 91540626 91926454 92349381 92725659 93119877 93574937
4397I3574937N81247P57392R30648J216944J616895J943371K100790K402505K895363
4388A08020092L348681L977404M587990N376819O297987P295494Q542243R854038
4380A57300748J0725610J1080017J0045154O882220J681098l889933q264333j0807434
4372A74753147j1445297j0368562q724014p077102n642838m343684l086480k408532
4364A21656638j949449j440587q47473l47687j67294L4829N61456P60978R07520
4355A19168931J227738J491868J654724J796626J974072K133184K029213J950614
4347A33426970J774587J479675J111581P21495M98730L30333J20459J06047M60564
4338A40030441P21716J251120J862998K481459K826146L148058L585609M022313
$$ plain form
4397 93574937 94156184 94913576 95844224 97061168 98678063 100621434 102722224 105124729 108020092
4388 108020092 111368773 115346177 119934167 125310986 131608973 138904467 147446710 157300748
4380 157300748 168026358 179106375 189151529 196033749 197714847 193824914 185560581 174753147
4372 174753147 163307850 152939288 144215274 137138172 131495334 127151650 124065170 121656638
4364 121656638 119707189 118266602 117419129 117071442 116904148 116938977 117500433 118261411 119168931
4355 119168931 120396669 121888537 123543261 125339887 127313959 129447143 131476356 133426970
4347 133426970 135201557 136681232 137792813 138514308 139013038 139343371 139463830 139569877 140030441
4338 140030441 140752157 142003277 143866275 146347734 149173880 152321938 155907547 159929860
4330A59929860M563298N134191N898530O580085P443329Q487973R404209J0359854
4322B17801329J1485185J2196288J2626792J1676138J0070140P535794M553343
4315B87945009J582196p43848j911682k079457j104751P773M80771j40289j810447
4306B82225275m593011p626844j0026403j1891774j2854266j2392129j1337811
4299B11503037j0027148q703333p804673p398078o911211o383186n876465n042455
4291A53356488m025228k998834k129056j277600m52142M21339J130887J964675
4283A45990529K928522L705493M711824N463460O037444O170750N898718M705529
4275A85612269K337237n20760l457452n770043p656499q350895q215910p594365
$$ plain form
4330 159929860 164493158 169627349 175525879 182105964 189549293 198037266 207441475 217801329
4322 217801329 229286514 241482802 254109594 265785732 275855872 283391666 287945009
4315 287945009 289527205 288783357 286871675 284792218 283687467 283695240 284176011 284035722 282225275
4306 282225275 277632264 270005420 259979017 248087243 235232977 222840848 211503037
4299 211503037 201475889 192772556 184967883 177569805 170658594 164275408 158398943 153356488
4291 153356488 149331260 146332426 144203370 142925770 142473628 142894967 144025854 145990529
4283 145990529 148919051 152624544 157336368 162799828 168837272 175008022 180906740 185612269
4275 185612269 187949506 187428746 183971294 178201251 170544752 162193857 153977947 146383582
4267A46383582o630253n785019m922709m017940l426727l128003l291277l611008
4259A11570646m073284m397228m695148m879822m494104m148710l711036l162159
4251G8009155k719736k584711k337168k046122j912902j905246j863964j847236
4243F0792070j822255j792862j716436j440112j270323j262276r51829r07005
4235D9628972q92163o76949m24586l98295l19035j25448j0152r6958P743j05391
4225D6587738k22355l94324m34107m84432m90582l60901l05715n278O5140k01398
4215D3753786n2887N1091j39710j85135k73512k83962l13347k98659l38930k79282
4205D1639453k46260m20023n61247n91399n30685m71058l44990m58906m31988
$$ plain form
4267 146383582 139753329 133968310 129045601 125027661 121600934 118472931 115181654 111570646
4259 111570646 107497362 103100134 98404986 93525164 89031060 84882350 81171314 78009155
4251 78009155 75289419 72704708 70367540 68321418 66408516 64503270 62639306 60792070
4243 60792070 58969815 57176953 55460517 54020405 52750082 51487806 50535977 49628972
4235 49628972 48736809 48059860 47635274 47236979 46917944 46792496 46782344 46685386 46693129 46587738
4225 46587738 46365383 45971059 45536952 45052520 44561938 44201037 43895322 43890044 43955184 43753786
4215 43753786 43700899 43751990 43612280 43427145 43153633 42869671 42556324 42257665 41918735 41639453
4205 41639453 41393193 40973170 40411923 39820524 39289839 38818781 38473791 38014885 37582897
4196C7582897k21107r7064q8907r3146k5310k69134m27336j80118l97888m89002
4186C5293885k95821j95138j42059k48863p0775Q0048K44444K07159J99155J09211
4176C5181246J9737M6442n201k25478k18712k04798k86934k97468j85144k41575
4166C3582115l97980l79736m51163m93784l78875l62178l32673j58890j39449
4157C0487387j19577L2670n3927J22979J49102K05813L55740L36055L16995K05982
4147C2039219j25163l10164n69411o17099r36825p73134n99127l23366j69267
4138B7615663k02061q0842j52388k59424n14931n73424o98875n16049m83625o83307
4128B3450737n60647j35153k01399k81051k20820j82741n5760m4917j13903p3179
$$ plain form
4196 37582897 37361790 37264726 37175819 37082673 37057363 36788229 36360893 36180775 35782887 35293885
4186 35293885 34998064 34802926 34660867 34412004 34341229 34421277 34665721 34872880 35072035 35181246
4176 35181246 35200983 35247425 35242224 35016746 34798034 34593236 34306302 34008834 33823690 33582115
4166 33582115 33184135 32804399 32353236 31859452 31480577 31118399 30785726 30626836 30487387
4157 30487387 30367810 30400480 30346553 30469532 30618634 30824447 31180187 31516242 31833237 32039219
4147 32039219 31914056 31603892 31034481 30417382 29480557 28707423 28108296 27784930 27615663
4138 27615663 27413602 27332760 27180372 26920948 26406017 25832593 25133718 24617669 24134044 23450737
4128 23450737 22890090 22754937 22553538 22272487 22051667 21868926 21813166 21768249 21654346 21581167
4118B1581167k6818j58322k21537l45776m00248j88180l40043l64798k39511k12654
4108A9083280j98487j94906k65264l41902j58907P8534j44592j11960q4669j43510
4098A7517617j11600m4710q3174j03351j15531l9130Q593J49611M0923N2008J40501
4087A7411757J60375Q0596J80964L24881J58347J90047K49563K55851K45208M6765
4077A9304354J6642j01230N4682L6160J42039J53577k55997j60396k47836j98898
4067A8743097r0731m4153O7556J01242M5420M7511J37595K96707J53503J81829
4057A9639576K63649K39941K44764K40360R2707J48162K28677J59466J85677J6595
4047B1459574J9961j3987M3208Q6139J70835J35876R2382J92032J85197K57967
$$ plain form
4118 21581167 21554349 21396027 21174490 20828714 20428466 20240286 19900243 19535445 19295934 19083280
4108 19083280 18884793 18689887 18424623 18082721 17923814 18002348 17857756 17745796 17661127 17517617
4098 17517617 17406017 17361307 17278133 17174782 17059251 17020121 17028714 17178325 17219248 17271256 17411757
4087 17411757 17572132 17652728 17833692 18158573 18316920 18506967 18756530 19012381 19257589 19304354
4077 19304354 19320996 19219766 19274448 19310608 19452647 19606224 19350227 19189831 18941995 18743097
4067 18743097 18652366 18608213 18675769 18777011 18822431 18869942 19007537 19304244 19457747 19639576
4057 19639576 19903225 20143166 20387930 20628290 20720997 20869159 21097836 21257302 21442979 21459574
4047 21459574 21479535 21465548 21508756 21594895 21765730 21901606 21993988 22186020 22371217 22629184
4037B2629184L24773L90263K52990K27116k6805K27226J43115J27357M8959J49341
4027B4493519K41844L48671K15510K15875J91892L54368M45900K44657L56198
4018B7108434J84968K60061L57566M37041L46308L72901M00643M58401M69576
4009C0395899M35529M46983O03357N43254O90812O26884O34442P85890O51503
4000C5814553M81936O06950M78441L73133N01614K88743M17808N57529N06909
3991D0027616O67735N48483P22260P01667N52796N49255O39770O99975O37878
3982D5747435N33172N49692N97575L70048j05327o25968q76333j327479j495467
3973D3367348j493880j343474j502254j400032j455655j350974j186617j260379
$$ plain form
4037 22629184 22953957 23344220 23597210 23824326 23797521 24024747 24167862 24295219 24344178 24493519
4027 24493519 24735363 25084034 25299544 25515419 25707311 26061679 26507579 26752236 27108434
4018 27108434 27293402 27553463 27911029 28348070 28694378 29067279 29467922 29926323 30395899
4009 30395899 30831428 31278411 31881768 32425022 33115834 33742718 34377160 35163050 35814553
4000 35814553 36296489 36903439 37381880 37755013 38256627 38545370 38963178 39520707 40027616
3991 40027616 40695351 41243834 41966094 42667761 43220557 43769812 44409582 45109557 45747435
3982 45747435 46280607 46830299 47427874 47797922 47692595 47066627 46190294 44862815 43367348
3973 43367348 41873468 40529994 39027740 37627708 36172053 34821079 33634462 32374083
3965C2374083j154568j186009q64050p82174p15277p41767q68146p79064p56276
3956B4526752n40776o36563p72075p13748p25167n83663o51659n87355n64117
3947A8751629n01527m39025m53588l96055l50098l00524l16514j48879k37948
3938A5607471k12639k73617l28093j46010j57175j48313j33303j46400l35240
3929A3726681k02806n0480j00095j84395Q662j29106j89887m9818j43549j16359
3919A2568848j40034k35245j95603k06533k26676k51894l18712j79152j55588
3910A0659411j09072n9448k20928j83817j05781j05285l33144k66270k25778k85337
3900H764551k06968k35281j84034j53777j32086j26919j85486j25867j76973j35414
$$ plain form
3965 32374083 31219515 30033506 29169456 28387282 27672005 26930238 26062092 25283028 24526752
3956 24526752 23985976 23349413 22577338 21863590 21138423 20554760 19903101 19315746 18751629
3947 18751629 18250102 17811077 17357489 16961434 16611336 16310812 15994298 15845419 15607471
3938 15607471 15394832 15121215 14793122 14647112 14489937 14341624 14208321 14061921 13726681
3929 13726681 13523875 13473395 13373300 13188905 13197567 13068461 12878574 12828756 12685207 12568848
3919 12568848 12428814 12193569 11997966 11791433 11564757 11312863 10994151 10814999 10659411
3910 10659411 10550339 10490891 10269963 10086146 9980365 9875080 9541936 9275666 9049888 8764551
3900 8764551 8557583 8322302 8138268 7984491 7852405 7725486 7540000 7414133 7237160 7101746
3890G101746j30868j07768j73630k29978m3396p5103j36392k57050j76367J2580
3880E783774p4352j77444J18648o3186j47231r5512L3299R3538k12942k17071
3870E041521m6859N1065m1823j38651j38986r4644L0988j37550J0556q3163j8143
3859D434311j4246j3961R1358J211j23717o5186M1978k5127P579p5700K9461j7121
3847D270840r8018M1575j2644n4536n2411j23856J04380J6270r2072M6552O0627
3836D106707M8752q1254n5660N3445o0771N7719J2127K0924l2238O4048J41760
3825D275559K0702j6906l1134L3491q8667l7213R734p821Q2980N1297j13215j00112
3813D078695P8753J860j0746P9046P3660L3770j22678r7788L77l0263p7629J13523
$$ plain form
3890 7101746 6970878 6863110 6689480 6459502 6416106 6341003 6204611 5947561 5771194 5783774
3880 5783774 5709422 5531978 5650626 5587440 5440209 5344697 5377996 5471534 5258592 5041521
3870 5041521 4994662 5045727 5003904 4865253 4726267 4631623 4662611 4525061 4535617 4452454 4434311
3859 4434311 4420065 4406104 4497462 4498673 4374956 4309770 4351748 4326621 4334200 4258500 4287961 4270840
3847 4270840 4172822 4214397 4201753 4147217 4094806 3970950 4075330 4091600 3999528 4046080 4106707
3836 4106707 4155459 4074205 4018545 4071990 4011219 4068938 4081065 4101989 4069751 4133799 4275559
3825 4275559 4296261 4279355 4248221 4281712 4193045 4155832 4165566 4157745 4240725 4292022 4178807 4078695
3813 4078695 4157448 4159308 4148562 4227608 4301268 4335038 4212360 4114572 4114949 4084686 4007057 4120580
3801D120580O8939j8880k1213q7096k7378M1753P2079k8917j7263j18708j28389
3790C855507k8545O4423p463p7762N9460m6007J0017l0135q2836q0408J58969
3779C795220m2303k13354N8074p9159m3485r0311N998J53369J6568r7360o8910
3768C394347m1920K9049l3754j5959N2059m8746l8769l4739J4752L9918n3672
3757C262566l8258k500k5169n6233n8492K6793K197M7557l3949n981L4204k1410
3745C131325J9667k2693j14105r775O3862K1525P209K9598P455K3806j3197j0771
3733C133906r88O732N6996n6535j22176Q8297P2007l5870J11100j39177q8841
3722C025451Q9709Q4299O0635L5944L4429q3603L3028J22168K4551L0056n0519
$$ plain form
3801 4120580 4189519 4170639 4149426 4062330 4034952 4076705 4148784 4119867 4102604 3983896 3855507
3790 3855507 3826962 3891385 3883922 3806160 3865620 3819613 3829630 3799495 3716659 3636251 3795220
3779 3795220 3752917 3539563 3597637 3518478 3474993 3384682 3390680 3544049 3560617 3463257 3394347
3768 3394347 3352427 3381476 3347722 3331763 3383822 3335076 3296307 3261568 3276320 3316238 3262566
3757 3262566 3224308 3221808 3196639 3140406 3081914 3108707 3110904 3158461 3124512 3118531 3152735 3131325
3745 3131325 3150992 3128299 3014194 3004419 3068281 3089806 3097015 3126613 3134068 3157874 3144677 3133906
3733 3133906 3132918 3139650 3196646 3140111 3017935 3106232 3178239 3142369 3253469 3114292 3025451
3722 3025451 3115160 3199459 3260094 3296038 3330467 3246864 3279892 3402060 3426611 3456667 3406148
3711C406148M8690j52502N0852J6804J08681q797l1016P7611L3082j01895J0866
3700C458524j5726L1717k3578P2875n02M2991L0479p4329P706l1647K7542j00277
3688C425775J93100J06768j29956P2098N7046o0071J26534K9920K8587j47700
3678C702101p514p145K2685J2026k5432m3234J81153O739P1193p124j02868r349
3666C793231P5736N5041o9113r5271K6307M7337J30163K9633Q9618R9441J13582
3655D295705j4010k3953K6911L1501J3288L7260R9228N7382n2751q72L6721N0981
3643D557391L7307Q4641j52397n820J07891j29314K5311J67432J03325o3125O049
3632D738691m1664r3713K6384J10149k4475K2234k7555N3377K5943M4058n2163
$$ plain form
3711 3406148 3454838 3302336 3353188 3369992 3478673 3469876 3438860 3516471 3549553 3447658 3458524
3700 3458524 3442798 3474515 3450937 3523812 3523310 3566301 3596780 3522451 3530157 3498510 3526052 3425775
3688 3425775 3618875 3725643 3595687 3667785 3724831 3664760 3791294 3821214 3849801 3702101
3678 3702101 3694587 3687442 3710127 3722153 3696721 3653487 3834640 3841379 3912572 3905448 3802580 3793231
3666 3793231 3868967 3924008 3854895 3759624 3785931 3833268 3963431 3993064 4082682 4182123 4295705
3655 4295705 4281695 4257742 4284653 4316154 4329442 4366702 4465930 4523312 4470561 4469689 4506410 4557391
3643 4557391 4594698 4679339 4526942 4521122 4629013 4499699 4525010 4692442 4795767 4732642 4738691
3632 4738691 4697027 4603314 4629698 4739847 4715372 4737606 4710051 4763428 4789371 4833429 4781266
3621D781266Q7794J9602M2647q6858m2655N9737M5601q1498Q3336K7303k1030
3610D915245l1090J21533K61931J5357N2717N2807k7909J4131m6135J21525Q8486
3599E538598Q3356K1627q8817j4315M0394P6217j353j13124J32764k3973r5947
3588E555427J15220l8988J21682J47060p76O2907J10719J9592O1331O032k1752
3577F138454l4891K5278J3926j5028M2663N8419J47188Q5048r1034J03419K8621
3566F502063R143m523p2884O4385J43969K4421r4162L3798m7762M1473J99585
3555F799506P6121m4567k8701J52777M0402J37707M7333k7140l5611Q4441Q8495
3544G290763l536J24359L1844M196O1189J10299J81685J35673K1916J70312k3232
$$ plain form
3621 4781266 4869060 4888662 4931309 4844451 4801796 4861533 4907134 4825636 4908972 4936275 4915245
3610 4915245 4884155 5005688 5267619 5282976 5335693 5388500 5360591 5374722 5328587 5450112 5538598
3599 5538598 5621954 5643581 5554764 5540449 5580843 5657060 5655707 5542583 5675347 5651374 5555427
3588 5555427 5670647 5631659 5753341 5900401 5899625 5962532 6073251 6092843 6154174 6160206 6138454
3577 6138454 6103563 6128841 6142767 6127739 6170402 6228821 6376009 6461057 6370023 6473442 6502063
3566 6502063 6511206 6506683 6433799 6498184 6642153 6666574 6572412 6606210 6558448 6599921 6799506
3555 6799506 6875627 6831060 6802359 6955136 6995538 7133245 7180578 7153438 7117827 7202268 7290763
3544 7290763 7287227 7411586 7443430 7447626 7508815 7619114 7800799 7936472 7958388 8128700 8105468
3533H105468P4984J56240J47759N4225J22435J04220K56372K70123o8583K24856
3523I448099J17522Q0720J44515J17554Q3073J35853J53001L1031M6310J57593
3513A0515271q7656J02003m8420N4548M0182p7499J04396q5801p4691M8970l5265
3502A0456038L401K22471j35982o5455l211O6989O6228P7858J13207R5926j268
3491A0896202o5094R660P0169K28256P3730J9655J55058J22114M8779O0807J13747
3480A1733083R0841J02032J28265K86282J60379j994Q6062K73535J06172o9150
3470A2895507K33383K11185J90970O3429J49738J52031J74330J70176K59740K87064
3460A4787553J68905K47595J94647J70777L10274J67067J32866L05416K32442
$$ plain form
3533 8105468 8180452 8336692 8484451 8538676 8661111 8765331 9021703 9291826 9223243 9448099
3523 9448099 9565621 9646341 9790856 9908410 9991483 10127336 10280337 10311368 10357678 10515271
3513 10515271 10427615 10529618 10481198 10535746 10575928 10498429 10602825 10517024 10442333 10491303 10456038
3502 10456038 10459439 10681910 10545928 10480473 10477262 10544251 10610479 10688337 10801544 10897470 10896202
3491 10896202 10831108 10840768 10910937 11139193 11212923 11232578 11387636 11509750 11558529 11619336 11733083
3480 11733083 11823924 11925956 12054221 12340503 12500882 12498888 12584950 12858485 12964657 12895507
3470 12895507 13128890 13340075 13531045 13594474 13744212 13896243 14070573 14240749 14500489 14787553
3460 14787553 14956458 15204053 15398700 15569477 15879751 16046818 16179684 16485100 16717542
3451A6717542L08540L54138K18071J83534K19408K91094K49152J55643K80089
3442A8977211L37422L11147K31971L53996K99893K44890K26912J43562K62264
3433B1389268L18602K1571M7419J56536K3576m304J27296N0622o7015o684P3839
3422B2130726J49576j46979N6350j8691m5774n0305j6708j04507k35589m8267
3412B1669832j38125m6797p2789j27368j48122o9921k6197L5533l5718N9785O6455
3401B1166568K30431K48840K21430J65511J50204K44800J86595K26592K35576
3392B3076547K20127L13738K46623J68989K63061J93445K01769K97328L52262
3383B5333889L02370J75795J95672K67601J48411J48307J43806K31752J67395
$$ plain form
3451 16717542 17026082 17380220 17598291 17781825 18001233 18292327 18541479 18697122 18977211
3442 18977211 19314633 19625780 19857751 20211747 20511640 20756530 20983442 21127004 21389268
3433 21389268 21707870 21729441 21776860 21933396 21956972 21952668 22079964 22130586 22063571 22056887 22130726
3422 22130726 22280302 22133323 22189673 22170982 22125208 22074903 22058195 21953688 21718099 21669832
3412 21669832 21531707 21484910 21412121 21284753 21136631 21066710 21040513 21076046 21040328 21100113 21166568
3401 21166568 21396999 21645839 21867269 22032780 22182984 22427784 22614379 22840971 23076547
3392 23076547 23296674 23610412 23857035 24026024 24289085 24482530 24684299 24981627 25333889
3383 25333889 25636259 25812054 26007726 26275327 26423738 26572045 26715851 26947603 27114998
3374B7114998J95913K11264K08104L58228P5458K14759J10186J84112K32773L14413
3364B9220208L22958K57293J75761K17824L29273K59239M09202K81319M11824
3355C1884901M12918L79343L96847M48684L69747M05805N80163N26605M12479
3346C5817492M21354O00093N32814N32759N01317N77330O44214O49582O77330
3337D0954285O22624O25879N74777O32896P12469P24365O10078O55752P44283
3328D6857408N76014O02690Q36084O82425P65410P46238R50180Q02513P53313
3319E3572275R57069R79437J021651J070618J271326J230697J283953J349969
3311F2736995J374390J570772J746164J874541J903645K100089K158652K246178
$$ plain form
3374 27114998 27310911 27522175 27730279 28088507 28163965 28378724 28488910 28673022 28905795 29220208
3364 29220208 29543166 29800459 29976220 30194044 30523317 30782556 31191758 31473077 31884901
3355 31884901 32297819 32677162 33074009 33522693 33892440 34298245 34878408 35405013 35817492
3346 35817492 36238846 36838939 37371753 37904512 38405829 38983159 39627373 40276955 40954285
3337 40954285 41576909 42202788 42777565 43410461 44122930 44847295 45457373 46113125 46857408
3328 46857408 47433422 48036112 48872196 49554621 50320031 51066269 52016449 52818962 53572275
3319 53572275 54529344 55508781 56530432 57601050 58872376 60103073 61387026 62736995
3311 62736995 64111385 65682157 67428321 69302862 71206507 73306596 75465248 77711426
3303G7711426K417576K526521K625757K686812K672221K657620K558029K404306
3295I8260268K268392K247641K167355J853951J729956J502968J443250J375792
3287A12849573J312445J101871J086081J134718R47453J048910R01427Q50887
3279A21233365Q11193M95862M36685M62629L77029M33692K73401L14731M84810
3270A25323397O55519O52923Q59581R10611J112596J430817J417303J770882J729759
3261A35863388J846828J923380J764867J813084J942014J871754K097531K383425
3253A51506271K516163K894710L098188L422481L717899L914612M304249M328272
3245A79702845M248467M018869L749097L410702K979780K246852J732366J071562
$$ plain form
3303 77711426 80129002 82655523 85281280 87968092 90640313 93297933 95855962 98260268
3295 98260268 100528660 102776301 104943656 106797607 108527563 110030531 111473781 112849573
3287 112849573 114162018 115263889 116349970 117484688 118432141 119481051 120382478 121233365
3279 121233365 122044558 122540420 122977105 123439734 123816763 124250455 124523856 124838587 125323397
3270 125323397 125978916 126631839 127491420 128402031 129514627 130945444 132362747 134133629 135863388
3261 135863388 137710216 139633596 141398463 143211547 145153561 147025315 149122846 151506271
3253 151506271 154022434 156917144 160015332 163437813 167155712 171070324 175374573 179702845
3245 179702845 183951312 187970181 191719278 195129980 198109760 200356612 202088978 203160540
3237B03160540N02950j45037l98932m95114p03437q03305j224817j136029j574426
3228A97182393k079286k668903l198731l752460m517173n102035n476800n707011
3220A64679994n986311o014125n837631n586229n466185n119575m738938m505381
3212A21425619m317226m057964l706549l517165l245237k911383k657577k540757
3204I4471761k258845k161231k039187j800785j508588j348164j380831j239582
3196H0734548r47348r49254j024447o94727n91268n12854n68881l43963l81908
3187G4719898k07034j63853p6342p0j6491l0061M8783j56987k54080l7976j66489
3176G3659298k97856k46662k68032j58661k90722k46749j06018j83169r9709j31023
$$ plain form
3237 203160540 203663490 203518453 203119521 202624407 201920970 201117665 199892848 198756819 197182393
3228 197182393 195103107 192434204 189235473 185483013 180965840 175863805 170387005 164679994
3220 164679994 158693683 152679558 146841927 141255698 135789513 130669938 125931000 121425619
3212 121425619 117108393 113050429 109343880 105826715 102581478 99670095 97012518 94471761
3204 94471761 92212916 90051685 88012498 86211713 84703125 83354961 81974130 80734548
3196 80734548 79787200 78837946 77813499 77118772 76527504 76014650 75445769 75101806 74719898
3187 74719898 74512864 74349011 74272669 74272599 74256108 74226047 74274830 74117843 73863763 73825787 73659298
3176 73659298 73361442 73114780 72846748 72688087 72397365 72150616 72044598 71861429 71761720 71630697
3166G1630697j42890J15948J72628J02055K51202K33587K44995L54101L22924
3157G3285247M01060N36602N61573N95106M66211O51738N56174O78461N32699
3148G8264871O93001P02363P52680R01168J021267R85587J129085J160187J079990
3139H6690199J176901J085021J135629J176231J068060J177217J158251R83336
3131I5650845J015601Q94886P70851P15262P26537N91226N92266M62033L12260
3122A01731767L07398K68750K12741K06705L97564L71503N46723P00398R90339
3113A05733888J101341J316608J624142J886796K129008K305786K368058K720820
3105A21186447K885839L003721L046510K966131K905810K640831K297378J955910
$$ plain form
3166 71630697 71487807 71603755 71776383 71878438 72129640 72363227 72608222 72962323 73285247
3157 73285247 73686307 74222909 74784482 75379588 75845799 76497537 77053711 77732172 78264871
3148 78264871 78957872 79660235 80412915 81314083 82335350 83320937 84450022 85610209 86690199
3139 86690199 87867100 88952121 90087750 91263981 92332041 93509258 94667509 95650845
3131 95650845 96666446 97561332 98332183 99047445 99773982 100365208 100957474 101419507 101731767
3122 101731767 102039165 102307915 102520656 102727361 103124925 103496428 104043151 104743549 105733888
3113 105733888 106835229 108151837 109775979 111662775 113791783 116097569 118465627 121186447
3105 121186447 124072286 127076007 130122517 133088648 135994458 138635289 140932667 142888577
3097A42888577J653670J312341R34935L88236R4579r2275j83273m62319m53234
3088A46081237l99746k25319k80692l40350l03482l35228l07317n47183p98473
3079A42543447r26055j134456j418845j907064k112438k405630k502208k517473
3071A27619278k536265k521224k470506k309506k160850k001719j943200j959937
3063A09716071j921173k189798k171491k074777k162051k381973k573348k591034
3055I1650426k628695k630503k693241k798582k495692k277976k294971k222077
3047G1608689k021215j828848j743540j540666j604756j453139j226582j236240
3039E8953703j197961j043683j020753r45846q51209p03410p12024p96367n99865
$$ plain form
3097 142888577 144542247 145854588 146789523 147177759 147272338 147180063 146996790 146534471 146081237
3088 146081237 145681491 145456172 145175480 144835130 144531648 144196420 143889103 143341920 142543447
3079 142543447 141617392 140482936 139064091 137157027 135044589 132638959 130136751 127619278
3071 127619278 125083013 122561789 120091283 117781777 115620927 113619208 111676008 109716071
3063 109716071 107794898 105605100 103433609 101358832 99196781 96814808 94241460 91650426
3055 91650426 89021731 86391228 83697987 80899405 78403713 76125737 73830766 71608689
3047 71608689 69587474 67758626 66015086 64474420 62869664 61416525 60189943 58953703
3039 58953703 57755742 56712059 55691306 54745460 53894251 53190841 52478817 51682450 51082585
3030E1082585m77180n11264m91148m41260n59845n46322n23120o06832o55594
3021D6270020n39294p99139q62601o14974q01403q25608q31801p69686p61072
3012C9464442o91858n70529m80259n86580n00702k74951m46058m03777l13189
3003C5196539l96041m01104m41203l27395k91655m95554l42635k60907l78832
2994C1861213k21225k49517j09629k61823l69984k85153j76310l89400j72656
2985B9625516k33576k50573k20531k73205j72633m47286k78696l40708k18646
2976B7189662j70030l02698k56445k69959j94219j92235j8849n9824j62172r7300
2966B5465931j11635m8857M6137N9072J11584J80096J72636K23137J26046J03552
$$ plain form
3030 51082585 50605405 50094141 49602993 49161733 48601888 48055566 47532446 46925614 46270020
3021 46270020 45730726 44931587 44068986 43454012 42652609 41827001 40995200 40225514 39464442
3012 39464442 38772584 38202055 37721796 37135216 36634514 36359563 35913505 35509728 35196539
3003 35196539 34800498 34399394 33958191 33630796 33339141 32843587 32500952 32240045 31861213
2994 31861213 31639988 31390471 31280842 31019019 30649035 30363882 30187572 29798172 29625516
2985 29625516 29391940 29141367 28920836 28647631 28474998 28027712 27749016 27408308 27189662
2976 27189662 27019632 26716934 26460489 26190530 25996311 25804076 25785227 25725403 25563231 25465931
2966 25465931 25354296 25305439 25351576 25410648 25522232 25702328 25874964 26098101 26224147 26327699
2956B6327699J72396M56847K48110K57038K70067L15734L82766L65417J69288
2947B8965362M90385N37111M21859N01372M71090L51205M28913M35820L49415
2938C2952532L22552M27802N35375L68199M41704M02452N67488L53841L36119
2929C6708064L54113M46111O18281N48490N03725O38797N82123O75505Q03983
2920D1879192P19039N95001N84691M92149L09727J68498K68978K94239L97757
2911D5709271M87841N50665O87633O66129Q02828P11172O97770P43115Q51260
2902E1907684J038764J193183J302521J504853J435352J647508J854123J864475
2894F3748463K021289K128241K046102K014901K125081K120762K226303K205128
$$ plain form
2956 26327699 26500095 26956942 27205052 27462090 27732157 28047891 28430657 28796074 28965362
2947 28965362 29455747 29992858 30414717 30916089 31387179 31738384 32167297 32603117 32952532
2938 32952532 33275084 33702886 34238261 34606460 35048164 35450616 36018104 36371945 36708064
2929 36708064 37062177 37508288 38126569 38675059 39178784 39817581 40399704 41075209 41879192
2920 41879192 42598231 43193232 43777923 44270072 44579799 44748297 45017275 45311514 45709271
2911 45709271 46197112 46747777 47435410 48101539 48904367 49615539 50313309 51056424 51907684
2902 51907684 52946448 54139631 55442152 56947005 58382357 60029865 61883988 63748463
2894 63748463 65769752 67897993 69944095 71958996 74084077 76204839 78431142 80636270
2886H0636270K193657K224791K403386K372870K463201K647896K450853K531654
2878I9924578K677075K713131K714247K609147K829359K985381K969434L051603
2870A22473955L115268L283937L421763L545056L784074M035861M520940M885409
2862A53066263N547793O089711O672870P473227Q051097Q668648R151458R884563
2854B14605630J0773216J2269218J4132496J5833404J7630642J8744078J8526016
2847C22514700J6418520J1860916M896644k780317r879149j5012697j7629285
2840C10389332j8284892j7680215j6692880j5630879j4603019j3915515j3098983
2833B00482949j2303179j1702277j0839213j0052291r176389q225786p497787
$$ plain form
2886 80636270 82829927 85054718 87458104 89830974 92294175 94942071 97392924 99924578
2878 99924578 102601653 105314784 108029031 110638178 113467537 116452918 119422352 122473955
2870 122473955 125589223 128873160 132294923 135839979 139624053 143659914 148180854 153066263
2862 153066263 158614056 164703767 171376637 178849864 186900961 195569609 204721067 214605630
2854 214605630 225378846 237648064 251780560 267613964 285244606 303988684 322514700
2847 322514700 338933220 350794136 355690780 352910463 343031314 328018617 310389332
2840 310389332 292104440 274424225 257731345 242100466 227497447 213581932 200482949
2833 200482949 188179770 176477493 165638280 155585989 146409600 138183814 130686027
2826A30686027o837345o211726n880288n463355n026226m754880m520944m297467
2818H7693796m102331l809575l725911l418594l149373k996337k911122k574166
2810F1006387k350699k331522k061946j850778j725476j767250j653896j580553
2802D5684267j429851j329006j382543j100034r64813j046946j112709q70544
2794C6447821q20124r63820q86288p40981o95731p78927p57050o17406n18993
2785B9668501n31353l90470l38859m60307m58313l50298l95298l22202k70578
2776B6150823k32991k78554j36559k18860j70464o7179j4057j774L4497K40848
2766B5305730R2578K63852L00525L32685L94674L58920M00260O47226O63436P21562
$$ plain form
2826 130686027 123848682 117636956 111756668 106293313 101267087 96512207 91991263 87693796
2818 87693796 83591465 79781890 76055979 72637385 69488012 66491675 63580553 61006387
2810 61006387 58655688 56324166 54262220 52411442 50685966 48918716 47264820 45684267
2802 45684267 44254416 42925410 41542867 40442833 39478020 38431074 37318365 36447821
2794 36447821 35627697 34663877 33777589 33036608 32340877 31561950 30804900 30187494 29668501
2785 29668501 29137148 28746678 28407819 27947512 27489199 27138901 26743603 26421401 26150823
2776 26150823 25917832 25639278 25502719 25283859 25113395 25046216 25032159 25030385 25064882 25305730
2766 25305730 25398308 25662160 25962685 26295370 26690044 27048964 27449224 28096450 28759886 29481448
2756B9481448J038238J306060J315019J635908J933986K180011K584987K622254
2748D4097911K287441J444270L09704j098353k273436k795899k955991k688125
2740C6327522k285615j829634j420952r22187o29512m03788k4124Q3139M61849
2731B9356698O50645R68035J457861J784483K142906K245547K012344J660349
2723D2278868O82559p92088k042489k939675l297745l183050l056185k639970
2715B5010225k138046j931591j601961j358070j105263r85231q78135p72101o64121
2706A3575706n69365n11803m65210m38469l58087k73108k42427k85911l44777
2697A0086549l05861j75022j80292k03108k57498j40120j59109k39884k78995
$$ plain form
2756 29481448 30519686 31825746 33140765 34776673 36710659 38890670 41475657 44097911
2748 44097911 46385352 47829622 48139326 47040973 44767537 41971638 39015647 36327522
2740 36327522 34041907 32212273 30791321 29869134 29239622 28835834 28811710 28894849 29356698
2731 29356698 30007343 30975378 32433239 34217722 36360628 38606175 40618519 42278868
2723 42278868 42961427 42169339 40126850 37187175 33889430 30706380 27650195 25010225
2715 25010225 22872179 20940588 19338627 17980557 16875294 15890063 15011928 14239827 13575706
2706 13575706 13006341 12494538 12029328 11590859 11232772 10959664 10717237 10431326 10086549
2697 10086549 9780688 9605666 9425374 9222266 8964768 8824648 8665539 8425655 8146660
2688H146660j61747j63274j73627j48272k10561k10047m3668j53711j38656j70597
2678F572500K2533K414k04851r8987k24396j45989j90403j67174k20758j28687
2668E216202j8791j06183j90723k62259k31186j37501j05647j67224r3639r5595
2658C807454r5407j26936K1449j2804j59136l3330k2036q4481p7044n2080j04934
2647C060715n0821j06421j30489m1003j08267L7038P8711l6292O1682j47602m1697
2636B575554p4331q4386j5590k2546M8573O761K1562p3097q92R86m427n6637K0676
2623B342206j6957K1002j07385k0577j5047p4221j2462K90l1141j12476L7045
2612B010277l7251j0301N173M7958M7331K7083j10843m8318l3349K0613j9796
$$ plain form
2688 8146660 7984913 7821639 7648012 7499740 7289179 7079132 7035464 6881753 6743097 6572500
2678 6572500 6595033 6597447 6392596 6293609 6069213 5923224 5732821 5565647 5344889 5216202
2668 5216202 5197411 5091228 4900505 4638246 4407060 4269559 4163912 3996688 3903049 3807454
2658 3807454 3712047 3585111 3606560 3593756 3434620 3401290 3379254 3294773 3217729 3165649 3060715
2647 3060715 3009894 2903473 2772984 2731981 2623714 2660752 2739463 2703171 2764853 2617251 2575554
2636 2575554 2501223 2416837 2401247 2378701 2427274 2434035 2455597 2382500 2381608 2382594 2378167 2321530 2342206
2623 2342206 2325249 2346251 2238866 2218289 2203242 2129021 2116559 2116849 2085708 1973232 2010277
2612 2010277 1973026 1962725 1967898 2015856 2063187 2090270 1979427 1931109 1897760 1918373 1898577
2601A898577o948q0822n3970J8076p4882n4788q3326M8890K29368J9814p1207
2590A788782j23556l230P8322K6618j1340J35636J15171J8117j01263r4102R8668
2579A927823M036m2995q068M3966J45684n3092j10834N3567k7639k3349N6992
2568A966091R0536J18947J35652J32069K4105m7693k5788m6007J1208j54158j19773
2557B085189r1253j45067j15559J08845q2716m2352j20243p6683j15771J6250
2547A420640K3171r5666J4098l0655j71366k4817j20528q5768k8144j00464l3356
2536G67145Q6891P0300j703j04393j27445M0958L3133j2538L6491o6324r7823
2525F24692K4505j3840j78168j0814R6570p2427J36972j63845k2865k7977L3553
$$ plain form
2601 1898577 1891629 1810807 1756837 1774913 1700031 1645243 1561917 1610807 1840175 1859989 1788782
2590 1788782 1665226 1661996 1740318 1766936 1755596 1891232 2006403 2024520 1923257 1829155 1927823
2579 1927823 1931859 1888864 1880796 1924762 2070446 2017354 1906520 1960087 1932448 1909099 1966091
2568 1966091 2056627 2175574 2311226 2443295 2467400 2419707 2393919 2347912 2359120 2204962 2085189
2557 2085189 1993936 1848869 1733310 1842155 1759439 1717087 1596844 1520161 1404390 1420640
2547 1420640 1443811 1348145 1362243 1331588 1160222 1135405 1014877 929109 900965 800501 767145
2536 767145 854036 924336 922633 818240 690795 731753 764886 752348 788839 722515 624692
2525 624692 649197 635357 457189 446375 542945 470518 607490 443645 420780 392803 426356
2514D26356m7893p9558L0548m8878L4863Q4453k09547K0364K2712J7809k7786
2503B23443M853Q0734n0903R5726j36744q6070M1583M9936M918j0383K4350k28966
2491A2477M8827J17051K5428j2336o2620P2133m6335j05612L1149O5288K7180
2480A72630j7810P273m6176n9196K3091L3632M9745p2023J9475j24667J38142
2469A24116J970j32628P384J6104R2962Q7158q3955O0206j05707o0461M9948Q5472
2457A42569m1034j64575J8821k3439R3747j3476j15677K1146K0805l25R9898N9812
2445I8272M2366j07019k2645J41084p929j38469J5295o1823M3484m3347m6531
2434h7262m2752j08460L2452P7841O2042J7296M919L9169j10610j55555O3371
$$ plain form
2514 426356 378463 298905 329453 280575 315438 399891 190344 210708 233420 251229 223443
2503 223443 228296 309030 258127 353853 217109 131039 172622 222558 227476 217093 241443 12477
2491 12477 61304 178355 203783 191447 128827 200960 154625 49013 80162 145450 172630
2480 172630 154820 162093 115917 56721 79812 113444 163189 91166 110641 -14026 124116
2469 124116 126086 -6542 842 16946 109908 197066 113111 173317 67610 7149 57097 142569
2457 142569 101535 -63040 -44219 -67658 26089 12613 -103064 -81918 -61113 -61438 38460 98272
2445 98272 140638 33619 10974 152058 144129 5660 20955 -40868 2616 -40731 -87262
2434 -87262 -130014 -238474 -206022 -128181 -66139 -48843 -43924 -4755 -115365 -270920 -207549
2423b07549K7588k1205k3714m3294O6149j8032m5805K0259O4451l0083J00068
2412a11167j04869K4007J88086j07603n5858j278M8575m2291q5896j0512L4585
2401b24221O6153R426k2803O7846m9230o914N2508J6690k9335l6853m8315m5449
2389b50497M1973L8681P6482M3519P267j7264p3797K8942K3403j07174J850R279
2377a77336j7993J0873P4242m588K0017K4007l5486k9557l9433Q7056j15028Q0517
2365a22709k0103M50k2094o4103O8246N2217J6694k3893r4471r574k7758J13300
2353a33798p5211j28511M1837O0273j0172P0752n2701n6604Q138J7566L5737J7430
2341b05264l7367q7291M3368J64636M8909n3191j49941j06606J46205J90421n4544
$$ plain form
2423 -207549 -179961 -201166 -224880 -268174 -202025 -220057 -265862 -245603 -181152 -211235 -111167
2412 -111167 -216036 -192029 -3943 -111546 -167404 -168682 -120107 -162398 -248294 -258806 -224221
2401 -224221 -158068 -148642 -171445 -103599 -152829 -159743 -107235 -90545 -119880 -156733 -205048 -250497
2389 -250497 -208524 -169843 -93361 -49842 -42575 -59839 -133636 -104694 -81291 -188465 -186615 -177336
2377 -177336 -195329 -184456 -110214 -114802 -94785 -70778 -106264 -135821 -175254 -88198 -203226 -122709
2365 -122709 -142812 -142362 -164456 -228559 -160313 -108096 -91402 -115295 -209766 -219340 -247098 -133798
2353 -133798 -209009 -337520 -295683 -235410 -245582 -174830 -227531 -284135 -275997 -258431 -222694 -205264
2341 -205264 -242631 -329922 -286554 -121918 -73009 -126200 -276141 -382747 -236542 -46121 -100665
2330a00665k2607M7465o9532k9864L5945Q475m5489n2279R608J49357o6062O0696
2318g4952O691k8664j02867p212N3791M5709n441p3694L7957o311j18558O2411
2306b11140O2922N7063j0599k2451j53124M1007j9435l0691P4498j4306k8074
2295b54330k7531M8094L418M0623j1867R7011l7381p5620K7402K0175n4632K6134
2283a98504J2740l4192N7919q9663M2288n3585j30441M2681J70680R9030m592
2272h5639r3080j0039Q743K8748M5538Q469J82401j05904k03752J09884P0804
2261d3827p5848q7095j9447j301P237L5935l2593j38558J52345L5016P3582K4222
2249g0332L1886l0299l9709l4251L6351l7657l9061J4461j2135J02917j940L8887
$$ plain form
2330 -100665 -123272 -75807 -145339 -175203 -139258 -130783 -176272 -228551 -218943 -69586 -135648 -74952
2318 -74952 -68261 -96925 -199792 -207004 -153213 -107504 -112945 -186639 -148682 -154993 -273551 -211140
2306 -211140 -148218 -91155 -101754 -124205 -277329 -236322 -255757 -286448 -211950 -226256 -254330
2295 -254330 -281861 -233767 -230349 -189726 -201593 -104582 -141963 -217583 -190181 -170006 -224638 -198504
2283 -198504 -185764 -219956 -162037 -251700 -209412 -262997 -393438 -350757 -180077 -81047 -85639
2272 -85639 -178719 -188758 -180015 -151267 -105729 -97260 85141 -20763 -224515 -114631 -43827
2261 -43827 -119675 -206770 -226217 -227518 -220281 -184346 -216939 -355497 -203152 -168136 -94554 -70332
2249 -70332 -38446 -68745 -108454 -142705 -106354 -144011 -183072 -168611 -180746 -77829 -79769 -40882
2237d0882M1995p4892r096N6377j9904m6214j25914L1471J08102Q586q5968J41544
2225a4795R5497j30665m9206O9242J30258k7725q4745k2328J13565P1292p2102
2214G8288j01533J0382J19348m3409j6387n7138J55005L5815J9287l6721K9794
2203A92731n9493Q1376L0657k0858q3897J23495l2336K7406Q3462k4011K7261
2192C45793M9739M6695n5391L37R1573o7166L1346m0488j0732J24845K46M9662
2180E66459j03114K9981J34970R1909k8158j9748j1833k9042L2935J67944K3010
2169H55313K5972M4890L0120K7758n837p7833K0226J92593P9212Q4486L1537J51267
2157A459704J21392J1409J0643L7649Q5184M8283J13875K8417J1693M194K24810
$$ plain form
2237 -40882 1113 -73779 -82875 -26498 -46402 -92616 -218530 -187059 -78957 -70371 -156339 -14795
2225 -14795 80702 -49963 -99169 -29927 100331 72606 -12139 -34467 79098 150390 78288
2214 78288 -23245 -12863 106485 63076 46689 -10449 144556 180371 199658 162937 192731
2203 192731 133238 214614 245271 224413 140516 264011 231675 259081 342543 318532 345793
2192 345793 395532 442227 386836 387173 478746 411580 442926 402438 391706 516551 516797 566459
2180 566459 463345 493326 628296 720205 692047 672299 660466 631424 664359 832303 855313
2169 855313 881285 926175 956295 984053 978216 900383 920609 1113202 1192414 1276900 1308437 1459704
2157 1459704 1581096 1592505 1603148 1640797 1725981 1774264 1888139 1916556 1928249 1932443 2157253
2146B157253J42966J40203P1391J46798K05743L05547M58348L15681M17996L25093
2136D687019L06697K14730L27126M82584O80104O96806P27627J284690J503244
2127A0910627K043896K509410K926485L430257K658051j74038k570505l544598
2119A8189585l547110l011343k260109j571806j220701r25960o55802n56587k50324
2110D189843k81524m05175j78708k55846k45985j70901j92720j07803k42543k94103
2100A814535k04502o2151O5241j54974r7639j26916j62025k151l1306r7386M6513
2089I87239n1287j53674j26246r9919J10289M4612j58479N3591j5719r1289k32753
2078B66365J13119J04361j09133p4836r9365J24652m9676L0610m6161k5924k0849
$$ plain form
2146 2157253 2300219 2440422 2511813 2658611 2864354 3169901 3628249 3943930 4361926 4687019
2136 4687019 4993716 5208446 5535572 6018156 6698260 7395066 8122693 9407383 10910627
2127 10910627 12954523 15463933 18390418 21820675 24478726 24304688 21734183 18189585
2119 18189585 14642475 11631132 9371023 7799217 6578516 5652556 4996754 4440167 4189843
2110 4189843 3908319 3503144 3324436 3068590 2822605 2651704 2458984 2351181 2108638 1814535
2100 1814535 1610033 1547882 1613123 1458149 1360510 1233594 1071569 1069418 1038112 940726 987239
2089 987239 935952 782278 656032 556113 666402 711014 552535 606126 590407 499118 266365
2078 266365 379484 483845 374712 299876 200511 325163 275487 306097 259936 234012 213163
2067B13163j13180N6236K3715p8352n6752m0920K9871o8864L6739J06873r1025
2056A7504l2052J1443N8716n2987q8526Q7002j7950j51988R8753K8315p5189m4708
2044a61667N8698O6905l0685j6006L8526q2940m9614J19688N2396j6142j32440
2033a53281p8734p7093N6075J03315P7529K5847j07491k3459Q7286L783j8404
2022a04627n1272J28488N7088n8961m2287j01413o1801j0797R9634J2258j7914
2011a51604m0949L223J05751j30768k7526M7116M9190L5446j60165j3684J18890
2000a65080l3818Q8776J23j15883Q0182p7605R4805n0567k0597M3010r3106J01353
1988a48407P0481j03057N2395Q8487j77838J2028m1148J38444j8445j55258P0054
$$ plain form
2067 213163 99983 156219 179934 101582 44830 3910 33781 -35083 1656 108529 17504
2056 17504 -14548 -3105 55611 2624 -85902 1100 -16850 -168838 -70085 -41770 -116959 -161667
2044 -161667 -102969 -36064 -66749 -82755 -44229 -127169 -176783 -57095 -4699 -20841 -153281
2033 -153281 -232015 -309108 -253033 -149718 -72189 -46342 -153833 -177292 -90006 -86223 -104627
2022 -104627 -155899 -27411 29677 -29284 -71571 -172984 -234785 -245582 -145948 -133690 -151604
2011 -151604 -192553 -189330 -83579 -214347 -241873 -194757 -145567 -110121 -270286 -283970 -165080
2000 -165080 -198898 -110122 -109999 -225882 -145700 -223305 -128500 -179067 -199664 -156654 -249760 -148407
1988 -148407 -77926 -180983 -128588 -40101 -217939 -205911 -247059 -108615 -127060 -282318 -212264
1977b12264N6631l4162P946o9561O4866O5165J1177m4466Q874O7922o6090j06400
1965b50362q8945K10390M5022j56045J895J54360o222n4714j5252r114L9201O1825
1953f7961n5610o027j0550j8340p4027K1139q4884J15887l5978r3232J60744J4466
1941a34373p5398m2699r5801n033P7683K0393j0169n7735N0986K4155j6897O9810
1929a95078K8557J1351N4443P3655q1672K2134L9336r4039N3204r2862j36121
1918c17092J11284J051L1158n3947q434R5276m7712M4339j5164l1809j02451K0694
1906b72807N9933K908P446k373p503j8826J9116k2051J60151p4158j3292l5230
1894a96686O1368M4939p8105P3044O0081n9731m7470N3212l3090m5410O888l8939
$$ plain form
1977 -212264 -155633 -189795 -181849 -251410 -186544 -121379 -110202 -154668 -145794 -77872 -143962 -250362
1965 -250362 -339307 -128917 -83895 -239940 -238045 -83685 -89907 -144621 -159873 -168987 -129786 -67961
1953 -67961 -123571 -129598 -140148 -158488 -232515 -211376 -296260 -180373 -216351 -309583 -148839 -134373
1941 -134373 -209771 -252470 -348271 -353304 -275621 -255228 -265397 -323132 -272146 -247991 -264888 -195078
1929 -195078 -166521 -155170 -100727 -27072 -108744 -86610 -47274 -141313 -88109 -180971 -317092
1918 -317092 -205808 -204757 -173599 -227546 -235980 -140704 -188416 -144077 -159241 -191050 -293501 -272807
1906 -272807 -212874 -209966 -202520 -204893 -212396 -231222 -212106 -234157 -74006 -148164 -161456 -196686
1894 -196686 -135318 -90379 -168484 -95440 -35359 -95090 -142560 -89348 -122438 -167848 -160960 -199899
1882a99899p3292R4695K8030J2782N7511m4607r6434L1085J0259P6192m4444n7449
1870b05571J29895J6916M02o5068k1093p2735L1729J2939P856M7782j0028J01835
1858b5141l7284l6598l253K858N9883K6522m9424j3279m2683N7411J2382O6983
1846A8377n2906L4294j23519m1606N9959o8058m8997Q5431L2400r4178j2903Q1984
1834a29722k4451q078P2016k5916j73464k1768r1902J66970J33188j37883p135
1823b48145K16950j17587O3004P0060l9114j824j9983p0193N2168J9396j42521
1812b17789n9521J45232k2868r123K9343q4219J67889r4374m4067J54982j02856
1801a37371j26028M6806M4624K15552j03433j24167o7339J18656L5699o141q2353
$$ plain form
1882 -199899 -273191 -178496 -150466 -137684 -80173 -124780 -221214 -190129 -179870 -103678 -148122 -205571
1870 -205571 -75676 -58760 -58358 -123426 -144519 -217254 -185525 -172586 -164730 -116948 -126976 -25141
1858 -25141 -62425 -99023 -102276 -99418 -39535 -13013 -62437 -75716 -118399 -60988 -48606 18377
1846 18377 -34529 -235 -123754 -165360 -105401 -173459 -222456 -137025 -104625 -198803 -211706 -129722
1834 -129722 -154173 -162251 -90235 -116151 -289615 -311383 -403285 -236315 -103127 -241010 -248145
1823 -248145 -31195 -148782 -85778 -15718 -54832 -56656 -76639 -146832 -94664 -75268 -217789
1812 -217789 -277310 -132078 -154946 -164069 -134726 -218945 -51056 -145430 -189497 -34515 -137371
1801 -137371 -263399 -216593 -171969 43583 -59850 -184017 -251356 -132700 -97001 -103142 -185495
1790a85495O0943j8492k3116l7977p4207J16244O272k9632o3618J1291J17217
1779a20570O9359K0746j7667p4367k8878N703q5983O3830O6810j40096j2473J16345
1767a37241J8882k2300j469M1004p3693o9448M6621J03134r0697o7134K7806R4499
1755a30036m5616k4849j0638o0227N2628K8487L0027L7389o145J03829m4229q4335
1743a53715K9617J9658p9433O3465L172q7911O1199l8368q0041L912L2275P7642
1731a48528n8804L6110Q0927j4794k8999m5619l9023J35085N1639j32593o9692
1720b34291O5224l9868j4160L3988r8202J25896Q1072J02051o9143p2400o7454
1709a87287N714J36176M0005m2876l5645K2212m2973P561o3925P7118K4510K7263
$$ plain form
1790 -185495 -124552 -143044 -166160 -204137 -278344 -162100 -155828 -185460 -249078 -237787 -120570
1779 -120570 -51211 -30465 -48132 -122499 -151377 -145674 -231657 -167827 -101017 -241113 -253586 -137241
1767 -137241 -118359 -140659 -142128 -101124 -174817 -244265 -197644 -94510 -185207 -252341 -224535 -130036
1755 -130036 -175652 -200501 -211139 -271366 -218738 -190251 -160224 -122835 -128980 -25151 -69380 -153715
1743 -153715 -124098 -104440 -183873 -120408 -117236 -205147 -143948 -182316 -262357 -258445 -226170 -148528
1731 -148528 -207332 -171222 -90295 -105089 -134088 -179707 -218730 -83645 -32006 -164599 -234291
1720 -234291 -169067 -208935 -223095 -189107 -287309 -161413 -80341 21710 -47433 -119833 -187287
1709 -187287 -181573 -45397 -5392 -48268 -83913 -61701 -104674 -97113 -161038 -83920 -59410 -32147
1697c2147j05012p5723J8129L4732O8678P2483k3764o3344k2723j4586p016L0848
1685a19445Q2069L1926p9819o9529Q4616J08698M866K9337j54566j75157o991
1674b63995L9469J70995l3612J6832j08315l2319K7767k0512k8994J01372m6651
1663a77963P9320K694J4264j4675o9113J9667j13915J50397q830k1446K0400k3927
1651a43127n561p2793L0988m25k4686q6372J28944K2836m8215O3311J5319n731
1639a25512J0888N0321j2445n4225N4052j41682Q8862j20842N3317k8520J15817
1628a09969J14981p0415M1186J00913q5473q1418J47856Q6556j38254L623Q3533
1617I3119q1478J08546o3447k0035r1454p690R1585k9678p4077R2996j9142n4153
$$ plain form
1697 -32147 -137159 -212882 -194753 -160021 -91343 -18860 -42624 -105968 -128691 -143277 -150293 -119445
1685 -119445 -37376 -5450 -85269 -154798 -70182 38516 43382 72719 -81847 -257004 -263995
1674 -263995 -224526 -53531 -87143 -70311 -178626 -210945 -183178 -203690 -232684 -131312 -177963
1663 -177963 -98643 -95949 -81685 -96360 -165473 -145806 -259721 -109324 -118154 -139600 -119200 -143127
1651 -143127 -148688 -221481 -190493 -190918 -215604 -301976 -173032 -150196 -198411 -135100 -119781 -125512
1639 -125512 -114624 -64303 -76748 -130973 -76921 -218603 -129741 -250583 -197266 -225786 -109969
1628 -109969 5012 -65403 -24217 76696 -8777 -90195 57661 144217 5963 9586 93119
1617 93119 11641 120187 56740 36705 -54749 -62439 29146 -532 -74609 18387 -755 -54908
1605e4908J24672j32792Q937m1783J0905K0342j41511O3035J16383M3789r4821
1594g7752m2203l0850Q5417m0152k6634K4138j9040K2235N2727N1534l7575o6172
1582a04327M764R714P6342n8333j704n3161K8831j2452K4311j0260N9373L0962
1570e940P6738r2244n1462j0365l6277J28247k932l9964j5315K3673p0372N584
1558i0629j0677L9883L5753j98405N3647O2190o222j925o40Q5287k1349o8911
1546a21998l4333P990O8356J15748l3237m746q9017n5868R5932o0537K1257L4748
1534e5705J16402r5726p5177J09146P7400m6008p9625j04096P1208R0202m6398
1523c8377l1997r2914N1399j7940l2786J44951j1756K9997L0546m3487m6827r0809
$$ plain form
1605 -54908 69764 -63028 -54091 -95874 -84969 -64627 -206138 -143103 -26720 17069 -77752
1594 -77752 -119955 -150805 -65388 -105540 -132174 -108036 -127076 -104841 -52114 -580 -38155 -104327
1582 -104327 -99563 -89849 -13507 -71840 -73544 -126705 -97874 -110326 -86015 -96275 -36902 -5940
1570 -5940 70798 -21446 -72908 -83273 -119550 8697 5765 -34199 -49514 -25841 -96213 -90629
1558 -90629 -101306 -61423 -25670 -224075 -170428 -108238 -114460 -116385 -117025 -31738 -53087 -121998
1546 -121998 -156331 -148341 -79985 35763 2526 -2220 -91237 -147105 -51173 -111710 -90453 -55705
1534 -55705 60697 -35029 -110206 -1060 76340 30332 -49293 -153389 -82181 8021 -38377
1523 -38377 -70374 -163288 -111889 -129829 -162615 -17664 -29420 577 31123 -12364 -59191 -150000
1511a50000L3578P8822O0716L6262l4788q9508j20212k6855m1719j3970M6540
1500b21134J04384L1788J6786Q1743m2750K618P5497m7065m5386p5958J18313
1489a164M4243k26039J27890K3401p9963N903l2905j2871L0177M4986k6802o9025
1477a72169n015J15226J11686j57323M6059M5376r0076J01861P2180k08338J3604
1466a26929k5785P5604L1918R3935r930m0145L2498O0277o8166o5255N9443J29618
1454A47083p4816r9555K9781j13999Q8751n2912O0896L7568n1080j8356K6543
1443b0096P470k9949n5623K7802M9377n6060N3291J9955j20155M9487J03286l5063
1431f278P5359p2849J11936N8427j87995L0082P826p2696N562P0697m6665R2331
$$ plain form
1511 -150000 -116422 -37600 23116 59378 24590 -64918 -185130 -211985 -253704 -267674 -221134
1500 -221134 -116750 -84962 -68176 13567 -29183 -26565 48932 1867 -43519 -119477 -1164
1489 -1164 43079 -182960 -55070 -31669 -111632 -105729 -138634 -151505 -121328 -76342 -103144 -172169
1477 -172169 -177184 -61958 49728 -107595 -61536 -16160 -106236 -4375 67805 -140533 -126929
1466 -126929 -152714 -77110 -45192 48743 38813 -1332 31166 91443 23277 -41978 17465 147083
1454 147083 72267 -27288 2493 -111506 -22755 -75667 -14771 22797 -28283 -46639 -20096
1443 -20096 -12626 -42575 -98198 -70396 -21019 -77079 -23788 -3833 -123988 -74501 28785 -6278
1431 -6278 69081 -3768 108168 166595 -21400 8682 16508 -56188 -50626 20071 -26594 65737
1419F5737M8077n2661q3803k378Q1075j31764k4007L0897L5772P0023K0102k5130
1407C1940L5231l602q3610J38158K4258r6823j47792k486J8506J04034o5724l854
1395e1764O264p0363R5845n5909L1707K318J9072k0147J0793p85J37470n1784
1383E2717L7142n6927q2461K2466k4915j0849N0788N9458P8652p8011K7853K0675
1371I6588l1976k6393j3723K2516j27386J05928L4332J7060l9973L5036m0945
1360C1064l5730L385n5303N8001J1311j55403O6170L0687J0724R1511p383j4483
1348C4551N269k1624k963r6014j03709M7281J16638M8673R5016q5147o9373o2660
1336i4062m4447O4101Q1067R346m3367o9231N2089k4270K5948J35393n448j13298
$$ plain form
1419 65737 113814 61153 -22650 -25028 56047 -75717 -99724 -68827 -33055 36968 57070 31940
1407 31940 67171 63569 -20041 118117 142375 45552 -102240 -104726 -86220 17814 -47910 -51764
1395 -51764 -45500 -115863 -20018 -75927 -44220 -41902 -22830 -42977 -32184 -32969 104501 52717
1383 52717 89859 32932 -49529 -27063 -51978 -62827 -12039 47419 126071 48060 75913 96588
1371 96588 64612 38219 24496 47012 -80374 25554 59886 76946 36973 72009 31064
1360 31064 -4666 -1281 -56584 1417 12728 -142675 -76505 -45818 -35094 56417 49034 34551
1348 34551 39820 18196 15233 -80781 -184490 -137209 -20571 28102 123118 37971 -31402 -94062
1336 -94062 -138509 -74408 6659 16005 -27362 -96593 -44504 -68774 -42826 92567 87119 -26179
1324b6179O0590N9740L340n8673o4117L4483m0679L5345M7338m8625K3431o0285
1312c4291j33091O5942j00080J41044J5810J13264K6601k7642N4574j23926N3973
1301E2178L3174n8661K7826Q4591n0332j7178q7606l9871M3169r1000N7241J33431
1289H6962K3112m1399p7323K8490L7289p4675o3386L065j7211P0410k6114J1911
1277c8869P9493Q252p0778j26920N691K56698P6657K8341j28903j72824O2035
1266b1127L1358k8842L175M1105m0934K9121P5294L7779l7730O6044l438j2268
1254A39537n497M0524q0748k8739j54735M3261J76490q8058j8567Q9523M8081
1243A61072n8549j38385N0470O7120M484j09894M0730R4926j58951r355Q6619
$$ plain form
1324 -26179 34411 94151 97491 38818 -25299 9184 -31495 3850 51188 2563 25994 -34291
1312 -34291 -167382 -101440 -201520 -60476 -44666 68598 95199 67557 122131 -1795 52178
1301 52178 85352 26691 54517 139108 88776 71598 -16008 -55879 -12710 -103710 -46469 86962
1289 86962 110074 68675 -8648 19842 57131 -17544 -80930 -77865 -95076 -24666 -50780 -38869
1277 -38869 40624 48876 -21902 -148822 -143131 113567 190224 218565 89662 -83162 -21127
1266 -21127 10231 -18611 -15436 25669 -15265 13856 89150 126929 89199 155243 151805 139537
1254 139537 134040 174564 93816 65077 -89658 -46397 130093 42035 23468 112991 161072
1243 161072 102523 -35862 14608 81728 86212 -23682 17048 111974 -46977 -56332 30287
1232C0287Q6411j26350n233j471O8015o9548K0481L9011o4193r957N5961M482
1220B7896r1465j12659r852K04130J3048q6055n4962J18574m5710J16201m083
1209G5063n002O2572p2169J016P4304K1022j15035l1938p0790l025j1722R4865
1197A9161M7581n768l3374l7937R1193l4655J2586R3407j7111p6420n1910N7440
1185F4193K8881m9106o7382K7575Q4608J0682j2166k1076j2927k9593m2987R4156
1173G4858r086o2596Q6850J2328j38850l5998K7836N1318K4794M0147R0361n0119
1161A11843j134J9472O3142p7757O18r7233n211J7672J21686j19175l8889j5047
1149b0013K7838J02984r6312P7530P878j01892k2433p948N1651L9455n5030J03051
$$ plain form
1232 30287 116698 -9652 -14885 -16356 51659 -17889 2592 41603 -22590 -32547 23414 27896
1220 27896 -63569 -176228 -186080 18050 31098 -54957 -109919 8655 -37055 79146 75063
1209 75063 70061 132633 60464 61480 135784 156806 41771 9833 -60957 -63982 -75704 19161
1197 19161 66742 60974 27600 -10337 80856 46201 58787 152194 135083 58663 6753 64193
1185 64193 93074 43968 -23414 4161 88769 99451 87285 66209 53282 23689 -19298 74858
1173 74858 65772 3176 90026 102354 -36496 -72494 -44658 6660 31454 71601 161962 111843
1161 111843 110709 130181 193323 115566 116184 18951 13740 31412 153098 33923 -4966 -20013
1149 -20013 7825 110809 14497 92027 99905 -1987 -24420 -32368 19283 58738 3708 106759
1137A06759m784n8987o2941K7924K0900J9883J1552j4471j07014R4737N8343N473
1125I7374Q6095R5209j34385j33231M0296o2717q8384P2174M6164J42939O0744
1114B22278r0044K5865n2788n5937J59004j17058k6303K1756j02028J32210r2086
1103B4869K4347R2243j62630p4380p3612J13339p276m3178J09675R9143L1076
1092A33616r226M6022k9238K5604L0262j00343o764R7986o0586M5n3253K4874
1080I8999j5034k1509o3446R0601O8464L7078l7152n6029l8014n679l6040j2899
1068I340R1423m5749j15381J7782K3081M6369L4749n4993N2217N5621M7907j29677
1056C2689k4655O1868K7739N6180M8755r9357m6319Q3705L8396j82751R3042k4684
$$ plain form
1137 106759 101975 42988 -19953 7971 28871 48754 60306 45835 -61179 33558 91901 97374
1125 97374 183469 278678 144293 11062 51358 -11359 -99743 -27569 18595 161534 222278
1114 222278 132234 158099 105311 49374 208378 91320 65017 86773 -15255 116955 24869
1103 24869 49216 141459 -21171 -95551 -169163 -55824 -63100 -106278 3397 102540 133616
1092 133616 124390 170412 141174 166778 197040 96697 89933 187919 127333 127378 74125 98999
1080 98999 83965 62456 -990 89611 158075 195153 158001 101972 63958 58279 22239 9340
1068 9340 100763 55014 -60367 -42585 -19504 26865 61614 6621 58838 114459 162366 32689
1056 32689 8034 69902 97641 153821 202576 103219 56900 140605 179001 -3750 89292 64608
1044F4608K2027J05329k7480K2176o7918j6578J3549q0462q1302k4479n6950J90313
1032F2833R4596m3335j05294p495N6675p0784m8940L010L8880m8428N7207m94
1020a1569m8923P9711J1917M7097N6655p8242j9276n3896N3428j0435m3473J06641
1008H9635m7010J453L8436m2647J4659O2683m5088n4566J10904l4435j26998P1247
996C8273J9132N7762q1830J07834M2910j10649l7787n0228l6864K7295J20418
985I6266p3295k4715L8150O0766l6828j0479j26154l9444N2371L9746P8554l3536
973B1402R7711n4333l099j320j07527M9648L1376o0693J75143p7537j38647O1679
961f197K0190K2900O7518m2219J2008O3100j10595l8519m0429O4416R1584K4995
$$ plain form
1044 64608 86635 191964 164484 186660 118742 102164 115713 35251 -46051 -70530 -127480 62833
1032 62833 157429 114094 8800 1305 57980 -12804 -61744 -58734 -19854 -68282 -11075 -11569
1020 -11569 -60492 19219 31136 78233 134888 56646 37370 -16526 36902 26467 -17006 89635
1008 89635 42625 44078 82514 39867 54526 117209 72121 17555 128459 94024 -32974 38273
996 38273 57405 115167 33337 141171 184081 73432 35645 -14583 -51447 -24152 96266
985 96266 22971 -1744 36406 97172 60344 49865 -76289 -115733 -63362 -23616 54938 21402
973 21402 119113 64780 61681 60361 -47166 2482 33858 -26835 148308 70771 -67876 -6197
961 -6197 13993 36893 104411 62192 74200 137300 26705 -11814 -52243 12173 103757 128752
949A28752K349m1700n1241j5194P3923n5197J15303n9335q080j026J3721K2802
937A25077n6819N8623L1245l6359N0340K3065j25909o952n1097O1798m1338J7720
925D9394Q4873l1869N9189q1103l180P7517q2483P1022k8378M8765r2145r1638
913b0036Q2073J32853j037j29599O5647j0242j54384P8468P4769q5591K5096Q9863
901A47880r6913J39627N2862j211m3109j5586K8033j50020J27497n5883Q001K3499
889A64677o9801l8345p0574P7292J19273J43n4312j19311j4191J19168n6064l4789
877B3166J32234O6726j06307j52652J83136M5092p2921l2762n9735N9499M8594
866A34070l2978o8533O6967O2628j26366p3533l4363J00251R899P1582j783k952
$$ plain form
949 128752 131101 89401 38160 22966 96889 41692 156995 97660 89580 88554 102275 125077
937 125077 68258 126881 158126 121767 172107 195172 69263 62311 11214 73012 31674 49394
925 49394 134267 102398 161587 80484 77304 154821 72338 143360 114982 163747 71602 -20036
913 -20036 62037 194890 193853 64254 129901 119659 -34725 43743 118512 32921 58017 147880
901 147880 50967 190594 243456 242245 199136 183550 211583 61563 189060 133177 141178 164677
889 164677 94876 56531 -14043 63249 182522 182665 128353 9042 -5149 114019 57955 23166
877 23166 155400 222126 115819 -36833 146303 191395 118474 85712 25977 85476 134070
866 134070 101092 32559 99526 162154 35788 -37745 -72108 28143 38042 109624 107841 104889
854A04889J43633j83465K8962l5221J219P3132j41899N039J25234o3128o3649
843e254O2030L7909O971o5689r507j6084j13570l377N5281P5192j39303M5689
831f9712M3687j2329K6459k0972R8852o0222N541J4314m8431J22984Q167r342
819I8996M3139K7882q345l1691p8354k3647Q9262K8969N3811j16903p4379Q6768
807I5508N6798o843L688n6917j01272n7226J78501J5036j61117J19327k9885j078
795E4520o4538M4774O0145J4765K840M127p1261m7859M7073K8593K3891k0959
783G6111L2304p801J7254o3222r2206J3238M3187P5945k0880o1190k2806m6555
771e6621N2536Q009N4462K3920n2751L9745j4488R2895K02711r839m4770n5987
$$ plain form
854 104889 248522 65057 94019 58798 60017 133149 -8750 -3711 121523 58395 -5254
843 -5254 56776 94685 101656 35967 26460 10376 -103194 -106571 -51290 23902 -115401 -69712
831 -69712 -26025 -38354 -11895 -32867 65985 5763 11304 25618 -22813 100171 108338 98996
819 98996 142135 170017 161672 129981 51627 27980 117242 146211 200022 83119 8740 95508
807 95508 152306 145463 149151 92234 -9038 -66264 112237 127273 -33844 85483 55598 54520
795 54520 -10018 34756 94901 109666 112506 116633 45372 -2487 44586 73179 97070 76111
783 76111 108415 100614 117868 54646 -37560 -24322 18865 94810 73930 12740 -10066 -56621
771 -56621 -4085 3924 58386 82306 29555 69300 54812 147707 350418 340579 295809 239822
759B39822j7910n0718j52985j389K17854j1992n117j7854j3950p1039m3735J6553
747H7540N0555q0865P4173R5017j32839O1367J6476K6638n5076O1078L6188k1808
735B18444M1793j09981r7699p0888R8409M7774p0439q1319L1671p114r4234L4615
723e8968J15534J83861p0686j27672k8304l203Q1097J15032j50467r5316L7627
712a465R5132O5034j36604j6587J03732J8144j06054j1740K3034L4894j1641L4682
700I0561p8351Q3503N6010k8075N1050q1854j31340q3798J05502O6937J180M8682
688A00007N8462q3703r043L0630P384k6906j8964m9258j02142L0920l1876q226
676a02715J01912O2694M5499R9726r1540q6803O3074j3628l0581o0226J6796J19979
$$ plain form
759 239822 221912 171194 18209 16820 234674 222682 217565 199711 185761 114722 70987 87540
747 87540 138095 57230 131403 226420 93581 154948 171424 198062 142986 204064 240252 218444
735 218444 260237 150256 52557 -18331 80078 127852 57413 -23906 7765 651 -93583 -58968
723 -58968 56566 240427 169741 42069 13765 10562 91659 206691 56224 -39092 -1465
712 -1465 93667 158701 22097 5510 109242 127386 21332 9592 32626 67520 55879 90561
700 90561 12210 95713 151723 123648 174698 92844 -38496 -122294 -16792 50145 51325 100007
688 100007 158469 74766 65723 96353 103737 76831 57867 8609 -93533 -62613 -94489 -102715
676 -102715 -803 61891 107390 207116 115576 28773 91847 78219 47638 -12588 4208 124187
664A24187j34439j215N4576n1327k3161J42278L1074j22951M509o0752P2505L3003
652F8287o6408k7135l1027M656J39278J2052O781j44987p7255r8847P6397Q9119
640d9089j5454P0526L3676M4345p3752o3980P3422J21495K7296N4814q2261j8212
628A22826J8360J06094j22887j99973j25509J27647J47037r985l0384r9979R8780
617C2027R0319M4725j1423p0354k4171L2143r5930m4618N0827q3411k6408J14925
605H651J3448J27463J3074q0457k0491L8290p8240N474Q3471k8643l7925l3382
593A0733N1087J28402j01941n309o9003J27194J7896l1063K245J3936k8214Q6052
581B02015o6474k2157P9888r3708r0430L4551Q780L632J12061j46924n7192L3147
$$ plain form
664 124187 -10252 -11467 43109 -8218 -31379 110899 141973 19022 23531 -37221 35284 68287
652 68287 1879 -25256 -56283 -51627 87651 99703 106484 -38503 -115758 -214605 -138208 -49089
640 -49089 -64543 5983 39659 84004 10252 -53728 19694 141189 168485 223299 141038 122826
628 122826 141186 247280 124393 -75580 -201089 -73442 73595 63610 33226 -66753 32027
617 32027 122346 167071 155648 85294 61123 93266 -2664 -47282 3545 -79866 -106274 8651
605 8651 22099 149562 162636 82179 61688 99978 21738 27212 110683 82040 44115 10733
593 10733 61820 190222 88281 82972 13969 141163 159059 127996 130241 144177 115963 202015
581 202015 135541 113384 193272 99564 9134 43685 52465 56097 168158 21234 -35958 -2811
569b811n5467Q40l0102N6000J27565j47466O6613n5259Q489k808J7411k3546P778
556c2763j0297N8192k3348N4517R7321j18972o9470R8108M1139J34052l4531p9064
544A14884k0874j08527M0603k87q2794N2690p0660K5873Q6169P258N230Q1725
532A31290m472q2967j7176q7178O4951j3407L2690l6049Q465K0408m3352N6875
520C0078J00406j39766r4N6784n459M34l1211M416j4868N1699m0252L5118O1368
507A08653l8933l5595p924R4206K7685n1140m6673j7892j2172O722p2440l0228
495g5731P2074M1739M47j36713O2422n9600K4207K7005K2879P0513q2625L5148
483A765j00118l6352K8263l9755J02480J51148J1804j23530P3936O7033k5351
$$ plain form
569 -2811 -58278 -57438 -87540 -31540 96025 -51441 15172 -40087 -31598 -34406 -16995 -40541 -32763
556 -32763 -43060 15132 -8216 46301 143622 24650 -44820 53288 94427 228479 193948 114884
544 114884 94010 -14517 26086 25799 -56995 -4305 -74965 -49092 37077 44335 49565 131290
532 131290 126818 43851 26675 -60503 4448 -8959 23731 -12318 -3853 16555 -26797 30078
520 30078 130484 -9282 -9376 47408 41949 42383 11172 15588 720 52419 12167 47285 108653
507 108653 69720 34125 26201 120407 148092 96952 50279 32387 20215 26937 -45503 -75731
495 -75731 -3657 38082 38529 -98184 -35762 -95362 -71155 -44150 -21271 49242 -33383 1765
483 1765 -98353 -134705 -106442 -146197 -43717 107431 119235 -4295 69641 136674 111323
472A11323r7276j8357L7656J8597j23615n2349L6903r0783P1096J46475m7371
461g701m4094l8272q7340N3593J97434M7991Q9998q9976n1989P6449k9010o5003
449E2080j17838K7964j2104L9201O4545j10468K3281P9585J585k6604l2436J30467
437A19258p7328O083M1551J5475J1413j85249O7637O4041q7437O6650m0512n2110
425e0528l0422L8983O6558j38453J8525Q6771j4555n1707j793P7745N6467l2878
413B4713j26019J24715N1140k3230j12801R3777m22k4632l1075n9636J4925P8649
401A0104q201N2433n4310k4039k6684K4704L2951n3561l8683J05921J17179j02922
389C4892p8781N5302L067n9054J18929j21107p9131l4783K7718K8054P4127Q5546
$$ plain form
472 111323 14047 -4310 33346 51943 -71672 -124021 -87118 -177901 -106805 39670 -7701
461 -7701 -51795 -90067 -177407 -123814 73620 121611 211609 121633 69644 146093 117083 52080
449 52080 -65758 -37794 -49898 -10697 53848 -56620 -33339 46246 47831 21227 -11209 119258
437 119258 41930 48013 89564 105039 116452 -68797 -1160 62881 -24556 42094 1582 -50528
425 -50528 -80950 -41967 24591 -113862 -95337 -8566 -23121 -74828 -76621 1124 57591 24713
413 24713 -101306 23409 74549 51319 -61482 32295 31873 7241 -23834 -83470 -68545 10104
401 10104 1903 54336 26 -24013 -50697 -25993 6958 -46603 -85286 20635 137814 34892
389 34892 -43889 11413 14480 -44574 74355 -46752 -125883 -160666 -132948 -104894 -30767 54779
377E4779l1741q9402l8598R2608M0570o4495r5601R2780k3262q2330Q1203J60
365f3329j0264L7206n8191J06265O3224l9129n5561l2757P3120M9297n3444p1975
353e5538O859m6937q7630R6084K7038j4252n82J02376O5331n2280m5761L1463
341B6171j03114N167M2691J2839L5679j3641m7920N2871O8819p9269k2418k046
329b4171J05623j17782O7781j09043r0303O1792K2732Q7278J22792j23622j71941
318a68864L774R8315N6501J06342o2993j32605n7710J47588j1796k7149K42l2661
306h1016M1696K4329l5413N030p9795j5749J4323R7690l6916l2870n9021O8998
294h8714J4288n3408Q1529L1589l012p7197k6614K3362Q3734l2710p4618m3712
$$ plain form
377 54779 23038 -66364 -104962 -12354 28216 -36279 -131880 -39100 -62362 -144692 -63489 -63329
365 -63329 -73593 -36387 -94578 11687 74911 35782 -19779 -52536 20584 69881 16437 -55538
353 -55538 -48679 -95616 -183246 -87162 -60124 -74376 -74958 27418 92749 40469 -5292 26171
341 26171 -76943 -71776 -29085 -16246 19433 5792 -42128 10743 79562 293 -22125 -24171
329 -24171 81452 -36330 31451 -77592 -167895 -106103 -83371 3907 126699 3077 -168864
318 -168864 -165090 -66775 -10274 96068 33075 -99530 -157240 -9652 -21448 -48597 -48355 -81016
306 -81016 -39320 -14991 -50404 -45374 -125169 -140918 -126595 -28905 -65821 -98691 -157712 -88714
294 -88714 -74426 -127834 -46305 -14716 -17728 -94925 -121539 -98177 -14443 -47153 -121771 -165483
282a65483J35678P185J3030o0984j848J52173r7496P9316J00038n0034n853l7547
270F8175k6898r118j25833m4910J24028L0784r375p6488m6741j5840J32100N3272
258E3156l2479O0880j10110q5260N5601O4905M7202o4973j6040R651N4556m4639
246g550r4397o2481J10152L03j07704r7121Q482J22760J17639J0348L3956o6868
234c2481o6351N1805O9757P067m9846p6757l3245l2044M4350J18881N1457p8745
222b6152j26348N1711R350j987N568Q1378k6853n8915O0021l6966N5046K111J9986
209G950j18386p1017J92152j22800j07215j5162j4246K08434j0686l103J12405
198E8326j85986j02181J00081j15289O3809J83803n8130r5524R0453L9039J8848
$$ plain form
282 -165483 -29805 -22620 -9590 -70574 -72422 79751 -17745 61571 161609 111575 105722 68175
270 68175 41277 32159 -93674 -138584 -14556 16228 6853 -69635 -116376 -132216 -116 53156
258 53156 20677 81557 -28553 -113813 -58212 6693 53895 -11078 -27118 -17467 37089 -7550
246 -7550 -101947 -164428 -54276 -53973 -161677 -258798 -250316 -127556 -9917 431 34387 -32481
234 -32481 -98832 -47027 22730 29797 -20049 -96806 -130051 -162095 -117745 1136 52593 -26152
222 -26152 -152500 -100789 -91439 -93426 -87858 -6480 -33333 -92248 -32227 -69193 -14147 -12036 7950
209 7950 -110436 -181453 10699 -112101 -219316 -234478 -248724 -40290 -50976 -54079 58326
198 58326 -127660 -229841 -129760 -245049 -181240 2563 -55567 -151091 -60638 -21599 -2751
187b751r9874k0399J14004K1834j1543p8576j28591N9995Q6749r1961J4285R0498
175d6330J10565j02230l6125J7411M4606m6423n175M309n9193N7279m6488m0278
163a48072P3842R0606j2613k4860J4027m1951m4322Q929j22921k5770J20460N4387
151e8258J2773J1007o614N1517n1386j29093L1726L1253p4172J04670J8912L1295
139b6370k5041n6787J8115O9416L9365m8153n8027j4042N3604j2016N8070j18215
127a20081J0533R4984k7591j05859L7433J24918m7506l9543k8755q3165J22026
116f2606J9648J0716j1712k7323P7320o6557l9553O530P291k1915n5667J07164
104e6664J3796k3755K8562M9329j15159n0409Q0836l8899m9705J5508P6303K077
$$ plain form
187 -2751 -102625 -123024 -9020 12814 1271 -77305 -205896 -145901 -59152 -151113 -136828 -46330
175 -46330 64235 -37995 -74120 -56709 -12103 -58526 -63701 -59392 -118585 -61306 -107794 -148072
163 -148072 -74230 16376 3763 -21097 -7070 -49021 -93343 -84414 -207335 -233105 -112645 -58258
151 -58258 -45485 -34478 -41092 10425 -40961 -170054 -138328 -107075 -181247 -76577 -57665 -26370
139 -26370 -51411 -108198 -90083 -20667 18698 -29455 -87482 -101524 -47920 -59936 -1866 -120081
127 -120081 -109548 -14564 -42155 -148014 -110581 14337 -33169 -72712 -101467 -184632 -62606
116 -62606 -42958 -32242 -43954 -71277 6043 -60514 -100067 -93537 -86246 -108161 -163828 -56664
104 -56664 -42868 -66623 -38061 11268 -103891 -154300 -73464 -112363 -162068 -146560 -70257 -68180
92f8180m6842J2317o2834K2824N3618o297k0111J21929k5713N2954q3303j3474
80f3112k6855j2188K5688p1387j9997P1294Q046J3272K6464L8071n4973J654k8666
67i2689q5684O1156p9613P3220k7310m4700J47721Q7798r4052j4929l3210o7040
55a69332J5307O5845J2662J4830k2744K7235P3937o475j48754K1098M9725Q837
43e7829m1233p2624k5032O4704j3584m2995L1401J215J6506L5357l7417J47254
31E723l8018q3541n5767O4505l4290n370k7391P8654L2770K7828Q5184p7632j55378
18a82723q893J13093n3598r689M6772J9031J9255j8495k9592J6459q056J8457
6g7979l6941N2651o0098K8986l0871j0800
$$ plain form
92 -68180 -115022 -102705 -165539 -142715 -89097 -95394 -115505 6424 -19289 33665 -49638 -63112
80 -63112 -89967 -102155 -76467 -147854 -167851 -96557 -88511 -75239 -48775 -10704 -65677 -64023 -92689
67 -92689 -178373 -117217 -196830 -123610 -150920 -195620 -47899 39899 -54153 -69082 -102292 -169332
55 -169332 -154025 -88180 -75518 -60688 -83432 -56197 17740 11265 -137489 -116391 -66666 -57829
43 -57829 -99062 -171686 -196718 -132014 -145598 -188593 -157192 -155977 -139471 -104114 -141531 5723
31 5723 -32295 -115836 -171603 -107098 -141388 -146758 -174149 -95495 -62725 -34897 50287 -27345 -182723
18 -182723 -191616 -78523 -132121 -141810 -95038 -76007 -56752 -75247 -104839 -88380 -96436 -77979
6 -77979 -114920 -62269 -122367 -93381 -124252 -135052
0a35052
$$ plain form
0 -135052
$$ Imaginary data points
##PAGE= N=2
##DATA TABLE= (X++(I..I)), XYDATA
16383c519866M49l5637n22L9613J11113J21574J06999J15193K6285l5033M4684
16372c025148J23380O6836O084L9406M0894M5309Q3182n870Q2744R1791n555O4142
16360b392805M2305K1940J17130K1446J10202O3964M7474J6916P1992M8439J5220
16349a815777N4778L3249r1190N3531Q3741J69662k4654K3537R6556O6329P1815
16338a278423K2980M5954L5132P7655M7294J40947J8668O3442j0236P469P7115
16327g52003J9635M5540J39705N9200P4576J10978R360n239M5163q006M6207J00784
16315a14100P7792J3609J4993N6949K2784M4561J00256K1399k5712K546J27556
16304C42633K6616P7966J23793O5396p1282L7672K4717K0506J36338M163K4991
$$ plain form
16383 -3519866 -3519417 -3555054 -3555576 -3515963 -3404850 -3283276 -3176277 -3061084 -3034799 -3069832 -3025148
16372 -3025148 -2901768 -2834932 -2828848 -2789442 -2748548 -2703239 -2620057 -2625927 -2543183 -2451392 -2456947 -2392805
16360 -2392805 -2350500 -2328560 -2211430 -2189984 -2079782 -2015818 -1968344 -1951428 -1879436 -1830997 -1815777
16349 -1815777 -1760999 -1727750 -1818940 -1765409 -1681668 -1512006 -1536660 -1513123 -1416567 -1350238 -1278423
16338 -1278423 -1255443 -1209489 -1174357 -1096702 -1049408 -908461 -889793 -826351 -836587 -829118 -752003
16327 -752003 -732368 -686828 -547123 -487923 -413347 -302369 -293009 -298248 -253085 -261091 -214884 -114100
16315 -114100 -36308 -22699 -7706 49243 72027 116588 216844 238243 212531 215077 342633
16304 342633 369249 447215 571008 636404 565122 602794 627511 648017 784355 788518 813509
16293H13509J40962L2452L1190j4768J2324P9011J41714K7598q5330k3314M5235
16282A200583J31433J0195K8835J00485J036k5973O5753J05807P3888J6417K9626
16271A738085K3198r0010J9014P5795M0383N8186O6852k049Q1766j4651M5011
16260B041580J17702j4867Q6455j4262Q3714l2499k1595K6732J32959O481M3254
16249B455654P0637m7733J38939J469n8428Q3287k1253P5171l1737p230J20385
16238B779161l3612o0160R6427J09625R77O3457Q9743p0958j19351R2713j0658
16227B937364k0411Q0921Q8213J28819K11k8538l5772R4609k227M3841L7133k019
16215C322144N5135m8662o858k191J9190J14818P5264r4673k3626Q0259J84538
$$ plain form
16293 813509 954471 986923 1018113 1003345 1015669 1094680 1236394 1263992 1178662 1155348 1200583
16282 1200583 1332016 1342211 1371046 1471531 1472567 1446594 1512347 1618154 1692042 1708459 1738085
16271 1738085 1761283 1671273 1690287 1766082 1806465 1864651 1931503 1929454 2011220 1996569 2041580
16260 2041580 2159282 2144415 2230870 2216608 2300322 2267823 2246228 2272960 2405919 2412400 2455654
16249 2455654 2526291 2478558 2617497 2618966 2560538 2643825 2622572 2697743 2666006 2658776 2779161
16238 2779161 2745549 2685389 2781816 2891441 2892418 2955875 3045618 2974660 2855309 2948022 2937364
16227 2937364 2916953 2997874 3086087 3214906 3215117 3186579 3150807 3245416 3243189 3287030 3324163 3322144
16215 3322144 3377279 3328617 3321759 3319568 3338758 3453576 3528840 3434167 3410541 3490800 3675338
16204C675338J9746p5509Q6546K8631m6621j0222j8076Q0077Q6519m6246n282
16193C774901J24755q2812k6753R5762m9422M0101j9826J16468j0718o7149J37109
16182D032416N67J0033p0996M1111L0944j5321l28O3051J4177k8979L0966M4429
16170D152070j3392N4766j15062L055K01908J9510j399p8203j0181j0500N5156
16159D257728l0199k8089L4291J7564J575j04403Q7332P5721M3136j5251l1532
16148D307873N401P5087J8852K5762J03930R769j28131j12286l1057R3941P3036
16137D442177J18880K470k7241k1967n6200L6544M3164o7458P9083R1793j71744
16126D469501J70264R8555n4884n657K0616j0871o3249q9463O5740J782Q9451
$$ plain form
16204 3675338 3695084 3619575 3706121 3734752 3688131 3677909 3659833 3739910 3826429 3780183 3774901
16193 3774901 3899656 3816844 3790091 3885853 3836431 3876532 3856706 3973174 3962456 3895307 4032416
16182 4032416 4032983 4043016 3972020 4013131 4044075 4028754 4028426 4091477 4105654 4076675 4107641 4152070
16170 4152070 4138678 4193444 4078382 4081437 4283345 4302855 4301456 4223253 4213072 4202572 4257728
16159 4257728 4227529 4199440 4233731 4251295 4252870 4148467 4235799 4311520 4354656 4339405 4307873
16148 4307873 4313274 4388361 4407213 4432975 4536905 4546674 4418543 4306257 4275200 4369141 4442177
16137 4442177 4561057 4563527 4536286 4514319 4458119 4494663 4537827 4470369 4549452 4641245 4469501
16126 4469501 4639765 4738320 4683436 4677779 4698395 4687524 4624275 4534812 4600552 4602334 4691785
16115D691785K362L3670l9546p081k5381J4084k2418J6207J09983J5555r5891
16104D693329p9217J56959P5801m544r5198j06575J28137N8990l1106P456J1465
16093D815497r7581O5541P3948j48546m2456N3532J36233l7231J2558l9530k9932
16082D762033L3640M1544k1133J19208o8067j26082M8508k5736M0421L5910p2818
16071D767428K144P2370L263r448L3000R0759p3427J9245O6137l7430j83163Q4301
16059D835179O9168P0614K9245j08026l3510q5480O0327L595L1024l0710l3256
16048D808170r045L1699o710n5570O1838L3905O5580M998n337r4648L2815J21039
16036D988734p4092O4292p3346n6222l7007N9535N2768o4042n3855M3321p8007
$$ plain form
16115 4691785 4694147 4727817 4688271 4681190 4655809 4669893 4647475 4663682 4773665 4789220 4693329
16104 4693329 4614112 4771071 4846872 4842328 4747130 4640555 4768692 4827682 4796576 4804032 4815497
16093 4815497 4717916 4783457 4857405 4708859 4666403 4719935 4856168 4818937 4831495 4791965 4762033
16082 4762033 4795673 4837217 4816084 4935292 4867225 4741143 4789651 4763915 4804336 4840246 4767428
16071 4767428 4769572 4841942 4845205 4835757 4868757 4959516 4886089 4905334 4971471 4934041 4750878 4835179
16059 4835179 4904347 4974961 5004206 4896180 4862670 4777190 4837517 4841112 4872136 4841426 4808170
16048 4808170 4799125 4830824 4824114 4768544 4830382 4864287 4929867 4934865 4929528 4834880 4867695 4988734
16036 4988734 4914642 4978934 4905588 4849366 4812359 4871894 4924662 4860620 4806765 4850086 4772079
$$ [...]
##END NTUPLES=NMR SPECTRUM
##END=
