##TITLE=1H_CA-9161-2
 CDCl3
 8 sc, 
 9.6.2023
##JCAMPDX= 6.0         $$ Bruker NMR JCAMP-DX V2.0
##DATA TYPE= NMR SPECTRUM
##DATA CLASS= NTUPLES
##ORIGIN= UXNMR, Bruker Analytische Messtechnik GmbH
##OWNER= root
$$ XWIN-NMR		Version 3.5
$$ Fri Jun  9 15:18:14 2023 Russian Standard Time (UT+4h)  she@DPX200
##.OBSERVE FREQUENCY= 200.13135
##.OBSERVE NUCLEUS= ^1H
##.ACQUISITION MODE= SIMULTANEOUS
##.ACQUISITION SCHEME= undefined
##.AVERAGES= 8
##.DIGITISER RES= 18
##SPECTROMETER/DATA SYSTEM= spect
##.PULSE SEQUENCE= zg30
##.SOLVENT NAME= CDCl3
##.SHIFT REFERENCE= (INTERNAL, CDCl3, 0, 15.7425)
##AUDIT TRAIL= $$ (NUMBER, WHEN, WHO, WHERE, WHAT)
$$ ##TITLE= Audit trail, XWIN-NMR		Version 3.5
$$ ##JCAMPDX= 5.01
$$ ##ORIGIN= Bruker BioSpin GmbH
$$ ##OWNER= she
$$ F:/spectra/data/she/nmr/H-F/1/pdata/1/auditp.txt
$$ ##AUDIT TRAIL=  $$ (NUMBER, WHEN, WHO, WHERE, WHAT)
(   1,<2023-06-09 15:17:02.85 +0400>,<she>,<DPX200>,
      <created by zg, POWCHK disabled, PULCHK disabled
       configuration hash MD5:
       00 E9 B6 7A A2 85 ED C7 34 08 36 98 17 FE 4E 26
       data hash MD5: 16K
       71 1F B6 97 50 97 6F 0A 76 C7 41 51 D6 97 B0 F8>)
(   2,<2023-06-09 15:17:05.79 +0400>,<she>,<DPX200>,
      <Start of raw data processing
       efp BC_mod = 2 LB = 0.24 FT_mod = 6 PKNL = 1 PHC0 = -20625.01 PHC1 = 10.45272 SI = 16K 
       data hash MD5: 16K
       F0 E5 D2 67 17 54 BA 14 18 50 DA B6 2E F1 8A B7>)
(   3,<2023-06-09 15:17:22.73 +0400>,<she>,<DPX200>,
      <pk PHC0 = -1.23781 PHC1 = 2.6 
       data hash MD5: 16K
       3E FC CB 43 7E 8E 0F D1 44 36 5E 79 15 71 BE 70>)
(   4,<2023-06-09 15:17:25.93 +0400>,<she>,<DPX200>,
      <abs ABSG = 5 
       data hash MD5: 16K
       F7 98 04 E8 05 6B 52 47 08 A1 2D C8 56 3B 9A 22>)
$$ ##END=
$$ 
$$ hash MD5
$$ 73 47 FE 3C D6 A5 D6 0E FB 62 73 82 7C 52 22 F4
##$RELAX= 
##$RELAX= 
##$RELAX= 
##$RELAX= 
##$RELAX= 
##$RELAX= 
$$ Bruker specific parameters
$$ --------------------------
##$DU= <F:/spectra>
##$EXPNO= 1
##$NAME= <H-F>
##$PROCNO= 1
##$TYPE= <nmr>
##$USER= <she>
##$AMP= (0..31)
100 100 100 100 100 100 100 100 100 100 100 100 100 100 100 100 100 100 
100 100 100 100 100 100 100 100 100 100 100 100 100 100 
##$AQSEQ= 0
##$AQ_mod= 1
##$AUNM= <au_zg>
##$AUTOPOS= <>
##$BF1= 200.13
##$BF2= 200.13
##$BF3= 200.13
##$BF4= 200.13
##$BF5= 200.13
##$BF6= 200.13
##$BF7= 200.13
##$BF8= 200.13
##$BYTORDA= 1
##$CFDGTYP= 0
##$CFRGTYP= 5
##$CHEMSTR= <none>
##$CNST= (0..31)
1 1 145 1 1 1 1 1 1 1 1 1 1 1 1 1 1 1 1 1 1 1 1 1 1 1 1 1 1 1 1 1 
##$CPDPRG= <>
##$CPDPRG1= <>
##$CPDPRG2= <>
##$CPDPRG3= <>
##$CPDPRG4= <mlev>
##$CPDPRG5= <mlev>
##$CPDPRG6= <mlev>
##$CPDPRG7= <mlev>
##$CPDPRG8= <mlev>
##$CPDPRGB= <>
##$CPDPRGT= <>
##$D= (0..31)
0 1.2 0 0 0 0 0 0 0 0.06 0 0.03 0 0 0 0 0.0002 0 0 0 0 0 0 0 0 0 0 0 0 
0 0 0 
##$DATE= 1686309422
##$DBL= (0..7)
120 120 120 120 120 120 120 120 
##$DBP= (0..7)
150 150 150 150 150 150 150 150 
##$DBP07= 0
##$DBPNAM0= <>
##$DBPNAM1= <>
##$DBPNAM2= <>
##$DBPNAM3= <>
##$DBPNAM4= <>
$$ [...]
##$SUBNAM3= <"">
##$SUBNAM4= <"">
##$SUBNAM5= <"">
##$SUBNAM6= <"">
##$SUBNAM7= <"">
##$SUBNAM8= <"">
##$SUBNAM9= <"">
##$SW= 18.05172834244
##$SWIBOX= (0..15)
0 0 2 0 0 0 0 0 0 0 0 0 0 0 0 0 
##$SW_h= 3612.71676300578
##$TD= 16384
##$TD0= 1
##$TE= 0
##$TE2= 300
##$TE3= 300
##$TEG= 300
##$TL= (0..7)
0 120 120 120 120 120 120 120 
##$TP= (0..7)
150 150 150 150 150 150 150 150 
##$TP07= 0
##$TPNAME0= <>
##$TPNAME1= <>
##$TPNAME2= <>
##$TPNAME3= <>
##$TPNAME4= <>
##$TPNAME5= <>
##$TPNAME6= <>
##$TPNAME7= <>
##$TPOAL= (0..7)
0.5 0.5 0.5 0.5 0.5 0.5 0.5 0.5 
##$TPOFFS= (0..7)
0 0 0 0 0 0 0 0 
##$TUNHIN= 0
##$TUNHOUT= 0
##$TUNXOUT= 0
##$USERA1= <user>
##$USERA2= <user>
##$USERA3= <user>
##$USERA4= <user>
##$USERA5= <user>
##$V9= 5
##$VALIST= <valist>
##$VCLIST= <CCCCCCCCCCCCCCC>
##$VD= 0
##$VDLIST= <DDDDDDDDDDDDDDD>
##$VPLIST= <PPPPPPPPPPPPPPP>
##$VTLIST= <TTTTTTTTTTTTTTT>
##$WBST= 1024
##$WBSW= 4
##$XGAIN= (0..3)
0 0 0 0 
##$XL= 0
##$YL= 0
##$YMAX_a= 216846
##$YMIN_a= -253962
##$ZGOPTNS= <>
##$ZL1= 120
##$ZL2= 120
##$ZL3= 120
##$ZL4= 120
##$ABSF1= 15.77664
##$ABSF2= -2.275209
##$ABSG= 5
##$ABSL= 3
##$ALPHA= 0
##$AQORDER= 0
##$ASSFAC= 0
##$ASSFACI= 0
##$ASSFACX= 0
##$ASSWID= 0
##$AUNMP= <proc_1d>
##$AZFE= 0.1
##$AZFW= 0.1
##$BCFW= 0
##$BC_mod= 2
##$BYTORDP= 0
##$COROFFS= 0
##$CY= -3
##$DATMOD= 1
##$DC= 0
##$DFILT= <>
##$DTYPP= 0
##$F1P= 0
##$F2P= 0
##$FCOR= 1
##$FTSIZE= 16384
##$FT_mod= 6
##$GAMMA= 0
##$GB= 0
##$INTBC= 1
##$INTSCL= 3.70164e-10
##$ISEN= 128
##$LB= 0.24
##$LEV0= 0
##$LPBIN= 0
##$MAXI= 10000
##$MC2= 0
##$MEAN= 0
##$ME_mod= 0
##$MI= 1.114404
##$NCOEF= 0
##$NC_proc= -7
##$NLEV= 6
##$NOISF1= 3.799351
##$NOISF2= 2.8
##$NSP= 0
##$NTH_PI= 0
##$NZP= 0
##$OFFSET= 15.74248
##$PC= 1
##$PHC0= -20626.25
##$PHC1= 13.05272
##$PH_mod= 1
##$PKNL= yes
##$PPARMOD= 0
##$PSCAL= 0
##$PSIGN= 0
##$REVERSE= no
##$SF= 200.130005815335
##$SI= 16384
##$SIGF1= 3
##$SIGF2= 2
##$SINO= 5.538805
##$SIOLD= 16384
##$SREGLST= <1H.CDCl3>
##$SSB= 0
##$STSI= 16384
##$STSR= 0
##$SW_p= 3612.71676300578
##$SYMM= 0
##$S_DEV= 0
##$TDeff= 16384
##$TDoff= 0
##$TI= <>
##$TILT= no
##$TM1= 0
##$TM2= 0
##$TOPLEV= 0
##$USERP1= <user>
##$USERP2= <user>
##$USERP3= <user>
##$USERP4= <user>
##$USERP5= <user>
##$WDW= 1
##$XDIM= 16384
##$YMAX_p= 342821025
##$YMIN_p= -658203
$$ End of Bruker specific parameters
$$ ---------------------------------
##NTUPLES= NMR SPECTRUM
##VAR_NAME=  FREQUENCY,     SPECTRUM/REAL,   SPECTRUM/IMAG
##SYMBOL=    X,             R,               I
##VAR_TYPE=  INDEPENDENT,   DEPENDENT,       DEPENDENT
##VAR_FORM=  AFFN,          ASDF,            ASDF
##VAR_DIM=   16384,         16384,           16384
##UNITS=     HZ,            ARBITRARY UNITS, ARBITRARY UNITS
##FACTOR=    0.220516191357247, 1,           1
##FIRST=     3150.54266958697, 0,            0
##LAST=      -462.174093418814, 0,           0
##MIN=       -462.174093418814, -658203,     0
##MAX=       3150.54266958697, 342821025,    0
$$ Real data points
##PAGE= N=1
##DATA TABLE= (X++(R..R)), XYDATA
$$ [...]
$$ plain form
6647 1308270 1567435 1653393 1695530 1676207 1640686 1437581 1542939 1837518 1744234 1764454 1823087
6636 1823087 1905636 1865585 1602757 1622990 1760723 1806701 1702238 1813811 1920162 1726421
6626 1726421 1520432 1584129 1703943 1905924 1512848 1609473 1793552 1783454 1809231 1879368
6616 1879368 1984402 2033662 1991293 2005900 1869264 1910232 1959537 2165873 2122002 2043198 2238238
6605 2238238 2284583 2230552 2369814 2378947 2320302 2422838 2345920 2635164 2564130 2475338 2372545
6594 2372545 2288522 2161509 2313757 2425316 2421425 2440163 2472500 2414479 2584763 2665324 2530010
6583 2530010 2659065 2869912 2724373 2729109 2931308 2933986 3029923 3014165 2968224 3005501 3217596
6572 3217596 3145834 3234337 3372070 3453446 3508508 3746084 3869130 3939902 3986268 3876913 3726126
$$ packed form
6647A308270K59165Q5958M2137j9323l5521k03105J05358K94579r3284K0220N8633
6636A823087Q2549m0051k62828K0233J37733M5978j04463J11573J06351j93741
6626A726421k05989O3697J19814K01981l93076R6625J84079j0098K5777P0137
6616A879368J05034M9260m2369J4607j36636M0968M9305K06336m3871p8804J95040
6605B238238M6345n4031J39262R133n8645J02536p6918K89244p1034q8792j02793
6594B372545q4023j27013J52248J11559l891J8738L2337n8021J70284Q0561j35314
6583B530010J29055K10847j45539M736K02199K678R5937j5758m5941L7277K12095
6572C217596p1762Q8503J37733Q1376N5062K37576J23046P0772M6366j09355j50787
$$ plain form
6561 3726126 3783876 3757171 3506521 3543399 3581064 3388836 3610940 3814822 3782235 3619462
6551 3619462 3713733 3865045 3730447 3625490 3683732 3794324 3985787 4032430 4030652 3956723 4275211
6540 4275211 4341696 4237737 4494751 4426814 4509307 4703090 4717324 4827030 4919344 4872789 4788266
6529 4788266 4819969 4926993 5102934 5297656 5156080 5238352 5571315 5782338 5712146 5726619
6519 5726619 5824686 6112204 6040866 5774466 6089292 6138653 6268993 6393553 6467065 6583023
6509 6583023 6439990 6544826 6575550 6691933 6883398 6876622 6877478 7075656 7379620 7467824 7374740
6498 7374740 7429506 7505780 7913879 7831662 7914094 8093867 8151066 8395542 8676267 8729056 8937227
6487 8937227 9037186 9151290 9302813 9463430 9589478 9775520 9921134 10100743 10167236 10430788
$$ packed form
6561C726126N7750k6705k50650L6878L7665j92228K22104K03882l2587j62773
6551C619462R4271J51312j34598j04957N8242J10592J91463M6643j778p3929L18488
6540D275211O6485j03959K57014o7937Q2493J93783J4234J09706R2314m6555q4523
6529D788266L1703J07024J75941J94722j41576Q2272L32963K11023p0192J4473
6519E726619R8067K87518p1338k66400L14826M9361J30340J24560P3512J15958
6509F583023j43033J04836L0724J16383J91465o776Q56J98178L03964Q8204r3084
6498G374740N4766P6274M08099q2217Q2432J79773N7199K44476K80725N2789K08171
6487H937227R9959J14104J51523J60617J26048J86042J45614J79609O6493K63552
$$ plain form
6477 10430788 10673495 10779830 11047800 11208784 11560027 11651860 11703578 11931878 12096975 12546269
6467 12546269 12768306 12871225 13138954 13347211 13722645 13733709 14134139 14576224 14848210 15051629
6457 15051629 15261792 15549526 15888957 16232304 16391106 16791535 17251193 17721249 18180621
6448 18180621 18687231 19031303 19491923 19846283 20018340 20574662 21252342 21430164 21822547
6439 21822547 22407124 22712785 23579924 24251247 24630589 25132765 25748707 26259213 27101248
6430 27101248 27657463 28538489 29231880 29972401 30751325 31482723 32211696 33190039 33908044
6421 33908044 34810861 35744566 36950737 37875411 38730620 40089220 41236702 42422301 43570794
6412 43570794 45071413 46619477 47875111 49238313 50967876 52541760 54169956 56043198
$$ packed form
6477A0430788K42707J06335K67970J60984L51243R1833N1718K28300J65097M49294
6467A2546269K22037J02919K67729K08257L75434J1064M00430M42085K71986K03419
6457A5051629K10163K87734L39431L43347J58802M00429M59658M70056M59372
6448A8180621N06610L44072M60620L54360J72057N56322O77680J77822L92383
6439B1822547N84577L05661Q67139O71323L79342N02176O15942N10506Q42035
6430B7101248N56215Q81026O93391P40521P78924P31398P28973R78343P18005
6421C3908044R02817R33705J206171R24674Q55209J358600J147482J185599J148493
6412D3570794J500619J548064J255634J363202J729563J573884J628196J873242
$$ plain form
6404 56043198 57915615 60080254 62147904 64007929 65996451 68182399 70887261 73445353
6396 73445353 75865956 78437947 81387191 84236268 87372277 90474511 93718234 96935358
6388 96935358 100472780 103756826 107151819 110747934 114165981 117685898 120976182 123974177
6380 123974177 126830337 129841541 132527918 134702750 136307459 137264971 138193681 138850706
6372 138850706 138737510 137785222 136597864 135024293 132629895 129963983 127234822 123957567
6364 123957567 120321707 116696405 113077213 109626249 105637810 101827939 98254270 94567954
6356 94567954 90979978 87390005 84158197 80823306 77750198 74755517 71982912 69112219
6348 69112219 66569756 64003453 61593550 59264151 56870895 54948990 53015817 50963725
$$ packed form
6404E6043198J872417K164639K067650J860025J988522K185948K704862K558092
6396G3445353K420603K571991K949244K849077L136009L102234L243723L217124
6388I6935358L537422L284046L394993L596115L418047L519917L290284K997995
6380A23974177K856160L011204K686377K174832J604709R57512R28710O57025
6372A38850706j13196r52288j187358j573571k394398k665912k729161l277255
6364A23957567l635860l625302l619192l450964l988439l809871l573669l686316
6356I4567954l587976l589973l231808l334891l073108k994681k772605k870693
6348F9112219k542463k566303k409903k329399k393256j921905j933173k052092
$$ plain form
6340 50963725 49086743 47443174 45895410 44480745 42899840 41540121 40127414 38634521
6332 38634521 37379107 36232765 35198107 34099435 33180098 32156693 30872803 29943591
6324 29943591 29140523 28562552 27789700 27097224 26432103 25596846 24797306 24277855 23588933
6315 23588933 22782660 22116184 21684255 21104447 20660775 20163790 19676455 19202851 18832672
6306 18832672 18177606 17697654 17536921 17079280 16656799 16302021 15957315 15651432 15516759
6297 15516759 15087527 14721299 14524516 14121476 13557571 13428728 13090044 12680261 12446026
6288 12446026 12265250 12004694 11853938 11639773 11315141 11103920 10751348 10825060 10509906 10290075
6278 10290075 9991713 9712115 9880262 9926880 9639298 9539037 9322993 9043058 8959024 8948770
$$ packed form
6340E0963725j876982j643569j547764j414665j580905j359719j412707j492893
6332C8634521j255414j146342j034658j098672r19337j023405j283890r29212
6324B9943591q03068n77971p72852o92476o65121q35257p99540n19451o88922
6315B3588933q06273o66476m31929n79808m43672m96985m87335m73604l70179
6306A8832672o55066m79952j60733m57641m22481l54778l44706l05883j34673
6297A5516759m29232l66228j96783m03040n63905j28843l38684m09783k34235
6288A2446026j80776k60556j50756k14165l24632k11221l52572P3712l15154k19831
6278A0290075k98362k79598J68147M6618k87582j00261k16044k79935q4034j0254
$$ plain form
6268 8948770 8666762 8436268 8292133 8228121 8179156 7958463 7935361 7843785 7622437 7438947
6258 7438947 7570733 7481485 7159632 7084844 7161412 6905585 6793746 6815756 6745383 6631595
6248 6631595 6635205 6768714 6806260 6636048 6314266 6319960 6303149 6227657 6089831 6082836 6188033
6237 6188033 6299922 6134770 5838227 5961303 5850516 5874629 5830486 5845458 5695037 5725616
6227 5725616 5780537 5672201 5476891 5528453 5444664 5322887 5328561 5224194 5279386 5272480 5120706
6216 5120706 5067194 4985714 5017614 4849432 4797529 4795610 4922406 4894312 4912552 4783155 4870643
6205 4870643 4945817 5024380 5112073 5075359 5090625 5131069 5300335 5291218 5478708 5289091 5197109
6194 5197109 5059776 5172562 5169690 5274972 5114600 4937881 5020250 4967861 4723654 4684704
$$ packed form
6268H948770k82008k30494j44135o4012m8965k20693k3102r1576k21348j83490
6258G438947J31786q9248l21853p4788P6568k55827j11839K2010p0373j13788
6248F631595L610J33509L7546j70212l21782N694j6811p5492j37826o995J05197
6237F188033J11889j65152k96543J23076j10787K4113m4143J4972j50421L0579
6227E725616N4921j08336j95310N1562q3789j21777N674j04367N5192o906j51774
6216E120706n3512q1480L1900j68182n1903j919J26796k8094J8240j29397Q7488
6205D870643P5174P8563Q7693l6714J5266M0444J69266r117J87490j89617r1982
6194E197109j37333J12786k872J05282j60372j76719Q2369n2389k44207l8950
$$ plain form
6184 4684704 4799119 4872949 4965824 4789889 4765107 4762861 4430255 4326659 4493317 4547587 4133742
6173 4133742 3717828 3561889 3596643 3598448 3506438 3635140 3653628 3453002 3441183 3347177 3506655
6162 3506655 3619547 3544755 3527118 3416399 3277915 3235188 3308763 3248758 3234297 3292771 3079439
6151 3079439 3144113 3265386 3016761 3068927 3050978 3034048 2897860 2838758 2924037 3188597 3325836
6140 3325836 3183276 2967485 2811972 2950990 2889044 2811441 2894482 2942267 3040447 3099206 3250890
6129 3250890 3530662 3706245 3674661 3818301 3954050 3732829 3795904 3775465 3945635 3928010
6119 3928010 3753590 3660624 3766780 3780830 3639995 3631593 3429092 3341074 3347620 3344049 3257411
6108 3257411 3150213 2940757 2953466 2909462 2741160 2627328 2608622 2509449 2317501 2432038
$$ packed form
6184D684704J14415P3830R2875j75935k4782k246l32606j03596J66658N4270m13845
6173D133742m15914j55939L4754J805r2010J28702J8488k00626j1819r4006J59478
6162C506655J12892p4792j7637j10719j38484m2727P3575o0005j4461N8474k13332
6151C079439O4674J21273k48625N2166j7949j6930j36188n9102Q5279K64560J37239
6140C325836j42560k15791j55513J39018o1946p7603Q3041M7785R8180N8759J51684
6129C250890K79772J75583l1584J43640J35749k21221O3075k0439J70170j7625
6119C928010j74420r2966J06156J4050j40835q402k02501q8018O546l571q6638
6108C257411j07198k09456J2709m4004j68302j13832j8706r9173j91948J14537
$$ plain form
6098 2432038 2505840 2455890 2413314 2489219 2629143 2271373 2196953 2303198 2295417 2436992 2638488
6087 2638488 2711880 2532588 2405877 2285537 2260184 2123987 2155618 2158146 1984400 2129666
6077 2129666 2260060 2249320 2084467 2007798 2111692 2171429 2219079 2158799 2063476 2311109 2303667
6066 2303667 2327610 2186988 2062840 2011890 2140798 2141657 2050130 2090398 1953557 1811960 1865380
6055 1865380 1951766 2103531 2034192 2179198 2161241 2141684 1979380 1807217 1887520 1924678 2106079
6044 2106079 2156396 2400332 2434168 2280742 2296107 2443087 2618416 2731473 2609834 2589573
6034 2589573 2429786 2380292 2389497 2270705 2319425 2414548 2249690 2211464 2156551 1961757 1867835
6023 1867835 2014723 2116493 2113913 1998268 1962979 1833462 2060579 2078675 1897058 1865188
$$ packed form
6098B432038P3802m9950m2576P5905J39924l57770p4420J06245p781J41575K01496
6087B638488P3392j79292j26711j20340k5353j36197L1631K528j73746J45266
6077B129666J30394j0740j64853p6669J03894N9737M7650o0280r5323K47633p442
6066B303667K3943j40622j24148n0950J28908Q59r1527M0268j36841j41597N3420
6055A865380Q6386J51765o9339J45006j7957j9557j62304j72163Q0303L7158J81401
6044B106079N0317K43936L3836j53426J5365J46980J75329J13057j21639k0261
6034B589573j59787m9494R205j18792M8720R5123j64858l8226n4913j94794r3922
6023A867835J46888J01770k580j15645l5289j29517K27117J8096j81617l1870
$$ plain form
6013 1865188 1864910 1728354 1818924 1890081 2013811 1856557 1787194 1758445 1872119 1799747 1886854
6002 1886854 1816644 1730018 1834094 1566037 1697366 1729778 1680237 1548095 1599290 1858322
5992 1858322 1731076 1693097 1886156 1880855 1729644 1488847 1562556 1647920 1787750 1692295 1854432
5981 1854432 2086765 1995553 2131826 2088951 2108765 2087989 2045464 2212360 2291373 2414184 2320294
5970 2320294 2431939 2223724 2337119 2453613 2748918 3054198 3055129 3079168 3099135 3145224 3109584
5959 3109584 2911358 3316316 3287129 3058367 3062361 3151942 3248726 3318592 3494517 3581289 3443238
5948 3443238 3162875 3271017 3363336 3532651 3546204 3432646 3562580 3594153 3815529 3901587
5938 3901587 3433118 3302730 3307083 3009400 2869668 2718538 2576762 2613564 2461621 2519951
$$ packed form
6013A865188k78j36556R0570P1157J23730j57254o9363k8749J13674p2372Q7107
6002A886854p0210q6626J04076k68057J31329L2412m9541j32142N1195K59032
5992A858322j27246l7979J93059n301j51211k40797P3709Q5364J39830r5455J62137
5981A854432K32333r1212J36273m2875J9814k0776m2525J66896P9013J22811r3890
5970B320294J11645k08215J13395J16494K95305L05280R31K4039J9967M6089l5640
5959C109584j98226M04958k9187k28762L994Q9581R6784O9866J75925Q6772j38051
5948C443238k80363J08142R2319J69315J3553j13558J29934L1573K21376Q6058
5938C901587m68469j30388M353k97683j39732j51130j41776L6802j51943N8330
$$ plain form
5928 2519951 2653730 2464123 2575658 2596433 2279915 2457745 2558829 2684493 2753307 2693487
5918 2693487 2922102 3049570 2848592 2815909 2662171 2665783 2400738 2343720 2310259 2167208
5908 2167208 2271976 2208466 2046328 2008117 1968446 2015016 1741311 1852789 1833332 1851530 2132850
5897 2132850 2005137 1876632 1759525 1762461 1855250 1761636 1883851 1949356 1684363 1737310 1712556
5886 1712556 1870956 1837478 1894327 1804924 1881286 1842343 1807286 1814454 1532205 1602138 1515773
5875 1515773 1613040 1826749 1885838 1783948 1586563 1782061 1778038 1739560 1822690 1742397 1639617
5864 1639617 1612708 1682174 1805862 1732909 1609538 1795663 1796635 1595885 1470032 1508292 1636380
5853 1636380 1703744 1685655 1739405 1604383 1593563 1889862 2061370 1894632 1806430 1957568
$$ packed form
5928B519951J33779j89607J11535K0775l16518J77830J01084J25664O8814n9820
5918B693487K28615J27468k00978l2683j53738L612k65045n7018l3461j43051
5908B167208J04768o3510j62138l8211l9671M6570k73705J11478j9457J8198K81320
5897B132850j27713j28505j17107K936R2789r3614J22215O5505k64993N2947k4754
5886A712556J58400l3478N6849q9403P6362l8943l5057P168k82249O9933q6365
5875A515773R7267K13709N9089j01890j97385J95498m023l8478Q3130q0293j02780
5864A639617k6909O9466J23688p2953j23371J86125R72k00750j25853L8260J28088
5853A636380O7364j8089N3750j35022j0820K96299J71508j66738q8202J51138
$$ plain form
5843 1957568 2153805 2223764 2117237 2098708 2261592 2183418 2053036 1979047 1932055 1944843 1776440
5832 1776440 1765585 1912379 2089601 2095558 2083621 2292412 2152939 2308748 2549788 2337833
5822 2337833 2527947 2638747 2843198 2863014 2877024 2880259 3091578 3313524 3518004 3525021 3787809
5811 3787809 4111420 4113343 4139434 4275073 4360914 4470766 4486780 4410633 4527019 4544312 4655991
5800 4655991 4650289 4567875 4509300 4355402 4313580 4377512 4201890 4168420 4244081 4466950 4672737
5789 4672737 4561092 4630895 4669882 4553757 4494236 4334110 4213823 4163751 4217802 3971588
5779 3971588 3952893 3958517 3786499 3567080 3226836 3218797 3070590 2967340 2901127 2581094 2508117
5768 2508117 2394343 2581770 2451221 2312858 2235588 2248472 2379412 2128344 2280615 2259455
$$ packed form
5843A957568J96237O9959j06527j8529J62884p8174j30382p3989m6992J2788j68403
5832A776440j0855J46794J77222N957j1937K08791j39473J55809K41040k11955
5822B337833J90114J10800K04451J9816J4010L235K11319K21946K04480P017K62788
5811C787809L23611J923K6091J35639Q5841J09852J6014p6147J16386J7293J11679
5800D655991n702q2414n8575j53898m1822O3932j75622l3470P5661K22869K05787
5789D672737j11645O9803L8987j16125n9521j60126j20287n0072N4051k46214
5779C971588j8695N624j72018k19419l40244q039j48207j03250o6213l20033p2977
5768B508117j13774J87427j30549j38363p7270J2884J30940k51068J52271k1160
$$ plain form
5758 2259455 1982448 1983447 2085206 2024859 1820420 1917799 2053199 1870542 1883755 1938189 2123695
5747 2123695 2050381 2065989 2194988 1874698 2009780 2087273 1776257 1717511 1944268 1966368
5737 1966368 2185363 2356094 2322542 2205849 2047292 2373778 2418302 2338694 2536174 2681235
5727 2681235 2590716 2652969 2686329 2910933 2902771 2820977 2809747 2572178 2637818 2886116 2675686
5716 2675686 2436435 2478361 2355815 2417192 2499351 2510562 2613887 2840584 2790436 2954721
5706 2954721 2895148 2845102 2912481 2954846 2988045 2840824 2620517 2747610 2747759 2786110 2950163
5695 2950163 2771856 2670823 2546321 2599328 2567888 2728517 3022795 2809033 2628464 2756261
5685 2756261 2520365 2519368 2659797 2780190 2672068 2532640 2543894 2465576 2551710 2370372 2512496
$$ packed form
5758B259455k77007R99J01759o0347k04439R7379J35400j82657J3213N4434J85506
5747B123695p3314J5608J28999l20290J35082P7493l11016n8746K26757K2100
5737A966368K18995J70731l3552j16693j58557L26486M4524p9608J97480J45061
5727B681235r0519O2253L3360K24604q162q1794j1230k37569O5640K48298k10430
5716B675686k39251M1926j22546O1377Q2159J1211J03325K26697n0148J64285
5706B954721n9573n0046O7379M2365L3199j47221k20307J27093J49L8351J64053
5695B950163j78307j01033j24502N3007l1440J60629K94278k13762j80569J27797
5685B756261k35896r97J40429J20393j08122j39428J1254p8318Q6134j81338J42124
$$ plain form
5674 2512496 2473515 2455245 2743113 2711159 2559133 2484085 2391455 2286617 2531762 2554159 2593720
5663 2593720 2508094 2272218 2198925 2199911 2432699 2186856 2282744 2516044 2327686 2479892 2467059
5652 2467059 2536943 2306312 2263318 2245608 1951626 2049304 2192822 2387471 2173030 2009678
5642 2009678 2096541 2189858 2210474 2003268 1989209 2009085 2009453 1844752 1909915 1820718 1533513
5631 1533513 1563175 1459623 1471508 1628019 1661249 1679803 1852048 1922732 1960259 1775813 1750545
5620 1750545 1871165 1897828 1808950 1787952 2097987 2076492 1950203 2110387 2141768 2180291 2234086
5609 2234086 1858455 1849690 1912481 1928992 1917193 1855120 1803618 1617518 1789032 1806175 1619139
5598 1619139 1600340 1708259 2113962 2341183 2200212 1986742 1959075 2110472 2214705 2011307
$$ packed form
5674B512496l8981j8270K87868l1954j52026p5048r2630j04838K45145K2397L9561
5663B593720q5626k35876p3293R86K32788k45843R5888K33300j88358J52206j2833
5652B467059O9884k30631m2994j7710k93982R7678J43518J94649k14441j63352
5642B009678Q6863R3317K0616k07206j4059J9876L68j64701O5163q9197k87205
5631A533513K9662j03552J1885J56511L3230J8554J72245P0684L7527j84446k5268
5620A750545J20620K6663q8878k0998L10035k1495j26289J60184L1381L8523N3795
5609B234086l75631q765O2791J6511j1799o2073n1502j86100J71514J7143j87036
5598A619139j8799J07919M05703K27221j40971k13470k7667J51397J04233k03398
$$ plain form
5588 2011307 1825956 1907204 2037684 1902824 1725507 1727859 1518279 1409635 1534806 1501979
5578 1501979 1585620 1702706 1497460 1553134 1619480 1410929 1495176 1606192 1754370 1841191
5568 1841191 1654985 1613417 1846924 1592907 1371776 1526733 1563755 1575382 1506656 1616904
5558 1616904 1553122 1562185 1644964 1559867 1623234 1862753 1555563 1381438 1624205 1843966 1728309
5547 1728309 1618169 1790482 1678589 1495400 1444538 1426940 1258057 1565639 1608787 1568037
5537 1568037 1598955 1791591 1844972 1651801 1641654 1553943 1577835 1612374 1540473 1426117 1452933
5526 1452933 1739190 1805083 1762787 1753535 1575739 1762947 1723647 1609532 1596950 1650463 1795732
5515 1795732 1794960 1815312 1825120 1794938 1823627 1866979 1998797 1771096 1889469 1883600 1868005 1777733
$$ packed form
5588B011307j85351Q1248J30480j34860j77317K352k09580j08644J25171l2827
5578A501979Q3641J17086k05246N5674O6346k08551Q4247J11016J48178Q6821
5568A841191j86206m1568K33507k54017k21131J54957L7022J1627o8726J10248
5558A616904o3782R063Q2779q5097O3367K39519l07190j74125K42767K19761j15657
5547A728309j10140J72313j11893j83189n0862j7598j68883L07582M3148m0750
5537A568037L0918J92636N3381j93171j0147q7711K3892L4539p1901j14356K6816
5526A452933K86257O5893m2296r252j77796J87208l9300j14115j2582N3513J45269
5515A795732p72K0352R808l0182K8689M3352J31818k27701J18373n869j5595r0272
$$ plain form
5503 1777733 1732359 1899170 1899441 1773990 1735419 1845499 1848072 1854563 1904916 2043278 2258015
5492 2258015 2177573 2183424 2277772 2132206 2065549 2217843 2435586 2583898 2530943 2526098 2835218
5481 2835218 2650766 2709474 2882091 2909768 2987748 2805139 2551016 2567026 2516046 2547856 2595520
5470 2595520 2443953 2649892 2658216 2644451 2589029 2553488 2578187 2681958 2782211 2708670 2836807
5459 2836807 2953312 3024973 3236205 3215315 3190240 3248690 3037854 2749033 2838979 3071235
5449 3071235 2858109 2992528 2926762 2829318 2895381 2881286 2839352 2780488 2920025 2876371 3041174
5438 3041174 3182570 3007344 3071327 2940867 2982545 2979164 3074591 3211849 3589976 3684469 3510664
5427 3510664 3654940 3648190 3859982 4010400 3977351 3790050 3868263 3965015 4078928 4089134 4044616
$$ packed form
5503A777733m5374J66811K71j25451l8571J10080K573O491N0353J38362K14737
5492B258015q0442N851R4348j45566o6657J52294K17743J48312n2955m845L09120
5481B835218j84452N8708J72617K7677P7980j82609k54123J6010n0980L1810M7664
5470B595520j51567K05939Q324j3765n5422l5541K4699J03771J00253p3541J28137
5459B836807J16505P1661K11232k0890k5075N8450k10836k88821Q9946K32256
5449C071235k13126J34419o5766r7444O6063j4095m1934n8864J39537m3654J64803
5438C041174J41396j75226O3983j30460M1678l381R5427J37258L78127R4493j73805
5427C510664J44276o750K11792J50418l3049j87301P8213R6752J13913J0206m4518
$$ plain form
5416 4044616 4048738 4131717 4266735 4435139 4553632 4595239 4724200 4737530 4943957 5009226 5393746
5405 5393746 5550837 5703564 5879255 6534983 6752621 7018903 7476142 7671610 7715198 7487019
5395 7487019 7376161 7073195 6801920 6542368 6684763 6950489 7072061 6906094 6954867 7005965
5385 7005965 7168339 7372764 7320131 7573044 7935377 8308356 8892400 9227932 9856226 10431074
5375 10431074 11352808 12134097 12270125 12029772 11572173 11282357 11234688 11258462 11223689 11437438
5365 11437438 11665580 12074040 12656204 13198226 13599031 14151337 14815638 15568196 16398799
5356 16398799 17339563 18703887 20304446 22043538 24084868 26409184 29354712 32989055
5348 32989055 37951875 44651483 52591361 59895783 63101369 61712347 58508801 56742278
$$ packed form
5416D044616M122Q2979J35018J68404J18493M1607J28961J3330K06427O5269L84520
5405E393746J57091J52727J75691O55728K17638K66282M57239J95468M3588k28179
5395G487019j10858l02966k71275k59552J42395K65726J21572j65967M8773N1098
5385G005965J62374K04425n2633K52913L62333L72979N84044L35532O28294N74848
5375A0431074R21734P81289J36028k40353m57599k89816m7669K3774l4773K13749
5365A1437438K28142M08460N82164N42022M00805N52306O64301P52558Q30603
5356A6398799R40764J364324J600559J739092K041330K324316K945528L634343
5348C2989055M962820O699608P939878P304422L205586j389022l203546j766523
$$ plain form
5340 56742278 57532731 59568168 60422550 58059010 52650799 46226863 40380534 35968173
5332 35968173 33186746 31876781 31196585 31704842 32767903 34083049 36336873 39732366
5324 39732366 44481854 51037812 59307039 66505400 68854563 66026230 60880937 57256410
5316 57256410 56674518 58553435 60541798 60071445 55886212 48559089 40365868 33180288
5308 33180288 27685298 23693959 20711480 18706399 17123462 15687535 14921951 13915426
5300 13915426 13144282 12591601 11928026 11317960 10666632 10133976 9795847 9383241 9224602
5291 9224602 9128194 8756805 8642903 8626444 8554902 8843218 8867566 8579365 8002055 7423965
5281 7423965 7096901 6700900 6524019 6308282 6124036 6125890 5904980 5639045 5445867 5559943
$$ packed form
5340E6742278P90453K035437Q54382k363540n408211o423936n846329m412361
5332C5968173k781427j309965o80196N08257J063061J315146K253824L395493
5324C9732366M749488O555958Q269227P198361K349163k828333n145293l624527
5316E7256410n81892J878917J988363m70353m185233p327123q193221p185580
5308C3180288n494990l991339k982479k005081j582937j435927p65584j006525
5300A3915426p71144n52681o63575o10066o51328n32656l38129m12606j58639
5291I224602r6408l71389j13902j6459p1542K88316K4348k88201n77310n78090
5281G423965l27064l96001j76881k15737j84246J854k20910k65935j93178J14076
$$ plain form
5271 5559943 5548999 5535059 5530587 5635495 5773199 5920131 5719131 5934996 5991304 6496943
5261 6496943 7074564 7133332 7001331 6640326 6016295 5232949 4678475 4317042 4138210 3926463
5251 3926463 3948530 3917057 3724331 3524904 3552991 3333738 3173618 3296907 3400058 3484251
5241 3484251 3272057 3172565 3284083 3177679 3225067 3252579 3068380 2904105 2896483 2807139 2733587
5230 2733587 2901674 2941713 2680925 2722394 2788110 2857834 2751034 2784159 2863206 2927230 2871922
5219 2871922 2852518 2816383 2658082 2718249 2754210 2485779 2544475 2865982 3016764 2739008
5209 2739008 2636312 2560681 2691968 2638118 2507910 2356747 2568870 2488028 2632134 2791976
5199 2791976 2666347 2915558 2987230 2819483 2840294 2981141 2604958 2733556 2835706 2932900
$$ packed form
5271E559943j0944j3940m472J04908J37704J46932k01000K15865N6308N05639
5261F496943N77621N8768j32001l61005o24031p83346n54474l61433j78832k11747
5251C926463K2067l1473j92726j99427K8087k19253j60120J23289J03151Q4193
5241C484251k12194r9492J11518j06404M7388K7512j84199j64275p622q9344p3552
5230B733587J68087M0039k60788M1469O5716O9724j06800L3125P9047O4024n5308
5219B871922j9404l6135j58301O0167L5961k68431N8696L21507J50782k77756
5209B739008j02696p5631J31287n3850j30208j51163K12123q0842J44106J59842
5199B791976j25629K49211P1672j67747K0811J40847l76183J28598J02150R7194
$$ plain form
5189 2932900 3010285 3205736 3306341 3250302 3107971 3179538 3256596 3430496 3627119 3545057
5179 3545057 3448250 3368403 3565348 3521887 3430859 3410554 3433187 3332626 3511322 3440240 3541444
5168 3541444 3692565 3654516 3950604 4070185 4133905 4025788 4239836 3926097 3841427 3737902
5158 3737902 3795250 3621556 3633082 3706668 3635175 3822707 3948505 4140186 4283490 4243052
5148 4243052 4418895 4396937 4366977 4409058 4167694 4066985 4115219 4017272 4039340 4161036 4165848
5137 4165848 4066766 4145790 4197570 4058872 4158468 4036582 4298577 4379690 4383331 4397650 4406501
5126 4406501 4565909 4575121 4635608 4514349 4578324 4863869 4746287 4685413 4804216 4843981 4958060
5115 4958060 5054855 4868579 4860464 4878153 4862213 4961131 4679710 4630732 4820330 4846562 4845277
$$ packed form
5189B932900P7385J95451J00605n6039j42331P1567P7058J73900J96623q2062
5179C545057r6807p9847J96945m3461r1028k0305K2633j00561J78696p1082J01204
5168C541444J51121l8049K96088J19581O3720j08117K14048l13739q4670j03525
5158C737902N7348j73694J1526P3586p1493J87532J25798J91681J43304m0438
5148D243052J75843k1958k9960M2081k41364j00709M8234r7947K2068J21696M812
5137D165848r9082P9024N1780j38698R9596j21886K61995Q1113L641J4319Q851
5126D406501J59408R212O0487j21259O3975K85545j17582o0874J18803L9765J14079
5115D958060R6795j86276q115J7689j5940R8918k81421m8978J89598K6232j285
$$ plain form
5104 4845277 4886477 5130012 5310516 5336564 5410023 5312796 5339589 5343606 5405218 5593602 5846943
5093 5846943 5962613 6004915 6116003 6106514 6295171 6502056 6595124 6446906 6643696 6837444
5083 6837444 6892918 7055025 7082284 7287863 7567599 7839479 8245695 8449395 8896870 9486542
5073 9486542 10299413 10829876 11948692 13092154 14334304 14991415 14769692 14053653 13346936
5064 13346936 13007629 13065498 13515932 14011073 15031748 16138722 17767899 18831315 18956611
5055 18956611 18491212 18191294 18812941 20346893 21625792 21987369 21475504 21287161 22021289
5046 22021289 23499012 25312592 26306856 26211940 25446906 25085114 25506492 25080676 24306519
5037 24306519 23707621 23506059 24340487 25905393 27230246 27050607 26037157 24979498 24943808
$$ packed form
5104D845277M1200K43535J80504K6048P3459r7227K6793M017O1612J88384K53341
5093E846943J15670M2302J11088r489J88657K06885R3068j48218J96790J93748
5083F837444N5474J62107K7259K05579K79736K71880M06216K03700M47475N89672
5073I486542Q12871N30463J118816J143462J242150O57111k21723p16039p06717
5064A3346936l39307N7869M50434M95141J020675J106974J629177J063416J25296
5055A8956611m65399k99918O21647J533952J278899L61577n11865j88343P34128
5046B2021289J477723J813580R94264r4916p65034l61792M21378m25816p74157
5037B4306519n98898k01562Q34428J564906J324853j79639j013450j057659l5690
$$ plain form
5028 24943808 25746665 26789262 26934073 25351845 23441713 22310375 21958923 22194176 22610927
5019 22610927 22967154 23382615 24360005 25423036 25543072 24288383 22059544 20115630 19023110
5010 19023110 18744555 18748466 18348338 17446275 16499998 16250525 16318513 16586596 16790908 16119299
5000 16119299 14973316 14168318 13363863 13100973 12934247 12902759 13176137 13941043 14720379
4991 14720379 14926369 14578546 13502543 12411756 11459648 10855630 10197156 9934685 9659216
4982 9659216 9493711 9052145 9008580 8941793 8852326 8522989 8582167 8409109 8200568 8176967
4972 8176967 8176730 8250604 7878890 7885960 7885641 7794034 7759306 7844996 7929915 7810885 7867782 8109437
4960 8109437 7880518 7837261 7853448 7684334 7734115 7847774 7887716 7804013 7920042 7996161 7903972
$$ packed form
5028B4943808Q02857J042597J44811j582228j910132j131338l51452K35253M16751
5019B2610927L56227M15461R77390J063031J20036j254689k228839j943914j092520
5010A9023110k78555L911m00128r02063r46277k49473O7988K68083K04312o71609
5000A6119299j145983q04998q04455k62890j66726l1488K73378P64906P79336
4991A4720379K05990l47823j076003j090787r52108o04018o58474k62471k75469
4982I659216j65505m41566m3565o6787q9467l29337N9178j73058k08541k3601
4972H176967k37P3874l71714P070l19r1607l4728Q5690Q4919j19030N6897K41655
4960H109437k28919m3257J6187j69114M9781J13659L9942q3703J16029P6119r2189
$$ plain form
4949 7903972 7747698 7893913 7883669 7939978 8308452 8345538 8241766 8332930 8574633 8719352
4939 8719352 8996253 8936075 8992597 9013108 9071946 9392490 9693515 9659629 10138606 10242201
4929 10242201 10203026 10412320 10646428 10663925 10755951 10939050 11326423 11578802 11673536 12162397
4919 12162397 12215589 12341292 12519623 12934681 13190242 13373986 13627529 13850827 14309538 14519226
4909 14519226 14786159 15258657 15669994 16084411 16554747 16835683 17431800 17824421 18016431
4900 18016431 18580543 19054828 19541684 20089666 20459231 21037558 21729322 22322906 22993782
4891 22993782 23475145 23968576 24810825 25578035 26476006 27494668 28500456 29508401 30797548
4882 30797548 32294244 33491970 34834359 36209589 37635658 39083815 40942865 42982655
$$ packed form
4949G903972j56274J46215j0244N6309L68474L7086j03772R1164K41703J44719
4939H719352K76901o0178N6522K0511N8838L20544L01025l3886M78977J03595
4929A0242201l9175K09294K34108J7497R2026J83099L87373K52379R4734M88861
4919A2162397N3192J25703J78331M15058K55561J83744K53543K23298M58711K09688
4909A4519226K66933M72498M11337M14417M70336K80936N96117L92621J92010
4900A8016431N64112M74285M86856N47982L69565N78327O91764N93584O70876
4891B2993782M81363M93431Q42249P67210Q97971J018662J005788J007945J289147
4882C0797548J496696J197726J342389J375230J426069J448157J859050K039790
$$ plain form
4874 42982655 45052836 47662739 50206435 53003099 56130992 59461425 63391719 67944095
4866 67944095 72721280 77662194 82664366 87251039 90999861 93600385 95604372 96948144
4858 96948144 98157887 99129805 100023065 101333167 102730331 103870707 104914378 105941006
4850 105941006 107137952 108564629 110396053 112733907 115592219 118551681 121745031 125249986
4842 125249986 129071394 133139197 137546391 142262511 147252033 152820187 158698502 164432140
4834 164432140 169900596 174356948 176950964 176826152 174368806 169909724 163589310 156917639
4826 156917639 150560917 145150997 140562943 136047594 131943331 127875501 124159368 121113673
4818 121113673 118568322 116875539 115682961 114502073 113177828 111828337 110349100 108393800
$$ packed form
4874D2982655K070181K609903K543696K796664L127893L330433L930294M552376
4866F7944095M777185M940914N002172M586673L748822K600524K003987J343772
4858I6948144J209743R71918Q93260J310102J397164J140376J043671J026628
4850A05941006J196946J426677J831424K337854K858312K959462L193350L504955
4842A25249986L821408M067803M407194M716120M989522N568154N878315N733638
4834A64432140N468456M456352K594016j24812k457346m459082o320414o671671
4826A56917639o356722n409920m588054m515349m104263m067830l716133l045695
4818A21113673k545351j692783j192578j180888j324245j349491j479237j955300
$$ plain form
4810 108393800 106231164 104209918 101492818 98295127 94633960 91138985 87610134 84209313
4802 84209313 80876887 77308206 73205474 68367362 63538543 58789756 54410805 50390221
4794 50390221 47097416 44154092 41500883 39361509 37584924 35792478 34303811 33156202
4786 33156202 31999103 30899040 30098602 28987639 28268480 27732948 26751339 25801373 25113036
4777 25113036 24342986 23312691 22714283 22203496 21608826 21098723 20790819 20367773 19907933
4768 19907933 19331308 18964825 18499943 18207762 17886423 17543921 17469408 17211027 17016435 16798810
4758 16798810 16637913 16540149 16336473 16357700 16329913 16206008 16189702 16286026 16413243 16538109
4748 16538109 16671567 16780440 16938890 17386937 17612411 18037688 18542332 19146435 20093056
$$ packed form
4810A08393800k162636k021246k717100l197691l661167l494975l528851l400821
4802H4209313l332426l568681m102732m838112m828819m748787m378951m020584
4794E0390221l292805k943324k653209k139374j776585j792446j488667j147609
4786C3156202j157099j100063q00438j110963p19159n35532r81609r49966o88337
4777B5113036p70050j030295n98408n10787n94670n10103l07904m23046m59840
4768A9907933n76625l66483m64882k92181l21339l42502p4513k58381j94592k17625
4758A6798810j60897r7764k03676K1227k7787j23905j6306R6324J27217J24866
4748A6538109J33458J08873J58450M48047K25474M25277N04644O04103R46621
$$ plain form
4739 20093056 21068057 22453382 24809070 27493050 30849574 33919359 35408082 34213420
4731 34213420 31406767 28351036 25610430 23873454 22953461 22467143 22405482 22737695 23503660
4722 23503660 24388955 25600360 27619020 30560533 34231627 38348465 41921251 44748435
4714 44748435 46886855 47977731 48120440 46498111 42734114 37586539 32368419 28273799
4706 28273799 25610354 23685424 22688103 22096525 22063540 22088874 22849758 24169061 25699015
4697 25699015 28185016 31539097 34626866 36279030 36011289 33641446 29800491 26342678
4689 26342678 23734590 22109906 20864449 19454992 18098637 17045459 16078835 15544531
4681 15544531 15297829 14994014 14591976 14669431 14586284 14632042 14750939 15054374 15432310 15573621
$$ packed form
4739B0093056R75001J385325K355688K683980L356524L069785J488723j194662
4731C4213420k806653l055731k740606j736976r19993m86318o1661L32213P65965
4722B3503660Q85295J211405K018660K941513L671094M116838L572786K827184
4714D4748435K138420J090876J42709j622329l763997n147575n218120m094620
4706B8273799k663445j924930r97321n91578l2985K5334P60884J319303J529954
4697B5699015K486001L354081L087769J652164k67741k369843l840955l457813
4689B6342678k608088j624684j245457j409457j356355j053178r66624n34304
4681A5544531k46702l03815m02038P7455q3147M5758J18897L03435L77936J41311
$$ plain form
4671 15573621 15425202 14920030 14263363 13653966 13123558 12641446 12363553 12271181 11948388 11699527
4661 11699527 11883723 12066192 12018679 11969002 12209212 12213174 11995641 12047580 12144226 12189056 11946995
4650 11946995 11715116 11581210 11288460 10778950 10412458 10075414 9829326 10027613 10130434
4641 10130434 10261385 10154054 9885037 9963116 10127836 9914078 10114026 10101352 9996751 10129230
4631 10129230 10108486 9995758 9754907 9646801 9572377 9271603 8850155 8496360 8429055 8220348
4621 8220348 8364571 8362201 8406819 8412194 8243790 8255220 8244105 8193579 8129220 8322669 8582959
4610 8582959 8680664 8820205 8833164 8762897 8733757 8707926 8709737 8709765 8748980 8666862 8540416 8639960
4598 8639960 8817948 9025677 9052949 9369481 9258632 9275331 9311556 9567097 9690149 9640262
$$ packed form
4671A5573621j48419n05172o56667o09397n30408m82112k77893r2372l22793k48861
4661A1699527J84196J82469m7513m9677K40210L962k17533N1939R6646M4830k42061
4650A1946995k31879j33906k92750n09510l66492l37044k46088J98287J02821
4641A0130434J30951j07331k69017P8079J64720k13758J99948j2674j04601J32479
4631A0129230k0744j12728k40851j08106p4424l00774m21448l53795o7305k08707
4621H220348J44223k370M4618N375j68404J1430j1115n0526o4359J93449K60290
4610H582959R7705J39541J2959p0267k9140k5831J811K8L9215q2118j26446R9544
4598H639960J77988K07729K7272L16532j10849J6699L6225K55541J23052m9887
$$ plain form
4588 9640262 9733365 9844882 10148781 10242202 10403424 10505280 10564348 10745102 11046265 11126701
4578 11126701 11171923 11307542 11682034 11924628 12150433 12127522 12146869 12475156 12710125 12726763
4568 12726763 12965570 13157998 13248329 13607391 13888707 14218202 14645907 15085677 15409918 15597664
4558 15597664 16079859 16320752 16828348 17518187 18036806 18818766 20079086 21420226 22902111
4549 22902111 24177721 25765706 28001005 30758495 34429716 39027600 43271579 44951988
4541 44951988 43737168 40547356 37422640 35413237 34704465 34853499 36422892 39066129
4533 39066129 42794589 46662741 48553685 47360270 44203311 40743664 38302591 37269648
4525 37269648 37318184 38333703 40762519 43801787 46047103 46456319 44541468 41639348 38915367
$$ packed form
4588I640262R3103J11517L03899R3421J61222J01856N9068J80754L01163Q0436
4578A1126701M5222J35619L74492K42594K25805k2911J9347L28287K34969J6638
4568A2726763K38807J92428R0331L59062K81316L29495M27705M39770L24241J87746
4558A5597664M82195K40893N07596O89839N18619P81960J260320J341140J481885
4549B2902111J275610J587985K235299K757490L671221M597884M243979J680409
4541D4951988j214820l189812l124716k009403p08772J49034J569393K643237
4533C9066129L728460L868152J890944j193415l156959l459647k441073j032943
4525C7269648M8536J015519K428816L039268K245316M09216j914851k902120k723981
$$ plain form
4516 38915367 37328545 36830023 36877737 37802035 39973090 43059143 45735151 46462262 44545008
4507 44545008 41385901 38482885 35964929 34476059 33581379 32986739 32740955 32788537 33050389
4498 33050389 32997838 33266710 33637354 33878126 34095322 34574216 35054514 35462925 36132975 36773781
4488 36773781 37669488 38297259 39153591 40282815 41401948 42553875 43757643 45057544 46443221
4479 46443221 47606581 49349948 51417689 53776035 56732492 59591686 62583278 66106148
4471 66106148 70080039 74108444 78205376 82509775 86385998 89968856 92968417 95624402
4463 95624402 98122027 100077621 101880619 103552753 105094748 106908551 108852438 110621434
4455 110621434 112739097 115187605 117569649 119723823 121755151 124007580 126004643 128114913
$$ packed form
4516C8915367j586822m98522M7714R24298K171055L086053K676008P27111j917254
4507D4545008l159107k903016k517956j488870q94680n94640k45784M7582K61852
4498C3050389n2551K68872L70644K40772K17196M78894M80298M08411O70050O40806
4488C6773781Q95707O27771Q56332J129224J119133J151927J203768J299901J385677
4479D6443221J163360J743367K067741K358346K956457K859194K991592L522870
4471F6106148L973891M028405M096932M304399L876223L582858K999561K655985
4463I5624402K497625J955594J802998J672134J541995J813803J943887J768996
4455A10621434K117663K448508K382044K154174K031328K252429J997063K110270
$$ plain form
4447 128114913 130816495 134011590 137363545 141607472 146377560 151953367 158358327 165642648
4439 165642648 172464787 178153484 181905945 182413682 180164291 175623729 169185910 162229060
4431 162229060 155258366 148421924 141758920 135706508 130403301 125990013 122529924 119683540
4423 119683540 117225552 114673298 111983675 109128454 106959438 105243306 103844687 103132701
4415 103132701 102777378 102446559 102367405 101766127 101230762 100394051 99685682 98717542 97032042
4406 97032042 93942837 89489141 84032286 78085474 72278491 66777294 61926786 57464123
4398 57464123 53583744 50294864 47364635 44726428 42513631 40453956 38382698 36502562
4390 36502562 34783053 33220864 31562938 29856143 28448379 27205843 25804901 24615176
$$ packed form
4447A28114913K701582L195095L351955M243927M770088N575807O404960P284321
4439A65642648O822139N688697L752461N07737k249391m540562o437819o956850
4431A62229060o970694o836442o663004o052412n303207m413288l460089k846384
4423A19683540k457988k552254k689623k855221k169016j716132j398619p11986
4415A03132701l55323l30819p9154o01278n35365q36711p08369r68140j685500
4406I7032042l089205m453696n456855n946812n806983n501197m850508m462663
4398E7464123l880379l288880k930229k638207k212797k059675k071258j880136
4390C6502562j719509j562189j657926j706795j407764j242536j400942j189725
$$ plain form
4382 24615176 23720943 22673533 21924169 21461874 21183341 20701138 20158248 19474865 18619517
4373 18619517 18149281 17676057 17437004 16951756 16619707 16353348 16081854 15588530 15124643
4364 15124643 14546799 14175576 13934184 13836458 13727620 13737014 13608828 13372999 13206618 12938440
4354 12938440 12684264 12314781 12100939 11857354 11583000 11514477 11373027 11417364 11277606 10846967
4344 10846967 10771980 10506147 10425964 10332040 10155551 9860412 9860336 9948550 9896077 9700012 9349568
4333 9349568 9121679 8924351 8734252 8612221 8247701 8419958 8456251 8396265 8521493 8389903
4323 8389903 8194808 7756584 7571286 7342912 6969180 6936773 7117871 7221936 7107790 6901344
4313 6901344 6769121 6746001 6744500 6691906 6863848 6810948 6812646 6760019 6957632 6870878 7023743
$$ packed form
4382B4615176q94233j047410p49364m62295k78533m82203n42890o83383q55348
4373A8619517m70236m73224k39053m85248l32049k66359k71494m93324m63887
4364A5124643n77844l71223k41392r7726j08838R394j28186k35829j66381k68178
4354A2938440k54176l69483k13842k43585k74354o8523j41450M4337j39758m30639
4344A0846967p4987k65833q0183r3924j76489k95139p6Q8214n2473j96065l50444
4333I349568k27889j97328j90099j22031l64520J72257L6293n9986J25228j31590
4323H389903j95095m38224j85298k28374l73732l2407J81098J04065j14146k06446
4313F901344j32223k3120j501n2594J71942n2900J698n2627J97613q6754J52865
$$ plain form
4302 7023743 7300637 7231184 7357978 7372443 7188192 7146196 7059434 7210585 7308103 7138612
4292 7138612 6857326 6760190 6654989 6509472 6625828 6347473 6340346 6529863 6655563 6646546
4282 6646546 6359996 6337872 6534941 6358905 6617426 6759849 6720839 6818891 7079679 6895218
4272 6895218 6775411 6905888 6791845 6745599 6889465 6928742 6986420 6719026 6735591 6588192
4262 6588192 6568993 6598991 6564833 6344893 6262908 6213331 6177819 5921128 5718454 5746174 5671474
4251 5671474 5764354 5513260 5396514 5297235 5472234 5596254 5557152 5570664 5529864 5464741 5523327
4240 5523327 5265993 5246483 5363093 4906907 4861777 4981257 4995650 4879659 4610874 4615604
4230 4615604 4530521 4439345 4438675 4228398 4288016 4238831 4277262 4201639 4048726 4088577 4074481
$$ packed form
4302G023743K76894o9453J26794J4465j84251m1996q6762J51151R7518j69491
4292G138612k81286r7136j05201j45517J16356k78355p127J89517J25700r017
4282F646546k86550k2124J97069j76036K58521J42423l9010R8052K60788j84461
4272F895218j19807J30477j14043m6246J43866L9277N7678k67394J6565j47399
4262F588192j9199K9998l4158k19940q1985m9577l5512k56691k02674K7720p4700
4251E671474R2880k51094j16746r9279J74999J24020l9102J3512m0800o5123N8586
4240E523327k57334j9510J16610m56186m5130J19480J4393j15991k68785M730
4230D615604q5083r1176o70k10277N9618m9185L8431p5623j52913L9851j4096
$$ plain form
4219 4074481 3798531 3735739 3720158 3834562 3943259 3733243 3356583 3366439 3440261 3575424
4209 3575424 3631189 3332439 3472501 3685456 3756350 3923311 4055187 3906658 3805258 3947495
4199 3947495 3898901 4054660 4393440 4426468 4415432 4363401 4449135 4346836 4337041 4145052 4166680
4188 4166680 4091183 4138171 4257509 4445017 4298358 4148717 4159096 4260196 4200784 4150374
4178 4150374 4075654 4289766 4307063 4290513 4165117 4140837 4263965 4362617 4256468 4501929
4168 4501929 4823450 4952387 4777588 4663518 4947599 5245124 5307350 5341291 5569922 5473867
4158 5473867 5384453 5665650 5862733 6000865 5932598 5958966 5981598 5925604 5867526 5912184 6103888
4147 6103888 6063296 6153759 6402386 6672475 6542420 6641277 6714547 6880576 7267457 7460792
$$ packed form
4219D074481k75950o2792j5581J14404J08697k10016l76660R856P3822J35163
4209C575424N5765k98750J40062K12955P0894J66961J31876j48529j01400J42237
4199C947495m8594J55759L38780L3028j1036n2031Q5734j02299r795j91989K1628
4188D166680p5497M6988J19338J87508j46659j49641J0379J01100n9412n0410
4178D150374p4720K14112J7297j6550j25396k4280J23128R8652j06149K45461
4168D501929L21521J28937j74799j14070K84081K97525O2226L3941K28631r6055
4158E473867q9414K81197J97083J38132o8267K6368K2632n5994n8078M4658J91704
4147F103888m0592R0463K48627K70089j30055R8857P3270J66029L86881J93335
$$ plain form
4137 7460792 7649593 8268103 8710850 9121126 9804941 10621472 11086555 10931516 10005449 9181531
4127 9181531 8397847 7762503 7342852 7107804 6569775 6550056 6398234 6361469 6414943 6017998
4117 6017998 5750721 5597891 5530979 5683878 5955305 5660297 5781864 5697054 5597632 5385953
4107 5385953 5282358 5340248 5231493 5073121 4949164 4862845 5092701 5011610 4809365 4916889
4097 4916889 5031127 5001140 4701419 4496203 4761157 4835048 4826772 4842182 4709120 4654132 4320339
4086 4320339 4513995 4429378 4519476 4526205 4624018 4586506 4593555 4745093 4660392 4840771 4788221
4075 4788221 4592976 4679899 4623337 4363143 4347344 4518186 4610633 4517902 4474676 4542546 4726348
4064 4726348 4870973 5038658 5255812 5607462 5906396 5894858 6086819 6410366 6410888 5941841
$$ packed form
4137G460792J88801O18510M42747M10276O83815Q16531M65083j55039r26067q23918
4127I181531p83684o35344m19651k35048n38029j9719j51822l6765N3474l96945
4117F017998k67277j52830o6912J52899K71427k95008J21567q4810r9422k11679
4107E385953j03595N7890j08755j58372j23957q6319K29856q1091k02245J07524
4097D916889J14238k9987k99721k05216K64954P3891q276J5410j33062n4988l33793
4086D320339J93656q4617R0098O729R7813l7512P049J51538q4701J80379n2550
4075D788221j95245Q6923n6562k60194j5799J70842R2447r2731m3226O7870J83802
4064D726348J44625J67685K17154L51650K98934j1538J91961L23547N22m69047
$$ plain form
4054 5941841 5515851 5214397 5240656 5071708 4843437 4734489 4480564 4424220 4383110 4273896
4044 4273896 4429838 4608633 4518001 4628702 4467892 4419567 4369880 4662053 4633745 4758062
4034 4758062 4730078 4604072 4405322 4483013 4583340 4622732 4583814 4397241 4527564 4625478
4024 4625478 4908564 4959440 4799101 4886626 4945550 4946867 5039449 5168252 5491394 5509004 5427066
4013 5427066 5628810 5694809 5611938 5984897 5997552 5703915 5710605 6026157 6089089 6388582 6574732
4002 6574732 6684599 6713957 6785269 6763088 6862642 7064982 7002333 6891242 7005229 7026987 7197930
3991 7197930 7595271 7557364 7436852 7417589 7570293 7875003 7987855 8098355 8225599 8612558
3981 8612558 8572108 8739823 8832275 8911631 9099079 9076130 9335230 9431617 9510360 9747868 10048030
$$ packed form
4054E941841m25990l01454K6259j68948k28271j08948k53925n6344m1110j09214
4044D273896J55942J78795r0632J10701j60810m8325m9687K92173k8308J24317
4034D758062k7984j26006j98750P7691J00327L9392l8918j86573J30323R7914
4024D625478K83086N0876j60339Q7525N8924J317R2582J28803L23142J7610q1938
4013E427066K01744O5999q2871L72959J2655k93637O690L15552O2932K99493J86150
4002F574732J09867K9358P1312k2181R9554K02340o2649j11091J13987K1758J70943
3991G197930L97341l7907j20512j9263J52704L04710J12852J10500J27244L86959
3981H612558m0450J67715R2452P9356J87448k2949K59100R6387P8743K37508L00162
$$ plain form
3970 10048030 10111392 10392213 10509867 10676087 10972337 11290327 11582431 11561710 11513342 11581299
3960 11581299 11725684 12021642 12108018 12152152 12424515 12648612 12961997 13357642 13539276 13884067
3950 13884067 13894758 13888739 14178624 14413302 14758416 15218165 15540565 15884828 16090881 16765853
3940 16765853 17277503 17304874 17626415 18054379 18335038 18798040 19126513 19530738 19925941 20401846
3930 20401846 20984314 21408860 22014297 22642630 23439079 23895925 24496500 25396346 26171648
3921 26171648 26899174 27594681 28647720 29604830 30214133 31127158 32355934 33624324 35154997
3912 35154997 36380067 37805338 39011700 40412585 42338484 43729950 45215286 47347834
3904 47347834 49698670 52154773 54742667 57587983 60609849 63754000 67057435 70761948
$$ packed form
3970A0048030O3362K80821J17654J66220K96250L17990K92104k0721m8368O7957
3960A1581299J44385K95958Q6376M4134K72363K24097L13385L95645J81634L44791
3950A3884067J0691o019K89885K34678L45114M59749L22400L44263K06053O74972
3940A6765853N11650K7371L21541M27964K80659M63002L28473M04225L95203M75905
3930B0401846N82468M24546O05437O28333P96449M56846O00575Q99846P75302
3921B6171648P27526O95507J053039R57110O09303R13025J228776J268390J530673
3912C5154997J225070J425271J206362J400885J925899J391466J485336K132548
3904D7347834K350836K456103K587894K845316L021866L144151L303435L704513
$$ plain form
3896 70761948 74115142 78277104 84001406 91030963 101234691 115702552 132971696 144612985
3888 144612985 141370470 127051943 112096555 101512350 94794241 90267530 87776961 86915063
3880 86915063 87274315 88143424 89897611 91911770 94395741 97577232 101081426 105339682
3872 105339682 110300042 115838110 121900705 128294787 135607067 143418942 150869651 158010947
3864 158010947 164720096 170757774 175916141 180159733 183844173 186596903 188303939 190182081
3856 190182081 192734319 196753341 202592279 210390633 219933241 231646934 245555676 259990367
3848 259990367 271176528 275190610 272071140 265327593 258776823 254776659 253995800 256011399
3840 256011399 261312343 269569573 280411839 292892135 306477314 320288673 332826585
$$ packed form
3896G0761948L353194M161962N724302P029557J0203728J4467861J7269144J1641289
3888A44612985l242515j4318527j4955388j0584205o718109m526711k490569q61898
3880H6915063L59252Q69109J754187K014159K483971L181491L504194M258256
3872A05339682M960360N538068O062595O394082P312280P811875P450709P141296
3864A58010947O709149O037678N158367M243592L684440K752730J707036J878142
3856A90182081K552238M019022N838938P798354R542608J1713693J3908742J4434691
3848B59990367J1186161M014082l119470o743547o550770m000164p80859K015599
3840B56011399N300944Q257230J0842266J2480296J3585179J3811359J2537912
$$ plain form
3833 332826585 341084423 342821025 337598736 326048726 310470049 294053760 278540194
3826 278540194 265011797 253834728 245260669 239311836 235963935 234921313 236473350 240570505
3818 240570505 244846674 245412732 239482950 227801737 214066438 200868774 189852233 180530425
3810 180530425 172499670 166137410 161086133 157151621 154306955 152559339 151242896 149237850
3802 149237850 145498579 140077314 132550285 124163753 115921457 108396471 101664878 95628730
3794 95628730 89662262 83959552 78321554 73275540 69158003 65783041 62954458 60411293
3786 60411293 57926405 55700784 53910236 52482557 51297718 50405108 49460225 48684420 47972348
3777 47972348 47345576 46380740 45223952 43810917 42146963 41067361 40136515 39558769 38882956
$$ packed form
3833C32826585Q257838J736602n222289j1550010j5578677j6416289j5513566
3826B78540194j3528397j1177069q574059n948833l347901j042622J552037M097155
3818B40570505M276169N66058n929782j1681213j3735299j3197664j1016541r321808
3810A80530425q030755o362260n051277l934512k844666j747616j316443k005046
3802A49237850l739271n421265p527029q386532q242296p524986o731593o036148
3794I5628730n966468n702710n637998n046014m117537l374962k828583k543165
3786F0411293k484888k225621j790548j427679j184839q92610r44883p75805p12072
3777D7972348o26772r64836j156788j413035j663954j079602r30846n77746o75813
$$ plain form
3768 38882956 37810097 36426591 34853097 33266216 31783461 30672887 29692929 28788414
3760 28788414 28313599 27704062 27103470 26486029 25857895 25316496 24609826 23732238 22857352
3751 22857352 22236183 21772416 21331216 20814881 20480748 19937605 19482984 19181149 18744662
3742 18744662 18548317 18238319 17866153 17528628 17339035 17083590 16748174 16555675 16425012
3733 16425012 16252767 16113888 15981757 15755944 15453376 15342982 15395047 15384691 15348843 15053836
3723 15053836 15050676 15073400 14977078 14778668 14866455 15076522 14997517 15059773 15061229 14984356 14815292
3712 14815292 14809625 14757439 14569188 14471170 14536892 14415038 14186955 13924549 13841739 13957740
3702 13957740 14048567 13713293 13426946 13554995 13539105 13477138 13297328 13088304 12935520 12774928
$$ packed form
3768C8882956j072859j383506j573494j586881j482755j110574r79958r04515
3760B8788414m74815o09537o00592o17441o28134n41399p06670q77588q74886
3751B2857352o21169m63767m41200n16335l34133n43143m54621l01835m36487
3742A8744662j96345l09998l72166l37525j89593k55445l35416j92499j30663
3733A6425012j72245j38879j32131k25813l02568j10394N2065j0356l5848k95007
3723A5053836l160K2724r6322j98410Q7787K10067p9005O2256J456p6873j69064
3712A4815292n667n2186j88251r8018O5722j21854k28083k62406q2810J16001
3702A3957740R0827l35274k86347J28049j5890o1967j79810k09024j52784j60592
$$ plain form
3692 12774928 12799405 12884351 12876228 12785390 12582735 12248390 12177539 12309495 12212127 11894905 11703707
3681 11703707 11621649 11233913 11240523 11018348 10798302 10648952 10149230 10054284 9964227 9796639
3671 9796639 9767532 9701221 9322344 9262644 9260623 8978727 8896628 8973975 8989763 8971462 8754212
3660 8754212 8720902 8494743 8396645 8332902 8422089 8257929 8029697 8018570 7871490 7780616 7857482
3649 7857482 7872521 7882955 7815709 7833862 7646697 7365681 7528550 7276049 7260218 7375688
3639 7375688 7235217 7091508 7192847 6950039 7001009 6898066 6841938 6872234 6781846 6670760
3629 6670760 6958139 6960613 6713063 6795939 6936127 6865493 6798736 6695558 6594049 6469875
3619 6469875 6553333 6589965 6344803 6276556 6315603 6271082 6309409 6260301 6348438 6402349 6316392
$$ packed form
3692A2774928K4477Q4946q123r0838k02655l34345p0851J31956r7368l17222j91198
3681A1703707q2058l87736O610k22175k20046j49350m99722r4946r0057j67588
3671I796639k9107o6311l78877n9700k021k81896q2099P7347J5788j8301k17250
3660H754212l3310k26159r8098o3743Q9187j64160k28232j1127j47080r0874P6866
3649G857482J5039J0434o7246J8153j87165k81016J62869k52501j5831J15470
3639G375688j40471j43709J01339k42808N0970j02943n6128L0296r0388j11086
3629F670760K87379K474k47550Q2876J40188p0634o6757j03178j01509j24174
3619F469875Q3458L6632k45162o8247L9047m4521L8327m9108Q8137N3911q5957
$$ plain form
3608 6316392 6364828 6605482 6615906 6447074 6643815 6783101 6533778 6439863 6556341 6431628
3598 6431628 6519851 6497853 6361252 6498764 6372676 6234293 6313215 6377794 6208486 6331966
3588 6331966 6391492 6248445 6481732 6417338 6511403 6725857 6778310 6764570 6915445 7229315
3578 7229315 7183829 7026285 7029532 6948707 7083508 6951251 7001197 6837405 6657324 6660147 6556843
3567 6556843 6324934 6619915 6653648 6608991 6795027 6837467 6726568 6565041 6498735 6582510
3557 6582510 6605117 6690243 6640318 6828611 6557177 6474659 6313752 6141121 6380489 6285316
3547 6285316 6384684 6486558 6331202 6114326 6249954 6233317 6082127 6038637 5902639 5988568
3537 5988568 6107524 6000628 6087135 5927588 5838599 5651932 5548574 5599172 5475226 5510101
$$ packed form
3608F316392M8436K40654J0424j68832J96741J39286k49323r3915J16478j24713
3598F431628Q8223k1998j36601J37512j26088j38383P8922O4579j69308J23480
3588F331966N9526j43047K33287o4394R4065K14454N2453j3740J50875L13870
3578G229315m5486j57544L247q0825J34801j32257M9946j63792j80081K823j03304
3567F556843k31909K94981L3733m4657J86036M2440j10899j61527o6306Q3775
3557F582510K2607Q5126m9925J88293k71434q2518j60907j72631K39368r5173
3547F285316R9368J01874j55356k16876J35628j6637j51190m3490j35998Q5929
3537E988568J18956j06896Q6507j59547q8989j86667j03358N0598j23946L4875
$$ plain form
3527 5510101 5426302 5215839 5405580 5482928 5218005 5186465 5007611 4756029 4778282 4587420
3517 4587420 4486976 4374815 4384128 4312752 4409168 4497125 4410517 4114080 3840955 3841929 3954623
3506 3954623 3999920 4005817 3741805 3688402 3757952 3514947 3424516 3612192 3703316 3603819 3404167
3495 3404167 3401830 3427935 3282112 3310808 3192009 3132616 3129082 3139316 3326403 3393626 3215861
3484 3215861 2995346 2932740 3063702 2928160 2657160 2757344 3066313 3014956 2788446 2802659
3474 2802659 2670473 2702531 2834257 2603826 2724737 2693623 2753752 2808839 2893606 2692191
3464 2692191 2669003 2821927 2678456 2706511 2507236 2391031 2474377 2642991 2544038 2582765
3454 2582765 2454439 2215264 2229817 2308672 2303783 2390113 2346115 2278263 2085023 2148275 2233577
$$ packed form
3527E510101q3799k10463J89741P7348k64923l1540j78854k51582K2253j90862
3517D587420j00444j12161R313p1376R6416Q7957q6608k96437k73125R74J12694
3506C954623M5297N897k64012n3403O9550k43005r0431J87676R1124r9497j99652
3495C404167k337K6105j45823K8696j18799n9393l534J0234J87087O7223j77765
3484C215861k20515o2606J30962j35542k71000J00184L08969n1357k26510J4213
3474B802659j32186L2058J31726k30431J20911l1114O0129N5087Q4767k01415
3464B692191k3188J52924j43471K8055j99275j16205Q3346J68614r8953L8727
3454B582765j28326k39175J4553P8855m889Q6330m3998o7852j93240O3252Q5302
$$ plain form
3443 2233577 2247026 2279304 2138716 2135549 2016674 1921305 1784881 1814990 1708779 1701219 1788452
3432 1788452 1682963 1698758 1942824 1879618 1580767 1707757 1691222 1580853 1583237 1365755
3422 1365755 1335056 1468898 1457574 1421326 1434053 1637180 1423332 1436735 1509801 1458285 1401846
3411 1401846 1323738 1461635 1552282 1431615 1333047 1288837 1438279 1672461 1702098 1434551
3401 1434551 1650915 1606640 1247035 1241487 1290102 1290564 1203081 1333162 1307879 1331788 1400698
3390 1400698 1152256 1053366 1309920 1380676 1537970 1474585 1324363 1166476 999526 1112075
3380 1112075 1314645 1208685 1201677 1257754 1303671 1240672 1120292 1168215 1029732 1099585 1099817
3369 1099817 1116381 1076631 1042534 1254701 1198069 951244 1101477 1169302 886367 964103 1132442
$$ packed form
3443B233577J3449L2278j40588l167j18875r5369j36424L0109j06211p560Q7233
3432A788452j05489J5795K44066o3206k98851J26990j6535j10369K384k17482
3422A365755l0699J33842j1324l6248J2727K03127k13848J3403P3066n1516n6439
3411A401846p8108J37897R0647j20667r8568m4210J49442K34182K9637k67547
3401A434551K16364m4275l59605n548M8615M62q7483J30081k5283K3909O8910
3390A400698k48442r8890K56554P0756J57294o3385j50222j57887j66950J12549
3380A112075K02570j05960p008N6077M5917o2999j20380M7923j38483O9853K32
3369A099817J6564l9750l4097K12167n6632k46825J50233O7825k82935P7736J68339
$$ plain form
3358 1132442 1152533 1039339 1071650 1186109 1107230 1047582 1082774 963355 853860 692278
3348 692278 832949 830830 900426 915845 938094 895300 1010981 1012352 665040 844135 1006608
3337 1006608 960568 875565 823120 835157 641383 757630 953925 995885 1035001 890140 1015576
3326 1015576 1073219 926565 815778 832398 1025987 1213805 942245 936992 866950 876187 857589
3315 857589 671279 882869 1067226 1012321 665714 669995 606410 566851 674872 683690 790761
3304 790761 894407 1046175 921686 831660 616829 701682 882162 893984 872893 807424 778723
3293 778723 1000220 1148020 1072976 1108347 840044 855016 831570 914726 1121980 1021819 896407
3282 896407 851510 850318 781206 1012884 1026427 849877 884778 869872 1023151 906879 1072303
$$ packed form
3358A132442K0091j13194L2311J14459p8879n9648L5192j19419j09495j61582
3348F92278J40671k119O9596J5419K2249m2794J15681J371l47312J79095J62473
3337A006608m6040q5003n2445J2037j93774J16247J96295M1960L9116j44861J25436
3326A015576N7643j46654j10787J6620J93589J87818k71560n253p0042R237j8598
3315H57589j86310K11590J84357n4905l46607M281o3585l9559J08021Q818J07071
3304G90761J03646J51768j24489r0026k14831Q4853J80480J1822k1091o5469k8701
3293G78723K21497J47800p5044L5371k68303J4972k3446Q3156K07254j00161j25412
3282H96407m4897j192o9112K31678J3543j76550L4901j4906J53279j16272J65424
$$ plain form
3271 1072303 989026 976249 927693 1041332 1110539 927275 989138 1001220 900259 1020742 1156245
3260 1156245 1236897 1199693 1336271 1361697 1449907 1473563 1397292 1460378 1298760 1203300 1306209
3249 1306209 1198440 1246429 1377432 1419786 1488415 1587944 1588183 1645754 1718402 1617138 1792456
3238 1792456 2004616 2112479 2219313 2443583 2396717 2526150 2272013 2237791 2332288 2018987
3228 2018987 1807550 1658652 1701219 1751586 1713069 1587003 1453189 1471221 1282429 1405602
3218 1405602 1456281 1373077 1418960 1278832 1011311 997202 991753 1040042 787415 1022719 1156216
3207 1156216 1108054 1240325 1259240 1182891 1110778 891706 1086560 1235285 952296 831745
3197 831745 908248 775414 972269 916117 803550 806379 577567 664933 1051257 757704 623197
$$ packed form
3271A072303q3277j2777m8556J13639O9207j83264O1863J2082j00961J20483J35503
3260A156245Q0652l7204J36578K5426Q8210K3656p6271O3086j61618r5460J02909
3249A306209j07769M7989J31003M2354O8629R9529K39N7571P2648j01264J75318
3238A792456K12160J07863J06834K24270m6866J29433k54137l4222R4497l13301
3228B018987k11437j48898M2567N0367l8517j26066j33814J8032j88792J23173
3218A405602N0679q3204M5883j40128k67521j4109n449M8289k52627K35304J33497
3207A156216m8162J32271J8915p6349p2113k19072J94854J48725k82989j20551
3197H31745P6503j32834J96855n6152j12567K829k28812Q7366L86324k93553j34507
$$ plain form
3186 623197 667843 500907 634764 783536 753255 813333 533736 308665 450765 667223
3176 667223 548264 552792 467379 409463 391356 493974 531483 345120 442946 241404 396369
3165 396369 360293 263245 324752 264311 272244 313778 293341 279673 374532 620913 639360 569565
3153 569565 435360 388559 220432 130916 281822 427201 426889 461484 410095 445606 145442
3142 145442 349784 309781 200293 122917 262539 439205 611489 502822 452765 454573 549114
3131 549114 489828 397411 266425 219837 240951 242130 216351 225681 265942 313626 399792 214736
3119 214736 221431 224518 321790 293163 322105 387770 153725 348869 388423 283962 382535
3108 382535 315227 253684 148090 146286 158542 -7706 71382 239014 501920 628436 368215
$$ packed form
3186F23197M4646j66936J33857J48772l0281O0078k79597k25071J42100K16458
3176F67223j18959M528q5413n7916j8107J02618L7509j86363R7826k01542J54965
3165C96369l6076r7048O1507o0441P933M1534k0437j3668R4859K46381J8447o9795
3153E69565j34205m6801j68127q9516J50906J45379l12L4595n1389L5511l00164
3142A45442K04342m0003j09488p7376J39622J76666J72284j08667n0057J808R4541
3131E49114n9286r2417j30986m6588K1114J179k5779R330M0261M7684Q6166j85056
3119B14736O695L087R7272k8627K8942O5665k34045J95144L9554j04461R8573
3108C82535o7308o1543j05594j804J2256j66248P9088J67632K62906J26516k60221
$$ plain form
3097 368215 262899 198821 171017 227875 196015 319978 504051 383013 150442 63187 187389
3086 187389 251091 177821 399109 230656 144973 207072 349444 231420 260226 353345 280975
3075 280975 234581 115174 462732 513379 280596 259489 306260 178038 365061 278172 313982
3064 313982 283259 406279 344075 247974 423867 423722 359163 264510 506269 506692 277866 325789
3052 325789 171148 -42468 31058 99862 214160 212891 47799 145713 87053 139487 491199
3041 491199 488397 329940 334238 142886 213059 289559 335977 283206 116272 55657 59674 165387
3029 165387 208944 339471 361162 236339 206511 177312 305532 239387 44759 37295 -78473
3018 -78473 -99081 -39042 -99832 36026 37476 155383 286233 287930 158659 137653 152600
$$ packed form
3097C68215j05316o4078k7804N6858l1860J23963J84073j21038k32571q7255J24202
3086A87389O3702p3270K21288j68453q5683O2099J42372j18024K8806R3119p2370
3075B80975m6394j19407L47558N0647k32783k1107M6771j28222J87023q6889L5810
3064C13982l0723J23020o2204r6101J75893j45o4559r4653K41759M23k28826M7923
3052C25789j54641k13616P3526O8804J14298j269j65092R7914n8660N2434L51712
3041D91199k802j58457M298j91352P0173P6500M6418n2771j66934o0615M017J05713
3029A65387M3557J30527K1691j24823k9828k9199J28220o6145j94628p464j15768
3018g8473k0608O0039o0790J35858J450J17907J30850J697j29271k1006J4947
$$ plain form
3007 152600 297070 227420 179852 267816 234499 139734 181336 151992 10461 154897 313711
2996 313711 266466 135708 60203 109647 106680 -80206 -57974 143758 66132 25267 92922
2985 92922 285375 124647 7268 161651 112523 126964 205770 261761 376279 429161 341264
2974 341264 237842 -26601 -53458 200828 227253 329284 218769 171384 77701 86232 397618
2963 397618 308405 109887 181757 360992 248578 137802 189146 102999 12818 54576 68432
2952 68432 107446 83847 122253 164648 406368 281663 248474 263562 366420 364012 359949 60447
2940 60447 -26923 155598 166984 149647 105097 178607 305225 409218 393342 277294 190212
2929 190212 84160 38355 252603 300670 340287 337108 326928 266452 174921 356431 371633
$$ packed form
3007A52600J44470o9650m7568Q7964l3317r4765M1602k9344j41531J44436J58814
2996C13711m7245j30758p5505M9444k967j86886K2232K01732p7626m0865O7655
2985I2922J92453j60728j17379J54383m9128J4441P8806N5991J14518N2882q7897
2974C41264j03422k64443k6857K54286K6425J02031j10515m7385r3683Q531L11386
2963C97618q9213j98518P1870J79235j12414j10776N1344q6147r0181M1758J3856
2952F8432L9014k3599L8406M2395K41720j24705l3189J5088J02858k408m063k99502
2940F0447q7370J82521J1386j7337m4550P3510J26618J03993j5876j16048q7082
2929A90212j06052m5805K14248M8067L9617l179j0180o0476r1531J81510J5202
$$ plain form
2918 371633 338186 247054 303510 457787 419940 187236 224471 421279 458890 333499 422210
2907 422210 353769 164552 143366 250166 400074 367130 268128 154888 165118 305867 411364
2896 411364 240255 212034 303497 360171 459111 396700 277501 181195 127526 268028 370782
2885 370782 358472 442750 288170 370049 444794 273701 444254 523755 190680 119217 5078
2874 5078 50187 327894 459944 248409 329950 542722 500721 462348 231646 358998 612726
2863 612726 431234 431905 407215 147135 37140 108880 437485 384099 415364 458580 372888
2852 372888 318283 224773 246659 268716 322304 324267 494078 338561 272093 390951 52754
2841 52754 105972 91068 190513 238876 129344 20514 133397 450884 305266 171110 158961
$$ packed form
2918C71633l3447r1132N6456J54277l7847k32704L7235J96808L7611j25391Q8711
2907D22210o8441j89217k1186J06800J49908l2944r9002j13240J0230J40749J05497
2896D11364j71109k8221R1463N6674R8940o2411j19199r6306n3669J40502J02754
2885C70782j2310Q4278j54580Q1879P4745j71093J70553P9501l33075p1463j14139
2874E078M5109K77707J32050k11535Q1541K12772m2001l8373k30702J27352K53728
2863F12726j81492O71k4690k60080j09995P1740L28605n3386L1265M3216q5692
2852C72888n4605r3510K1886K2057N3588J963J69811j55517o6468J18858l38197
2841E2754N3218j4904R9445M8363j09532j08830J12883L17487j45618j34156j2149
$$ plain form
2830 158961 -79801 -176589 -156294 -99303 -76402 -71409 95503 136869 -6235 86598 172663
2819 172663 135601 170311 151036 -148363 -2692 221563 219700 25660 79408 264138 87573
2808 87573 198118 262223 -8022 -138199 -360420 -209098 173182 89967 -185378 -225593
2798 -225593 -109264 -37407 36140 39341 26926 87748 133468 209426 110661 166529 133208 -131420
2786 -131420 -212177 -5645 113223 -8191 -241442 -164151 -70889 95382 101962 65623 129971
2775 129971 179529 -1539 -154836 -11041 -27149 54538 128922 72349 -120178 -50417 -180662
2764 -180662 -192840 -274281 -62803 56256 51525 -17823 -22252 -2111 -85988 -123130 -103759 31231
2752 31231 208006 82745 -105830 -177359 6643 203226 -93564 -154423 -200797 -103845 -17754
$$ packed form
2830A58961k38762r6788K0295N6991K2901M993J66912M1366j43104R2833Q6065
2819A72663l7062L4710j9275k99399J45671K24255j863j94040N3748J84730j76565
2808H7573J10545O4105k70245j30177k22221J51322L82280q3215k75345m0215
2798b25593J16329P1857P3547L201j2415O0822M5720P5958r8765N5868l3321k64628
2786a31420q0757K06532J18868j21414k33251P7291R3262J66271O580l6339O4348
2775A29971M9558j81068j53297J43795j6108Q1687P4384n6573j92527O9761j30245
2764a80662j2178q1441K11478J19059m731o9348m429K0141q3877l7142J9371J34990
2752C1231J76775j25261j88575p1529J84002J96583k96790o0859m6374R6952Q6091
$$ plain form
2741 -17754 -145965 -127740 -81648 85802 28379 -255690 -317498 -359058 -152252 -11139 -89586
2730 -89586 -38496 -631 44102 -91598 -75641 -88649 221194 183810 230672 400755 191862
2719 191862 306211 87644 -28630 -82839 66954 -48742 -49744 63721 -7049 -153152
2709 -153152 -128557 -153727 -343893 -224919 -328579 -436351 -139541 -133065 21469 -103083
2699 -103083 -97938 151685 152500 140096 108839 -199435 -55411 142158 -78902 33139 -213147
2688 -213147 11479 -67826 -43762 -9363 -93499 -140536 -142511 25437 -52014 212619 216332
2677 216332 -86551 -137428 -342812 -462471 -337714 -284589 -378499 -390721 -67120 174319
2667 174319 57050 -42353 -84229 25179 88152 71365 -170369 -122253 45274 -121351 -80901
$$ packed form
2741a7754j28211J8225M6092J67450n7423k84069o1808m1560K06806J41113p8447
2730h9586N1090L7865M4733j35700J5957j3008L09843l7384M6862J70083k08893
2719A91862J14349k18567j16274n4209J49793j15696j002J13465p0770j46103
2709a53152K4595k5170j90166J18974j03660j07772K96810O476J54534j24552
2699a03083N145K49623Q15j2404l1257l08274J44024J97569k21060J12041k46286
2688b13147K24626p9305K4064L4399q4136m7037j975J67948p7451K64633L713
2677B16332l02883n0877k05384j19659J24757N3125r3910j2222L23601K41439
2667A74319j17269r9403m1876J09408O2973j6787k41734M8116J67527j66625M0450
$$ plain form
2656 -80901 130519 -189115 -37047 216578 -195535 -170434 -46231 -124072 -147676 -56142 216626
2645 216626 92089 -47434 -84909 -83093 270200 197467 131469 151367 48481 -47030 -125001
2634 -125001 -65040 66328 99399 -84472 -62443 -140737 -94516 -185461 -350275 -191199 -72428
2623 -72428 48115 88638 -20068 -182961 -189261 -63116 109155 39101 -14508 -177459 -216308
2612 -216308 -18334 -69524 -7140 -103167 -121782 -122429 -131826 -81980 -31877 25754 -7933 -44408
2600 -44408 42262 6807 -47468 -182808 -59740 61316 29148 137123 136940 176099 -17893
2589 -17893 45114 -627 -234652 -265271 -107932 -186942 184582 194470 -87824 27344 15245
2578 15245 -175284 -240785 -116350 140678 200007 -115846 -74362 88096 -94555 -94150 -28620
$$ packed form
2656h0901K11420l19634J52068K53625m12113K5101J24203p7841k3604R1534K72768
2645B16626j24537j39523l7475J816L53293p2733o5998J9898j02886r5511p7971
2634a25001N9961J31368L3071j83871K2029p8294M6221r0945j64814J59076J18771
2623g2428J20543M0523j08706j62893o300J26145J72271p0054n3609j62951l8849
2612b16308J97974n1190O2384r6027j8615o47r397M9846N0103N7631l3687l6475
2600d4408Q6670l5455n4275j35340J23068J21056l2168J07975j83L9159j93992
2589a7893O3007m5741k34025l0619J57339p9010L71524R888k82294J15168j2099
2578A5245j90529o5501J24435K57028N9329l15853M1484J62458j82651M05O5530
$$ plain form
2567 -28620 35274 73106 -118040 87420 228589 289808 312248 220587 48639 -194602 -91188
2556 -91188 -150947 -198436 -62228 -204234 -103136 159849 -118250 -196812 -86679 -77083 -182689
2545 -182689 -88963 -104347 -122856 -13280 101564 -38308 -21657 -149319 -286125 -304602 -133243
2534 -133243 -11598 582 36843 -72053 -136514 -194215 -281740 -41531 -83811 -64409 -2228
2523 -2228 -163580 -139174 -135567 -107670 -14034 -59420 -66715 -321937 -315065 -101821 -136691 40172
2511 40172 -31294 -66452 -116363 -243964 -287966 -198753 -131148 -10364 -46006 -80551 -289760
2500 -289760 -252888 -226220 16483 -36521 -47238 -123683 -279093 -374191 -196213 -105843 -70276
2489 -70276 -145678 -188311 -216525 -214067 -158626 -13187 98051 54719 56198 -85639 -100798 -250001
$$ packed form
2567b8620O3894L7832j91146K05460J41169O1219K2440r1661j71948k43241J03414
2556i1188n9759m7489J36208j42006J01098K62985k78099p8562J10133R596j05606
2545a82689R3726j5384j8509J09576J14844j39872J6651j27662j36806j8477J71359
2534a33243J21645J2180L6261j08896o4461n7701q7525K40209m2280J9402O2181
2523b228j61352K4406L607K7897R3636m5386p295k55222O872K13244l4870J76863
2511D0172p1466l5158m9911j27601m4002Q9213O7605J20784l5642l4545k09209
2500b89760L6872K6668K42703n3004j0717p6445j55410r5098J77978R0370L5567
2489g0276p5402m2633k8214K458N5441J45439J11238m3332J479j41837j5159j49203
$$ plain form
2477 -250001 -237464 -9781 -44926 -29012 -299406 -202227 102537 101865 88216 70818 99074
2466 99074 -90759 58688 2256 154679 221507 7494 -97253 -197384 -248543 -151124 -142183
2455 -142183 -195041 -145696 -171472 -198274 -105092 -2425 -49747 88617 86690 -333 90639
2444 90639 198762 108619 -5249 -46198 179938 188021 -64312 -87668 -155189 -174742 -53246
2433 -53246 40731 28785 -46541 -193529 -61281 -169497 52741 67808 -107055 12979 49374
2422 49374 -105953 -109615 -122812 -28473 125085 191660 198562 97232 92949 -189388 -87079
2411 -87079 141430 144307 -33487 14840 44305 31717 144174 95824 -160474 -166967 -54393
2400 -54393 -59800 -386720 -339291 -62100 81307 80702 -64533 -26197 81270 -76089 -61048
$$ packed form
2477b50001J2537K27683l5145J5914k70394R7179L04764o72j3649j7398K8256
2466I9074j89833J49447n6432J52423O6828k14013j04747j00131n1159R7419Q941
2455a42183n2858M9345k5776k6802R3182J02667m7322J38364j927q7023R0972
2444I0639J08123r0143j13868m0949K26136Q083k52333k3356o7521j9553J21496
2433e3246R3977j1946p5326j46988J32248j08216K22238J5067j74863J20034L6395
2422D9374j55327l662j3197R4339J53558O6575O902j01330m283k82337J02309
2411h7079K28509K877j77794M8327K9465j2588J12457m8350k56298o493J12574
2400e4393n407l26920M7429K77191J43407o05j45235L8336J07467j57359J5041
$$ plain form
2389 -61048 234186 161512 30200 -138689 -172946 -27960 12778 -88997 -84902 -135024 31940
2378 31940 127633 88825 184652 290610 64976 -224929 -58073 192556 261827 115355 -55471
2367 -55471 -30865 69695 199107 313382 423086 292843 46128 117891 76043 -122449
2357 -122449 185612 153766 -71 -69185 -60084 163184 3754 -177032 -100987 101245 -8345
2346 -8345 -153832 -64360 -18954 -190133 -79878 9763 35420 19210 99168 143515 192506
2335 192506 101870 -26069 128175 170553 228066 111991 148555 38054 96742 140328 2143
2324 2143 12304 144384 160679 244181 186819 -1964 75004 167025 126393 101175 310728
2313 310728 203404 -54967 177109 115434 -62741 -37409 -192263 -98578 -247143 -112166
$$ packed form
2389f1048K95234p2674j31312j68889l4257J44986M0738j01775M095n0122J66964
2378C1940R5693l8808R5827J05958k25634k89905J66856K50629O9271j46472j70826
2367e5471K4606J00560J29412J14275J09704j30243k46715P1763m1848j98492
2357a22449L08061l1846j53837o9114R101K23268j59430j80786P6045K02232j09590
2346h345j45487Q9472M5406j71179J10255Q9641K5657j6210P9958M4347M8991
2335A92506r0636j27939J54244M2378N7513j16075L6564j10501N8688M3586j38185
2324B143J0161J32080J6295Q3502n7362j88783P6968R2021m0632k5218K09553
2313C10728j07324k58371K32076o1675j78175K5332j54854R3685j48565J34977
$$ plain form
2303 -112166 -123905 -176086 14600 73135 34669 -51055 51281 117873 145716 35977 39321
2292 39321 38237 -20095 30944 23262 162663 112424 -141261 -193157 -104330 31236 26465 73728
2280 73728 -96819 183913 202459 320103 235358 273864 121965 11242 -154808 -14511
2270 -14511 74761 12369 69952 158351 302877 181118 109873 -83124 28189 219599 130268
2259 130268 201655 217020 115834 208411 274210 397258 320455 331902 326458 286119 371144
2248 371144 352172 75056 90848 9919 253446 210373 309732 361089 292172 243592 383248
2237 383248 185892 81424 6426 126827 189833 138395 173972 178703 204262 298008 245407
2226 245407 300824 402445 462049 351669 467807 370733 363417 253856 49243 297082 511746
$$ packed form
2303a12166j1739n2181J90686N8535l8466q5724J02336O6592K7843j09739L344
2292C9321j084n8332N1039p682J39401n0239k53685n1896Q8827J35566m771M7263
2280G3728j70547K80732J8546J17644q4745L8506j51899j10723j66050J40297
2270a4511Q9272o2392N7583Q8399J44526j21759p1245j92997J11313J91410q9331
2259A30268P1387J5365j01186R2577O5799J23048p6803J1447n444m0339Q5025
2248C71144j8972k77116J5792q0929K43527m3073R9359N1357o8917m8580J39656
2237C83248j97356j04468p4998J20401O3006n1438L5577M731K5559R3746n2601
2226B45407N5417J01621N9604j10380J16138r7074p316j09561k04613K47839K14664
$$ plain form
2215 511746 669925 621686 509688 369525 570518 561195 568303 678527 665332 700765 846522
2204 846522 743372 828708 715933 657129 497710 582837 721054 562285 534204 610290 537609
2193 537609 641332 757653 687816 912072 840392 674567 898945 814105 832379 850047 782553
2182 782553 954632 1128467 1130644 902320 1055592 1400195 1474751 1387574 1435243 1444657 1258210
2171 1258210 1412408 1447838 1392467 1456628 1319931 1212208 1337096 1569174 1640693 1732720
2161 1732720 1889651 1920284 1883820 1914969 1795314 1779186 1970924 1886635 1979119 2161008 2180732
2150 2180732 2174173 2404571 2567514 2584514 2747386 2840628 2931862 3022529 3017731 3199062 3445427
2139 3445427 3518016 3701492 3704708 3835318 3925350 3959204 4189218 4349031 4641697 4786646
$$ packed form
2215E11746J58179m8239j11998j40163K00993r323P108J10224j3195L5433J45757
2204H46522j03150Q5336j12775n8804j59419Q5127J38217j58769k8081P6086p2681
2193E37609J03723J16321o9837K24256p1680j65825K24378q4840J8274J7668o7494
2182G82553J72079J73835K177k28324J53272L44603P4556q7177M7669R414j86447
2171A258210J54198L5430n5371O4161j36697j07723J24888K32078P1519R2027
2161A732720J56931L0633l6464L1149j19655j6128J91738q4289R2484J81889J9724
2150B180732o559K30398J62943J7000J62872R3242R1234R0667m798J81331K46365
2139C445427P2589J83476L216J30610R0032L3854K30014J59813K92666J44949
$$ plain form
2129 4786646 5006201 5391382 5500099 5720233 6022525 6153731 6421305 6725869 6835979 7057549
2119 7057549 7215279 7591575 8200708 9045953 9907235 10652462 11519007 12679429 13633157
2110 13633157 14409676 15269440 15963761 17149274 18729225 20995803 23878159 27299279 31667652
2101 31667652 37087802 44423686 55063270 70492502 86453430 90857820 80061193 61923138
2093 61923138 46594424 36466000 29502718 24262557 20299124 17452186 15658379 14354622
2085 14354622 13015408 12132180 11480512 11219262 10697391 10071681 8917640 7871153 7347913
2076 7347913 6803472 6326274 6078795 5573198 5338524 4990169 4760288 4545780 4137246 4185601
2066 4185601 4051397 3653790 3770356 3723398 3396692 3253232 3235952 3249723 3142386 3025170
$$ packed form
2129D786646K19555L85181J08717K20134L02292J31206K67574L04564J10110K21570
2119G057549J57730L76296O09133Q45245Q61282P45227Q66545J160422R53728
2110A3633157P76519Q59764O94321J185513J579951K266578K882356L421120M368373
2101C1667652N420150P335884J0639584J5429232J5960928M404390j0796627j8138055
2093F1923138j5328714j0128424o963282n240161l963433k846938j793807j303757
2085A4354622j339214q83228o51668k61250n21871o25710j154041j046487n23240
2076G347913n44441m77198k47479n05597k34674l48355k29881k14508m08534M8355
2066D185601j34204l97607J16566m6958l26706j43460j7280J3771j07337j17216
$$ plain form
2056 3025170 2880076 2588321 2594168 2499812 2347278 2437151 2304574 2116186 2088449 1842669
2046 1842669 1711388 1872418 1627918 1454297 1350541 1468684 1393515 1428349 1530453 1380988
2036 1380988 1242754 1156662 1165647 1198919 1167534 1023343 1009376 1234761 1029787 940550 919964
2025 919964 910908 889421 814043 909675 1131005 935650 742707 891899 908190 693370 858125
2014 858125 981205 999311 852547 778272 778056 793620 845978 735166 834907 717806 788528
2003 788528 806096 823811 767091 806603 666482 514449 485299 483318 671380 596525 267595
1992 267595 352796 349078 350161 596162 814177 587034 487897 450918 412245 486350 430369
1981 430369 183222 168545 343728 255979 264574 354769 276170 205452 171630 183837 61399
$$ packed form
2056C025170j45094k91755N847r4356j52534Q9873j32577j88388k7737k45780
2046A842669j31281J61030k44500j73621j03756J18143p5169L4834J02104j49465
2036A380988j38234q6092Q985L3272l1385j44191j3967K25385k04974q9237k0586
2025I19964r056k1487p5378R5632K21330j95355j92943J49192J6291k14820J64755
2014H58125J23080J8106j46764p4275k16J5564N2358j10812R9741j17101P0722
2003G88528J7568J7715n6720L9512j40121j52033k9150j981J88062p4855l28930
1992B67595Q5201l718J083K46001K18015k27143r9137l6979l8673P4105n5981
1981D30369k47147j4677J75183q7749Q595R0195p8599p0718l3822J2207j22438
$$ plain form
1970 61399 -40335 67512 190813 188625 -61518 -50801 -3609 40645 118856 145080 111965
1959 111965 369043 301719 225483 231621 127283 212468 206139 13565 -7801 -91284 62085
1948 62085 259394 175033 269998 33389 105915 152734 154303 268710 513338 363843 387928
1937 387928 367326 203970 194974 124543 101973 82116 157756 81524 1235 -32241 24100 113757
1925 113757 161549 220291 260475 330339 303244 382530 498263 317293 338500 345833 264481
1914 264481 326123 447575 360068 270361 240602 194609 273038 355377 245610 272008 275223
1903 275223 275540 5352 24031 32168 -96555 -70519 -64373 38648 261134 226480 11101
1892 11101 -56606 -150133 -81239 150209 190049 125591 -30667 -117704 -180912 11662 7949
$$ packed form
1970F1399j01734J07847J23301k188k50143J0717M7192M4254P8211K6224l3115
1959A11965K57078o7324p6236O138j04338Q5185o329j92574k1366q3483J53369
1948F2085J97309q4361R4965k36609P2526M6819J569J14407K44628j49495K4085
1937C87928k0602j63356q996p0431k2570j9857P5640p6232q0289l3476N6341Q9657
1925A13757M7792N8742M0184O9864k7095P9286J15733j80970K1207P333q1352
1914B64481O1642J21452q7507q9707k9759m5993P8429Q2339j09767K6398L215
1903B75223L17k70188J8679Q137j28723K6036O146J03021K22486l4654k15379
1892A1101o7707r3527O8894K31448L9840o4458j56258q7037o3208J92574l713
$$ plain form
1881 7949 -143023 -105748 40080 339421 311725 152048 237603 278423 207471 228963 47604
1870 47604 235127 37653 -7140 103080 137664 19003 96589 174613 188709 -19770 -9263
1859 -9263 -76438 -94746 -124349 -18488 151281 175282 23516 48976 198987 368349 198931
1848 198931 98410 336181 127189 131901 207275 377065 184026 305683 252198 98756
1838 98756 149928 129805 101298 152727 152166 72056 156428 451691 489104 513477 564177 556705
1826 556705 395866 426261 343367 63370 92814 194424 98402 221926 137692 98072 -85385
1815 -85385 -70138 -167866 -130834 -232378 3561 -31337 59065 84610 50977 -142460 -110044
1804 -110044 -26020 -158367 66795 321252 297294 -24738 -30251 84378 167975 -36153 -38499
$$ packed form
1881G949j50972L7275J45828K99341k7696j59677Q5555M0820p0952K1492j81359
1870D7604J87523j97474m4793J10220L4584j18661P7586P8024J4096k08479J0507
1859i263o7175j8308k9603J05861J69769K4001j51766K5460J50011J69362j69418
1848A98931j00521K37771k08992M712P5374J69790j93039J21657n3485j53442
1838I8756N1172k0123k8507N1429n61q0110Q4372K95263L7413K4373N0700p472
1826E56705j60839L0395q2894k79997K9444J01610r6022J23524q4234l9620j83457
1815h5385J5247r7728L7032j01544K35939l4898R0402K5545l3633j93437L2416
1804a10044Q4024j32347K25162K54457k3958l22032n513J14629Q3597k04128k346
$$ plain form
1793 -38499 -37338 -98174 -69285 -52313 -97681 16258 -123423 -109031 -13744 143418 137362 109194
1781 109194 -126791 81827 38577 -119605 -86081 -252149 -226637 187072 128264 126971 197882
1770 197882 167818 -47813 -149096 30325 139086 -59256 -21582 65212 6884 -61318 -134660
1759 -134660 -245983 -75629 -170043 -314828 -169387 -25741 -52160 -163013 -217611 -134131
1749 -134131 -22201 -145703 -133261 -193891 -91252 94538 99298 -58583 -33366 -37830 81192
1738 81192 12732 116629 72251 -57146 -141163 -208344 -143561 -19471 19716 -87995 -232618
1727 -232618 -138165 -84647 30863 52408 -105340 114945 59754 300442 418672 169687
1717 169687 73275 10760 47399 -23595 -208859 -324183 -103260 37859 -146529 31537
$$ packed form
1793c8499J161o0836K8889J6972m5368J13939j39681J4392R5287J57162o056k8168
1781A09194k35985K08618m3250j58182L3524j66068K5512M13709n8808j293P0911
1770A97882l0064k15631j01283J79421J08761j98342L7674Q6794n8328o8202p3342
1759a34660j11323J70354r4414j44785J45441J43646k6419j10853n4598Q3480
1749a34131J11930j23502J2442o0630J02639J85790M760j57881K5217m464J19022
1738H1192o8460J03897m4378j29397q4017o7181O4783J24090L9187j07711j44623
1727b32618R4453N3518J15510K1545j57748K20285n5191K40688J18230k48985
1717A69687r6412o2515L6639p0994j85264j15324K20923J41119j84388J78066
$$ plain form
1707 31537 126261 93469 278426 229577 191076 -82958 -20145 296988 127209 -212576 -378081
1696 -378081 -117680 40712 -78099 -33341 47684 55468 -31468 -250875 -27450 -41170 -107644
1685 -107644 -83387 -149860 -47874 -113056 -25914 6734 -85194 -49787 67278 25032 -135569
1674 -135569 -103860 199415 244383 158714 -25522 -111458 -73990 56885 -102097 49128 -19216
1663 -19216 -199284 -223365 -206408 -21119 -187482 -256179 -114263 66430 -178709 16612
1653 16612 98425 -121654 -124040 -13578 13068 170463 -104451 -256526 -70846 122746 45827
1642 45827 69943 -24449 -27110 13315 24772 -156359 -80514 80137 -100606 -19178 -5371
1631 -5371 -72386 -52133 -97879 -186983 -168167 24315 -102876 -327509 -237694 -179642 -72636
$$ packed form
1707C1537R4724l2792J84957m8849l8501k74034O2813L17133j69779l39785j65505
1696c78081K60401J58392j18811M4758Q1025P784q6936k19407K23425j3720o6474
1685a07644K4257o6473J01986o5182Q7142L2648r1928L5407J17065m2246j60601
1674a35569L1709L03275M4968q5669j84236q5936L7468J30875j58982J51225o8344
1663a9216j80068k4081J6957J85289j66363o8697J41916J80693k45139J95321
1653A6612Q1813k20079k386J10462K6646J57395k74914j52075J85680J93592p6919
1642D5827K4116r4392k661M0425J1457j81131P5845J60651j80743Q1428J3807
1631e371o7015K0253m5746q9104J8816J92482j27191k24633Q9815N8052J07006
$$ plain form
1620 -72636 -101552 6213 -14919 -281348 -340179 -126638 -127027 -190717 -260195 -195386 -158020 81768
1608 81768 144510 140368 -34196 -72951 -113609 -145004 -261082 -140461 -28383 -56558 -93161
1597 -93161 -114924 -117297 -83336 -111326 -46180 29934 -33725 -25614 70617 -34643 4538 202787
1585 202787 206338 -57697 -80804 93142 10102 -39465 -52363 -237721 -132698 -190870 -74954
1574 -74954 -7709 25204 85385 222 -59723 100313 -101971 -105756 -97721 -219094 137698
1563 137698 -68826 -23290 36669 -55046 -58002 -52858 20564 -121813 -229876 -117021 -168803
1552 -168803 -94467 -96986 -320461 -173704 -13033 80362 135526 54715 83280 -23999 36043
1541 36043 40423 -15589 90901 181322 -130721 -112074 14891 -73940 -90742 -97320 -173652 -21616
$$ packed form
1620g2636k8916J07765k1132k66429n8831K13541l89o3690o9478O4809L7366K39788
1608H1768O2742m142j74564l8755m0658l1395j16078J20621J12078k8175l6603
1597i3161k1763k373L3961k7990O5146P6114o3659Q111R6231j05260L9181J98249
1585B02787L551k64035k3107J73946q3040m9567j2898j85358J05023n8172J15916
1574g4954O7245L2913O0181q5163n9945J60036k02284l785Q035j21373L56792
1563A37698k06524M5536N9959r1715k956N144P3422j42377j08063J12855n1782
1552a68803P4336k519k23475J46757J60671R3395N5164q0811K8565j07279O0042
1541C6043M380n6012J06490R0421l12043J8647J26965q8831j6802o578p6332J52036
$$ plain form
1529 -21616 60544 148656 24681 -158502 -132919 -220142 -314746 -229814 -234199 -48999 -33810
1518 -33810 -193832 -162571 -67081 -100383 36771 56174 -70548 -28821 -80461 -295285 -159749
1507 -159749 -200997 -107831 -75763 -137976 -284731 -130765 -73485 18985 -4304 -290073 -296159
1496 -296159 -51458 164226 89987 -38844 -102055 -60283 -3005 -84252 -1916 -35583 -293403
1485 -293403 -261074 -126789 112927 62899 159753 75301 -7931 103382 -29558 -116411 26802
1474 26802 7782 -56566 -117435 123773 246688 194472 -41113 -233755 -186321 -338880 -155006
1463 -155006 49145 53927 -15251 -120016 -106488 -10493 18497 -62725 -83960 -75925 -132732 -235760
1451 -235760 -70730 -105125 64025 83018 52051 168856 -2626 -117578 -246009 -314097
$$ packed form
1529b1616Q2160Q8112j23975j83183K5583q7223r4604Q4932m385J85200J5189
1518c3810j60022L1261R5490l3302J37154J9403j26722M1727n1640k14824J35536
1507a59749m1248R3166L2068o2213j46755J53966N7280R2470k3289k85769o086
1496b96159K44701K15684p4239j28831o3211M1772N7278q1247Q2336l3667k57820
1485b93403L2329J34285K39716n0028R6854q4452q3232J11313j32940q6853J43213
1474B6802j9020o4348o0869K41208J22915n2216k35585j92642M7434j52559J83874
1463a55006K04151M782o9178j04765J3528R5995K8990q1222k1235Q035n6807j03028
1451b35760J65030l4395J69150J8993l0967J16805j71482j14952j28431o8088
$$ plain form
1441 -314097 -10001 18027 -106596 -152897 32192 -55361 -170240 17011 220694 169443
1431 169443 99288 155158 4950 -10406 73895 72284 -55417 -24717 -93065 -217959 56242
1420 56242 48579 -3511 138601 57246 -4449 8893 -71259 45717 71302 -178856 -171528 -94843
1408 -94843 -105193 -95790 -126378 -187703 -44612 53119 -74690 -202406 -226152 -111574 -102676
1397 -102676 -182113 -97330 -82043 16248 134891 71846 -16661 -125028 -23941 -134734 -350442
1386 -350442 -7372 99227 -13291 -103754 -132875 -164082 41947 31261 17435 123777 100199
1375 100199 100921 -107979 -156478 -277256 -193602 18051 -64375 -128967 -104346 -186467 -184153 -267100
1363 -267100 -4732 134938 110924 89110 -8132 140915 111295 -14566 -79636 34120 -58657
$$ packed form
1441c14097L04096K8028j24623m6301J85089q7553j14879J87251K03683n1251
1431A69443p0155N5870j50208j5356Q4301j611j27701L0700o8348j24894K74201
1420E6242p663n2090J42112q1355o1695J3342q0152J16976K5585k50158P328P6685
1408i4843j0350R403l0588o1325J43091R7731j27809j27716k3746J14578Q898
1397a02676p9437Q4783J5287R8291J18643o3045q8507j08367J01087j10793k15708
1386c50442L43070J06599j12518r0463k9121l1207K06029j0686j3826J06342k3578
1375A00199P22k08900m8499j20778Q3654K11653q2426o4592K4621q2121K314q2947
1363b67100K62368J39670k4014k1814r7242J49047k9620j25861o5070J13756r2777
$$ plain form
1352 -58657 -192241 -9947 -95951 10973 24055 -98480 -128028 -282928 -262756 -101836 -75792
1341 -75792 -189806 -188996 -90600 -29435 -43725 -59527 65221 -5635 -148584 -255415 -101732
1330 -101732 83679 -10629 -75435 -135534 -112752 103450 267567 125575 -97762 -102136 -106661
1319 -106661 -44174 114319 -119000 -208366 -260766 -427537 -284220 -215355 -194460 -157976 -278768
1308 -278768 -157228 -114999 -88888 -130660 6284 204830 141519 -15863 172333 -7280
1298 -7280 -109083 233859 -92808 -311280 -169800 -63893 52216 252034 -1600 112068
1288 112068 17174 -27504 66401 109943 207845 87845 -17326 -104939 4895 171251 223155
1277 223155 167326 89622 -57456 -43527 29843 -144564 -329958 -55522 17 -261055 -543253
$$ packed form
1352e8657j33584J82294q6004J06924J3082j22535k9548j54900K0172J60920K6044
1341g5792j14014Q10R8396O1165j4290j5802J24748p0856j42949j06831J53683
1330a01732J85411r4308o4806o0099K2782K16202J64117j41992k23337m374m525
1319a06661O2487J58493k33319q9366n2400j66771J43317O8865K0895L6484j20792
1308b78768J21540M2229K6111m1772J36944J98546o3311j57382J88196j79613
1298g280j01803L42942l26667k18472J41480J05907J16109J99818k53634J13668
1288A12068r4894m4678R3905M3542R7902j20000j05171q7613J09834J66356N1904
1277B23155n5829p7704j47078J3929P3370j74407j85394K74436N5539k61072k82198
$$ plain form
1266 -543253 -301624 -9699 143610 58061 3858 5504 -61378 -96212 -33102 -75580 64480
1255 64480 86171 -155144 -57558 -288835 -108979 -99470 -265730 148924 71348 82048 38496
1244 38496 -103838 -285618 -201788 -396381 -163232 -93881 -232085 -358051 -300832 -287016 -524702
1233 -524702 -366517 -216058 -291435 -358390 -334684 -125855 -18011 79918 60888 36005 63077
1222 63077 25347 -106094 -200941 -85176 -79526 30443 -33747 -95364 -42999 102176 107413
1211 107413 -80000 16006 134101 32784 -3357 -89612 84272 177494 -113601 -26183 -30496
1200 -30496 -205845 -75125 -79398 -90412 -246134 -78690 125504 44621 39848 -78635 -111099
1189 -111099 -1281 3604 -57643 -147605 -86578 -145123 -22134 -104511 47472 -69862 -151669
$$ packed form
1266e43253K41629K91925J53309q5549n4203J646o6882l4834O3110m2478J40060
1255F4480K1691k41315R7586k31277J79856R509j66260M14654p7576J0700m3552
1244C8496j42334j81780Q3830j94593K33149O9351j38204j25966N7219J3816k37686
1233e24702J58185J50459p5377o6955K3706K08829J07844R7929j9030k4883K7072
1222F3077l7730j31441r4847J15765N650J09969o4190o1617N2365J45175N237
1211A07413j87413R6006J18095j01317l6141q6255J73884R3222k91095Q7418m313
1200c0496j75349J30720m273j1014j55722J67444K04194q0883m773j18483l2464
1189a11099J09818M885o1247q9962O1027n8545J22989q2377J51983j17334q1807
$$ plain form
1178 -151669 -65978 131609 127794 36056 -123026 -114500 -29742 -15540 8740 -18736 152445
1167 152445 225672 233678 216640 -10931 -15280 -63816 -40372 62031 146283 -36348 -273651
1156 -273651 -169351 -81801 -77847 -113236 -84707 1552 75262 96103 204252 257423 83162
1145 83162 -47735 -69869 -266325 -213066 -102174 116385 163253 -54219 37787 -83400 -31510
1134 -31510 60402 115837 3013 88006 215783 217985 37110 -97758 -34702 -169529 -135529
1123 -135529 -185288 -164191 -113062 -81552 51859 -200901 -93366 -115772 -18809 64267 -52768
1112 -52768 -40917 198968 339293 416288 445836 90916 161080 -4828 -191636 -220967 -346668
1101 -346668 -191009 44674 139705 -56163 -40399 22217 -57581 34175 -69535 -126643 -71784
$$ packed form
1178a51669Q5691J97587l815r1738j59082Q526Q4758J4202K4280k7476J71181
1167A52445P3227Q006j7038k27571m349m8536K3444J02403Q4252j82631k37303
1156b73651J04300Q7550L954l5389K8529Q6259P3710K0841J08149N3171j74261
1145H3162j30897k2134j96456N3259J10892K18559M6868k17472R2006j21187N1890
1134c1510R1912N5435j12824Q4993J27777K202j80875j34868O3056j34827L4000
1123a35529m9759K1097N1129L1510J33411k52760J07535k2406R6963Q3076j17035
1112e2768J1851K39885J40325P6995K9548l54920P0164j65908j86808k9331j25701
1101c46668J55659K35683R5031j95868J5764O2616p9798R1756j03710n7108N4859
$$ plain form
1090 -71784 98628 168097 -70019 -152171 78060 -33860 29629 144773 66274 9320 -4231
1079 -4231 73976 215739 140943 61826 15273 41772 -232564 -292011 -200880 -107210 -166846 122441
1067 122441 51984 262244 138520 -17722 82095 85218 109231 -13865 -133088 -3390 -142353
1056 -142353 -60733 107607 40117 -142331 -57392 -24098 66631 25206 -50203 -15924 8093
1045 8093 72481 63810 68163 41138 74947 118066 267890 296313 273377 159457 189734 206996
1033 206996 166903 136192 92054 -39220 -85746 -106418 26802 80389 199411 -4169 -38092
1022 -38092 -135871 25101 52499 -11136 39225 17258 139670 222610 89633 53694 33472
1011 33472 -24878 -12595 -163914 -33472 -25423 20644 -14569 61951 122612 -90252 10756
$$ packed form
1090g1784J70412O9469k38116q2152K30231j11920O3489J15144p8499n6954j3551
1079d231P8207J41763p4796p9117m6553K6499k74336n9447R1131R3670n9636K89287
1067A22441p0457K10260j23724j56242R9817L123K4013j23096j19223J29698j38963
1056a42353Q1620J68340o7490j82448Q4939L3294R0729m1425p5409L4279K4017
1045H093O4388q671M353k7025L3809M3119J49824K8423k2936j13920L0277J7262
1033B06996m0093l0711m4138j31274m6526k0672J33220N3587J19022k03580l3923
1022c8092r7779J60972K7398o3635N0361k1967J22412Q2940j32977l5939k0222
1011C3472n8350J2283j51319J30442Q049M6067l5213P6520O0661k12864J01008
$$ plain form
1000 10756 149621 -174817 -210584 -103398 -13029 68191 105807 -5030 11857 63318 -77731
989 -77731 -103787 -29424 -51716 -125438 -40292 3016 104009 -72474 21561 -5407 15207 102560
977 102560 148583 170877 83834 -20463 13100 31663 80183 124636 -25127 -72069 93101
966 93101 250983 -53253 -146568 -18997 -149983 71562 216145 228279 288070 -37099 -309553
955 -309553 -57431 5078 59308 230835 199349 72325 96225 -114568 -19280 -32114 73324
944 73324 -63458 -313834 -386861 -283215 -32681 65891 137431 172717 169457 5682 -144157
933 -144157 83498 34910 157913 197621 67320 -64652 -57078 -90823 -162085 -182063 -117193
922 -117193 -188644 -277343 -194400 -141093 -38661 -80817 -161369 -120288 -38955 -8235 -49114 80231
$$ packed form
1000A0756J38865l24438l5767J07186R0369Q1220L7616j10837J6887N1461j41049
989g7731k6056P4363k2292p3722Q5146M3308J00993j76483R4035k6968K0614Q7353
977A02560M6023K2294q7043j04297L3563J8563M8520M4453j49763m6942J65170
966I3101J57882l04236r3315J27571j30986K21545J44583J2134N9791l25169k72454
955c09553K52122O2509N4230J71527l1486j27024K3900k10793R5288j2834J05438
944G3324j36782k50376p3027J03646K50534R8572P1540L5286l260j63775j49839
933a44157K27655m8588J23003L9708j30301j31972P574l3745p1262j9978O4870
922a17193p1451q8699Q2943N3307J02432m2156q0552M1081Q1333L0720m0879J29345
$$ plain form
910 80231 86509 -3344 -32613 4626 176020 3596 -5587 -224663 -276700 -247141 -152783 -98144
898 -98144 -179347 -47165 -28679 -143100 37785 45578 39216 102921 225534 108957 10848
887 10848 -45656 -62016 -303279 -220964 -85058 -6527 21431 -60265 -126328 -40883 -122077 -181227
875 -181227 -75551 -122072 -82639 -192348 -131449 -15209 -93180 -11663 -122404 -188462 -201478
864 -201478 26081 64217 -20810 134898 128689 -47500 -150694 -2079 -105240 93467 -27073
853 -27073 -19702 -157030 -66705 -52237 -67703 -34387 57444 137575 46274 266966 269223 220135
841 220135 7864 -91226 -249617 -294920 -61361 65160 -180199 12091 66385 248265
831 248265 -109159 -84685 -47075 -12798 -11813 44632 76401 156920 22587 -91085 -100057 4250
$$ packed form
910H0231O278q9853k9269L7239J71394j72424r183k19076n2037K9559R4358N4639
898i8144q1203J32182J8486j14421J80885P793o362O3705J22613j16577r8109
887A0848n6504j6360k41263Q2315J35906P8531K7958q1696o6063Q5445q1194n9150
875a81227J05676m6521L9433j09709O0899J16240p7971Q1517j10741o6058j3016
864b01478K27559L8136q5027J55708o209j76189j03194J48615j03161J98707j20540
853b7073P371j37328R0325J4468j5466L3316R1831Q0131r1301K20692K257m9088
841B20135k12271r9090j58391m5303K33559J26521k45359J92290N4294J81880
831B48265l57424K4474L7610L4277R85N6445L1769Q0519j34333j13672q972J04307
$$ plain form
819 4250 -17294 112125 109695 210016 221080 204363 22660 -95030 -1626 -165926 33650
808 33650 -1445 -31109 -114689 40100 -47333 -190954 -206427 -30372 136319 271045 387357
797 387357 161581 104486 199631 -77842 151031 134137 181393 185490 21323 -37015 -65910
786 -65910 -45438 -4525 -136260 70129 21641 -26970 -124332 32088 102660 117360 201941
775 201941 198148 -52348 -231715 -110974 -165890 71701 308990 141531 391436 289768
765 289768 117142 -161046 -245889 -188128 -272273 174939 264533 348853 179914 95996 101093
754 101093 63660 111749 -35303 40443 -25928 -98496 105572 113299 69414 43502 -188279
743 -188279 -261058 -50810 150205 94839 74106 -9412 -120768 -80741 -185630 -15240 113605
$$ packed form
819D250k1544J29419k430J00321J1064j6717j81703j17690R3404j64300J99576
808C3650l5095k9664q3580J54789q7433j43621j5473J76055J66691J34726J16312
797C87357k25776n7095R5145k77473K28873j6894M7256M097j64167n8338k8895
786f5910K0472M0913j31735K06389m8488m8611r7362J56420P0572J4700Q4581
775B01941l793k50496j79367J20741n4916K37591K37289j67459K49905j01668
765B89768j72626k78188q4843N7761q4145M47212Q9594Q4320j68939q3918N097
754A01093l7433M8089j47052P5746o6371p2568K04068P727m3885k5912k31781
743a88279p2779K10248K01015n5366k0733q3518j11356M0027j04889J70390J28845
$$ plain form
732 113605 180402 136647 -11805 27393 172055 200411 96371 50584 -57808 -93517 52909
721 52909 288650 34133 -46441 -181607 -215823 -108221 -9933 127368 47927 -38301 -213319
$$ packed form
732A13605O6797m3755j48452L9198J44662K8356j04040m5787j08392l5709J46426
721E2909K35741k54517q0574j35166l4216J07602R8288J37301p9441q6228j75018
$$ [...]
##END NTUPLES=NMR SPECTRUM
##END=
