##TITLE=1H_CA-9161-1
 CDCl3
 8 sc, 
 9.6.2023
##JCAMPDX= 6.0         $$ Bruker NMR JCAMP-DX V2.0
##DATA TYPE= NMR SPECTRUM
##DATA CLASS= NTUPLES
##ORIGIN= UXNMR, Bruker Analytische Messtechnik GmbH
##OWNER= root
$$ XWIN-NMR		Version 3.5
$$ Fri Jun  9 13:56:21 2023 Russian Standard Time (UT+4h)  she@DPX200
##.OBSERVE FREQUENCY= 200.13135
##.OBSERVE NUCLEUS= ^1H
##.ACQUISITION MODE= SIMULTANEOUS
##.ACQUISITION SCHEME= undefined
##.AVERAGES= 8
##.DIGITISER RES= 18
##SPECTROMETER/DATA SYSTEM= spect
##.PULSE SEQUENCE= zg30
##.SOLVENT NAME= CDCl3
##.SHIFT REFERENCE= (INTERNAL, CDCl3, 0, 15.8439)
##AUDIT TRAIL= $$ (NUMBER, WHEN, WHO, WHERE, WHAT)
$$ ##TITLE= Audit trail, XWIN-NMR		Version 3.5
$$ ##JCAMPDX= 5.01
$$ ##ORIGIN= Bruker BioSpin GmbH
$$ ##OWNER= she
$$ F:/spectra/data/she/nmr/H-F/1/pdata/1/auditp.txt
$$ ##AUDIT TRAIL=  $$ (NUMBER, WHEN, WHO, WHERE, WHAT)
(   1,<2023-06-09 13:55:05.00 +0400>,<she>,<DPX200>,
      <created by zg, POWCHK disabled, PULCHK disabled
       configuration hash MD5:
       00 E9 B6 7A A2 85 ED C7 34 08 36 98 17 FE 4E 26
       data hash MD5: 16K
       D7 78 FE 87 D2 C8 57 35 C9 6D B8 25 4E 79 12 10>)
(   2,<2023-06-09 13:55:07.14 +0400>,<she>,<DPX200>,
      <Start of raw data processing
       efp BC_mod = 2 LB = 0.24 FT_mod = 6 PKNL = 1 PHC0 = -20623.97 PHC1 = 11.45272 SI = 16K 
       data hash MD5: 16K
       31 D4 F6 11 92 5F E0 A2 1E B9 17 6E FB 55 CE 03>)
(   3,<2023-06-09 13:55:24.34 +0400>,<she>,<DPX200>,
      <pk PHC0 = -5.085958 PHC1 = 4.2 
       data hash MD5: 16K
       C2 C6 43 1F 9E 17 43 10 85 D8 5F CA B3 15 ED 4E>)
(   4,<2023-06-09 13:55:27.48 +0400>,<she>,<DPX200>,
      <abs ABSG = 5 
       data hash MD5: 16K
       C8 EB D3 F4 CB AE 5A 09 CA 2C 60 2E 3B EA 0B D5>)
$$ ##END=
$$ 
$$ hash MD5
$$ FD 70 60 F4 3E CA F5 65 3D 64 85 C7 7F 4E E5 42
##$RELAX= 
##$RELAX= 
##$RELAX= 
##$RELAX= 
##$RELAX= 
##$RELAX= 
$$ Bruker specific parameters
$$ --------------------------
##$DU= <F:/spectra>
##$EXPNO= 1
##$NAME= <H-F>
##$PROCNO= 1
##$TYPE= <nmr>
##$USER= <she>
##$AMP= (0..31)
100 100 100 100 100 100 100 100 100 100 100 100 100 100 100 100 100 100 
100 100 100 100 100 100 100 100 100 100 100 100 100 100 
##$AQSEQ= 0
##$AQ_mod= 1
##$AUNM= <au_zg>
##$AUTOPOS= <>
##$BF1= 200.13
##$BF2= 200.13
##$BF3= 200.13
##$BF4= 200.13
##$BF5= 200.13
##$BF6= 200.13
##$BF7= 200.13
##$BF8= 200.13
##$BYTORDA= 1
##$CFDGTYP= 0
##$CFRGTYP= 5
##$CHEMSTR= <none>
##$CNST= (0..31)
1 1 145 1 1 1 1 1 1 1 1 1 1 1 1 1 1 1 1 1 1 1 1 1 1 1 1 1 1 1 1 1 
##$CPDPRG= <>
##$CPDPRG1= <>
##$CPDPRG2= <>
##$CPDPRG3= <>
##$CPDPRG4= <mlev>
##$CPDPRG5= <mlev>
##$CPDPRG6= <mlev>
##$CPDPRG7= <mlev>
##$CPDPRG8= <mlev>
##$CPDPRGB= <>
##$CPDPRGT= <>
##$D= (0..31)
0 1.2 0 0 0 0 0 0 0 0.06 0 0.03 0 0 0 0 0.0002 0 0 0 0 0 0 0 0 0 0 0 0 
0 0 0 
##$DATE= 1686304504
##$DBL= (0..7)
120 120 120 120 120 120 120 120 
##$DBP= (0..7)
150 150 150 150 150 150 150 150 
##$DBP07= 0
##$DBPNAM0= <>
##$DBPNAM1= <>
##$DBPNAM2= <>
##$DBPNAM3= <>
##$DBPNAM4= <>
$$ [...]
##$SUBNAM3= <"">
##$SUBNAM4= <"">
##$SUBNAM5= <"">
##$SUBNAM6= <"">
##$SUBNAM7= <"">
##$SUBNAM8= <"">
##$SUBNAM9= <"">
##$SW= 18.05172834244
##$SWIBOX= (0..15)
0 0 2 0 0 0 0 0 0 0 0 0 0 0 0 0 
##$SW_h= 3612.71676300578
##$TD= 16384
##$TD0= 1
##$TE= 0
##$TE2= 300
##$TE3= 300
##$TEG= 300
##$TL= (0..7)
0 120 120 120 120 120 120 120 
##$TP= (0..7)
150 150 150 150 150 150 150 150 
##$TP07= 0
##$TPNAME0= <>
##$TPNAME1= <>
##$TPNAME2= <>
##$TPNAME3= <>
##$TPNAME4= <>
##$TPNAME5= <>
##$TPNAME6= <>
##$TPNAME7= <>
##$TPOAL= (0..7)
0.5 0.5 0.5 0.5 0.5 0.5 0.5 0.5 
##$TPOFFS= (0..7)
0 0 0 0 0 0 0 0 
##$TUNHIN= 0
##$TUNHOUT= 0
##$TUNXOUT= 0
##$USERA1= <user>
##$USERA2= <user>
##$USERA3= <user>
##$USERA4= <user>
##$USERA5= <user>
##$V9= 5
##$VALIST= <valist>
##$VCLIST= <CCCCCCCCCCCCCCC>
##$VD= 0
##$VDLIST= <DDDDDDDDDDDDDDD>
##$VPLIST= <PPPPPPPPPPPPPPP>
##$VTLIST= <TTTTTTTTTTTTTTT>
##$WBST= 1024
##$WBSW= 4
##$XGAIN= (0..3)
0 0 0 0 
##$XL= 0
##$YL= 0
##$YMAX_a= 116708
##$YMIN_a= -134387
##$ZGOPTNS= <>
##$ZL1= 120
##$ZL2= 120
##$ZL3= 120
##$ZL4= 120
##$ABSF1= 15.71731
##$ABSF2= -2.334539
##$ABSG= 5
##$ABSL= 3
##$ALPHA= 0
##$AQORDER= 0
##$ASSFAC= 0
##$ASSFACI= 0
##$ASSFACX= 0
##$ASSWID= 0
##$AUNMP= <proc_1d>
##$AZFE= 0.1
##$AZFW= 0.1
##$BCFW= 0
##$BC_mod= 2
##$BYTORDP= 0
##$COROFFS= 0
##$CY= -3
##$DATMOD= 1
##$DC= 0
##$DFILT= <>
##$DTYPP= 0
##$F1P= 0
##$F2P= 0
##$FCOR= 1
##$FTSIZE= 16384
##$FT_mod= 6
##$GAMMA= 0
##$GB= 0
##$INTBC= 1
##$INTSCL= 3.70164e-10
##$ISEN= 128
##$LB= 0.24
##$LEV0= 0
##$LPBIN= 0
##$MAXI= 10000
##$MC2= 0
##$MEAN= 0
##$ME_mod= 0
##$MI= 1.114404
##$NCOEF= 0
##$NC_proc= -8
##$NLEV= 6
##$NOISF1= 3.799351
##$NOISF2= 2.8
##$NSP= 0
##$NTH_PI= 0
##$NZP= 0
##$OFFSET= 15.84385
##$PC= 1
##$PHC0= -20629.06
##$PHC1= 15.65272
##$PH_mod= 1
##$PKNL= yes
##$PPARMOD= 0
##$PSCAL= 0
##$PSIGN= 0
##$REVERSE= no
##$SF= 200.12998552856
##$SI= 16384
##$SIGF1= 3
##$SIGF2= 2
##$SINO= 5.538805
##$SIOLD= 16384
##$SREGLST= <1H.CDCl3>
##$SSB= 0
##$STSI= 16384
##$STSR= 0
##$SW_p= 3612.71676300578
##$SYMM= 0
##$S_DEV= 0
##$TDeff= 16384
##$TDoff= 0
##$TI= <>
##$TILT= no
##$TM1= 0
##$TM2= 0
##$TOPLEV= 0
##$USERP1= <user>
##$USERP2= <user>
##$USERP3= <user>
##$USERP4= <user>
##$USERP5= <user>
##$WDW= 1
##$XDIM= 16384
##$YMAX_p= 361201146
##$YMIN_p= -4237638
$$ End of Bruker specific parameters
$$ ---------------------------------
##NTUPLES= NMR SPECTRUM
##VAR_NAME=  FREQUENCY,     SPECTRUM/REAL,   SPECTRUM/IMAG
##SYMBOL=    X,             R,               I
##VAR_TYPE=  INDEPENDENT,   DEPENDENT,       DEPENDENT
##VAR_FORM=  AFFN,          ASDF,            ASDF
##VAR_DIM=   16384,         16384,           16384
##UNITS=     HZ,            ARBITRARY UNITS, ARBITRARY UNITS
##FACTOR=    0.220516191357247, 1,           1
##FIRST=     3170.82949839497, 0,            0
##LAST=      -441.887264610808, 0,           0
##MIN=       -441.887264610808, -4237638,    0
##MAX=       3170.82949839497, 361201146,    0
$$ Real data points
##PAGE= N=1
##DATA TABLE= (X++(R..R)), XYDATA
$$ [...]
6613B2159374j58792N86733O41544P68291P73345O28906K9634P49412P17551N48674
$$ 22159374 22000582 22587315 23228859 23997150 24770495 25399401 25429035 26178447 26895998 27444672
6603B7444672O53580O27149P75810P58757O07452R02855O54809R66370R07332
$$ 27444672 28098252 28725401 29501211 30259968 30867420 31770275 32425084 33391454 34298786
6594C4298786Q76546O42987R36884J126539R00310R42234J200795J097221J237341
$$ 34298786 35175332 35818319 36755203 37881742 38782052 39724286 40925081 42022302 43259643
6585D3259643R03703J321410J283129J459531J749792J486724J672860J383686
$$ 43259643 44163346 45484756 46767885 48227416 49977208 51463932 53136792 54520478
6577E4520478J932537J477865K039935J978854K509510K188039K042005K606220
$$ 54520478 56453015 57930880 59970815 61949669 64459179 66647218 68689223 71295443
6569G1295443K299317K515430K914888K511523K770172L101434L393496L438705
$$ 71295443 73594760 76110190 79025078 81536601 84306773 87408207 90801703 94240408
6561I4240408L621099L785743L344202L708080M111423M546510L843422M094294
$$ 94240408 97861507 101647250 104991452 108699532 112810955 117357465 121200887 125295181
6553A25295181M490571M161071L982366M311725L690676L486624L372598K864110
$$ 125295181 129785752 133946823 137929189 142240914 145931590 149418214 152790812 155654922
6545A55654922K260124J863856J713597J288004k11208l06097j329279j583562
$$ 155654922 157915046 159778902 161492499 162780503 162569295 162263198 160933919 159350357
6537A59350357k391710l241777l148861l595107m239036m236338m413199m622561
$$ 159350357 156958647 153716870 150568009 146972902 142733866 138497528 134084329 129461768
6529A29461768m477459m434991m403162m507951m265618m246878m209297l609817
$$ 129461768 124984309 120549318 116146156 111638205 107372587 103125709 98916412 95306595
6521I5306595l171974m176158l714785l508198l142226k913290k736972l200025
$$ 95306595 92134621 87958463 84243678 80735480 77593254 74679964 71942992 68742967
6513F8742967k235145k340156k614857k385406j968487k222176j971505j783024
$$ 68742967 66507822 64167666 61552809 59167403 57198916 54976740 53005235 51222211
6505E1222211j689576j507406j272927j609162j712913j350726j672975j235402
$$ 51222211 49532635 48025229 46752302 45143140 43430227 42079501 40406526 39171124
6497C9171124j729029j373270k95128j074823j037655o48388j467803r86435p52606
$$ 39171124 37442095 36068825 35773697 34698874 33661219 33012831 31545028 30558593 29805987
6488B9805987q13010j058673q42101n05116p58631q13047l81408q51120p49582
$$ 29805987 28992977 27934304 27092203 26587087 25828456 25015409 24634001 23782881 23033299
6479B3033299r55988n87190R9472p16661q50108p38940n04138R5496k80811n64226
$$ 23033299 22077311 21490121 21589593 20872932 20022824 19283884 18779746 18875242 18594431 18030205
6469A8030205p25449l72532l33591o08580k61492n58024l17360k43346k34081
$$ 18030205 17304756 16932224 16598633 15990053 15728561 15170537 14853177 14609831 14375750
6460A4375750k96012m1442p57811o55123k78730l852k11232l16307l83933l06524
$$ 14375750 14079738 14038296 13280485 12625362 12346632 12342780 12131548 11815241 11431308 11124784
6450A1124784J91869R6028m79487k86684L2530n52914r9638M4453k41086k39630
$$ 11124784 11316653 11412681 10933194 10646510 10679040 10126126 10026488 10070941 9829855 9590225
6440I590225l87788j57920j12362j16192n0407p1011l63924m78116P08181j29658
$$ 9590225 9202437 9044517 8932155 8815963 8765556 8694545 8330621 7852505 8560686 8431028
6430H431028m74306J89353m83820m96595O218R3616M4489o95294K6327q0918k98874
$$ 8431028 7956722 8146075 7662255 7165660 7171878 7265494 7309983 6614689 6641016 6560098 6261224
6419F261224o7351J94418k45753l30553J23847J40046j31059q2103N06789m57015
$$ 6261224 6193873 6388291 6142538 5811985 5935832 6075878 5944819 5862716 6369505 5912490
6409E912490m68868L88792k03860K00246j32789p15004M1634n259j64960k97181
$$ 5912490 5443622 5832414 5628554 5828800 5696011 4981007 5022641 5017382 4852422 4555241
6399D555241K56832l30248o3888r8106o21027J54474J00705J40518M09808q7187
$$ 4555241 4812073 4481825 4417937 4319831 3698804 3853278 3953983 4094501 4504309 4417122
6389D417122k60471r9487l95837K09216l05n27288L09316K14290o57282J262K98787
$$ 4417122 4156651 4057164 3661327 3870543 3870238 3342950 3652266 3866556 3209274 3210536 3509323
6378C509323L28295K26597q7609m21542n10360l05919K84542l22916l00451N05765
$$ 3509323 3837618 4064215 3976606 3555064 3044704 2738785 3023327 2700411 2399960 2905725
6368B905725M14250l00478k61398O185r8467n1622J52417J5444k91063M64400
$$ 2905725 3319975 3019497 2758099 2764284 2665817 2614195 2766612 2782056 2490993 2955393
6358B955393J39467J30825n0936l91367K82536n03877J90805j4097m1151K63635
$$ 2955393 3094860 3225685 3174749 2783382 3065918 2562041 2752846 2738749 2697598 2961233
6348B961233J40370Q2794j01361J07815l22789K19883j71410j05035J07777k05546
$$ 2961233 3101603 3184397 3083036 3190851 2868062 3087945 2916535 2811500 2919277 2713731
6338B713731m90956l35739L0617K82016N98367J57047p99167J92687l63864j07740
$$ 2713731 2222775 1887036 1917653 2199669 2798036 2955083 2155916 2348603 1984739 1876999
6328A876999K42200j92454k93116n1384L63386K02708k19281n88008K83468N21467
$$ 1876999 2119199 1926745 1633629 1582245 1945631 2148339 1929058 1341050 1624518 2145985
6318B145985l60236l9454J18674m1532n9059M95888k27645l19200Q8654K40352
$$ 2145985 1785749 1746295 1864969 1823437 1764378 2260266 2032621 1713421 1802075 2042427
6308B042427l89995K29990K53151p17822Q7433M0960P1766o2111k64738M42298
$$ 2042427 1652432 1882422 2135573 1417751 1505184 1546144 1617910 1555799 1291061 1733359
6298A733359L22546m56182m70053j74308M56821K1126k86764P976L20771j77062
$$ 1733359 2055905 1599723 1129670 955362 1412183 1433309 1146545 1154521 1475292 1298230
6288A298230m15013K94165L07555m40933P5255J03552M2165J65139j39021p8045
$$ 1298230 883217 1177382 1484937 1044004 1119259 1222811 1264976 1430115 1291094 1213049
6278A213049M28615K61076o09981k54674j47163R2674Q1282L1554K9284k97852
$$ 1213049 1641664 1902740 1292759 1038085 890922 983596 1064878 1096432 1125716 827864
6268H27864n1711L00162j78651j68867r273J83323K5937l11082J31341M7j76490
$$ 827864 776153 1076315 897664 728797 719524 902847 928784 617702 749043 749090 572600
6257E72600P8790N64350K76851m06592l07105J17273L07986J12927n13914k27325
$$ 572600 651390 1215740 1492591 1085999 778894 896167 1204153 1317080 803166 575841
6247E75841q5852L58122J73124j99262j6652n5472L12455j29728q1198n73048
$$ 575841 489989 848111 1021235 821973 805321 749849 1062304 932576 851378 278330
6237B78330L5361L95248P2809o1428k67748K37681l51849k10942O7206K69771
$$ 278330 313691 708939 781748 720320 452572 690253 338404 127462 194668 464439
6227D64439l12689J50325j09021n8386M66672M9666K70697k41060j77956M5871
$$ 464439 151750 302075 193054 134668 601340 651006 921703 680643 502687 548558
6217E48558m9324K83164K82637J28132m98382L713j23711j12597J59799k66142
$$ 548558 499234 782398 1065035 1193167 694785 698498 574787 462190 621989 355847
6207C55847j4616R7952K36568J25137k5242l83256K0791K57660L91560j01140
$$ 355847 341231 439183 675751 800888 775646 392390 413181 670841 1062401 961261
6197I61261k67360j541m32701L57764k78270k03292M22118M65108J03186n75058
$$ 961261 693901 692360 259659 617423 339153 135861 557979 1023087 1126273 551215
6187E51215K16190k26582k92644K71438L6501k3343l81742o6127K41824N78689
$$ 551215 767405 540823 248179 519617 556118 532775 151033 84906 326730 905419
6177I05419J90098r4944N6943j23605n3859O4222l27197m40770L06555L3598j31555
$$ 905419 1095517 1000573 1057516 933911 880052 944274 617077 176307 482862 516460 384905
6166C84905J37469m07412O5342J96400L7950q1924O1090N8235K30823j61699k82462
$$ 384905 522374 114962 180304 376704 414654 332730 393820 452055 682878 521179 238717
6155B38717k58907n94175M08312O41725J26126j13452R5954k14722q9266k4523
$$ 238717 -20190 -614365 -206053 435672 561798 448346 544300 329578 240312 215789
6145B15789k93203k45742o6271R10364L42686k38481m99904k46229J33876k58158
$$ 215789 -77414 -323156 -389427 520937 863623 625142 125238 -120991 12885 -245273
6135b45273L87580o9595j04915k51044K15665L7167J34953K72558N1953l89937
$$ -245273 142307 72712 -32203 -283247 -67582 -30415 104538 377096 429049 39112
6125C9112P14K04583j234K1930N6009m22300L35740M20402j55077J21576n57005
$$ 39112 39826 244409 243175 265105 321114 -101186 234554 654956 499879 621455 64450
6114F4450J28313k05699k58098J49383l545M38634J12209J7907l25547o29727
$$ 64450 192763 -12936 -271034 -121651 -125196 313438 425647 443554 118007 -511720
6104e11720K17814N4700m1078K05553l57144N3951K71902k7484q7234j80072J77849
$$ -511720 -293906 -239206 -280284 -74731 -431875 -377924 -106022 -133506 -220740 -400812 -222963
6093b22963L01795O07914j69997k81537K1595l47430K7282m9535J37445K78404
$$ -222963 78832 686746 516749 235212 256807 -90623 -63341 -112876 24569 302973
6083C02973m76501q1328r831l70349L16924N40029P5874J37921J20j2481o0673
$$ 302973 -173528 -254856 -264687 -635036 -318112 221917 297791 435712 435832 423351 362678
6072C62678l68103j06560j22270L49087j68988j27816K25160O04963k31201m92018
$$ 362678 -5425 -111985 -234255 114832 -54156 -181972 43188 648151 416950 -75068
6062g5068M06003k11609k73871K17052j26449J34838r5569J57444K88451J98992
$$ -75068 330935 119326 -154545 62507 -63942 70896 -24673 132771 421222 620214
6052F20214o27511l58328K86981P2808o3003k85258K72814K73851J91783j24676
$$ 620214 -7297 -365625 -78644 -5836 -68839 -354097 -81283 192568 384351 259675
6042B59675k87188K62111K29741P2782q9474m27609Q8171Q9738J32129k00108
$$ 259675 -27513 234598 464339 537121 447647 20038 108209 197947 330076 129968
6032A29968Q5446q1565j04334J8229k05276k53143J39058M25853M22083J53188
$$ 129968 215414 133849 29515 47744 -157532 -410675 -271617 154236 576319 729507
6022G29507q0765J8488J85298O228O1293k30712k01337l93298j34133j34312O64418
$$ 729507 648742 667230 852528 858756 920049 689337 488000 94702 -39431 -173743 490675
6011D90675q6270m10631L80940m4557K8570P7989m53142k38015J48842P4142K27491
$$ 490675 404405 -6226 374714 330157 358727 436716 -16426 -254441 -105599 -31457 196034
6000A96034j0738j6837j77446K87262l3421J38039m7151n54127J05199j47526
$$ 196034 185296 168459 -8987 278275 244854 382893 335742 -218385 -113186 -260712
5990b60712n948J64986k60099K53917J25836J37829N3760k1270M05807j42831
$$ -260712 -266660 -101674 -361773 -107856 17980 155809 209569 188299 594106 451275
5980D51275n31469K64256j8789R812o5344K96477l4141j11342r8202j736K86675
$$ 451275 -80194 184062 165273 175085 109741 406218 372077 260735 162533 160797 447472
5969D47472J2736j47698Q1659L20027o33727n6609k27615J36687o1695j63432
$$ 447472 460208 312510 394169 714196 80469 23860 -203755 -67068 -128763 -292195
5959b92195J24078J4893j22141K34234O12060J92594l18868Q906J71669m646m94306
$$ -292195 -168117 -153224 -275365 -41131 570929 763523 444655 453561 625230 620584 126278
5948A26278R9067M48288m7330n20050k48084J25772R5474K53627j50444M89954
$$ 126278 225345 673633 626303 106253 -141831 -16059 79415 333042 182598 672552
5938F72552L9785m11249O678P6536k04115j335J77143l50032m16822o5817M54852
$$ 672552 712337 301088 307766 384302 180187 178852 355995 5963 -410859 -476676 -21824
5927b1824L36474j22783J59079j1073O4111L72828L437j16052j72675l57336p5404
$$ -21824 314650 191867 350946 339873 403984 776812 780249 664197 491522 134186 58782
5916E8782L7599J22807L1647J65189l60079j75372K52743J03281k93785P9937
$$ 58782 96381 219188 250835 416024 55945 -119427 133316 236597 -57188 22749
5906B2749K57089n74023j03943N72050K65298m68994j1491K14099j43624J23551
$$ 22749 279838 -294185 -398128 173922 439220 -29774 -41265 172834 29210 152761
5896A52761O0659J10545j51168M9434O3334m43999J22706k42712L74770K97987
$$ 152761 213420 323965 172797 222231 285565 -158434 -35728 -278440 96330 394317
5886C94317m9501l614q7008L11679l14983k93441O7029L70972j11735k7024k58401
$$ 394317 344816 341202 254194 565873 250890 -42551 24478 395450 283715 256691 -1710
5875a710l3878m6155j01744M9629J98180M864k01780J5254m25087L18629J57455
$$ -1710 -35588 -81743 -183487 -133858 64322 69186 -132594 -117340 -542427 -223798 -66343
5864f6343j88986L24502K35708O0051M7632j00613M3080k01916k56521j17682
$$ -66343 -255329 69173 304881 364932 412564 311951 355031 153115 -103406 -221088
5854b21088M8818J77270J14564L55420N5011k82557k21830J84992Q508k3258m17713
$$ -221088 -172270 5000 119564 474984 529995 247438 25608 210600 219108 195850 -221863
5843b21863M4204K4986j01240k4881N7792Q7049N3891J82611j85218M7597J22010
$$ -221863 -177659 -152673 -253913 -278794 -221002 -133953 -80062 102549 -82669 -35072 86938
5832H6938N24056k93699j65586P4965p120l26993L11802j79133j02122J0749j81260
$$ 86938 610994 317295 151709 226674 219554 -107439 204363 25230 -76892 -66143 -247403
5821b47403J61781l64946L39568J24974k95051L71135O8808l26180k53018l66362
$$ -247403 -85622 -450568 -111000 13974 -281077 90058 158866 -167314 -420332 -786694
5811g86694N29168L60870L6798O2490L20616k83597J19591L5242K2681k64878
$$ -786694 -257526 103344 140142 202632 523248 239651 359242 394484 417165 152287
5801A52287J25945J9658j37708j53849K53830n4471j37580K84131j8173k9802
$$ 152287 278232 297890 160182 6333 260163 205692 68112 352243 334070 304268
5791C04268J53534j03389m44071O8195R1981K03985j70091l23873R3256J54277
$$ 304268 457802 354413 -89658 -21463 70518 274503 104412 -219461 -126205 28072
5781B8072J78469m74807M3999N69189M47839k7510l39535m67298O1506K15582
$$ 28072 206541 -268266 -224267 344922 792761 765251 425716 -41582 19924 235506
5771B35506k35147j63658j63525J87272P1289P2798l6300j15754n80822L86482
$$ 235506 359 -163299 -326824 -139552 -68263 4535 -31765 -147519 -728341 -341859
5761c41859r6620M19486r1274J50415j47626K16017q3543L4588k25552j40549
$$ -341859 -438479 -18993 -110267 40148 -107478 108539 24996 59584 -165968 -306517
5751c06517K83843Q3553m4244J90851J5768k14126p8957l45665M58050j34461
$$ -306517 -22674 60879 16635 207486 223254 9128 -69829 -415494 42556 -91905
5741i1905n8598N19386M710J47484k15502M7518l55514J91568j42201k23083K46981
$$ -91905 -150503 368883 373593 521077 305575 353093 -2421 189147 46946 -176137 70844
5730G0844l66745p6743K68630L12756l82163k36763R9218L96622J99738j23674
$$ 70844 -295901 -372644 -104014 208742 -173421 -410184 -310966 85656 285394 161720
5720A61720O9711o127j94732J83911K82850N10280k99192m28860M168L43939l47204
$$ 161720 231431 225304 30572 214483 497333 1007613 708421 279561 283729 627668 280464
5709B80464o21975K03602k12451q6966N75302o4089j20345q3473K84567J88226
$$ 280464 -341511 -137909 -350360 -437326 137976 73887 -46458 -129931 154636 342862
5699C42862j23924j30518M89322k37589Q5357J2360j39123K21525m72749p7152
$$ 342862 218938 88420 577742 340153 425510 437870 298747 520272 47523 -29629
5689b9629R9426k37260K60138J89159j20281j75203J75566j17905m93926j73009
$$ -29629 69797 -167463 92675 281834 161553 -13650 161916 44011 -449915 -622924
5679f22924N37576J79743j68473L6840k14494P8470l4448M0331k06539l36163
$$ -622924 -85348 94395 -74078 -37238 -251732 -173262 -207710 -167379 -373918 -710081
5669g10081N07573J05309J6754l15008l51790N65818K22324J83053m8805m10271
$$ -710081 -202508 -97199 -80445 -395453 -747243 -181425 40899 223952 175147 -235124
5659b35124J15901n0499J03698J34484L46556K7009m87197k08111k10328k1834
$$ -235124 -119223 -169722 -66024 68460 415016 442025 -45172 -253283 -463611 -485445
5649d85445L36121q138j55700j82740j11934L41881L88803J13911K2846L35443
$$ -485445 -149324 -157462 -313162 -495902 -607836 -265955 122848 236759 259605 595048
5639E95048m7226m89605k10081J75490N89771j21238o01712L05368k11796n36014
$$ 595048 547822 58217 -151864 23626 613397 492159 -109553 195815 -15981 -551995
5629e51995J21342q3870R1305L20996j7471k67955k17403J63432M93327O5873
$$ -551995 -430653 -514523 -423218 -102222 -119693 -387648 -605051 -441619 51708 117581
5619A17581r7069j42700j5833Q4177l65618n996l60882O01141L30901Q26R9516
$$ 117581 20512 -122188 -138021 -53844 -419462 -425458 -786340 -185199 145702 146528 246044
5608B46044j41283K49821R4481J17305j6895l12219j91269J1204K83133J67569
$$ 246044 104761 354582 449063 566368 549473 237254 45985 57189 340322 507891
5598E07891l1142l86991P2255R698l35862k40522m1114K91599j6889p2994K30847
$$ 507891 476749 89758 162013 171711 -164151 -404673 -445787 -154188 -171077 -244071 -13224
5587a3224k86690j22353M12555j65732P5874m7373J27100M24851l43879J95394
$$ -13224 -299914 -422267 -9712 -175444 -99570 -146943 -19843 405008 61129 256523
5577B56523o1052j63366l77132M13750J58307L0762M47047j26877p01644m5871
$$ 256523 195471 32105 -345027 68723 227030 257792 704839 577962 -123682 -169553
5567a69553K89784R7724j10606k63946M766N1119J77245j25848K02340k3754K98710
$$ -169553 120231 217955 107349 -156597 -151831 -100712 76533 -49315 153025 129271 427981
5556D27981l90910j96761n9096K36173M5041N5898k14893M1297l71532L16934
$$ 427981 37071 -159690 -218786 17387 62428 118326 -96567 -55270 -426802 -109868
5546a09868M93454j62397K1526o37365J01094K58437K91204K53393l97110k11399
$$ -109868 383586 221189 242715 -394650 -293556 -35119 256085 509478 112368 -99031
5536i9031K48299l47785j98126K10728J01420M4121q7874J04130J98342l29873
$$ -99031 149268 -198517 -396643 -185915 -84495 -40374 -128248 -24118 174224 -155649
5526a55649N207K38727l62157L0914M42100J75874j69296j40331l72606j62557
$$ -155649 -150442 88285 -273872 -242958 199142 375016 205720 65389 -307217 -469774
5516d69774K54657R8504M88739p3586k84497j74212K61654l43236k49544K59505
$$ -469774 -215117 -116613 372126 298540 14043 -160169 101485 -241751 -491295 -231790
5506b31790J63527M4351m01811L53434L3427J30274m8852Q9647J78386j08382
$$ -231790 -68263 -23912 -425723 -72289 -38862 91412 42560 132207 310593 202211
5496B02211K4644j48129Q0426j20878K33904k3696k6649J33782k44692L63233
$$ 202211 226855 78726 159152 38274 272178 248482 221833 355615 110923 474156
5486D74156m44522k47571K30294K79594k7206k3601K44530n5667j98612r6635
$$ 474156 29634 -217937 12357 291951 264745 241144 485674 430007 231395 134760
5476A34760j4145n2913J1365p7359L84059l76375q1574N5360K39588K70731l76036
$$ 134760 120615 67702 79067 1708 385767 9392 -72182 -16822 222766 493497 117461
5465A17461J59049m4366k69583J56788r5081J81863j18470l9231k03382J3049
$$ 117461 276510 232144 -37439 119349 24268 206131 87661 48430 -154952 -141903
5455a41903j31304L5604K41099j3493J73790q3997J68898l61493J06917L58134
$$ -141903 -273207 -237603 3496 -9997 163793 79796 248694 -112799 -5882 352252
5445C52252k7699j92902k05383L90164O100l57784J80649M1913k8111J04374K41362
$$ 352252 324553 131651 -73732 316432 322532 -35252 145397 187310 159199 263573 504935
5434E04935k3051l72931K56001j05567M6312J36954n65265L200J55103k07085
$$ 504935 481884 108953 364954 259387 305699 442653 -122612 -119412 35691 -171394
5424a71394l7596J35523J81685L10379J4073k24109j14392l76508P3490P8271
$$ -171394 -208990 -73467 108218 418597 432670 208561 94169 -282339 -208849 -130578
5414a30578o9430L82066P7997k82939o7525P8997k5271o1614P5838J4807p4454
$$ -130578 -200008 182058 260055 -22884 -90409 -11412 -36683 -98297 -22459 -7652 -82106
5403h2106L54214K48478n27690j59283L14952p9690n7477m29777J99293K16983
$$ -82106 272108 520586 -7104 -166387 148565 68875 11398 -418379 -219086 -2103
5393b103L48602n15783M2386J00244J809K32013K8623K32921J48408j98295l89808
$$ -2103 346499 -169284 -126898 -26654 -24845 207168 235791 468712 617120 418825 29017
5382B9017P4422j36724j81937M83845k53889m5826J38418m1540L62201n2660m02191
$$ 29017 103439 -33285 -215222 268623 14734 -31092 107326 65786 427987 375327 -26864
5371b6864J72138K89866j15078k45021j60220M38287l27767K16442L68832J02974
$$ -26864 145274 435140 320062 75041 -85179 353108 25341 241783 610615 713589
5361G13589o5427j61186k317j83197j2247K86279j32635p1571J5226J71966J00043
$$ 713589 648162 486976 484659 301462 289215 575494 442859 371288 386514 558480 658523
5350F58523k74663P1674k47019K12153N3865j8290J6003P2235K30347m71975j63545
$$ 658523 383860 455534 208515 420668 474533 456243 472246 544481 774828 302853 139308
5339A39308L44891m9120J7149J70837l18854k17657K48806R2588k94575J88246
$$ 139308 484199 435079 452228 623065 304211 86554 335360 427948 133373 321619
5329C21619L23715j65220k03264L13790k76276N6939j45035j36948l72156L38070
$$ 321619 645334 480114 276850 590640 314364 371303 226268 89320 -282836 55234
5319E5234K60833J66005L25908j88713J19419L09726k32224q4599p7787k7641
$$ 55234 316067 482072 807980 619267 738686 1048412 816188 731589 653802 626161
5309F26161N7748l20243o0407J90790r3570J4491K5122K78240j53569k9098j57617
$$ 626161 683909 363666 303259 494049 400479 414970 440092 718332 564763 535665 378048
5298C78048j21044M77328j44352Q8705l88178r5643M16218p6022o303M29680l819
$$ 378048 257004 734332 589980 678685 290507 194864 611082 535060 528757 958437 954618
5287I54618j37991r3714k95087j36868L49942K19068m1625J15233j54930m93833
$$ 954618 816627 722913 427826 290958 640900 859968 818343 933576 778646 284813
5277B84813q0291L31414M12821k90737l49471J04177K10550M26215j6714l81811
$$ 284813 204522 535936 948757 658020 308549 412726 623276 1049491 1032777 650966
5267F50966K71455J85228J12796k77609j94898j01920k91809l10767M72822J07787
$$ 650966 922421 1107649 1220445 942836 747938 646018 354209 43442 516264 624051
5257F24051k98085j43021j02459Q0231j46248R0082M08422l06832N88990L52640
$$ 624051 325966 182945 80486 160717 14469 104551 512973 206141 795131 1147771
5247A147771m3104m3446k34920n2486k74640J10755L6807J93464j22909j07251
$$ 1147771 1104667 1061221 826301 773815 499175 609930 646737 840201 717292 610041
5237F10041Q4728O9414m96698O0233n2077J69398M72288l95836k27844M4639k31916
$$ 610041 694769 764183 267485 327718 275641 445039 917327 521491 293647 338286 106370
5226A06370J80906M96011L39180L9023k40414m21992o85179L34610M04730j93735
$$ 106370 287276 783287 1122467 1161490 921076 499084 -186095 148515 553245 359510
5216C59510m9943M5018j40494O91633j60030m60413O22063m42577l69028M98898
$$ 359510 309567 354585 214091 905724 745694 285281 907344 464767 95739 594637
5206E94637q4227j03448J94387j07290m8251j85950k15514J43090J41599J88193
$$ 594637 510410 406962 601349 494059 445808 259858 44344 187434 329033 517226
5196E17226N6344n63863j02288J69208L97985l33452n6447L58866J43517l20443
$$ 517226 573570 9707 -92581 76627 474612 141160 84713 443579 587096 266653
5186B66653l45410J89974L12673p5337J9187J21924k35726L45110K20623r5458
$$ 266653 -78757 111217 423890 348553 367740 489664 253938 599048 819671 724213
5176G24213N3557m21122l31878K03012K38239k35470K16437J81728k44900J50644
$$ 724213 777770 356648 24770 227782 466021 230551 446988 628716 383816 534460
5166E34460J38656j52484k26072K75084j70277J87613l35769k441J56927j53821
$$ 534460 673116 520632 294560 569644 399367 586980 251211 248770 405697 251876
5156B51876p8697M08881l8811m09342M13021k26158l87652L3874N75484l12548
$$ 251876 173179 582060 543249 133907 546928 320770 -66882 -33008 542476 229928
5146B29928J3043k56238n32672M76074R7706J48647M48801j97816m53071J38386
$$ 229928 242971 -13267 -545939 -69865 27841 176488 625289 427473 -25598 112788
5136A12788J71494J05035J09489p5568M9032J35863l09084k00358O82877Q5950
$$ 112788 284282 389317 498806 423238 472270 608133 299049 98691 781568 867518
5126H67518m72527j08270L02146J39973j62209L82698l86880k01876L90564p1909
$$ 867518 394991 286721 588867 728840 566631 949329 562449 360573 751137 679228
5116F79228l98108M4533K41741R8570K07601m05935k96390l938J67775J58384
$$ 679228 281120 325653 567394 665964 873565 467630 171240 167302 335077 493461
5106D93461Q3079K55447n4539J45640L03057j11158j4540p5644l25488j83703
$$ 493461 576540 831987 777448 923088 1226145 1114987 1100447 1024803 699315 515612
5096E15612K88693L02725k6040j29044J66770K14612n10173j79456K77240k9628
$$ 515612 804305 1107030 1080990 951946 1118716 1333328 823155 643699 920939 891311
5086H91311k36216J40427L71366k8940j01798l96260q931K88530P673L32327K63070
$$ 891311 655095 795522 1166888 1137948 1036150 639890 630959 919489 927162 1259489 1522559
5075A522559j11392J2203j02812k92093K75726M30908l30912j07287K31584J48354
$$ 1522559 1411167 1423370 1320558 1028465 1304191 1735099 1404187 1296900 1528484 1676838
5065A676838j35832n76312J07039Q3835L14594J99817l6565M6216J62742r5601
$$ 1676838 1541006 964694 1071733 1155568 1470162 1669979 1633414 1679630 1842372 1746771
5055A746771J46546m88794k92847P33513N7356q0575j77650L28166J58533j96570
$$ 1746771 1893317 1404523 1111676 1845189 1902545 1821970 1644320 1972486 2131019 1934449
5045A934449J27736o29014r504M69375p2159J81932l76899n46128J50379O5366
$$ 1934449 2062185 1433171 1423667 1893042 1820883 2002815 1625916 1079788 1230167 1295533
5035A295533N67487K78061k36963j92918q1503P765L73093K34487J6022L96005
$$ 1295533 1863020 2141081 1904118 1711200 1629697 1637462 2010555 2245042 2261064 2657069
5025B657069L75736M55313l87374O36539M80860l85589q08393q6585j03371l63711
$$ 2657069 3032805 3488118 3100744 3737283 4218143 3832554 3024161 2937576 2834205 2470494
5015B470494Q9262J64665q1204L5529j9274m80510j37906L84696j74737k21317
$$ 2470494 2559756 2724421 2643217 2678746 2659472 2178962 2041056 2425752 2251015 2029698
5005B029698r2607K37816J71029k22400M4045k2462m57383l59591M13141K87443
$$ 2029698 1937091 2174907 2345936 2123536 2167581 2145119 1687736 1328145 1741286 2028729
4995B028729K07882q1545j03437M5820m36267O20249M72482p80007R5251j79411
$$ 2028729 2236611 2155066 2051629 2097449 1661182 2281431 2753913 1973906 2069157 1889746
4985A889746j95734j19857L81940k90006J89452L9293j66140Q4152R1586J82531
$$ 1889746 1694012 1574155 1956095 1666089 1855541 1894834 1728694 1812846 1904432 2086963
4975B086963o0420k00622j81388o0672o0395k31884k07840Q5206K60986o0115
$$ 2086963 2026543 1825921 1644533 1583861 1523466 1291582 1083742 1168948 1429934 1369819
4965A369819k64798L40953J4346K5955o1781J42105L0613r7870l2499L48265k52559
$$ 1369819 1105021 1445974 1460320 1486275 1424494 1566599 1597212 1499342 1466843 1815108 1562549
4954A562549r7456p0154K30412q8206p8583k28479N1636K56914j63286Q5790L69245
$$ 1562549 1465093 1394939 1625351 1537145 1458562 1230083 1281719 1538633 1375347 1461137 1830382
4943A830382J10090J14770L64975n81288l20873M48083j46337M63454l93508n88668
$$ 1830382 1940472 2055242 2420217 1838929 1518056 1966139 1819802 2283256 1889748 1301080
4933A301080M42574K78661J96604J51667l48679j64107J35189L58860J32754l18720
$$ 1301080 1743654 2022315 2218919 2370586 2021907 1857800 1992989 2351849 2484603 2165883
4923B165883L85460l14183j89116j89537R2814K89974M98026j98457M5931n9717
$$ 2165883 2551343 2237160 2048044 1858507 1951321 2241295 2739321 2540864 2586795 2527078
4913B527078J46872k40779K55578J67842m76205L54099M1687P5514L32837l39671
$$ 2527078 2673950 2433171 2688749 2856591 2380386 2734485 2776172 2851686 3184523 2844852
4903B844852m26304L6488N60725k11872J76464L60067j38474p5351K65202K52694
$$ 2844852 2418548 2455036 3015761 2803889 2980353 3340420 3201946 3126595 3391797 3644491
4893C644491l4214R5700m21227k42436J50024M3655K00630L11442k1330J43370
$$ 3644491 3610277 3705977 3284750 3042314 3192338 3235993 3436623 3748065 3726735 3870105
4883C870105k03899J37250j91550R5662K48727K4837M8105p7414M09603j23566
$$ 3870105 3666206 3803456 3611906 3707568 3956295 3981132 4029237 3951823 4361426 4237860
4873D237860J01020K6029K53971J20494k66491K22708L63938R895J57365M8940
$$ 4237860 4338880 4364909 4618880 4739374 4472883 4695591 5059529 5069424 5226789 5275729
4863E275729l37437l59063K33940M06395J9006K72049M14240K26649l04228J9934
$$ 5275729 4938292 4579229 4813169 5219564 5238570 5510619 5924859 6151508 5847280 5867214
4853E867214L13718K59136p3557j28928Q7699K41672J88370J03140N22318K73027
$$ 5867214 6180932 6440068 6366511 6237583 6325282 6566954 6755324 6858464 7380782 7653809
4843G653809K87109K49202j07175M46053J56502K59748J64887k65515L05314M30660
$$ 7653809 7940918 8190120 8082945 8528998 8685500 8945248 9110135 8844620 9149934 9580594
4833I580594J04373k31836O18989L2034L13002K69194k35063R5106J75171L84161
$$ 9580594 9684967 9453131 10072120 10104154 10417156 10686350 10451287 10546393 10721564 11105725
4823A1105725M99602M84755R273J94632K22424Q17838L96060O99373M12058M90142
$$ 11105725 11605327 12090082 12099355 12293987 12516411 13334249 13730309 14429682 14841740 15331882
4813A5331882L41276N22890K55653P05634L11162K86129M34612N19068J14649
$$ 15331882 15673158 16196048 16451701 17157335 17468497 17754626 18189238 18708306 18822955
4804A8822955R6026K59287M43012M56484Q03862M20754N26015M00493J49498R98044
$$ 18822955 18918981 19178268 19621280 20077764 20881626 21302380 21828395 22228888 22378386 23376430
4794B3376430M16429J128205Q30178R95125O36890O30198J475130J697207R37492
$$ 23376430 23792859 24921064 25751242 26746367 27383257 28013455 29488585 31185792 32123284
4785C2123284J106186J476675J419076J486070J193956J337494J765483K002479
$$ 32123284 33229470 34706145 36125221 37611291 38805247 40142741 41908224 43910703
4777D3910703K121248K062543K042328K569721K901516L366659L058502L691061
$$ 43910703 46031951 48094494 50136822 52706543 55608059 58974718 62033220 65724281
4769F5724281M393407M831493M817805N139106N557450N609358N019929L847677
$$ 65724281 70117688 74949181 79766986 84906092 90463542 96072900 101092829 104940506
4761A04940506L030533K040170J087370J727233J737402O43589Q68800O21160
$$ 104940506 107971039 110011209 111098579 112825812 114563214 115206803 116075603 116696763
4753A16696763M28892N51457N81746J098328J637044K916420L876039L861145
$$ 116696763 117125655 117677112 118258858 119357186 120994230 123910650 127786689 131647834
4745A31647834M602602M664902N312422M610331M107423M751288M755375N330838
$$ 131647834 136250436 140915338 146227760 150838091 154945514 159696802 164452177 169783015
4737A69783015O229486O201988O042341N300493L605264J085551j178711l298467
$$ 169783015 176012501 182214489 188256830 193557323 197162587 198248138 197069427 193770960
4729A93770960m981827n625423n566595o378147o314661n727029n598717m700008
$$ 193770960 188789133 183163710 177597115 171218968 164904307 159177278 153578561 148878553
4721A48878553m399362l846131k801612k342149k016158j326523j414827j404852
$$ 148878553 144479191 140633060 137831448 135489299 133473141 132146618 130731791 129326939
4713A29326939j023049j201814j080844j778114k297375l641915l506806l816473
$$ 129326939 128303890 127102076 126021232 124243118 121945743 118303828 114797022 110980549
4705A10980549l983289m313905m229848m451078n074146n115973m963325n320778
$$ 110980549 106997260 102683355 98453507 94002429 88928283 83812310 78848985 73528207
4697G3528207n023814m750288m189175l118808k553379k600605k331627j848795
$$ 73528207 68504393 63754105 59564930 56446122 53892743 51292138 48960511 47111716
4689D7111716k004735j221072j125270j284914r66935j258341q51937q73296j169003
$$ 47111716 45106981 43885909 42760639 41475725 40508790 39250449 38398512 37525216 36356213
4680C6356213j127033q77675o70530q00781q51592q12706l50301o03250q8524
$$ 36356213 35229180 34351505 33680975 32880194 32028602 31215896 30865595 30262345 30173821
4671C0173821o56776o48915n25809j05052l07006o44634Q3654K96323k66882l85650
$$ 30173821 29517045 28868130 28342321 28237269 27930263 27285629 27369283 27665606 27398724 27013074
4661B7013074j29852M182K74473M4151j8234o290l36359J14514K05432J59936
$$ 27013074 26883222 26887404 27161877 27206028 27187794 27181504 26845145 26959659 27165091 27325027
4651B7325027N9814O81632R5256k67629k05141J66542M09158K33214K74981M17822
$$ 27325027 27384841 28066473 28161729 27894100 27688959 27855501 28264659 28497873 28772854 29190676
4641B9190676L36747O68002O60143O59849O166P80881O90372Q43200Q39956P46021
$$ 29190676 29527423 30195425 30855568 31515417 31521583 32302464 32992836 33836036 34675992 35422013
4631C5422013O93199M21142J089758P13312J065353R73741J405162Q85064J344582
$$ 35422013 36115212 36536354 37626112 38339424 39404777 40378518 41783680 42668744 44013326
4622D4013326J148624J195638J533596J365429J881711J626659J747648J796242
$$ 44013326 45161950 46357588 47891184 49256613 51138324 52764983 54512631 56308873
4614E6308873J696815J827903J670682K251028K121159J868115K361599J896582
$$ 56308873 58005688 59833591 61504273 63755301 65876460 67744575 70106174 72002756
4606G2002756K135251J839448J742534J395052J053309J540918Q98853K37461
$$ 72002756 74138007 75977455 77719989 79115041 80168350 81709268 82608121 82845582
4598H2845582k36534K95565j02484o02398j311191j316718j523271k182900j868013
$$ 82845582 82609048 82904613 82802129 82199731 80888540 79571822 78048551 75865651 73997638
4589G3997638j830891j795738k692184k378483k304231k606867k363121j941426
$$ 73997638 72166747 70371009 67678825 65300342 62996111 60389244 58026123 56084697
4581E6084697j810122j848720j829063j672663k322362k007800p32486j600016
$$ 56084697 54274575 52425855 50596792 48924129 46601767 44593967 43861481 42261465
4573D2261465j769343j652680j529905r04030p60874j339490r60275j071823j331930
$$ 42261465 40492122 38839442 37309537 36405507 35644633 34305143 33344868 32273045 30941115
4564C0941115j168951j100547q30161n01396p18225r54093k43635q51545p89201
$$ 30941115 29772164 28671617 27841456 27340060 26621835 25667742 25424107 24572562 23783361
4555B3783361l15363j158567r44760j17715p53820l25976m90208m68420k57651
$$ 23783361 23467998 22309431 21364671 21246956 20493136 20167160 19676952 19208532 18950881
4546A8950881j47065p34920N3476m76886q41302m68084N7680l3298l86174l10891
$$ 18950881 18803816 18068896 18122372 17645486 16804184 16336100 16393780 16360482 15974308 15663417
4536A5663417n37141j15033l24383m21403k34656K82538l45455l08036p93742
$$ 15663417 15126276 15011243 14686860 14265457 14030801 14313339 13967884 13659848 12866106
4527A2866106m78J17840R3513k86327j65161j39190J88375l52339l71967j04792
$$ 12866106 12865628 12983468 13076981 12790654 12625493 12486303 12674678 12322339 11950372 11845580
4517A1845580N480J07258j53905M3244j66222o7134j61737j07251k1203k61754
$$ 11845580 11851060 11958318 11804413 11847657 11681435 11614301 11452564 11345313 11324110 11062356
4507A1062356K54796J22444M5656O8741j78993k75851L03262J1444l62825J11038
$$ 11062356 11317152 11439596 11485252 11553993 11375000 11099149 11402411 11413855 11051030 11162068
4497A1162068K54738M06567k94125J15041k3458K943L28482k83027j81974L56844
$$ 11162068 11416806 11823373 11529248 11644289 11620831 11623774 11952256 11669229 11487255 11844099
4487A1844099J89718j16401j44804M49043J53836L56079M25558j37691J68801
$$ 11844099 12033817 11917416 11772612 12221655 12375491 12731570 13157128 13019437 13188238
4478A3188238m65308K46063N08235K59625M67342M4299k8816J89751O95061J39000
$$ 13188238 12722930 12968993 13477228 13736853 14204195 14248494 14219678 14409429 15104490 15243490
4468A5243490M2583K77068J31434K04994L17966j90651L10741Q41055o775K04828
$$ 15243490 15286073 15563141 15694575 15899569 16217535 16026884 16337625 17178680 17171905 17376733
4458A7376733O40296J27617K30706Q76593N94025K17345L68923R13771M26101
$$ 17376733 18017029 18144646 18375352 19251945 19845970 20063315 20432238 21346009 21772110
4449B1772110M60968O60761N37493M15653O09536L13949K93894M55592L67385
$$ 21772110 22233078 22893839 23431332 23846985 24456521 24770470 25064364 25519956 25887341
4440B5887341P40909L94353L02818M52170O16033P48791R31488P34328O31433
$$ 25887341 26628250 27022603 27325421 27777591 28393624 29142415 30073903 30808231 31439664
4431C1439664Q56271O79709J104517J030659R46941J497967R02427J116995J734471
$$ 31439664 32295935 32975644 34080161 35110820 36057761 37555728 38458155 39575150 41309621
4422D1309621J258097O47226P56185P53824J388724J646521J288935K157467J694984
$$ 41309621 42567718 43214944 43971129 44724953 46113677 47760198 49049133 51206600 52901584
4413E2901584K266886K178422K479600L257554L048084K926435M054081M709873
$$ 52901584 55168470 57346892 59826492 63084046 66132130 69058565 73112646 77822519
4405G7822519M647964N240389M567053M845485M031134M152307K932890K440034
$$ 77822519 82470483 87710872 92277925 97123410 101154544 105306851 108239741 110679775
4397A10679775K176692K388355K064522J793085J742507K266240K371791J362047
$$ 110679775 112856467 115244822 117309344 119102429 120844936 123111176 125482967 126845014
4389A26845014J780176J898312J988780K097787K849772L520951L623018L953270
$$ 126845014 128625190 130523502 132512282 134610069 137459841 140980792 144603810 148557080
4381A48557080M453958M170743M363841N049236N914395O571925O617248O626553
$$ 148557080 153011038 157181781 161545622 166594858 172509253 179081178 185698426 192324979
4373A92324979N082829L037497K58936k365219n370870p090398p144101p042861
$$ 192324979 197407808 200445305 200704241 198339022 192968152 185877754 178733653 171690792
4365A71690792o965176n982730n466651n599279n372095n246749m352390l609883
$$ 171690792 164725616 158742886 153276235 147676956 142304861 137058112 132705722 129095839
4357A29095839k966520k707932j719679j460315j292826r25372j01303O9629L95355
$$ 129095839 126129319 123421387 121701708 120241393 118948567 118023195 117921892 117991521 118386876
4348A18386876O68661l16432J04556p03208n97229j699772k577083l377820n111657
$$ 118386876 119055537 118739105 118843661 118140453 117543224 115843452 113266369 109888549 104776892
4339A04776892o285492p284733o583482o571821n953201m315827l324631l547669
$$ 104776892 98491400 91206667 84623185 78051364 72098163 67782336 64457705 60910036
4331F0910036l292315l257218l083665l529153k888399k469893j746304j763801
$$ 60910036 57617721 54360503 51276838 47747685 44859286 42389393 40643089 38879288
4323C8879288k001652k099027k279129j349475j413948j708196p78402r85955
$$ 38879288 36877636 34778609 32499480 31150005 29736057 28027861 27249459 26263504
4315B6263504j079516j102720q46855r28634p60402n28283p94047o76629l00531
$$ 26263504 25183988 24081268 23234413 22305779 21545377 21017094 20223047 19546418 19245887
4306A9245887k35517q21026l40531o95315l60419j56333p34850p22081p33043
$$ 19245887 19010370 18189344 17848813 17153498 16793079 16636746 15901896 15179815 14446772
4297A4446772k17079o34018m90709l04417k93866l02665J6085j11768j079240
$$ 14446772 14229693 13595675 13104966 12800549 12506683 12204018 12220103 12108335 11029095
4288A1029095j30420P0652l87423n09681l02025M6426n61922j72556k90806k62306
$$ 11029095 10898675 10969327 10581904 10072223 9770198 9816624 9254702 9082146 8791340 8529034
4278H529034l20059j50512p3871l69350k80193k09912J36087J2667k51209M58138
$$ 8529034 8208975 8058463 7984592 7615242 7335049 7125137 7261224 7273891 7022682 7480820
4268G480820j32622n04629n66495j18359J73823J006K49010m62512k60004m55502
$$ 7480820 7348198 6843569 6277074 6158715 6332538 6333544 6582554 6120042 5860038 5404536
4258E404536l20484k12640L11414Q9522j32306n84426M47365J11957j35997P5730
$$ 5404536 5084052 4871412 5182826 5272348 5140042 4555616 5002981 5114938 4978941 5054671
4248E054671l41068m008k39989L5535p6272l21556L83588Q4289o7158L1155j76690
$$ 5054671 4713603 4709595 4469606 4505141 4428869 4107313 4490901 4575190 4508032 4539187 4362497
4237D362497j37490k96738k39214L38746L8455k98490L66412o1405o229j03925
$$ 4362497 4225007 3928269 3689055 4027801 4066256 3767766 4134178 4072773 4066544 3962619
4227C962619j81730k96984l72470K97571R583Q92L53J51066k7061K7089J60934
$$ 3962619 3780889 3483905 3111435 3409006 3418589 3419481 3419834 3570900 3543839 3570928 3731862
4216C731862l04057k91264l27037K73805m3271p5141K98008o4487l13235j86449
$$ 3731862 3427805 3136541 2809504 3083309 3040038 2964897 3262905 3198418 2885183 2698734
4206B698734J25178m2642j36115K32044R802m24961J55699j0930J89258o2865
$$ 2698734 2823912 2781270 2645155 2877199 2887001 2462040 2617739 2606809 2796067 2733202
4196B733202M2790J4283M894m3750m0122J91636l28105j02666j26913l39366l45175
$$ 2733202 2775992 2790275 2795169 2751419 2711297 2902933 2574828 2472162 2345249 2005883 1660708
4185A660708k78904P91995J80202j88482L5474k60870k03259o5376K17678j95210
$$ 1660708 1381804 2173799 2354001 2165519 2200993 1940123 1736864 1671488 1889166 1693956
4175A693956L68271r1228J65862J80497J1467l91777K41620j50295k16226J27614
$$ 1693956 2062227 1970999 2136861 2317358 2328825 1937048 2178668 2028373 1812147 1939761
4165A939761M80114J5457j86344K44092j08525j3342l23484J40843K64059n6437
$$ 1939761 2419875 2435332 2248988 2493080 2384555 2371213 2047729 2188572 2452631 2396194
4155B396194J4066J89452l79581j49468n60765p6178L65764k139L21634O7352
$$ 2396194 2410260 2599712 2220131 2070663 1509898 1433720 1799484 1797345 2118979 2186331
4145B186331l39079p4875L04439l86170K82372J38625k53839J00968K05460K85303
$$ 2186331 1847252 1772377 2076816 1690646 1973018 2111643 1857804 1958772 2164232 2449535
4135B449535m3941k7791M6009l54056k18102M98924K0504j5576J30896j79824
$$ 2449535 2405594 2377803 2423812 2069756 1851654 2350578 2371082 2355506 2486402 2306578
4125B306578l8846J85230j03025j07498K18641l29365K51924K98618j17744j41322
$$ 2306578 2267732 2452962 2349937 2242439 2461080 2131715 2383639 2682257 2564513 2423191
4115B423191M26681l15879m39781L29870J41278l4767L09022P73521m44984m06171
$$ 2423191 2849872 2533993 2094212 2424082 2565360 2530593 2839615 3613136 3168152 2761981
4105B761981L65137l68787r4645O92975K95226k11987n12613K80042N5431K93951
$$ 2761981 3127118 2758331 2663686 3356661 3651887 3439900 2927287 3207329 3262760 3556711
4095C556711j59492j1679j31949K18956L8824K73747J06189L88640K12766j19200
$$ 3556711 3397219 3385540 3253591 3472547 3511371 3785118 3891307 4279947 4492713 4373513
4085D373513j70561q8839k87418j90360K31986l02369M42385O3892n48211k26522
$$ 4373513 4202952 4114113 3826695 3636335 3868321 3565952 4008337 4072229 3524018 3297496
4075C297496k40889L34652k03313k40180K83044R8917L13045p9802K57645J89381
$$ 3297496 3056607 3391259 3187946 2947766 3230810 3329727 3642772 3562970 3820615 4009996
4065D009996J02496J84324k81287k39317Q9001K1099O50663L55338j55075l94086
$$ 4009996 4112492 4296816 4015529 3776212 3865213 3886312 4536975 4892313 4737238 4343152
4055D343152M19125j28244m1136L05022p45538k15450L55787k64548k6211M45865
$$ 4343152 4762277 4634033 4592897 4897919 4152381 3936931 4292718 4028170 4001959 4447824
4045D447824j33458L82261m54669l12780m13737L06429J68453n1646r0607l03943
$$ 4447824 4314366 4696627 4241958 3929178 3515441 3821870 3990323 3938677 3848070 3544127
4035C544127O09893N0788r028l2020J37981k37416K47340Q8816l11618k34864
$$ 3544127 4154020 4204808 4195780 4163760 4301741 4064325 4311665 4400481 4088863 3853999
4025C853999n87032j45827L4236J96436J67737n78427K49669K58986M20337l836
$$ 3853999 3266967 3121140 3155376 3351812 3519549 2941122 3190791 3449777 3870114 3866278
4015C866278J84176k65385J43887o61609k41142K57952J07550p5824O050K38720
$$ 3866278 4050454 3785069 3928956 3267347 3026205 3284157 3391707 3315883 3321933 3560653
4005C560653K54032j28158j19389N35549m2110Q9237j23755j01380k86468l9651
$$ 3560653 3814685 3686527 3567138 4102687 4060577 4149814 4026059 3924679 3638211 3598560
3995C598560j25551p1669J36687m2794J79607K51126k39196k82407K64608K78208
$$ 3598560 3473009 3401340 3538027 3495233 3674840 3925966 3686770 3404363 3668971 3947179
3985C947179J38309K14931k68458J63766J43527j17513L08338J0284k24652j78894
$$ 3947179 4085488 4300419 4031961 4195727 4339254 4221741 4530079 4540363 4315711 4136817
3975D136817K6597k03990K49551J50000J15008P5955k62929K76745N7357q6449
$$ 4136817 4163414 3959424 4208975 4358975 4473983 4549938 4287009 4563754 4621111 4534662
3965D534662J9472k2868Q425L58278L50878j09349O2247n2080L16290j78610j86989
$$ 4534662 4554134 4531266 4539691 4897969 5248847 5139498 5201745 5149665 5465955 5287345 5100356
3954E100356M77534J99207l5458K15311J24225j56258L45442m3907L3197O7261
$$ 5100356 5577890 5777097 5741639 5956950 6081175 5924917 6270359 6226452 6259649 6326910
3944F326910k5215k08934J34110R4942P32782K40814j41864j46917J5506p7568
$$ 6326910 6301695 6092761 6226871 6321813 7054595 7295409 7153545 7006628 7022134 6944566
3934F944566n6489L14434j6278m01268n3189K68479L06282J76752p2830l00793
$$ 6944566 6888077 7202511 7186233 6784965 6731776 7000255 7306537 7483289 7410459 7109666
3924G109666J63667j54668P50356k20835k00079R0967j35980M15495M82990m05411
$$ 7109666 7273333 7118665 7869021 7648186 7448107 7539074 7403094 7818589 8301579 7896168
3914G896168q9057J95346k65216J70237n31066J07037j52014L79856J62335j96891
$$ 7896168 7807111 8002457 7737241 7907478 7376412 7483449 7331435 7711291 7873626 7676735
3904G676735j36760K36564L80271L64155L43020k39121r7569N5180j11134o28029
$$ 7676735 7539975 7776539 8156810 8520965 8863985 8624864 8527295 8582475 8471341 7843312
3894G843312P29390L97015R6260K44452L36086P07727L8382l46048M09595L13123
$$ 7843312 8572702 8969717 9065977 9310429 9646515 10354242 10392624 10046576 10456171 10769294
3884A0769294K9084K97739k22355K08802P12703l01412k77854Q54580J19620k91861
$$ 10769294 10798378 11096117 10873762 11082564 11795267 11493855 11216001 12070581 12190201 11898340
3874A1898340k08201L45592K96352O5806M99273K84577L85126Q11928O477O31156
$$ 11898340 11690139 12035731 12332083 12397889 12897162 13181739 13566865 14378793 14385270 15016426
3864A5016426M47887j78794P23106N01359O22554O48674N09724L78168k3242M28474
$$ 15016426 15464313 15285519 16008625 16509984 17132538 17781212 18290936 18669104 18645862 19074336
3854A9074336J021640M30731L70067J015583J20494j27991P62270R22953M98411
$$ 19074336 20095976 20526707 20896774 21912357 22032851 21904860 22667130 23590083 24088494
3845B4088494J142607M18645P31274J114820J046740P71542J501106R76378J071391
$$ 24088494 25231101 25649746 26381020 27495840 28542580 29314122 30815228 31791606 32862997
3836C2862997J428053J893400J453624K324510J860617J807469K630777K603818
$$ 32862997 34291050 36184450 37638074 39962584 41823201 43630670 46261447 48865265
3828D8865265L609811M053510L828783J725274o85244j809866q29667m73986K90390
$$ 48865265 52475076 56528586 60357369 62082643 61397399 59587533 58757866 58283880 58574270
3819E8574270J42518O33823O94795J432677J340685J456289K013964J794800J407172
$$ 58574270 58716788 59350611 60045406 61478083 62818768 64275057 66289021 68083821 69490993
3810F9490993J263090J140463R00725J184949J887832J880007J847747K429093
$$ 69490993 70754083 71894546 72795271 73980220 75868052 77748059 79595806 82024899
3802H2024899K684283L218064L306876M202941M418252L856134M886800N231487
$$ 82024899 84709182 87927246 91234122 95437063 99855315 103711449 108598249 113829736
3794A13829736N375652O398265O632423P455603P289708P240373P299676P246425
$$ 113829736 119205388 125603653 132236076 139691679 146981387 154221760 161521436 168767861
3786A68767861O806455O080434N361537N267745M337204L226736L037755K866277
$$ 168767861 175574316 181654750 187016287 192284032 196621236 199847972 202885727 205752004
3778B05752004L965619N009073O209078P717845R228005J1413455J4675461J5466609
$$ 205752004 209717623 214726696 220935774 228653619 237881624 249295079 263970540 279437149
3770B79437149J3260365O944885j370499n861087o536045l620879M37164L507141
$$ 279437149 292697514 299642399 298271900 292410813 285874768 282253889 282691053 286198194
3762B86198194O189472P759714J0056283J1634371J2887535J1912105R251097
$$ 286198194 292387666 300147380 310203663 321838034 334725569 346637674 355888771
3755C55888771N312375n9321l150496p162312j0146892j1776633j3471670j3108164
$$ 355888771 361201146 361141825 357991329 350829017 340682125 328905492 315433822 302325658
3747C02325658j1624634j0046753p503069n684281l391048l5869K192885L653287
$$ 302325658 290701024 280654271 273151202 267466921 264075873 264040004 266232889 269886176
3739B69886176J447125n537974j2622718j4657710j3827474j1550549q764441
$$ 269886176 271333301 265795327 253172609 238514899 224687425 213136876 204372435
3732B04372435p478686o001576n574549m885509l952597l369445k713630k511050
$$ 204372435 196893749 190892173 185317624 180432115 176479518 173110073 170396443 167885393
3724A67885393k793007m874033o657196q158758q668266q707931q038043o463099
$$ 167885393 165092386 160218353 153561157 145402399 136734133 128026202 119988159 113525060
3716A13525060n833852n291696n137977n397127m532181m676151m414843m047742
$$ 113525060 107691208 102399512 97261535 91864408 87332227 82656076 78241233 74193491
3708G4193491l460948k932082k805358k381066k175049j272194j607610p36619
$$ 74193491 70732543 67800461 64995103 62614037 60438988 59166794 57559184 56822565
3700E6822565j184343j212252o14725n73743j400489j837016j673878j678788
$$ 56822565 55638222 54425970 53811245 53237502 51837013 49999997 48326119 46647331
3692D6647331j377318j162337j210568j580998j021030j650087j367564j690898
$$ 46647331 45270013 44107676 42897108 41316110 40295080 38644993 37277429 35586531
3684C5586531j660324j355176p54195j237406j080696j176661n95064o44702p90618
$$ 35586531 33926207 32571031 31816836 30579430 29498734 28322073 27727009 27082307 26291689
3675B6291689j234205r31212j222969r59400l95457q17432p51424n29571m31591
$$ 26291689 25057484 24126272 22903303 21943903 21548446 20731014 19979590 19450019 19018428
3666A9018428o90337j76399n77621o22421l91928N9542k99955j012328o34598
$$ 19018428 18328091 18151692 17574071 16951650 16559722 16619264 16319309 15306981 14672383
3657A4672383J98999m54590l57744l06868k3673n35852m77531J28703k40728j98444
$$ 14672383 14871382 14416792 14059048 13752180 13728507 13192655 12715124 12843827 12603099 12404655
3647A2404655o13965J42849o2269k52262j95285l64469O5900J16365k82564j52869
$$ 12404655 11790690 11933539 11871270 11619008 11423723 11059254 11125154 11241519 10958955 10806086
3637A0806086m87871r87419O17414R7575l76173K91779P2771j49824l07867l53791
$$ 10806086 10318215 9330796 9948210 10045785 9669612 9961391 10034162 9884338 9576471 9222680
3627I222680q1388l52725J17890j55223j51562J10049j30987l37970J71351J60721
$$ 9222680 9141292 8788567 8906457 8751234 8599672 8709721 8578734 8240764 8412115 8572836
3617H572836j40272k55025N48687k16772l27681k9634q5104K5559l9966L9519
$$ 8572836 8432564 8177539 8726226 8509454 8181773 8152139 8067035 8092594 8052628 8092147
3607H092147N2098q0759J3279p1760N02740r7352P462K65375p2390L27394J70892
$$ 8092147 8144245 8063486 8076765 8005005 8507745 8410393 8417855 8683230 8610840 8938234 9109126
3596I109126l95617j00561Q550n4457j99102k96613j46898N0104n0230m193O94611
$$ 9109126 8713509 8612948 8621498 8567041 8367939 8071326 7924428 7974532 7924302 7920109 8614720
3585H614720j96119L94234M03200n94680k34500l4819N2268M17832K63680m30359
$$ 8614720 8418601 8812835 9216035 8621355 8386855 8352036 8404304 8822136 9085816 8655457
3575H655457K15889J12798j24591J30150K77396K73608R6351O36562k2562n76497
$$ 8655457 8871346 8984144 8859553 8989703 9267099 9540707 9637058 10273620 10251058 9674561
3565I674561p74917l77185l88926j50903k32365L4292k74222J34332L07207j07028
$$ 9674561 8899644 8522459 8133533 7982630 7750265 7784557 7510335 7644667 7951874 7844846
3555G844846j06825j93788M2499j77973m06558n2321l9000j52812m13483k3426
$$ 7844846 7738021 7544233 7586732 7408759 7002201 6949880 6910880 6758068 6344585 6321159
3545F321159j64853k76612p9253L8502p1161J60476R3851L531J65359m55790r4052
$$ 6321159 6156306 5879694 5800441 5838943 5767782 5928258 6022109 6025640 6190999 5735209 5641157
3534E641157q5523n56699r574j25688L83997j98609k02186J61625L50756l30600
$$ 5641157 5555634 4998935 4989361 4863673 5247670 5049061 4846875 5008500 5359256 5028656
3524E028656o08937j61299j93341M47456P5007m32716j48902J52348K17631r231
$$ 5028656 4419719 4258420 4065079 4512535 4587542 4154826 4005924 4158272 4375903 4366672
3514D366672K06725k89473m88331J72604L2477K21994J12539J1942L15399k5503
$$ 4366672 4573397 4283924 3795593 3968197 4000674 4222668 4335207 4347149 4662548 4637045
3504D637045k32748j14714j11828j76228J9946K34918l78733N4242P52047k82726
$$ 4637045 4404297 4289583 4177755 4001527 4021473 4256391 3877658 3931900 4683947 4401221
3494D401221k70223L40710j2814M3663k27069p3846K26960J35561J73083m33072
$$ 4401221 4130998 4471708 4458894 4502557 4275488 4201642 4428602 4564163 4737246 4304174
3484D304174N8391r0699m7264k643J49330k83353p71P4268r3821K14655j5395
$$ 4304174 4362565 4271866 4224602 4221959 4371289 4087936 4087165 4161433 4067612 4282267 4266872
3473D266872J51537L0815M93009k60964k55999l34642M89101M9599k79716j72603
$$ 4266872 4418409 4449224 4942233 4681269 4425270 4090628 4579729 4629328 4349612 4177009
3463D177009K73066k13753j62849k91305K5949N67592Q781m8111J01702L2509
$$ 4177009 4450075 4236322 4073473 3782168 3808117 4375709 4384490 4336379 4438081 4470590
3453D470590j91420J2084K24988k55784J83000O2127l0663k87079J05568j17359
$$ 4470590 4279170 4291254 4516242 4260458 4443458 4505585 4474922 4187843 4293411 4176052
3443D176052r2641L82620k11748n9828k72710J00623L16424O0941l4920L29210
$$ 4176052 4083411 4466031 4254283 4194455 3921745 4022368 4338792 4399733 4364813 4694023
3433D694023J31717j56367M47558j06656o6034O30230P51945J40285k85389L83208
$$ 4694023 4825740 4669373 5116931 5010275 4944241 5574471 6326416 6466701 6181312 6564520
3423F564520j8078K1113k70208K92656l14621j5759N71749m46355k00853j97813
$$ 6564520 6546442 6567555 6297347 6590003 6275382 6259623 6831372 6385017 6184164 5986351
3413E986351k30331l8860J93929L6737j2127J18615l23443k26818k61084n15318
$$ 5986351 5756020 5717160 5911089 5947826 5935699 6054314 5730871 5504053 5242969 4727651
3403D727651k30930K73949m24046P0296j82348n56812J57062l53743m90097p986
$$ 4727651 4496721 4770670 4346624 4416920 4234572 3677760 3834822 3481079 2990982 2982996
3393B982996K97319l18174n31466m18504J74264J68871M56034p8944k89179n1577
$$ 2982996 3280315 2962141 2430675 2012171 2186435 2355306 2811340 2732396 2443217 2391640
3383B391640J29809l64085j36382K2653j88484N02060m07496N16045J00713l85327
$$ 2391640 2521449 2157364 2020982 2043635 1855151 2357211 1949715 2465760 2566473 2181146
3373B181146P5906l20954p5031K2331J3073N7691m07864K28942k8303J83435j13390
$$ 2181146 2257052 1936098 1861067 1883398 1896471 1954162 1546298 1775240 1746937 1930372 1816982
3362A816982K09009J84961R1493K36698l6701J26888m80320P7946L9651n7216
$$ 1816982 2025991 2210952 2302445 2539143 2502442 2629330 2149010 2226956 2266607 2209391
3352B209391J58980j94273l44948L13140n1266k72195n3034O34783M0847m35263
$$ 2209391 2368371 2174098 1829150 2142290 2091024 1818829 1765795 2400578 2441425 2006162
3342B006162k85990Q7481N34104k33433K5911k46524j60805L99219L85238l87915
$$ 2006162 1720172 1807653 2341757 2108324 2134235 1887711 1726906 2126125 2511363 2123448
3332B123448K65593j59668J22888N33182N8669k99180k42288J7710m70794k06423
$$ 2123448 2389041 2229373 2352261 2885443 2944112 2644932 2402644 2420354 1949560 1743137
3322A743137L6967K20641P8931r5816k19261N88871J14073r1233J29490k36152
$$ 1743137 1780104 2000745 2079676 1983860 1764599 2353470 2467543 2376310 2505800 2269648
3312B269648j53357J72090j15212M8921k75585l55178J93210L87371J44431J03017
$$ 2269648 2116291 2288381 2173169 2222090 1946505 1591327 1784537 2171908 2316339 2419356
3302B419356m23910j99772J562K85345J48701J77286j40215o7758L12440k82231
$$ 2419356 1995446 1795674 1797236 2082581 2231282 2408568 2268353 2200595 2513035 2230804
3292B230804l70908N0952L645K51596K00675K61374k63769l21583N75752j00653
$$ 2230804 1859896 1910848 1914493 2166089 2366764 2628138 2364369 2042786 2618538 2517885
3282B517885j5595n59249M31988K09734n00497N16238J62791r7131l7466L4920
$$ 2517885 2502290 1943041 2375029 2584763 2084266 2600504 2763295 2666164 2628698 2663618
3272B663618m0021m9622R1162M3642l92597j32119K34760k00781j47448j23257
$$ 2663618 2623597 2573975 2665137 2708779 2316182 2184063 2418823 2218042 2070594 1947337
3262A947337J92041Q5616R8844N34673j5678j9620j28544k55051K67858N5388
$$ 1947337 2139378 2224994 2323838 2858511 2842833 2823213 2694669 2439618 2707476 2762864
3252B762864L73011j38449j19454K2172Q3374Q9286N13304O8611l40304J99659
$$ 2762864 3135875 2997426 2877972 2900144 2983518 3072804 3586108 3654719 3314415 3514074
3242C514074M06512M98350J18596O34989R7159R1636K79487r6278J01692J71865
$$ 3514074 3920586 4418936 4537532 5172521 5269680 5361316 5640803 5544525 5646217 5818082
3232E818082J46385M67748R10100M96107J7804M08874M16481K75599L51298L59269
$$ 5818082 5964467 6432215 7342315 7838422 7856226 8265100 8681581 8957180 9308478 9667747
3222I667747J9391J2295O0613j97066J9024J29483k45179m10779K27897R9360
$$ 9667747 9687138 9699433 9760046 9562980 9582004 9711487 9466308 9055529 9283426 9382786
3212I382786k30535k89851l89812l93689l64235j31141j89803j867J57966k99523
$$ 9382786 9152251 8862400 8472588 8078899 7714664 7583523 7393720 7391853 7549819 7250296
3202G250296j95408k00879j58919j83916k96472p6685M41278l71011l38170r116
$$ 7250296 7054888 6854009 6695090 6511174 6214702 6138017 6579295 6208284 5870114 5860998
3192E860998J25166O91007k52089M55710K54499j87856P21111M80344M47093N24288
$$ 5860998 5986164 6677171 6425082 6880792 7135291 6947435 7668546 8148890 8595983 9120271
3182I120271Q54576O87278J93008M7664l80327o9789N75599N68106O5715L0027
$$ 9120271 9974847 10662125 10855133 10902797 10522470 10452681 11028280 11596386 11662101 11692128
3172A1692128j09222R6052J77368K59944o6706j12932J12529J43882K45960n44
$$ 11692128 11582906 11678958 11856326 12116270 12049564 11936632 12049161 12193043 12439003 12438459
3162A2438459j44284q639k38204l84088j68077p80110n55054k57454k26746N9617
$$ 12438459 12294175 12285536 12047332 11663244 11495167 10715057 10160003 9902549 9675803 9735420
3152I735420j17518m29232M34377J13078R7766M3042J0231L17073Q28741L46332
$$ 9735420 9617902 9188670 9623047 9736125 9833891 9876933 9887164 10204237 11032978 11379310
3142A1379310k15623j85811k06038k8927p28524P6830l34030p42914o57972n02835
$$ 11379310 11163687 10977876 10771838 10742911 10014387 10091217 9757187 9014273 8356301 7853466
3132G853466m32967m27208l61655o1003K0734n33608J7188j25678m91921K9608
$$ 7853466 7420499 6993291 6631636 6570633 6591367 6057759 6074947 5949269 5457348 5486956
3122E486956k65392o9641J32866l7973k28584n60205o8312O820j74603n89140
$$ 5486956 5221564 5151923 5284789 5246816 5018232 4458027 4389715 4396535 4221932 3632792
3112C632792J3288R0342k80006M58951k17556o73303j64886N49566j75101m68115
$$ 3632792 3646080 3736422 3456416 3915367 3697811 3024508 2859622 3409188 3234087 2765972
3102B765972J86202L08784K19402l27839J56595P8151j79601M2190k69175l92681
$$ 2765972 2952174 3260958 3480360 3152521 3309116 3387267 3207666 3249856 2980681 2588000
3092B588000M34197j29394l28071k11855k44286N92521j79444J16742J36177l02615
$$ 2588000 3022197 2892803 2564732 2352877 2108591 2701112 2521668 2638410 2774587 2471972
3082B471972j28604K31946l36140N1480J96159J85992k24049l1010K27315j67032
$$ 2471972 2343368 2575314 2239174 2290654 2486813 2672805 2448756 2417746 2645061 2478029
3072B478029k20374J44664K17438l69009l71320K49587M25679j11339K26726k19856
$$ 2478029 2257655 2402319 2619757 2250748 1879428 2129015 2554694 2443355 2670081 2450225
3062B450225k69881J24412J28523o3407j97105l910j96964J33310M20851n40750
$$ 2450225 2180344 2304756 2433279 2369872 2172767 2168857 1971893 2105203 2526054 1985304
3052A985304k25284M84750L66475o56134J74112L24369k72480M32151J21465L96180
$$ 1985304 1760020 2244770 2611245 1955111 2129223 2453592 2181112 2613263 2734728 3130908
3042C130908J51395o21958r4173J52728j20294K41436j81711l53808Q6784J49543
$$ 3130908 3282303 2660345 2566172 2718900 2598606 2840042 2658331 2304523 2391307 2540850
3032B540850J78997l93501J442L08907L80236l65431l22943K79646L0332M2889
$$ 2540850 2719847 2326346 2327788 2636695 3016931 2651500 2328557 2608203 2638535 2681424
3022B681424n8751N62141j64947K6323K61617j43327L88030J27263K73796L5410
$$ 2681424 2622673 3184814 3019867 3046190 3307807 3164480 3552510 3679773 3953569 3988979
3012C988979N74740K8881L70802N66456k52565J82786K23495K74673j92754K5090
$$ 3988979 4563719 4592600 4963402 5529858 5277293 5460079 5683574 5958247 5765493 5790583
3002E790583p2040M75634k37623K5373k71509q38763J67269k16853l22910p9850
$$ 5790583 5718543 6194177 5956554 5981927 5710418 4871655 5038924 4822071 4499161 4419311
2992D419311j69079m53511p1880k09487l67159l06751L4966K45124M5812k74346
$$ 4419311 4250232 3796721 3724841 3515354 3148195 2841444 2876410 3121534 3167346 2893000
2982B893000l02368j24296R2390m54971j76551L92847r7229j47234K50456j59560
$$ 2893000 2590632 2466336 2558726 2103755 1927204 2320051 2222822 2075588 2326044 2166484
2972B166484m14082J61510K80422m91362j37815J81633K88097p5862q7482n74724
$$ 2166484 1752402 1913912 2194334 1702972 1565157 1746790 2034887 1959025 1871543 1296819
2962A296819M816K33844j57126J6045O2483j82286J2422P9295j92710k8474k44791
$$ 1296819 1301635 1535479 1378353 1394398 1456881 1274595 1287017 1366312 1173602 1145128 900337
2951I00337k1105k51016K07705r2320K45242K74322o0188p7376L07844j34242
$$ 900337 879232 628216 835921 743601 988843 1263165 1202977 1125601 1433445 1299203
2941A299203j60831P8717o8858r3584K63526J89044n04676K3468n6765J88131
$$ 1299203 1138372 1217089 1148231 1054647 1318173 1507217 1002541 1026009 969244 1157375
2931A157375m0573o04754P3470J47599P1375J74820o7997J78296J18085l99476
$$ 1157375 1116802 512048 585518 733117 804492 979312 911315 1089611 1207696 808220
2921H08220K1792k60035j45283O9324K21545j698j46034L05820J69234P420j7682
$$ 808220 830012 569977 424694 494018 715563 713865 567831 873651 1042885 1050305 1032623
2910A032623l83369o8484M19304k36067N5664k66195J20102J58377K02093l640
$$ 1032623 649254 580770 1000074 764007 819671 553476 673578 831955 1034048 1030408
2900A030408j41325n0661j26613J93755o74277R6765L51148N0512L38792j02205
$$ 1030408 889083 838422 711809 905564 231287 328052 679200 729712 1068504 966299
2890I66299j93205L5131j80920N07464l6947J85054L54397o14553K2150o2238
$$ 966299 773094 808225 627305 1134769 1097822 1282876 1637273 1022720 1044870 982632
2880I82632k54460K4973k2310l2947K72064J84424L18441q1775l13641L7995j83577
$$ 982632 728172 753145 730835 697888 969952 1154376 1472817 1391042 1077401 1115396 931819
2869I31819J49714L29788Q7668n28879p8994L7170k62907p0811j74490J65269
$$ 931819 1081533 1411321 1498989 970110 891116 928286 665379 594568 420078 585347
2859E85347J60675q1229K45764J07879o7341L45115p9319L0269K10138m35277
$$ 585347 746022 664793 910557 1018436 951095 1296210 1216891 1247160 1457298 1022021
2849A022021K70495K61246N3160l99109k16675L25289J30796l68320Q9273L92138
$$ 1022021 1292516 1553762 1606922 1207813 991138 1316427 1447223 1078903 1168176 1560314
2839A560314j51263R8353o0374J0103J91025m07618n1334M76437J20991N4252
$$ 1560314 1409051 1507404 1447030 1457133 1648158 1240540 1189206 1665643 1786634 1840886
2829A840886k22795L1680M35543K19227n268l4030k26927r2631M8405J19237J06921
$$ 1840886 1618091 1649771 2085314 2304541 2299273 2265243 2038316 1945685 1994090 2113327 2220248
2818B220248Q6653o5669L34965k09544K9973J41614K53368R0020j43948K94224
$$ 2220248 2306901 2241232 2576197 2366653 2396626 2538240 2791608 2881628 2737680 3031904
2808C031904m92910L5715K63801J70040K11284L0129l60555j44173M1466J07997
$$ 3031904 2538994 2574709 2838510 3008550 3219834 3249963 2889408 2745235 2786701 2894698
2798B894698K73749K16525K07123k653k1121K51463M657K36422r6440l8599M75100
$$ 2894698 3168447 3384972 3592095 3589442 3568321 3819784 3824441 4060863 3964423 3925824 4400924
2787D400924K96774J07283K66091J48651N37326J35415J28103J81155M75131J240959
$$ 4400924 4697698 4804981 5071072 5219723 5757049 5892464 6020567 6201722 6676853 7917812
2777G917812M90523M17042O66532N88847J300290J606057J186239J992873K597578
$$ 7917812 8408335 8825377 9491909 10080756 11381046 12987103 14173342 16166215 18763793
2768A8763793K938201L142565K793096L65711j761419l371071k716760j888327
$$ 18763793 21701994 24844559 27637655 28003366 26241947 22870876 20154116 18265789
2760A8265789j380214j207520j241698j397498j078867j354452r58547q12866
$$ 18265789 16885575 15678055 14436357 13038859 11959992 10605540 9646993 8834127
2752H834127p67226p22810l05043r26697m49047m63113j69370J58837n4850n58043
$$ 8834127 8066901 7344091 7039048 6112351 5663304 5200191 5030821 5189658 5134808 4576765
2742D576765n68402m6718L159j24106j08153l9956l78445m79318l96336N7257
$$ 4576765 4008363 3961645 3964804 3840698 3732545 3692589 3314144 2834826 2438490 2495747
2732B495747K92743k14769j07912l1833j11398K91947p8858l5184p2361n7281
$$ 2495747 2788490 2573721 2465809 2433976 2322578 2614525 2535667 2500483 2428122 2370841
2722B370841n0454k20937l06112o1065k6274J76560l48871L9284j17784m10186
$$ 2370841 2320387 2099450 1793338 1732273 1705999 1882559 1533688 1572972 1455188 1045002
2712A045002j61635n4238J86231O50859m69065m26868q6523L30652L05038j71202
$$ 1045002 883367 829129 1015360 1666219 1197154 770286 683763 1014415 1319453 1148251
2702A148251m18720K51017j0805p1346m40082P83001K93924n90871k76377J91444
$$ 1148251 729531 980548 969743 898397 458315 1241316 1535240 944369 667992 859436
2692H59436J03562q6710Q944m4289j20324K72417L32172n32354j06519L78557
$$ 859436 962998 876288 885232 840943 720619 993036 1325208 792854 686335 1064892
2682A064892j50469q9665n4983Q5455Q070k02661K27037J6731j68284l5550L84584
$$ 1064892 914423 824758 769775 855230 863300 660639 887676 904407 736123 700573 1085157
2671A085157O9658j78906k91413j23408k36361J04025p9194J17645j57703J17869
$$ 1085157 1154815 975909 684496 561088 324727 428752 349558 467203 309500 427369
2661D27369M7695R849K25513j86217l2554m20594O5732k2922O2318K23590j84908
$$ 427369 475064 484913 710426 524209 491655 71061 136793 113871 176189 399779 214871
2650B14871r2233J69998k64886J09255K55895m0706K25134k39293K27983n7092
$$ 214871 122638 292636 27750 137005 392900 352194 577328 338035 566018 508926
2640E08926m12932P1450j57099J7161m1819L04848K44935o3926j11027M39297
$$ 508926 95994 167444 10345 27506 -14313 290535 535470 471544 360517 799814
2630G99814m88351k44234J19503j85119l54447J88816Q3020r0857K93786R924
$$ 799814 311463 67229 186732 1613 -352834 -164018 -80998 -171855 121931 131855
2620A31855K95360k84773Q8813J5072J58829j21180K20431P1069k82202m51032
$$ 131855 427215 142442 231255 246327 405156 283976 504407 575476 293274 -157758
2610a57758j5145J65122R4549J45869R4807P742j80086R5966L4409K18029r8266
$$ -157758 -172903 -7781 86768 232637 327444 335186 155100 251066 285475 503504 405238
2599D05238n88494J59708R4479l09198J93632L59587n5736q6623N4822l441k11572
$$ 405238 -183256 -23548 70931 -238267 -44635 314952 259216 172593 227415 223974 12402
2588A2402j2153j33731j75378L4395O01796l67229L71580j180k68591J73166l05161
$$ 12402 249 -133482 -308860 -274465 327331 -39898 331682 330502 61911 235077 -70084
2577g0084k16600K29941J23741N5198O4596k85740J89300r6113R1240J06192j1700
$$ -70084 -286684 -56743 66998 122196 186792 -98948 90352 -5761 85479 191671 179971
2566A79971q140k80448J41692n2163K06047k2705n08558J43664j70650q7251J27954
$$ 179971 171831 -108617 33075 -19088 186959 164254 -344304 -200640 -371290 -458541 -330587
2555c30587J3922K06003k56059k0795M20719j04827J80156J34536j15894J71852
$$ -330587 -316665 -110662 -366721 -387516 33203 -71624 108532 243068 127174 299026
2545B99026j14630m80161N9051N22562j15800j49772n0608N4074P9782k55925
$$ 299026 184396 -295765 -236714 285848 170048 20276 -30332 23742 103524 -152401
2535a52401j68165K90626L00263J7090n4264j4605o3284j72081m76372Q6753L82865
$$ -152401 -320566 -29940 270323 287413 233149 218544 155260 -16821 -493193 -406440 -23575
2524b3575n56961k04718Q17557k85242k50558M3808L04937N41143m9550j13905
$$ -23575 -580536 -785254 32303 -252939 -503497 -459689 -154752 386391 336841 222936
2514B22936M396k82677j95488J74410K19325k94330O397J61578j86120K15126
$$ 222936 227332 -55345 -250833 -76423 142902 -151428 -145031 16547 -169573 45553
2504D5553l54263M56503o81318R5303l9122L77694k4143J3812K58188n1930q8868
$$ 45553 -308710 147793 -533525 -438222 -477344 -99650 -123793 -109981 148207 96277 7409
2493G409m7022j75643O30257M23272o35271M7634m03663j72991J81222N8069m3640
$$ 7409 -39613 -215256 415001 838273 203002 250636 -153027 -326018 -144796 -86727 -130367
2482a30367N00174N7278l75504l8195J18778j05362j13935J88164J82713k72470
$$ -130367 369807 427085 51581 13386 132164 26802 -87133 101031 283744 11274
2472A1274J0762k2203k8734M0280J7542O7175q5831P0169j63470r2495M4926J48238
$$ 11274 22036 -167 -28901 11379 28921 96096 10265 80434 -83036 -175531 -130605 17633
2460A7633k66363N919j210o3155J18458j53317m04746M19363R6130m1679q699
$$ 17633 -248730 -242811 -244021 -307176 -188718 -342035 -746781 -327418 -231288 -272967 -281666
2449b81666m30267N51359M58908L3203J1911m45419p435K5388l86732M0735K85184
$$ -281666 -711933 -160574 298334 331537 343448 -101971 -109406 -84018 -470750 -430015 -144831
2438a44831j19265l9118o1415J91976J95088j83462K88488P3013k14015J38238
$$ -144831 -264096 -303214 -364629 -172653 22435 -161027 127461 200474 -13541 124697
2428A24697j56426m856M10968J22964J24456k67713m4396n52216j66480J52048
$$ 124697 -31729 -36585 374383 497347 621803 354090 309694 -242522 -409002 -256954
2418b56954K01507J26466K44950k45789k12417J33749R7753j58508p8572L83699
$$ -256954 -55447 71019 315969 70180 -142237 -8488 89265 -69243 -147815 235884
2408B35884j87601j39614m57797K27039J80582o7133j43674L4037J16295k96040
$$ 235884 48283 -91331 -549128 -322089 -141507 -208640 -352314 -318277 -201982 -498022
2398d98022L18912o6436J28923m2626j31231l19850K48968j50605K49654K84253
$$ -498022 -179110 -245546 -116623 -159249 -290480 -610330 -361362 -511967 -262313 21940
2388B1940j66109k81493R706K93404j67178M0599q975j77886R2775J85700j67462
$$ 21940 -144169 -425662 -415956 -122552 -289730 -249131 -258106 -435992 -343217 -157517 -324979
2377c24979J53247j71449j79508K94072l20169Q6679M04552j46299j84930j70411
$$ -324979 -171732 -343181 -522689 -228617 -548786 -462107 -57555 -203854 -388784 -559195
2367e59195J2193P8049m389k2309K03777J66604R5026k8182k27250k24091o4286
$$ -559195 -547002 -468953 -473342 -495651 -291874 -125270 -30244 -58426 -285676 -509767 -574053
2356e74053K62552K38114l6305O7464L06106l83673m94456K71461n2985M74166
$$ -574053 -311501 -73387 -109692 -42228 263878 -119795 -614251 -342790 -395775 78391
2346G8391O6790j10732L42295l74664k5576p1382J2847j17667j95216J52175M88931
$$ 78391 145181 34449 376744 2080 -23496 -94878 -82031 -199698 -394914 -242739 246192
2335B46192M51219k15871m61172p1166M1936R8211M45512j0948m99203K73896
$$ 246192 697411 481540 20368 -50798 -8862 89349 534861 523913 24710 298606
2325B98606q4156J33333j26569K84196J25928l18706o3305l72835o3488P5920
$$ 298606 214450 347783 221214 505410 631338 312632 249327 -123508 -186996 -111076
2315a11076L01662j04849k87721l1467p6605k51637L30736j4908j90079r8887
$$ -111076 190586 85737 -201984 -233451 -310056 -561693 -230957 -245865 -435944 -534831
2305e34831M79996J71981n49363k7145K70399l6540J23066j15869K05989K9656
$$ -534831 -54835 117146 -432217 -459362 -188963 -225503 -102437 -218306 -12317 17339
2295A7339j34914J26536k74596m01143R2080n1J04303L4668L85728M41064l39236
$$ 17339 -117575 8961 -265635 -666778 -574698 -574749 -470446 -435778 -50050 391014 51778
2284E1778j27482l03080N3029Q46472K94800k43133K7474n0652j60051l28663
$$ 51778 -75704 -378784 -325755 520717 815517 572384 599858 549206 389155 60492
2274F0492J76648N00568L41309K72591o54812P4184J99848J49179p35779l02058
$$ 60492 237140 737708 1079017 1351608 696796 770980 970828 1120007 384228 82170
2264H2170j22616j09259O028J87203K4271j87011K02064j27863j10292q0927J02118
$$ 82170 -40446 -149705 -143677 43526 67797 -119214 82850 -45013 -155305 -236232 -134114
2253a34114O2655n8281K19999J12286k46069k11074m7851O5729Q9653M00226j0510
$$ -134114 -71459 -129740 90259 202545 -43524 -254598 -302449 -236720 -147067 253159 242649
2242B42649l32075j70011Q8392J10865L4328j60242J82705n25009j35929N44208
$$ 242649 -89426 -259437 -171045 -60180 -25852 -186094 -3389 -528398 -664327 -120119
2232a20119p7116N0489R7876r7851k7727j10676j13144Q6281M0845M32027k6050
$$ -120119 -197235 -146746 -48870 -146721 -174448 -285124 -398268 -311987 -271142 160885 134835
2221A34835J76889j69224k97138M11475k52489k41333k1226O58274m92493j55525
$$ 134835 311724 142500 -154638 256837 4348 -236985 -258211 400063 -92430 -247955
2211b47955K58411K22428l97548J92738K21836k45739L16637n0184m5015J37995
$$ -247955 10456 232884 -164664 28074 249910 4171 320808 270624 225609 363604
2201C63604L19005q6577m0047j51022j06607q4796j47066O2734n6740J93876j89506
$$ 363604 682609 596032 555985 404963 298356 213560 66494 129228 72488 266364 76858
2190G6858J73239j33432k49335L23110K0363J59886K24298K68586l67657o47526
$$ 76858 250097 116665 -132670 190440 210803 370689 594987 863573 495916 -151610
2180a51610l37431P19392K42662r884r3820l20213K35686L34725k56227k85528
$$ -151610 -489041 230351 473013 463129 369309 49096 284782 619507 363280 77752
2170G7752M20935J55982Q3764j83432j90691P6760n3456M97931J4137n24241m76608
$$ 77752 498687 654669 738433 555001 364310 441070 387614 885545 899682 375441 -101167
2159a01167n65624M24289O34746j85108o944j7993M07142J68440K9618K58402
$$ -101167 -666791 -242502 392244 207136 200192 182199 589341 757781 787399 1045801
2149A045801J13463k6192k81256k20728n33979j1249p4959l7935J77417n2773
$$ 1045801 1159264 1133072 851816 631088 97109 85860 10901 -27034 150383 97610
2139I7610M90230K11131p8604K8024m53470K80384J91154k36756K10108k5346
$$ 97610 587840 798971 720367 748391 294921 575305 766459 529703 739811 714465
2129G14465j80214k41483o1892L97055r541q1916j32910K68194K42963J06198
$$ 714465 534251 292768 230876 627931 618390 536474 403564 671758 914721 1020919
2119A020919k26286J16573k14914l33539N77139N45424K23117m17568J24172J05026
$$ 1020919 794633 911206 696292 362753 939892 1485316 1708433 1290865 1415037 1520063
2109A520063n3946K84491J74819l57595j33013M97815l67594n26753J52565M74433
$$ 1520063 1466117 1750608 1925427 1567832 1434819 1932634 1565040 1038287 1190852 1665285
2099A665285l28811j6770K10340r7532j87988N35101O22900j45242n3436J20796
$$ 1665285 1336474 1319704 1530044 1432512 1244524 1779625 2402525 2257283 2203847 2324643
2089B324643j06939j58364k6874O2985M65020J10625l28003L56252p5749J36907
$$ 2324643 2217704 2059340 2032466 2095451 2560471 2671096 2343093 2699345 2623596 2760503
2079B760503k47695j02077K35462J60751L06683J08177M21186k06054K12607R919
$$ 2760503 2512808 2410731 2646193 2806944 3113627 3221804 3642990 3436936 3649543 3659462
2069C659462p7967j05144J1838q7073N4198M40070O52164k17228j71329K92380
$$ 3659462 3581495 3476351 3488189 3401116 3455314 3895384 4547548 4330320 4158991 4451371
2059D451371K41411j29511K75766l3676M39596j5546j53615K34428L55700M63454
$$ 4451371 4692782 4563271 4839037 4805361 5244957 5229411 5075796 5310224 5665924 6129378
2049F129378l91707L64132M17569Q2857N72974J87101Q7889Q45427K75015J54696
$$ 6129378 5737671 6101803 6519372 6602229 7175203 7362304 7450193 8295620 8570635 8725331
2039H725331R0976K06785O82065L03751O57668L04853M90167M74103P41899O67334
$$ 8725331 8816307 9023092 9705157 10008908 10666576 10971429 11461596 11935699 12677598 13344932
2029A3344932R07050P41534J197529Q97436R69507Q83466J305673J695307J477622
$$ 13344932 14251982 14993516 16191045 17088481 18057988 18941454 20247127 21942434 23420056
2020B3420056K217187K128693J425918J475643K226829K923215M105323N224882
$$ 23420056 25637243 27765936 29191854 30667497 32894326 35817541 39922864 45147746
2012D5147746N733063P558626R352238J2438450J5671742K2662464K8567833K8618778
$$ 45147746 50880809 58439435 67791673 80230123 95901865 118564329 147132162 175750940
2004A75750940l115362l5537515l2174916k2720501j5787161j2018254q024497
$$ 175750940 172635578 137098063 104923147 82202646 66415485 54397231 46372734
1997D6372734o629857m726447l629565l075680j757314r45722j176100m19118
$$ 46372734 39742877 35016430 31386865 28311185 26553871 25608149 24432049 24012931
1989B4012931p76164k493582k609158r18125j451053j072942q90255j012041q33815
$$ 24012931 23236767 20743185 18134027 17215902 15764849 14691907 13801652 12789611 11955796
1980A1955796o8590p08977k52504n21875m89093m36935l6128m17371k90708n71903
$$ 11955796 11887206 11178229 10925725 10403850 9914757 9477822 9441694 9024323 8733615 8161712
1970H161712n33660j84868o14265k86884m09963l06546J65950j55036l52732k13919
$$ 8161712 7628052 7443184 6828919 6542035 6132072 5825526 5991476 5836440 5483708 5269789
1960E269789j72943n65147J35674k41375K24528k01592p36720K05677K9923k50613
$$ 5269789 5096846 4531699 4667373 4425998 4650526 4448934 3712214 3917891 3947814 3697201
1950C697201K21809k70262j16066l19744L3253j07641l65897j06151k63863L8140
$$ 3697201 3919010 3648748 3532682 3212938 3246191 3138550 2772653 2666502 2402639 2440779
1940B440779n4109L30496R3624O8916k54800k63040j96241j10511m48849K65341
$$ 2440779 2386670 2717166 2810790 2879706 2624906 2361866 2165625 2055114 1606265 1871606
1930A871606n4014M04922r1460j49598k40231m24240r1516j95766L21288K89076
$$ 1871606 1817592 2222514 2131054 1981456 1741225 1316985 1225469 1029703 1350991 1640067
1920A640067q7957Q3265j40100N50367k65687l58204q0584L82268m4981q3200
$$ 1640067 1552110 1635375 1495275 2045642 1779955 1421751 1341167 1723435 1678454 1595254
1910A595254M07j18865j74314L31818n47818K80861k00766l63364L59610j26200
$$ 1595254 1595661 1476796 1302482 1634300 1086482 1367343 1166577 803213 1162823 1036623
1900A036623j19583K16998j1996K56136o3709j2011m13749j08316P11038k91827
$$ 1036623 917040 1134038 1122042 1378178 1314469 1302458 888709 780393 1491431 1199604
1890A199604l98942J98310l61737p5984K35070k01418j10073j50378J77211J27474
$$ 1199604 800662 998972 637235 561251 796321 594903 484830 334452 511663 639137
1880F39137J84790K88382n6919j93165L8786r7607L56141n55891K83750J54765
$$ 639137 823927 1112309 1055390 862225 901011 803404 1159545 603654 887404 1042169
1870A042169j81465m90329j35873M21080K36436J1535l13564j78060J62988J4143
$$ 1042169 860704 370375 234502 655582 892018 903553 589989 411929 574917 589060
1860E89060o2789k15006l1144J65242k77569N84041J02720q5204L15585l38123
$$ 589060 526271 311265 280121 445363 167794 751835 854555 769351 1084936 746813
1850G46813N3573L65290l30819r6242j39521O9473k79479j42438k71452L6265
$$ 746813 800386 1165676 834857 738615 599094 668567 389088 246650 -24802 11463
1840A1463R643M98361L03098m05034k23821L29244M16942o38611j68173P5008
$$ 11463 21106 519467 822565 417531 193710 522954 939896 301285 133112 208120
1830B08120J42829o0720q7615o4874L03063J29912L38140l46485k62548j88410
$$ 208120 350949 290229 202614 137740 440803 570715 908855 562370 299822 111412
1820A11412L30290k81955j08967K5236k71601J94669k93404j80250k4991L57277
$$ 111412 441702 159747 50780 76016 -195585 -916 -294320 -474570 -499561 -142284
1810a42284N83032J71471m00048k16305K43155k74497m49395J24335M94994M93882
$$ -142284 440748 612219 212171 -4134 239021 -35476 -484871 -360536 134458 628340
1800F28340J24538q0525l66675l23563j41597J79900J77294J24740J26306k84459
$$ 628340 752878 672353 305678 -17885 -159482 20418 197712 322452 448758 164299
1790A64299O9151k27293J46578o4470j5215J38402K24694n52222J92557m9741
$$ 164299 233450 6157 152735 88265 73050 211452 436146 -116076 76481 26740
1780B6740j01331J69754J83817k2014p8620L87060m12067l2458k19700K05365
$$ 26740 -74591 95163 278980 256966 178346 565406 153339 120881 -98819 106546
1770A06546K03132j37710k3193K34751J38874k42830q2306J30126K49448j09388
$$ 106546 309678 171968 148775 383526 522400 279570 197264 327390 576838 467450
1760D67450j58157n95965j57498L41916L20784k46849j25281L84497p1312M10648
$$ 467450 309293 -286672 -444170 -102254 218530 -28319 -153600 230897 159585 570233
1750E70233J46633l29060j53896J97472J35056k10885P3595L02254J72577K70529
$$ 570233 716866 387806 233910 431382 566438 355553 429148 731402 903979 1174508
1740A174508k88027l82816q9739N53146J21628j59909l42767j74596Q8081k7409
$$ 1174508 886481 503665 413926 967072 1088700 928791 586024 411428 499509 472100
1730D72100j68174J79567k60235j99815K08913J19594j8055k978k96702m433M3759
$$ 472100 303926 483493 223258 23443 232356 351950 333895 330917 34215 29782 73541
1719G3541J14373j19956k82444j01296J18144j09461q4406Q3066K27553n480j69494
$$ 73541 187914 67958 -214486 -315782 -197638 -307099 -391505 -308439 -80886 -86366 -255860
1708b55860l05029L16333R0745p4629N14984J81597j4820l98698J60684J15745
$$ -255860 -560889 -244556 -153811 -228440 286544 468141 453321 54623 215307 331052
1698C31052k05250j03166o893j36435K90025K21976k47246m7539n6033M5860l52423
$$ 331052 125802 22636 15743 -120692 169333 391309 144063 96524 40491 86351 -266072
1687b66072P9391K20608K50368n7226k32571K63141M67431k03980k70344r7543
$$ -266072 -186681 33927 284295 227069 -5502 257639 725070 521090 250746 153203
1677A53203k43138L86060J48154k78518k20515K22248L72263O2086l72331P2409
$$ 153203 -89935 296125 444279 165761 -54754 167494 539757 601843 229512 301921
1667C01921K5750j89836k50672J27909q3666m5130p4188Q3069J32009m480o6471
$$ 301921 327671 137835 -112837 15072 -68594 -113724 -187912 -104843 27166 22686 -43785
1656d3785r3317k33249J19544O57037j64790N5086j93846k25690J54854K11420
$$ -43785 -137102 -370351 -250807 406230 241440 296526 102680 -123010 31844 243264
1646B43264k54772N7237J47003j62942l04488L32066K27634K8230k38144J68718
$$ 243264 -11508 45729 192732 29790 -274698 57368 285002 313232 75088 243806
1636B43806L55642l95890o9164j38616P1636p3102o3887k82188r248K31028P7736
$$ 243806 599448 203558 134394 -4222 67414 -5688 -69575 -351763 -361011 -129983 -52247
1625e2247r3081K9959n3373N47619o0015k81908q5758N94265l18406N6461Q1422
$$ -52247 -145328 -115369 -168742 378877 318862 36954 -48804 545461 227055 283516 364938
1614C64938p49738l12719J6932L92035M61306K09953M18028j64166n03270O564
$$ 364938 -384800 -697519 -680587 -288552 172754 382707 800735 636569 133299 139863
1604A39863k62401n653K32906p0935j42332Q5521L22085K078K9717l70993l39721
$$ 139863 -122538 -128191 104715 33780 -108552 -23031 299054 301132 330849 -40144 -379865
1593c79865J92619L73734l02134k56713N84720l4931L043j3475j08393J51353
$$ -379865 -187246 186488 -115646 -372359 212361 177430 180473 166998 58605 209958
1583B09958n7555l39515j31042L1197J57778L89093J27151j85298k39173j14026
$$ 209958 152403 -187112 -318154 -286957 -129179 259914 387065 201767 -37406 -151432
1573a51432K2821L18049l1326P9838P570l24508k99939K42313L3435J71415K93064
$$ -151432 -128611 189438 158112 237950 245520 -78988 -378927 -136614 -103179 68236 361300
1562C61300k81164k19644k6541K47241J42769J71149R3130m07130j8262r4836
$$ 361300 80136 -139508 -166049 81192 223961 395110 488240 81110 62848 -31988
1552c1988j53004k13217j43164N39592J38271j10631l68114K2700j71829J81438
$$ -31988 -184992 -398209 -541373 -1781 136490 25859 -342255 -319555 -491384 -309946
1542c09946J02993L25447k3691L54741r778j86906l11443L68362K90873N19633
$$ -309946 -206953 118494 94803 449544 439766 252860 -58583 309779 600652 1120285
1532A120285o34190m85174J2821J52693l59733l97099M60580n6948J37361m4448
$$ 1120285 486095 921 13742 166435 -193298 -590397 -129817 -186765 -49404 -93852
1522i3852j18962J68951L1555j52397p0327r6195K48899K98243p4343j93622L10591
$$ -93852 -212814 -43863 -12308 -164705 -235032 -331227 -82328 215915 141572 -52050 258541
1511B58541J97460p83058K00207N6965K75638j0013l34304L63090k96290j02783
$$ 258541 456001 -327057 -126850 -69885 205753 195740 -138564 224526 -71764 -174547
1501a74547J10014n5727j32278j6120J43280j25855j97285K70035o9639L14881
$$ -174547 -64533 -120260 -252538 -268658 -125378 -251233 -448518 -178483 -248122 66759
1491F6759L0675p8706J0605K1628j49802O61K73363K41136j66703J08975l90733
$$ 66759 97434 18728 29333 50961 -98841 -98180 175183 416319 249616 358591 -32142
1480c2142k59764L15322J49369q6299m7072J24504l08642n90382M1100R31129
$$ -32142 -291906 23416 172785 86486 39414 163918 -144724 -735106 -694006 237123
1470B37123K56088l8808J63354o43442j35984J93980L35759K8278l48645J21137
$$ 237123 493211 454403 617757 -25685 -161669 32311 368070 396348 47703 168840
1460A68840j3672n29504K10248J63595K48987k03580J4683l69024k23952K7091
$$ 168840 155168 -374336 -164088 -493 248494 44914 59597 -309427 -533379 -506288
1450e06288J91743k7114j78223K31560J27309J25924L39702j3749l82209J28994
$$ -506288 -314545 -341659 -519882 -288322 -161013 -35089 304613 290864 -91345 37649
1440C7649k98236p0494K82674j13257j49236K79544K18278q8511j34416K34010
$$ 37649 -260587 -331081 -48407 -161664 -310900 -31356 186922 98411 -36005 198005
1430A98005j37185N0705N5774k24962l0388M5119m6333K16398N7385m86231j29110
$$ 198005 60820 111525 167299 -57663 -88051 -42932 -89265 127133 184518 -301713 -430823
1419d30823j25631J86882k9054N60395K92850k70039j27598m44229K05999J3309
$$ -430823 -556454 -369572 -398626 161769 454619 184580 56982 -387247 -181248 -167939
1409a67939j87992N86919m5207j56863K44808l14982j77230K07763n1101K00707
$$ -167939 -355931 230988 185781 28918 273726 -41256 -218486 -10723 -61824 138883
1399A38883K34214p75006J3389K66975j08430J89890o1665l80021L06440J8846
$$ 138883 373097 -401909 -388520 -121545 -229975 -40085 -101750 -481771 -175331 -156485
1389a56485L03704j4923o4417k18686N9925m4082K07736k21701r1903O40723l73119
$$ -156485 147219 132296 67879 -150807 -90882 -134964 72772 -148929 -240832 399891 26772
1378B6772l25737O2675m3784Q3498J12957J24689m8521k45514J10673r6078K8916
$$ 26772 -298965 -236290 -280074 -196576 -83619 41070 -7451 -252965 -142292 -238370 -209454
1367b09454K12830j37436j15002j08320L7482J43652n7225L97285k16937l26997
$$ -209454 3376 -134060 -249062 -357382 -319900 -176248 -233473 163812 -53125 -380122
1357c80122M81759M88573k97002j70507j9393m98534k562p175J29372K19627J50522
$$ -380122 101637 590210 293208 122701 103308 -395226 -397788 -404963 -275591 -55964 94558
1346I4558o9160m20556q4609p6025N30747M5292l8059p635l47408J35176k4915
$$ 94558 25398 -395158 -479767 -555792 -25045 20247 -17812 -25447 -372855 -237679 -262594
1335b62594K47180P7328r1519n74133j5306J93001m5590L40280J88549m40594
$$ -262594 -15414 61914 -29605 -603738 -619044 -426043 -471633 -131353 57196 -383398
1325c83398k29173J5171J93547L58916K15955q9224l11809L57517k40323j93688
$$ -383398 -612571 -597400 -403853 -44937 171018 81794 -230015 127502 -112821 -306509
1315c06509Q6388j82665p6010J05224M55673j63794M20810j92672j56791P039
$$ -306509 -220121 -402786 -478796 -373572 82101 -81693 339117 146445 -10346 -3307
1305c307p5101J05994M3459Q4346n29078m7627J44334j05478k1014M25979J06028
$$ -3307 -78408 27586 71045 155391 -373687 -421314 -276980 -382458 -403472 22507 128535
1294A28535K47501n79862O923j16563J96339K94181l04345j41512J64020L56572
$$ 128535 376036 -203826 -196903 -313466 -117127 177054 -127291 -268803 -104783 251789
1284B51789k60908m02353L28025j1061J23695k08309O1948M19357j23153n97639
$$ 251789 -9119 -411472 -83447 -94508 29187 -179122 -117174 302183 179030 -418609
1274d18609m1147j30181N11495L65050l59703n3062R9384n2665j78353J13060
$$ -418609 -459756 -589937 -78442 286608 -73095 -126157 -26773 -79438 -257791 -144731
1264a44731k36226K84921m3137J92490J89060k19936k40834k59378L92825Q7896
$$ -144731 -380957 -96036 -139173 53317 242377 22441 -218393 -477771 -84946 2950
1254B950M4333O5722l34553K6971j74497J15181J00634J71913M9008K1514J74992
$$ 2950 47283 113005 -221548 -194577 -369074 -253893 -153259 18654 67662 89176 264168
1243B64168r100j72980n31186l26591N68358J54471j56381k6375M95164k6479
$$ 264168 255068 82088 -449098 -775689 -207331 -52860 -209241 -235616 259548 233069
1233B33069O5668r8750r5239O8782R6130k99532l5898K6697r4356P1757m41074
$$ 233069 298737 199987 104748 173530 269660 -29872 -65770 -39073 -133429 -61672 -502746
1222e02746j69915L83701j82041L83837K11220j66611K41951l03730N04006j40673
$$ -502746 -672661 -288960 -471001 -87164 124056 -42555 199396 -104334 399672 258999
1212B58999k10467p5590Q3605q096l5753n6900l31196j10917p9676L34823L36344
$$ 258999 48532 -27058 56547 48451 12698 -44202 -375398 -486315 -565991 -231168 105176
1201A05176j61820N601K65008j11752K30724l05716n4529l66065P8440N68359
$$ 105176 -56644 -51043 213965 102213 332937 27221 -27308 -393373 -314933 253426
1191B53426M9145j41363j98715k77440L4166j01686K71047N5772l51565J14724
$$ 253426 302571 161208 -37507 -314947 -280781 -382467 -111420 -55648 -407213 -292489
1181b92489J23659K85593J29379K41235Q3700l7227m40980J70733J45424j1821
$$ -292489 -168830 116763 246142 487377 571077 533850 92870 263603 409027 397206
1171C97206l01771j28275k53975L2873q5499R940J62696M52825N23498P8730n3933
$$ 397206 95435 -32840 -286815 -253942 -339441 -329501 -166805 286020 809518 888248 834315
1160H34315k97823k80155j52799r9480j64744J56150K96735l79987n5254K28339
$$ 834315 536492 256337 103538 4058 -160686 -4536 292199 -87788 -143042 85297
1150H5297m60516l2183J58450L77509m23660J70651J8171l5088K72676k07893
$$ 85297 -375219 -407402 -248952 128557 -295103 -124452 -106281 -141369 131307 -76586
1140g6586J76161j12192k6173l38359q0321J03324J54952k97083J62599K0874
$$ -76586 99575 -12617 -38790 -377149 -457470 -354146 -199194 -496277 -333678 -312804
1130c12804J81280J32794j59689K61054J98988l78470K217L6080L97216j58083
$$ -312804 -131524 1270 -158419 102635 301623 -76847 -74630 -38550 358666 200583
1120B00583n13810l0244J73620L27864j72530K72474o8479l98577K19482J53255
$$ 200583 -313227 -343471 -169851 158013 -14517 257957 189478 -209099 10383 163638
1110A63638j37251n88862n530K53557o9047K53070M63343k15615n72314k91876
$$ 163638 26387 -562475 -568005 -314448 -383495 -130425 332918 117303 -455011 -746887
1100g46887L56302j29736l26508P89912K42269q4258j30873l90141L53961K20790
$$ -746887 -390585 -520321 -846829 -56917 185352 101094 -29779 -419920 -65959 154831
1090A54831l17797q7529K85730n9712N2085j03563Q4421K4005l67995L89246k78403
$$ 154831 -162966 -250495 35235 -24477 27608 -75955 8466 32471 -335524 53722 -224681
1079b24681J95490Q3888j17752j86713N30674k18626l690p5887J9484m24077J9691
$$ -224681 -29191 54697 -63055 -249768 280906 62280 58590 -17297 2187 -421890 -402199
1068d02199L77507J43867l40822k02149p036n5400L1457Q9491J92157K04260r898
$$ -402199 -24692 119175 -221647 -423796 -430832 -486232 -454775 -365284 -173127 31133 21235
1057B1235j88758k71986K29062K26356L64336J48901l78737J27307j65576m72302
$$ 21235 -167523 -439509 -210447 15909 380245 529146 150409 277716 112140 -360162
1047c60162j13148O2758K49267J80220j03124k9424M5571n5294j80004N41768
$$ -360162 -473310 -410552 -161285 18935 -84189 -113613 -68042 -123336 -303340 238428
1037B38428l49388k35810J06463K08585N4686j91730O3728K48076k18342k33260
$$ 238428 -110960 -346770 -240307 -31722 22964 -168766 -105038 143038 -75304 -308564
1027c08564r3939K76736N63248k56337J14128j25972m91569Q1641l8436L1814
$$ -308564 -402503 -125767 437481 181144 295272 169300 -322269 -240628 -279064 -247250
1017b47250L65578Q1888J90104j76740l65272J75517K51261N3079j19468m0069
$$ -247250 118328 200216 390320 213580 -151692 23825 275086 328165 208697 168628
1007A68628m3477l6926j92506L381j00001j39937N0054N29700o05330M36267K45336
$$ 168628 125151 88225 -104281 -100900 -200901 -340838 -290784 238916 -366414 69853 315189
996C15189j80865J76586k05573o8098J9938k02721K81217m980m04275k93867N2168
$$ 315189 134324 310910 105337 37239 57177 -145544 135673 130693 -273582 -567449 -515281
985e15281L27200J44812Q6973l09565p4135J32915L09121M12629k94061j30247
$$ -515281 -188081 -43269 43704 -265861 -339996 -207081 102040 514669 220608 90361
975I0361k69880K9425J62343J37571K8312l65867J60911j07750l4708K84970q2221
$$ 90361 -179519 -150094 12249 149820 178132 -187735 -26824 -134574 -169282 115688 33467
964C3467J51688j19983k65105j11628q9805L81459K04427J51058l45584N3688
$$ 33467 185155 65172 -199933 -311561 -401366 -19907 184520 335578 -10006 43682
954D3682m87901k2587L74546m74387L3603N51019k83563L29509J31674l51250
$$ 43682 -444219 -466806 -92260 -566647 -533044 17975 -265588 63921 195595 -155655
944a55655K28693J54690k53636k68263J38175n9443J76977j35788J16982K74103
$$ -155655 73038 227728 -25908 -294171 -155996 -215439 -38462 -174250 -57268 216835
934B16835Q8265J88325l53284j08676N7678j28867J86044k18071j30150j5961
$$ 216835 305100 493425 140141 31465 89143 -39724 146320 -71751 -201901 -217862
924b17862M41923J60675j35115L00757J41204l25169n75020j31249j68026j8123
$$ -217862 224061 384736 249621 550378 691582 366413 -208607 -339856 -507882 -526005
914e26005O689L79020M55574J98779l11970l716n07006l36046O12432K96701p7896
$$ -526005 -519316 -140296 315278 514057 202087 198371 -308635 -644681 -32249 264452 186556
903A86556j25385k97925k86283M60650j49789J29256K06219j87147L95882j78196
$$ 186556 61171 -236754 -523037 -62387 -212176 -82920 123299 -63848 332034 153838
893A53838l84001M0527j03906k47290L10134J04109j6746J7781J18625j78919
$$ 153838 -230163 -189636 -293542 -540832 -230698 -126589 -143335 -125554 -6929 -185848
883a85848k32506L87343k2092r5007M28077r2601J51400J23489m11807j58420
$$ -185848 -418354 -31011 -53103 -148110 279967 187366 338766 462255 50448 -107972
873a07972j54428j3480L8449M10948j84284J27381M67560k15150L498J54774j06586
$$ -107972 -262400 -275880 -237431 173517 -10767 116614 584174 369024 372522 527296 420710
862D20710k48050o6420j67944j4421j16347n5800j40723O8297J67499k00264P0975
$$ 420710 172660 106240 -61704 -76125 -192472 -248272 -388995 -320698 -153199 -353463 -282488
851b82488J86270M31008k4308k67213K7080k66781K10766k03809J64843O5002
$$ -282488 -96218 334790 310482 43269 70349 -196432 14334 -189475 -24632 40370
841D0370K3773m05291j39194J68508q9790K89952K46079k57736m29321L08135
$$ 40370 64143 -341148 -480342 -311834 -401624 -111672 134407 -123329 -552650 -244515
831b44515k93339L47627N846m97038K6644L70514N13714j01156j86177j38467
$$ -244515 -537854 -190227 -184381 -681419 -654775 -284261 229453 128297 -57880 -196347
821a96347k83795L09643P7971j66788K21311L70940p1371m7320n6931k01124J9422
$$ -196347 -480142 -170499 -92528 -259316 -38005 332935 261564 214244 157313 -43811 -24389
810b4389K06149K13232k83799j92426P3600j85129j24920o2688J36416J57197
$$ -24389 181760 394992 111193 -81233 -7633 -192762 -317682 -380370 -243954 -86757
800h6757M5609K8600K92867J01996k18610O8546L94731n80362j67983j44338J33936
$$ -86757 -41148 -12548 280319 382315 163705 232251 626982 46620 -121363 -265701 -131765
789a31765J96255M2642L03805k85411m13375J18193M76062j9702k01608l54837
$$ -131765 64490 107132 410937 125526 -287849 -169656 306406 286704 85096 -269741
779b69741N8668M65954m0813J1865L01667j97050j39447L2802K27779j51475j79680
$$ -269741 -211073 254881 214068 225933 527600 330550 191103 223905 451684 300209 120529
$$ [...]
##END NTUPLES=NMR SPECTRUM
##END=
