##TITLE=1H_CA-9160-3xy
 CDCl3
 8 sc, 
 16.6.2023
##JCAMPDX= 6.0         $$ Bruker NMR JCAMP-DX V2.0
##DATA TYPE= NMR SPECTRUM
##DATA CLASS= NTUPLES
##ORIGIN= UXNMR, Bruker Analytische Messtechnik GmbH
##OWNER= root
$$ XWIN-NMR		Version 3.5
$$ Fri Jun 16 14:16:46 2023 Russian Standard Time (UT+4h)  she@DPX200
##.OBSERVE FREQUENCY= 200.13135
##.OBSERVE NUCLEUS= ^1H
##.ACQUISITION MODE= SIMULTANEOUS
##.ACQUISITION SCHEME= undefined
##.AVERAGES= 8
##.DIGITISER RES= 18
##SPECTROMETER/DATA SYSTEM= spect
##.PULSE SEQUENCE= zg30
##.SOLVENT NAME= CDCl3
##.SHIFT REFERENCE= (INTERNAL, CDCl3, 0, 15.7557)
##AUDIT TRAIL= $$ (NUMBER, WHEN, WHO, WHERE, WHAT)
$$ ##TITLE= Audit trail, XWIN-NMR		Version 3.5
$$ ##JCAMPDX= 5.01
$$ ##ORIGIN= Bruker BioSpin GmbH
$$ ##OWNER= she
$$ F:/spectra/data/she/nmr/H-F/1/pdata/1/auditp.txt
$$ ##AUDIT TRAIL=  $$ (NUMBER, WHEN, WHO, WHERE, WHAT)
(   1,<2023-06-16 14:15:25.53 +0400>,<she>,<DPX200>,
      <created by zg, POWCHK disabled, PULCHK disabled
       configuration hash MD5:
       00 E9 B6 7A A2 85 ED C7 34 08 36 98 17 FE 4E 26
       data hash MD5: 16K
       DA 9B D8 11 A4 CF 7C E6 88 90 8E B4 AC A5 90 99>)
(   2,<2023-06-16 14:15:28.09 +0400>,<she>,<DPX200>,
      <Start of raw data processing
       efp BC_mod = 2 LB = 0.24 FT_mod = 6 PKNL = 1 PHC0 = -20783.41 PHC1 = 10.45272 SI = 16K 
       data hash MD5: 16K
       AE 30 33 5E E3 67 92 9F 3A 26 EB 0D 6E 42 BB 4F>)
(   3,<2023-06-16 14:15:43.60 +0400>,<she>,<DPX200>,
      <pk PHC0 = 157.8658 PHC1 = -2.2 
       data hash MD5: 16K
       68 BA 88 9A 68 CD 82 D3 BD CE 93 24 6A EE 64 A7>)
(   4,<2023-06-16 14:15:47.54 +0400>,<she>,<DPX200>,
      <abs ABSG = 5 
       data hash MD5: 16K
       7A 8E 57 56 E7 B4 7D 60 A6 48 E5 4B BB F3 44 D2>)
$$ ##END=
$$ 
$$ hash MD5
$$ E5 71 7C DD 92 F2 F4 8D 37 D8 FA 21 2D 60 18 B7
##$RELAX= 
##$RELAX= 
##$RELAX= 
##$RELAX= 
##$RELAX= 
##$RELAX= 
$$ Bruker specific parameters
$$ --------------------------
##$DU= <F:/spectra>
##$EXPNO= 1
##$NAME= <H-F>
##$PROCNO= 1
##$TYPE= <nmr>
##$USER= <she>
##$AMP= (0..31)
100 100 100 100 100 100 100 100 100 100 100 100 100 100 100 100 100 100 
100 100 100 100 100 100 100 100 100 100 100 100 100 100 
##$AQSEQ= 0
##$AQ_mod= 1
##$AUNM= <au_zg>
##$AUTOPOS= <>
##$BF1= 200.13
##$BF2= 200.13
##$BF3= 200.13
##$BF4= 200.13
##$BF5= 200.13
##$BF6= 200.13
##$BF7= 200.13
##$BF8= 200.13
##$BYTORDA= 1
##$CFDGTYP= 0
##$CFRGTYP= 5
##$CHEMSTR= <none>
##$CNST= (0..31)
1 1 145 1 1 1 1 1 1 1 1 1 1 1 1 1 1 1 1 1 1 1 1 1 1 1 1 1 1 1 1 1 
##$CPDPRG= <>
##$CPDPRG1= <>
##$CPDPRG2= <>
##$CPDPRG3= <>
##$CPDPRG4= <mlev>
##$CPDPRG5= <mlev>
##$CPDPRG6= <mlev>
##$CPDPRG7= <mlev>
##$CPDPRG8= <mlev>
##$CPDPRGB= <>
##$CPDPRGT= <>
##$D= (0..31)
0 1.2 0 0 0 0 0 0 0 0.06 0 0.03 0 0 0 0 0.0002 0 0 0 0 0 0 0 0 0 0 0 0 
0 0 0 
##$DATE= 1686910525
##$DBL= (0..7)
120 120 120 120 120 120 120 120 
##$DBP= (0..7)
150 150 150 150 150 150 150 150 
##$DBP07= 0
##$DBPNAM0= <>
##$DBPNAM1= <>
##$DBPNAM2= <>
##$DBPNAM3= <>
##$DBPNAM4= <>
$$ [...]
##$SUBNAM3= <"">
##$SUBNAM4= <"">
##$SUBNAM5= <"">
##$SUBNAM6= <"">
##$SUBNAM7= <"">
##$SUBNAM8= <"">
##$SUBNAM9= <"">
##$SW= 18.05172834244
##$SWIBOX= (0..15)
0 0 2 0 0 0 0 0 0 0 0 0 0 0 0 0 
##$SW_h= 3612.71676300578
##$TD= 16384
##$TD0= 1
##$TE= 0
##$TE2= 300
##$TE3= 300
##$TEG= 300
##$TL= (0..7)
0 120 120 120 120 120 120 120 
##$TP= (0..7)
150 150 150 150 150 150 150 150 
##$TP07= 0
##$TPNAME0= <>
##$TPNAME1= <>
##$TPNAME2= <>
##$TPNAME3= <>
##$TPNAME4= <>
##$TPNAME5= <>
##$TPNAME6= <>
##$TPNAME7= <>
##$TPOAL= (0..7)
0.5 0.5 0.5 0.5 0.5 0.5 0.5 0.5 
##$TPOFFS= (0..7)
0 0 0 0 0 0 0 0 
##$TUNHIN= 0
##$TUNHOUT= 0
##$TUNXOUT= 0
##$USERA1= <user>
##$USERA2= <user>
##$USERA3= <user>
##$USERA4= <user>
##$USERA5= <user>
##$V9= 5
##$VALIST= <valist>
##$VCLIST= <CCCCCCCCCCCCCCC>
##$VD= 0
##$VDLIST= <DDDDDDDDDDDDDDD>
##$VPLIST= <PPPPPPPPPPPPPPP>
##$VTLIST= <TTTTTTTTTTTTTTT>
##$WBST= 1024
##$WBSW= 4
##$XGAIN= (0..3)
0 0 0 0 
##$XL= 0
##$YL= 0
##$YMAX_a= 122267
##$YMIN_a= -85198
##$ZGOPTNS= <>
##$ZL1= 120
##$ZL2= 120
##$ZL3= 120
##$ZL4= 120
##$ABSF1= 15.71621
##$ABSF2= -2.335639
##$ABSG= 5
##$ABSL= 3
##$ALPHA= 0
##$AQORDER= 0
##$ASSFAC= 0
##$ASSFACI= 0
##$ASSFACX= 0
##$ASSWID= 0
##$AUNMP= <proc_1d>
##$AZFE= 0.1
##$AZFW= 0.1
##$BCFW= 0
##$BC_mod= 2
##$BYTORDP= 0
##$COROFFS= 0
##$CY= -3
##$DATMOD= 1
##$DC= 0
##$DFILT= <>
##$DTYPP= 0
##$F1P= 0
##$F2P= 0
##$FCOR= 1
##$FTSIZE= 16384
##$FT_mod= 6
##$GAMMA= 0
##$GB= 0
##$INTBC= 1
##$INTSCL= 3.70164e-10
##$ISEN= 128
##$LB= 0.24
##$LEV0= 0
##$LPBIN= 0
##$MAXI= 10000
##$MC2= 0
##$MEAN= 0
##$ME_mod= 0
##$MI= 1.114404
##$NCOEF= 0
##$NC_proc= -8
##$NLEV= 6
##$NOISF1= 3.799351
##$NOISF2= 2.8
##$NSP= 0
##$NTH_PI= 0
##$NZP= 0
##$OFFSET= 15.7557
##$PC= 1
##$PHC0= -20625.54
##$PHC1= 8.25272
##$PH_mod= 1
##$PKNL= yes
##$PPARMOD= 0
##$PSCAL= 0
##$PSIGN= 0
##$REVERSE= no
##$SF= 200.130003169255
##$SI= 16384
##$SIGF1= 3
##$SIGF2= 2
##$SINO= 5.538805
##$SIOLD= 16384
##$SREGLST= <1H.CDCl3>
##$SSB= 0
##$STSI= 16384
##$STSR= 0
##$SW_p= 3612.71676300578
##$SYMM= 0
##$S_DEV= 0
##$TDeff= 16384
##$TDoff= 0
##$TI= <>
##$TILT= no
##$TM1= 0
##$TM2= 0
##$TOPLEV= 0
##$USERP1= <user>
##$USERP2= <user>
##$USERP3= <user>
##$USERP4= <user>
##$USERP5= <user>
##$WDW= 1
##$XDIM= 16384
##$YMAX_p= 436784187
##$YMIN_p= -1342681
$$ End of Bruker specific parameters
$$ ---------------------------------
##NTUPLES= NMR SPECTRUM
##VAR_NAME=  FREQUENCY,     SPECTRUM/REAL,   SPECTRUM/IMAG
##SYMBOL=    X,             R,               I
##VAR_TYPE=  INDEPENDENT,   DEPENDENT,       DEPENDENT
##VAR_FORM=  AFFN,          ASDF,            ASDF
##VAR_DIM=   16384,         16384,           16384
##UNITS=     HZ,            ARBITRARY UNITS, ARBITRARY UNITS
##FACTOR=    0.220516191357247, 1,           1
##FIRST=     3153.18831322614, 0,            0
##LAST=      -459.528449779637, 0,           0
##MIN=       -459.528449779637, -1342681,    0
##MAX=       3153.18831322614, 436784187,    0
$$ Real data points
##PAGE= N=1
##DATA TABLE= (X++(R..R)), XYDATA
$$ [...]
16289E7779o0249J501k06164l24411M39627J13528N2283L73133J03000J9982r0094
$$ 57779 -2470 -969 -207133 -531544 -91917 21611 73894 447027 550027 570009 479915
16278D79915K87432k37001m3161l24603M6928j09795M93042l20767R5979j27054
$$ 479915 767347 530346 487185 162582 209510 99715 592757 271990 367969 240915
16268B40915l25454M65835L38070j85535m09893l38601K94150n96j00565K6008
$$ 240915 -84539 381296 719366 533831 123938 -214663 79487 78891 -21674 4334
16258D334R2958k3326j92746L19832L33082K2518k56949j90560j00850l73125
$$ 4334 97292 73966 -118780 201052 534134 556652 299703 109143 8293 -364832
16248c64832J23306L98959M15299J57400l75907P3656k50532j64951J025K97082
$$ -364832 -241526 157433 572732 730132 354225 427881 177349 12398 13423 310505
16238C10505j01115K36470J09542K8799r8894k63169k14960L30344k62636J27448
$$ 310505 209390 445860 555402 584201 485307 222138 7178 337522 74886 202334
16228B02334K77105r2032J5942j74104l97141o9708J02914N08621k21620k56454
$$ 202334 479439 387407 403349 229245 -167896 -237604 -134690 373931 152311 -104143
16218a04143K86786N0424l1914J39493o6407L7384j53064j50571K93397m9693
$$ -104143 182643 233067 201153 340646 274239 311623 158559 7988 301385 251692
16208B51692o7094j85353O6990L84721L110o7562O7641r1337L9464l55223m0401
$$ 251692 184598 -755 66235 450956 454066 386504 454145 362808 402272 47049 6648
16197F648Q0356J25520Q9642K49235N3610k75587K69404k4445l74135L21641Q7797
$$ 6648 87004 212524 302166 551401 605011 329424 598828 574383 200248 521889 609686
16186F09686l30998J27391L58058p4762m25095k66778K14535j0723k71824K73036
$$ 609686 278688 406079 764137 689375 264280 -2498 212037 201314 -70510 202526
16176B02526O3536m22930J01867K06933j06674k18157J99179n2112p7357r464
$$ 202526 266062 -156868 -55001 151932 45258 -172899 26280 -25832 -103189 -112653
16166a12653L55773J40767j41023l04136q2365k24372L91371M46291J18211j03372
$$ -112653 243120 383887 242864 -61272 -143637 -368009 23362 469653 587864 484492
16156D84492J4782L75744j71399O1217j98389J40552j83810K34845j99717k59670
$$ 484492 499274 875018 703619 764836 566447 706999 523189 758034 558317 298647
16146B98647l89786r1479J89719k04161O7146J98122K64756J13517K26718q5392
$$ 298647 -91139 -182618 7101 -197060 -129914 68208 332964 446481 673199 587807
16136E87807k55865j90136q064N7160L5121N1090J54963P468p77246l5361M66722
$$ 587807 331942 141806 133742 190902 226023 277113 432076 439544 -337702 -373063 93659
16125I3659k71573M1135K66806K79074j01199n1128k85927l26448J90782M23748
$$ 93659 -177914 -136779 130027 409101 307902 256774 -29153 -355601 -164819 258929
16115B58929Q0614l28129k4037m179m5646R8560j46046j5747K69909k1555J76825
$$ 258929 339543 11414 -12623 -16802 -62448 36112 -109934 -125681 144228 122673 299498
16104B99498q9377o0920J44392J20895l13372l5192K29688l73853J19461K46225
$$ 299498 210121 149201 293593 414488 101116 65924 295612 -78241 41220 287445
16094B87445L01808j19512p15611R5712K35046J27492q0J94143R5058m48289q3427
$$ 287445 589253 469741 -245870 -150158 84888 212380 212300 406443 501501 53212 -30215
16083c0215J19055M5647J25459L05437J53013j69441k59131j3188j93663j73507
$$ -30215 88840 134487 259946 565383 718396 548955 289824 276636 82973 -90534
16073i0534M08382M53440k14131l82690k26267J21712N6715M81375K46613k55269
$$ -90534 317848 771288 557157 174467 -51800 69912 126627 608002 854615 599346
16063E99346j68782j0302n28701N5032J53116K28150J58091K57676J38904J28673
$$ 599346 430564 420262 -108439 -53407 99709 327859 485950 743626 882530 1011203
16053A011203j79833l65766l80890j22534J64726R8823J47426L8635J70247q2823
$$ 1011203 831370 465604 84714 -37820 126906 225729 373155 411790 582037 499214
16043D99214j36910m11020K59539K03960n78046O4598J48285J20428L07633m05438
$$ 499214 362304 -48716 210823 414783 -163263 -98665 49620 170048 477681 72243
16033G2243L0923k26299L90541K28722l26688k1797M1654k55401J5218q0007J43848
$$ 72243 103166 -123133 267408 496130 169442 147645 189299 -66102 -50884 -130891 12957
16022A2957o6627K36877j44789J68406J53030K57617R4999o1608k87192r6869
$$ 12957 -53670 183207 38418 206824 359854 617471 712470 650862 363670 266801
16012B66801J93136k18658k15749k21745J77846J25678j60707k3217J24702M66625
$$ 266801 459937 241279 25530 -196215 -18369 107309 -53398 -76615 48087 514712
16002E14712j89529M1030P8091j52994J82680j34468j74922l49937J1698N19552
$$ 514712 325183 366213 444304 291310 473990 339522 164600 -185337 -173639 345913
15992C45913l15484k7305K6508K41985L31790l60097J55232l74612K53354N8818
$$ 345913 30429 3124 29632 271617 603407 243310 398542 23930 277284 336102
15982C36102n25839P304L72847L25503O0697j88687P2986k27987k05941K38216
$$ 336102 -189737 -182433 190414 515917 576614 387927 460913 232926 26985 265201
15972B65201j6117Q9184k7090k22384j36465l67854l8174o1347K43770L26793
$$ 265201 249084 338268 311178 88794 -47671 -415525 -453699 -515046 -271276 55517
15962E5517O03094m69483k62252k02472M02416j08788n8361O4894m78445j94714
$$ 55517 658611 189128 -73124 -275596 126820 18032 -40329 24565 -453880 -648594
15952f48594O13049K9357l25944L58103J99524N2894l48345L89304N9968m00751
$$ -648594 -35545 -6188 -332132 25971 225495 278389 -69956 319348 379316 -21435
15942b1435J94751O9657J24477k38471R3362K42965k56521k95234J7505m36321
$$ -21435 173316 242973 367450 128979 222341 465306 208785 -86449 -68944 -505265
15932e05265O534M14919k388J80491j44463k18395L12869l408r253M3360j05350
$$ -505265 -498731 -83812 -86200 94291 -50172 -268567 44302 40894 31641 75001 -30349
15921c0349j84488k3002J79840l53228K48027N92781m04635m87449j88459K16731
$$ -30349 -214837 -237839 -57999 -411227 -163200 429581 24946 -462503 -650962 -434231
15911d34231N2499J49962K87481l40080j25016J49196J6736p2113K78499k7805
$$ -434231 -381732 -231770 55711 -284369 -409385 -260189 -243453 -315566 -37067 -64872
15901f4872n7042N4205M75602l02990J32191K1706m35716P6072M25817m10250
$$ -64872 -121914 -67709 407893 104903 237094 258800 -176916 -100844 324973 -85277
15891h5277l88176J7556J997L34240J90836n78178L38473K993L19481j28695j82536
$$ -85277 -473453 -455897 -453900 -119660 71176 -507002 -168529 -165536 153945 25250 -157286
15880a57286l8603K48370J98551j41604N3990j59723k64831J3864j92550J14669
$$ -157286 -195889 52481 251032 109428 163418 3695 -261136 -247272 -439822 -325153
15870c25153J83762L07885J3287j74285L9994j71251K87665l9983m3446j49467
$$ -325153 -141391 166494 179781 5496 45490 -125761 161904 121921 78475 -70992
15860g0992j61892L6640j6641j83221L02924J53389j07607Q8967k07419j39723
$$ -70992 -232884 -196244 -212885 -396106 -93182 60207 -47400 41567 -165852 -305575
15850c05575J54949j2087L58965J07163J05770o83892j51027N01479k08486n0766
$$ -305575 -150626 -162713 196252 303415 409185 -274707 -425734 75745 -132741 -183507
15840a83507j07071J33468J54703K48164r0331M9689L12211k83636l04915m6038
$$ -183507 -290578 -157110 -2407 245757 155426 205115 517326 233690 -71225 -117263
15830a17263J02136j54084J33184K57459k15163j27480M18120n11303m1827J68611
$$ -117263 -15127 -169211 -36027 221432 6269 -121211 296909 -214394 -256221 -87610
15820h7610L70894K45020n87273m5992K79461l15980j14344M1578O9490P1689
$$ -87610 283284 528304 -58969 -104961 174500 -141480 -255824 -214246 -144756 -73067
15810g3067K24867J19485k44885j00274J32498j19654M2330k63324j09953M4490
$$ -73067 151800 271285 26400 -73874 58624 -61030 -18700 -282024 -391977 -347487
15800c47487l5505L45590K92513K21121o0838k51051r8384j89857Q2150l91261
$$ -347487 -382992 -37402 255111 476232 415394 164343 65959 -123898 -41748 -433009
15790d33009n4057K35233L35589K1288p2499k14694r8009P4788m51914K77261
$$ -433009 -487066 -251833 83756 105044 32545 -182149 -280158 -205370 -657284 -380023
15780c80023P12632l28803J28212L3220k10713K13518k11880r1137J33037Q1561
$$ -380023 332609 3806 132018 165238 -45475 168043 -43837 -134974 -1937 79624
15770G9624k90571j27529p9794N46298L5524K87435j62943q7427M111o9029q7127
$$ 79624 -210947 -338476 -418270 128028 163552 450987 288044 200617 204728 135699 48572
15759D8572K57465m87145j72809O02742J73277k29747m31692K63463N0251k84219
$$ 48572 306037 -181108 -353917 248825 422102 192355 -239337 24126 74377 -209842
15749b09842k55200J02685N18542J51553n0822L0912k30860O0886O3761k70005
$$ -209842 -465042 -362357 156185 307738 256916 287828 56968 117854 181615 -88390
15739h8390J06105j83023K82963r1786o06641K20988j0006L43353K80459j30368
$$ -88390 17715 -165308 117655 25869 -580772 -359784 -369790 -26437 254022 123654
15729A23654J63288m51734Q3734o7442k88524J26389M10941l04366m04040o9122
$$ 123654 286942 -164792 -81058 -148500 -437024 -310635 100306 -204060 -608100 -677222
15719f77222L64058N06380L0763r5418m93042J74081O9345Q5339J99959j50362
$$ -677222 -313164 193216 223979 128561 -364481 -190400 -121055 -35716 164243 13881
15709A3881l99679K77361k34874L36467K13512k32440l04693N3391L76606j30147
$$ 13881 -385798 -108437 -343311 -6844 206668 -25772 -330465 -277074 99532 -30615
15699c0615j70120K07143J39738Q8931j06015k98172J48049K42094m53648O03497
$$ -30615 -200735 6408 146146 235077 129062 -169110 -21061 221033 -232615 370882
15689C70882J78055n60278K0886L3761J25170M36889k30624j44081k6011o65550
$$ 370882 548937 -11341 9545 43306 168476 605365 374741 230660 204649 -460901
15679d60901L00791O35353K0012m66827L76336l53596o2524l12265K35252J68837
$$ -460901 -160110 475243 495255 28428 404764 51168 -11356 -323621 -88369 80468
15669H0468Q6835K41573o8458j61220Q2906j3945n2321l00662K97106J86386r0372
$$ 80468 167303 408876 340418 179198 262104 248159 195838 -104824 192282 378668 288296
15658B88296q4921n5777k17457L1964K98174l37611K58357j39826j08556J81237
$$ 288296 203375 147598 -69859 -37895 260279 -77332 181025 41199 -67357 113880
15648A13880J11637r1511L83093n50631j79717J01032L3o7662j37079L48952n01291
$$ 113880 225517 134006 517099 -33532 -213249 -112217 -112184 -179846 -316925 32027 -469264
15637d69264K99828L05649k85138k08978M12305Q481N6676j33811k95650p6384
$$ -469264 -169436 136213 -148925 -357903 54402 62883 119559 -14252 -309902 -386286
15627c86286J94157K36997j06778L70732k83888n9967l88897Q3584J53995P1730
$$ -386286 -192129 44868 -61910 308822 24934 -35033 -423930 -340346 -186351 -114621
15617a14621k10831K18945L02879j41237j84785O7285l29822J01820J11764j9754
$$ -114621 -325452 -106507 196372 55135 -129650 -62365 -392187 -290367 -178603 -198357
15607a98357J32962L18714J90088J52880m95737l67907O9426j39404j35117M30522
$$ -198357 -65395 253319 443407 596287 100550 -267357 -197931 -337335 -472452 -41930
15597d1930n2164k29847O06578l66539k30735J63550J22584l44939J65736p5094
$$ -41930 -94094 -323941 282637 -83902 -314637 -151087 -28503 -373442 -207706 -282800
15587b82800J92464l2789j20709N08711j86000N8771K3703M4576m09083l53370
$$ -282800 -90336 -123125 -243834 264877 78877 137648 161351 205927 -203156 -556526
15577e56526L10330K47853L91363l58118j43950k36472M1728Q6841o3389r9949
$$ -556526 -246196 1657 393020 34902 -109048 -345520 -303792 -216951 -280340 -380289
15567c80289K26385n5706R0762r0446K53783k3048J39540K75244m07060L8472
$$ -380289 -153904 -209610 -118848 -209294 44489 21441 160981 436225 29165 67637
15557F7637p3360J78816L66902k84862k1562k06010l47124M89583l4778J83125
$$ 67637 -5723 173093 539995 255133 233571 27561 -319563 170020 135242 318367
15547C18367m77733q6958M31111k81175m3620j24488J25082M0740k6239k84159
$$ 318367 -159366 -246324 184787 -96388 -140008 -264496 -139414 -98674 -124913 -409072
15537d09072J13910M51319l04420o6711J00100Q1553M25878j49532n53190K33777
$$ -409072 -295162 156157 -148263 -214974 -114874 -33321 392557 243025 -310165 -76388
15527g6388o2545k45431L17195L01033j07163l09174q001j37982N6950O0303l27697
$$ -76388 -138933 -384364 -67169 233864 126701 -182473 -190474 -328456 -271506 -211203 -538900
15516e38900Q16786K62541n73535l668J98801j20339k63864J99012L54582r30
$$ -538900 277886 540427 -33108 -36776 162025 41686 -222178 -23166 331416 330486
15506C30486j96059l9239P7568l93871J16436l89329L79005M58802n50620O79
$$ 330486 134427 95188 172756 -221115 -104679 -494008 -115003 343799 -206821 -206142
15496b06142n00842M0669M35014J61109P8188m5225N00394j89881j20599L47476
$$ -206142 -706984 -666315 -231301 -70192 7996 -37229 463165 273284 152685 500161
15486E00161l63781l92675l28544L27197k40288J46609J47367k33782L58773p2914
$$ 500161 136380 -256295 -584839 -257642 -497930 -351321 -203954 -437736 -78963 -151877
15476a51877L45024L10429k70972j74833J18203m9748j25423j86817J61960J49481
$$ -151877 193147 503576 232604 57771 175974 126226 803 -186014 -24054 125427
15466A25427r4014j93471K47305N45312n83871l6893M09827J01631n4070l03842
$$ 125427 31413 -162058 85247 630559 46688 9795 419622 521253 467183 163341
15456A63341J83579K16788j38090k2470q8972k77426q74P8225n3428j83873m93723
$$ 163341 346920 563708 425618 403148 314176 36750 35876 114101 60673 -123200 -616923
15445f16923O8269J48947M05976r2515l47544M57437J96764p5294J28703k33111
$$ -616923 -548654 -399707 6269 -86246 -433790 23647 220411 145117 273820 40709
15435D0709j55662K09277j77835p7715J00869Q6183l54866J45963L14580j6271
$$ 40709 -114953 94324 -83511 -161226 -60357 25826 -329040 -183077 131503 115232
15425A15232q2342J5706j04904J43531n2165Q7305L1090j02005k98334k08521
$$ 115232 32890 48596 -56308 87223 35058 122363 153453 51448 -246886 -455407
15415d55407K10422J80451J37085J57863j56312l78192M46818L30365M1677j47892
$$ -455407 -244985 -64534 72551 230414 74102 -304090 142728 473093 514770 366878
15405C66878p058l1830J0794m42185N05860m97537l05785L48649J74865k60789
$$ 366878 359820 327990 338784 -103401 402459 -95078 -400863 -52214 122651 -138138
15395a38138J38210K58373j75061J769k13881L4371J01310O484L07875l94328
$$ -138138 72 258445 83384 85153 -128728 -94357 6953 13437 321312 -73016
15385g3016n23254M53763L84424o9287l52670K06504q8093j4503j17859J08970
$$ -73016 -596270 -142507 241917 172630 -180040 26464 -61629 -76132 -193991 -85021
15375h5021n588L25197J552J53787o8149l58920j14726J86433j98374q5027J9831
$$ -85021 -90609 234588 236140 389927 321778 -37142 -151868 34565 -163809 -248836 -229005
15364b29005j33179j31893J10693n627o4490J47646L80101K4293m3583J17091
$$ -229005 -362184 -494077 -383384 -389011 -453501 -305855 74246 98539 54956 172047
15354A72047l60437J60245J97310j33676j10443L37528r4228k69250n8852K61827
$$ 172047 -188390 -28145 169165 35489 -74954 262574 168346 -100904 -159756 102071
15344A02071j46825K32541k4040p0285R3082k26131j43556k29220L53358L67353
$$ 102071 -44754 187787 163747 93462 186544 -39587 -183143 -412363 -59005 308348
15334C08348J19769l21371j58056j94520o1806K64303l928j33095l20253J54115
$$ 308348 428117 106746 -51310 -245830 -307636 -43333 -47261 -180356 -500609 -346494
15324c46494l00578J52282L46532k94875Q3674J15814M71912j74377k73716J30734
$$ -346494 -647072 -494790 -148258 -443133 -359459 -243645 228267 53890 -219826 -89092
15314h9092K67582K30566J8468j90058k08996l011l02208l77359L11072M71426
$$ -89092 178490 409056 427524 237466 28470 25459 -276749 -654108 -343036 128390
15304A28390O4417k28991n09348j7759L08135J96891k03015j34939N99224J9796
$$ 128390 192807 -36184 -545532 -563291 -255156 -58265 -261280 -396219 203005 222801
15294B22801q4728j55449k65891M53076j44875J56488J92866k15535O08310l18244
$$ 222801 138073 -17376 -283267 169809 24934 181422 374288 158753 767063 448819
15284D48819k30517O6600J50040o4145m4676J853o1173J26990j95689j39435J91165
$$ 448819 218302 284902 434942 370797 326121 327974 266801 393791 198102 58667 249832
15273B49832k35416p0385K71380l73301R525j74984K00298N38207Q0698l83958
$$ 249832 14416 -55969 215411 -157890 -148365 -323349 -123051 415156 495854 111896
15263A11896r1010n0986j68437o2878k90067L14361J92196k05252L62261J35515
$$ 111896 20886 -30100 -198537 -261415 -551482 -237121 -44925 -250177 112084 247599
15253B47599j18663k14291O1753l94430K65981O5093l56105J70959K02876p7131
$$ 247599 128936 -85355 -23602 -418032 -152051 -86958 -443063 -272104 -69228 -146359
15243a46359M46345J04922m2624j99924n35262J38514J55296L42255r7268L06820
$$ -146359 299986 404908 362284 162360 -372902 -234388 -79092 263163 165895 472715
15233D72715k34700n18336L169L4043K81233M4967r1459j51393J38055O1783o57034
$$ 472715 238015 -280321 -277152 -243109 38124 83091 -8368 -159761 -21706 40077 -616957
15222f16957j41563J59168L2912L55532L09793q5050n3959j8438n3937O2748J31814
$$ -616957 -758520 -599352 -566440 -210908 98885 13835 -40124 -58562 -112499 -49751 82063
15211H2063k27337J12778N5861l46161L64628k74450l296N2876J49443J16413
$$ 82063 -145274 -32496 23365 -322796 41832 -232618 -235914 -183038 -33595 82818
15201H2818K84149l61438k28970j35053j94216L51355J51463L14821l66820k2142
$$ 82818 366967 5529 -223441 -358494 -552710 -201355 -49892 264929 -101891 -124033
15191a24033O0005K03562R8618k80479q4878N34102l58696k97911N72687O5586
$$ -124033 -64028 139534 238152 -42327 -127205 406897 48201 -249710 322977 388563
15181C88563m59529j51452l03262J76651L17338m02881j05740K94424k702J60262
$$ 388563 -70966 -222418 -525680 -349029 -31691 -434572 -540312 -245888 -248590 -88328
15171h8328l5723k66913R5880R0568L53961R2955j44323M08299l87292j27992
$$ -88328 -124051 -390964 -295084 -204516 149445 242400 98077 506376 119084 -8908
15161h908J69849m19932J9449L66660j62641m45829K75358P03853J2321m79546
$$ -8908 160941 -258991 -239542 127118 -35523 -481352 -205994 497859 510180 30634
15151C0634K23646j73796k64753M2916k6303J10737j91886K33638M64923m6162
$$ 30634 254280 80484 -184269 -141353 -167656 -56919 -248805 -15167 449756 403594
15141D03594l74148N3952m63333R198K10148j37610l0708K13923L8219l89787
$$ 403594 29446 83398 -379935 -370737 -160589 -298199 -328907 -114984 -76765 -466552
15131d66552j21533L00430J65317j41902N21893j19469n02783N9066J49035k11316
$$ -466552 -588085 -287655 -122338 -264240 257653 138184 -364599 -305533 -156498 -367814
15121c67814K35528k63052K72945N5980k92582l887J34535L85340o4651k13855
$$ -367814 -132286 -395338 -122393 -66413 -358995 -362882 -228347 156993 92342 -121513
15111a21513r650l89446j52999L19302J65811J42576l01606k46064K86426O2250
$$ -121513 -131163 -520609 -673608 -354306 -188495 -45919 -347525 -593589 -307163 -244913
15101b44913j6341K26849L14694k15933m0172L1821k04970l48740j61527M69923
$$ -244913 -261254 -34405 280289 64356 24184 56005 -148965 -497705 -659232 -189309
15091a89309p6512j59680K27112m06628o5064K68828J08460L96192O1720l5553
$$ -189309 -265821 -425501 -198389 -605017 -670081 -401253 -292793 103399 165119 129566
15081A29566M17674j41542l08379J56853J11012k70449J56952K06997l7359k34761
$$ 129566 547240 405698 97319 254172 365184 94735 251687 458684 421325 186564
15071A86564L195n7265k6143r6289m81086J32615M73542M20806m36576l35439
$$ 186564 189759 132494 106351 10062 -471024 -338409 135133 555939 119363 -216076
15061b16076j816q6664r0280q52J57576K07824k77067J95758q9240r0681j70885
$$ -216076 -217892 -304556 -394836 -395688 -238112 -30288 -307355 -111597 -200837 -291518 -462403
15050d62403M7075O31490K51911k10685k0525l33053k37133K64901K25653m5200
$$ -462403 -415328 216162 468073 257388 236863 -96190 -333323 -68422 157231 112031
15040A12031m24513K79976K20706L9222j68266R26j96992R1240k1237k59976N29674
$$ 112031 -312482 -32506 188200 227422 59156 60082 -136910 -45670 -66907 -326883 202791
15029B02791l9522k26367k64175L94444j44290L6632j72969j00456O32037j48966
$$ 202791 163269 -63098 -327273 67171 -77119 -40487 -213456 -313912 318125 169159
15019A69159k37731J87873J50672J4784k35939j21355K3178q0205j32475J33977
$$ 169159 -68572 119301 269973 284757 48818 -72537 -49359 -129564 -262039 -128062
15009a28062r1881j69213k37529L68549L87438l17601J46801N02580m26000K78173
$$ -128062 -219943 -389156 -626685 -258136 129302 -188299 -41498 461082 35082 313255
14999C13255K66479l04362J33410m25736K78264q1343Q9819j75883k20303k18230
$$ 313255 579734 275372 408782 -16954 261310 179967 269786 93903 -126400 -344630
14989c44630K04969M6907N378j12671n4452L41839m8528m360j40811L13324m2397
$$ -344630 -139661 -92754 -87376 -200047 -254499 87340 38812 34452 -106359 206965 164568
14978A64568l4985k7903j08566l12088K46220K63666l64780J30027j44276l53571
$$ 164568 129583 101680 -6886 -318974 -72754 190912 -173868 -43841 -188117 -541688
14968e41688L46486m9990l24453J51053L81644M9312j78015J99498j26947K94098
$$ -541688 -195202 -245192 -569645 -418592 -36948 12364 -165651 33847 -93100 200998
14958B00998l80517M07806l76514O0521L43760O8795n11509o14538N10628q5410
$$ 200998 -179519 228287 -148227 -87706 256054 324849 -186660 -801198 -290570 -375980
14948c75980k9088R383p8863M35075K02951K0172r0716k56205k90332j54373N40300
$$ -375980 -405068 -395685 -474548 -39473 163478 183650 92934 -163271 -453603 -607976 -67676
14937f7676O7173j23218K59643M21957j41801l52925k62300M44554j73916n28607
$$ -67676 -503 -123721 135922 557879 416078 63153 -199147 245407 71491 -457116
14927d57116L7837L8718M67566r3710K7519n264l434L3917k30421J77848M49827
$$ -457116 -419279 -380561 87005 -6705 20814 15550 12116 46033 -184388 -6540 443287
14916D43287m09978k51011M4456J6403m3279l5898j8278m1296O4501J29110K75407
$$ 443287 33309 -217702 -173246 -156843 -200122 -236020 -254298 -295594 -231093 -101983 173424
14905A73424P8275M221l20566j0980m07180Q3082R1602J26183j14441L41674R4406
$$ 173424 251699 255920 -64646 -75626 -482806 -399724 -308122 -181939 -296380 45294 139700
14894A39700K26751j97517L47541l27109j53832J29098j82262J40600K34438m50660
$$ 139700 366451 168934 516475 189366 35534 164632 -17630 122970 357408 -93252
14884i3252k84872M12295k38262L3403J94808p8204J18311j73916P6622K88018
$$ -93252 -378124 34171 -204091 -170688 24120 -54084 64227 -109689 -33067 254951
14874B54951n33006K64065q5401L14984n18465l1847n6493N9657L81271j67133
$$ 254951 -278055 -13990 -99391 215593 -302872 -334719 -391212 -331555 49716 -117417
14864a17417j68536L57197Q867o2836j40271L01410P6111l36221J14146L4602
$$ -117417 -285953 71244 80111 17275 -122996 178414 254525 -81696 32450 67052
14854F7052N8629j20618N8443n812k42039j12849O6786J86206L47006j43498P9780
$$ 67052 125681 5063 63506 57694 -184345 -297194 -230408 -44202 302804 159306 239086
14843B39086j99305K53521m8535L9652k69811r4336L03591l734P3155l89825j21876
$$ 239086 39781 293302 244767 284419 14608 -79728 223863 220129 293284 -96541 -218417
14832b18417o5870k55981p967P6906l7736l07592J05317K6079K5098J08557L24874
$$ -218417 -284287 -540268 -548235 -471329 -509065 -816657 -711340 -685261 -660163 -551606 -226732
14821b26732K57478j56220k87985p1648K57780j14508J76685K34716M9739q606
$$ -226732 30746 -125474 -413459 -485107 -227327 -341835 -165150 69566 119305 110699
14811A10699k29535m3201M4698k60568J6744J44067k00506L18786L23278k4579
$$ 110699 -118836 -162037 -117339 -377907 -361163 -217096 -417602 -98816 224462 199883
14801A99883l47717j79463N86953K30682k83199k70258K01381l24264M4028k08046
$$ 199883 -147834 -327297 259656 490338 207139 -63119 138262 -186002 -141974 -350020
14791c50020J92099j7184J95934k22901o9238M47845k44569o191j02368j29273
$$ -350020 -157921 -175105 20829 -202072 -271310 176535 -68034 -74225 -176593 -305866
14781c05866L8603J00806J19141M46363o03208N2123L89859K1065o06748M0015
$$ -305866 -267263 -166457 -47316 399047 -204161 -152038 237821 258886 -347862 -307847
14771c07847L94320J1915n4051j08395L15012o8235n6118r1645j86161M19270
$$ -307847 86473 98388 44337 -64058 250954 182719 126601 34956 -151205 268065
14761B68065P7813J3883l51564l79725j36244Q05779K12051n11276Q9743m85011
$$ 268065 345878 359761 8197 -371528 -507772 298007 510058 -1218 88525 -396486
14751c96486J03365L11438K38057m13198l0561J18841J31594J2444k68325j47256
$$ -396486 -293121 18317 256374 -156824 -187385 -68544 63050 75494 -192831 -340087
14741c40087j70123K58714L29198k3721k3086J7547k02966O1639J41911j71979
$$ -340087 -510210 -251496 77702 53981 30895 48442 -154524 -92885 49026 -122953
14731a22953j86841j79500k148L8924L36239O5920j61954N6238o1057K4467j43234
$$ -122953 -309794 -489294 -491442 -452518 -116279 -50359 -212313 -156075 -217132 -192665 -335899
14720c35899q2847L90359r3392K2234j01006k17737O81128M93777o06338k21246
$$ -335899 -418746 -28387 -121779 -99545 -200551 -418288 262840 756617 150279 -70967
14710g0967j56741Q9478J87012l00030L43592K16118l31054J2144k52922l09635
$$ -70967 -227708 -138230 48782 -251248 92344 308462 -22592 -10448 -263370 -573005
14700e73005J96521O71379k9554l12764j22769K99539k22114o3659l7385j70112
$$ -573005 -376484 294895 265341 -47423 -170192 129347 -92767 -156426 -193811 -363923
14690c63923K57217o5067Q5137l21947k44333m05033J76191M45603J11204J21173
$$ -363923 -106706 -171773 -86636 -408583 -652916 -1057949 -881758 -436155 -324951 -203778
14680b03778K25383J30173J22687k31291K9440j07539R6768j35083j72822P9655
$$ -203778 21605 151778 274465 43174 72614 -34925 61843 -73240 -246062 -166407
14670a66407N07846l56424n5711j28143n39170N10393n559K39654K18345J16010
$$ -166407 341439 -14985 -70696 -198839 -738009 -227616 -233175 6479 224824 340834
14660C40834k52326N1569p7479j16981K57968o17518J22851J65391M20745m4079
$$ 340834 88508 140077 62598 -54383 203585 -413933 -291082 -125691 295054 250975
14650B50975l64221k3778L7998j46042o6652M14774m2087k36700j36284K96499
$$ 250975 -113246 -137024 -99026 -245068 -311720 103054 60967 -175733 -312017 -15518
14640a5518J7455l00029L17781m4002j93450J03019k49148J92681j27076k88243
$$ -15518 1937 -298092 19689 -24313 -217763 -114744 -363892 -171211 -298287 -586530
14630e86530L19852K86645j31354n4586j412K0740J43294k25808M5123j774j42644
$$ -586530 -266678 19967 -111387 -165973 -167385 -146645 -3351 -229159 -184036 -185810 -328454
14619c28454L61767P0074j32324n753m39593l73453M47535K55529k01190R8940
$$ -328454 33313 103387 -28937 -34690 -474283 -847736 -400201 -144672 -345862 -246922
14609b46922K30757j95286j31704K01467l4232K00455l0203j22273l23867l36420
$$ -246922 -16165 -211451 -343155 -141688 -175920 24535 -5668 -127941 -451808 -788228
14599g88228j7432L70014O74213J15692l23598m46623K89946L97731j30214k07390
$$ -788228 -805660 -435646 238567 354259 30661 -415962 -126016 271715 141501 -65889
14589f5889n18452N5056J75945L77806n45176Q5394K64605O0344J40580o5699
$$ -65889 -584341 -529285 -353340 24466 -520710 -435316 -170711 -110367 30213 -35486
14579c5486N8213K06166m3641r9244j97614j1003K54896j08342M25235k02001
$$ -35486 22727 228893 185252 86008 -111606 -122609 132287 23945 449180 247179
14569B47179J17519n05181l07406M23523k62563k61288J85048J44053K47522k31741
$$ 247179 364698 -140483 -447889 -24366 -286929 -548217 -363169 -219116 28406 -203335
14559b03335K24958K47700j03778l58482L37225n04690J45558L14017j5041n8963
$$ -203335 21623 269323 165545 -192937 144288 -360402 -214844 99173 84132 25169
14549B5169j4014M19995K3915o26517j53978M8562L27890J53411j66830J10831
$$ 25169 11155 431150 455065 -171452 -325430 -276868 51022 204433 37603 148434
14539A48434k47782l32553K30856J41933L35348o13957l23884J39355N10776K63797
$$ 148434 -99348 -431901 -201045 -59112 276236 -337721 -661605 -522250 -11474 252323
14529B52323n0030J47027k66324J21041m69732M32742j9236j53448l86609J49545
$$ 252323 202293 349320 82996 204037 -265695 167047 147811 -5637 -392246 -242701
14519b42701L86376O0900m16437j84919O64506j10241n41496J9686K45378j19106
$$ -242701 143675 204575 -211862 -396781 267725 157484 -384012 -364326 -118948 -238054
14509b38054k71914L22964K01961K41445k64029j39577L74270l7823m34735k3514
$$ -238054 -509968 -187004 14957 256402 -7627 -147204 227066 189243 -245492 -269006
14499b69006k3655j16835K00277l0144k2046K04066n88042L54522K01943k14213
$$ -269006 -292661 -409496 -209219 -239363 -261409 -57343 -645385 -290863 -88920 -303133
14489c03133k79271j0570J11963k56775K53058M49073L63111k84896k89582L33793
$$ -303133 -582404 -592974 -481011 -737786 -484728 -35655 327456 42560 -247022 86771
14479H6771L76153m76648o82578M50689J28611K5535J84338j34794L17191L32002
$$ 86771 462924 -13724 -696302 -245613 -117002 -91467 92871 -41923 275268 607270
14469F07270k63607n95563k55845J12900n3137l9430M49760O86270K79688l35726
$$ 607270 343663 -251900 -507745 -394845 -447982 -487412 -37652 648618 928306 592580
14459E92580j4380l73826k78276M6610o1626R9909J9985L16779J6480q0872K62695
$$ 592580 578200 204374 -73902 -27292 -88918 10991 30976 347755 364235 283363 546058
14448E46058k98778j47288K22422q5344l47188J89336l49350k51640L90556j21923
$$ 546058 247280 99992 322414 237070 -110118 79218 -270132 -521772 -131216 -253139
14438b53139j22159K73547o3168k39255n5357j10925N11214j9882M6016J74709
$$ -253139 -375298 -101751 -164919 -404174 -459531 -570456 -59242 -79124 -33108 141601
14428A41601p9368j44388j57083K31623J90532J28459j39771n348K89063K24850
$$ 141601 62233 -82155 -239238 -7615 182917 311376 171605 166257 455320 680170
14418F80170l53506J94509J6423j58813j23533j18063p1410j84187P7412m1780
$$ 680170 326664 521173 537596 378783 255250 137187 65777 -118410 -40998 -82778
14408h2778n3111L00108L1883L51980k13192K85135R1592k41381j4428k50706
$$ -82778 -135889 164219 196102 548082 334890 620025 711617 470236 455808 205102
14398B05102K00798j27090j50967K06676N33920j60270m87939j19511n7529j36852
$$ 205102 405900 278810 127843 334519 868439 708169 220230 100719 43190 -93662
14388i3662Q808l40485K5401K43222J86595l6788K86012k63247l58677L09341
$$ -93662 -84854 -425339 -399938 -156716 29879 -6909 279103 15856 -342821 -33480
14378c3480j72867j24240L44054j83276J85545J46868j2366M17443j71848L44058
$$ -33480 -206347 -330587 13467 -169809 15736 162604 150238 567681 395833 739891
14368G39891j49163k67027o57834J99963L77774Q4766Q9410m48156j11524L6634
$$ 739891 590728 323701 -334133 -134170 243604 328370 417780 -30376 -141900 -105266
14358a05266j5621M9661M8797M0822j7100k02255k44689P3373k13482j8548N50796
$$ -105266 -120887 -71226 -22429 18393 1293 -200962 -445651 -372278 -585760 -604308 -53512
14347e3512j6969q8242k99J39656p2682N7819l69842K65859K48596r2859K30432
$$ -53512 -70481 -158723 -159022 -19366 -92048 -34229 -404071 -138212 110384 17525 247957
14336B47957K08743l15091k2221j90164M032L42522M6837p6416j95963J73657
$$ 247957 456700 141609 119388 -70776 -66744 275778 322615 246199 50236 223893
14326B23893p4610J1395j88915k88984K59086j65051M85217K19756l20160K19892
$$ 223893 149283 160678 -28237 -317221 -58135 -223186 262031 481787 161627 381519
14316C81519l21257l79717K15625K82813O303k63202k88012L4295J24090O19583
$$ 381519 60262 -319455 -103830 178983 185286 -77916 -365928 -331633 -207543 412040
14306D12040R5878k82284j32050j97422L97945J5080m7494J21900L46130k72799
$$ 412040 507918 225634 93584 -103838 294107 309187 261693 383593 729723 456924
14296D56924k57743J40135k8740j76559k02705J62997L8637j10002j18627K96632
$$ 456924 199181 339316 310576 134017 -68688 94309 132946 22944 -95683 200949
14286B00949J57845J22066m62642J20273J40726o50934Q299K50357J35734J08074
$$ 200949 358794 480860 18218 138491 279217 -371717 -363418 -113061 22673 130747
14276A30747j93148J62469L0397M95388O0367m74415k20335Q3671J47162j01106
$$ 130747 -62401 100068 130465 625853 686220 211805 -8530 75141 222303 121197
14266A21197m04026N6336K83059N24641k82448l75666L59227k25352M8713p815
$$ 121197 -282829 -226493 56566 581207 298759 -76907 282320 56968 105681 97866
14256I7866K32326K50955j93725l69084l94889n0882q9599L07233L30075q5653
$$ 97866 330192 581147 387422 18338 -376551 -427433 -517032 -209799 120276 34623
14246C4623K7004M47904L56733n02038M10225n9303m68711o5104O4333n64062
$$ 34623 61627 509531 866264 364226 774451 715148 246437 181333 245666 -318396
14236c18396k56099N92163M83683l37690J06511J41922k22144M6788m40195K37069
$$ -318396 -574495 17668 501351 163661 270172 412094 189950 236738 -203457 33612
14226C3612l27813k757k1989J66829p3889k1025o2536J73001M10509L9380j87548
$$ 33612 -294201 -296958 -318947 -152118 -226007 -247032 -309568 -136567 273942 313322 125774
14215A25774j72797M58854j71681j01844j37456j71655j49978L66429K47040L9436
$$ 125774 -47023 411831 240150 138306 850 -170805 -320783 45646 292686 332122
14205C32122P4221n85832n8093L02599j23284K25789m06933j38249M21296O9845
$$ 332122 406343 -179489 -237582 65017 -58267 167522 -239411 -377660 43636 113481
14195A13481J63417l33211L03336p5790l80874M58758J7226j76682q0737n7786
$$ 113481 276898 -56313 247023 171233 -209641 249117 266343 89661 8924 -48862
14185d8862N61961j4949j80005k17549J43609m4531J48254K62720k87835k80961
$$ -48862 513099 498150 318145 100596 244205 199674 347928 610648 322813 41852
14175D1852J70953L53144o91241j61454q2687k34431j40646M96395p493j41868
$$ 41852 212805 565949 -125292 -286746 -369433 -603864 -744510 -248115 -255608 -397476
14165c97476L47409k4631K55238K19342O6760J88466n23457M8433k63045K5091
$$ -397476 -50067 -74698 180540 399882 466642 655108 131651 180084 -82961 -57870
14155e7870o8196L14839O1649k18367J87422J73200l66724j80846K5573N2320
$$ -57870 -126066 188773 250422 32055 219477 392677 25953 -154893 -129320 -77000
14145g7000K15151J24376K47969l31723J1073m5554l21313j75117K65801K27531
$$ -77000 138151 262527 510496 178773 189846 144292 -177021 -352138 -86337 141194
14135A41194J0005J65199k61759k01177L18470K4926j09951Q2030N4140O8158
$$ 141194 151199 316398 54639 -146538 171932 196858 86907 168937 223077 291235
14125B91235l39648J66738L12338Q713J2101k64984K5273m13054J09768l49756
$$ 291235 -48413 118325 430663 439376 451477 186493 211766 -201288 -91520 -441276
14115d41276l7856L74647j1347N7345M46586l51754J13006j27106j59861L97795
$$ -441276 -479132 -104485 -115832 -58487 388099 36345 149351 22245 -137616 260179
14105B60179K9794l36030O7499L27190j3710j93631j10522N6932K4546L62412
$$ 260179 289973 -46057 21442 348632 334922 141291 30769 87701 112247 474659
14095D74659K78586k66760k29831K58228l0346k83291m42717j60199N44082K08552
$$ 474659 753245 486485 256654 514882 484536 201245 -241472 -401671 142411 350963
14085C50963j63945N7346J0981J07294J95183j21626k25680L25171m2843J52315
$$ 350963 187018 244364 255345 362639 557822 436196 210516 535687 492844 645159
14075F45159m57182K73963j28350j63743J58133j44945J60001k23638K30550k42485
$$ 645159 187977 461940 333590 169847 327980 183035 343036 119398 349948 107463
14065A07463J29966k99302K59125K8247m0373k27337j04662L28695k92148M32063
$$ 107463 237429 -61873 197252 225499 185126 -42211 -146873 181822 -110326 321737
14055C21737j27881n27834K93235N3951J56866K46748k43910j42665J42139K27123
$$ 321737 193856 -333978 -40743 13208 170074 416822 172912 30247 172386 399509
14045C99509l16163J39033J7221k47782M06219N6257j87513k5879j08891Q5307
$$ 399509 83346 222379 239600 -8182 398037 454294 266781 240902 132011 217318
14035B17318Q6473m93581M19413R7044k50228K30065O442j63536j05922n2753
$$ 217318 303791 -189790 229623 326667 76439 306504 312946 149410 43488 -9265
14025i265j79016K50560L99053L299l25701N5604k1067K58405j0544j30586k07755
$$ -9265 -188281 62279 461332 464631 138930 194534 173467 431872 421328 290742 82987
14014H2987l8355J79888n8307j15977K25477P9866q8175m94298J77357L74255
$$ 82987 44632 224520 166213 50236 275713 355579 267404 -226894 -49537 324718
14004C24718J80722j45564m06890J22662M0811k147O8288N10575j74776q8892
$$ 324718 505440 359876 -47014 75648 116459 114312 182600 693175 518399 429507
13994D29507M5855L31326k81221q5047l01065j12799M18384j4833k77641q827
$$ 429507 475362 806688 525467 440420 139355 26556 444940 430107 152466 143639
13984A43639J31549N8988K33887m895P3238k79015m38026j57M82335J82097K43243
$$ 143639 275188 334176 568063 563168 636406 357391 -80635 -80792 401543 583640 826883
13973H26883n4252J10582j23544k35225M5859K43022j70834k40601K68070K13891
$$ 826883 772631 883213 759669 524444 570303 813325 642491 401890 669960 883851
13963H83851k32196j28246j60608K33245K69213j3856l0682r2214k04440k9742
$$ 883851 651655 523409 362801 596046 865259 851403 820721 728507 524067 494325
13953D94325k81726j37372l87091J91767O66840J9525m09364L20649o4834l0049
$$ 494325 212599 75227 -311864 -120097 546743 566268 156904 477553 412719 382670
13943C82670L69769m8537j64047j25372N0489k79451M78915r3191Q4219k51780
$$ 382670 752439 703902 539855 414483 464972 185521 664436 571245 655464 403684
13933D03684J45472l49883r6428J57803O4659K67245K58556L30118k34901N9997
$$ 403684 549156 199273 102845 260648 325307 592552 851108 1181226 946325 1006322
13923A006322k64707j28577j63842L2037p5220k75198N5770L99701j9303O3867
$$ 1006322 741615 613038 449196 481233 406013 130815 186585 586286 566983 630850
13913F30850K45419j81676m20055k09749M03665M16503j09112n03532k26961J39233
$$ 630850 876269 694593 274538 64789 468454 884957 775845 272313 45352 184585
13903A84585K29030j85723k19850N14498L21092O8816k56615j66501J4207L60853
$$ 184585 413615 227892 8042 522540 843632 912448 655833 489332 503539 864392
13893H64392K45526m67826J04260K5079k17511p3660m216K13011J09323j00375
$$ 864392 1109918 642092 746352 771431 553920 480260 476044 689055 798378 698003
13883F98003J03234j36377L56503J83356j10145l84905K51764K16744m51912k686
$$ 698003 801237 664860 1021363 1204719 1094574 709669 961433 1178177 726265 723579
13873G23579J18194j39321k73984K17659J9826K97933j45035k07691O2760j49915
$$ 723579 841773 702452 428468 646127 665953 963886 818851 611160 673920 524005
13863E24005M332K09073j83089K03539K00407n041m71553p5822J99923J52276
$$ 524005 528337 737410 554321 757860 958267 953226 481673 405851 605774 758050
13853G58050k5718k67103J96192k92058K03798j79055K31266Q324M71917j04200
$$ 758050 732332 465229 661421 369363 573161 394106 625372 633696 1105613 1001413
13843A001413J74752n0218m45157K94377L52934m5026j75048k83743j90441L63677
$$ 1001413 1176165 1125947 680790 975167 1328101 1283075 1108027 824284 633843 997520
13833I97520r9445j85493M87394J63762j27406o2383m93647j28506j33596K08642
$$ 997520 898075 712582 1199976 1363738 1236332 1173949 680302 551796 418200 626842
13823F26842N85926K59354m03333l76492L1020K00998L80882k21717m7725j73091
$$ 626842 1212768 1472122 1068789 692297 723317 924315 1305197 1083480 1035755 862664
13813H62664P7938k40060J49295N13709q1941j36652m8527j27384l26234m3580
$$ 862664 940602 700542 849837 1363546 1281605 1144953 1096426 969042 642808 599228
13803E99228J05091j22512M48318J00479k58142L19900L19683k09002k49009J47470
$$ 599228 704319 581807 1030125 1130604 872462 1192362 1512045 1303043 1054034 1201504
13793A201504r624M33393j82773m43211L09280K0488p8797Q3363j56640j21489
$$ 1201504 1191880 1625273 1442500 999289 1308569 1329057 1250260 1333623 1176983 1055494
13783A055494P3378L97374j91065Q4521o1478N8035o25172j31780K61889k7919
$$ 1055494 1128872 1526246 1335181 1419702 1358224 1416259 791087 659307 921196 893277
13773H93277j66671L26524r0265J23776j08107J99415k09353J79408K10514L80425
$$ 893277 726606 1053130 962865 1086641 978534 1177949 968596 1148004 1358518 1738943
13763A738943Q7593j14262k47016l40412J72655K65439r3062K8335j35193k85586
$$ 1738943 1826536 1712274 1465258 1124846 1297501 1562940 1469878 1498213 1363020 1077434
13753A077434K50770k40290l90090K45104N17140P7739J28716k00460P64j83039
$$ 1077434 1328204 1087914 697824 942928 1460068 1537807 1666523 1466063 1466827 1283788
13743A283788m3830L27059K7950j19861N8280K31224K80043p7430l67340n2773
$$ 1283788 1239958 1567017 1594967 1475106 1533386 1764610 2044653 1967223 1599883 1547110
13733A547110M64045J10770m56096j06881K56017j6747o7536j56752q4194j60694
$$ 1547110 2011155 2121925 1665829 1558948 1814965 1798218 1730682 1573930 1489736 1329042
13723A329042L45852o3551j42134K39888o6016L16271K72049l46574K51494k80507
$$ 1329042 1674894 1611343 1469209 1709097 1643081 1959352 2231401 1884827 2136321 1855814
13713A855814K56609M5084n4581J22212m81139k14656M95059J08351J01604j21903
$$ 1855814 2112423 2157507 2102926 2225138 1743999 1529343 2024402 2132753 2234357 2112454
13703B112454j98960M36198n9754Q2752m7148k58984J29651J3488J23765n7870
$$ 2112454 1913494 2349692 2289938 2372690 2325542 2066558 2196209 2209697 2333462 2275592
13693B275592K63348J59886o3377J12945L16704k14642n99031J93989k0402l66769
$$ 2275592 2538940 2698826 2635449 2748394 3065098 2850456 2251425 2445414 2425012 2058243
13683B058243j74478M11510N68536m27837n31974K94903P3237K05395J70588r1596
$$ 2058243 1883765 2295275 2863811 2435974 1904000 2198903 2272140 2477535 2648123 2556527
13673B556527j71313K26327O56039p72298j33734M14455K7799j23844N85311M4879
$$ 2556527 2385214 2611541 3267580 2495282 2361548 2776003 2803802 2679958 3265269 3310148
13663C310148l20458k82398J78269K97851l77388P4502k17232K84211K23698M31379
$$ 3310148 2989690 2707292 2885561 3183412 2806024 2880526 2663294 2947505 3171203 3602582
13653C602582J25347o20177L23430l03404K87730k156j02247J30837P0566r8604
$$ 3602582 3727929 3107752 3431182 3127778 3415508 3413352 3311105 3441942 3512508 3413904
13643C413904k60399J49582K56660J03157k86479j70493N20620J46719l99255
$$ 3413904 3153505 3303087 3559747 3662904 3376425 3205932 3726552 3873271 3474016
13634C474016O370m8424K54470q7390K09648k06543M69540K12609j42419j69757
$$ 3474016 3480386 3431962 3686432 3599042 3808690 3602147 4071687 4284296 4141877 3972120
13624C972120n7710k946O3445L4104N46424J0274k85995n64675J64502M04856
$$ 3972120 3914410 3911464 3974909 4009013 4555437 4565711 4279716 3715041 3879543 4284399
13614D284399J47059j34919l58371L16793K53547k24067j80970M8647J47229O1063
$$ 4284399 4431458 4296539 3938168 4254961 4508508 4284441 4103471 4152118 4299347 4360410
13604D360410L26372L55445k81741J19755J37772L1646l17704M8596j17426k47619
$$ 4360410 4686782 5042227 4760486 4880241 5018013 5049659 4731955 4780551 4663125 4415506
13594D415506J26313K82102M97230o6436j72928n33887L89359k63828L71233J93899
$$ 4415506 4541819 4823921 5321151 5254715 5081787 4547900 4937259 4673431 5044664 5238563
13584E238563k671k99863Q7919L09713j67549J75246j76346O29012N30151k29791
$$ 5238563 5235892 4936029 5023948 5333661 5166112 5341358 5165012 5794024 6324175 6094384
13574F094384J41007l88167n11482M58672L6778j27493J21568O02784J77757J75419
$$ 6094384 6235391 5847224 5335742 5794414 5831192 5703699 5825267 6428051 6605808 6781227
13564F781227l6133k80355j0970l92167k35285M27852K69378k54839M50747N88551
$$ 6781227 6745094 6464739 6453769 6061602 5826317 6254169 6523547 6268708 6719455 7308006
13554G308006R6362J46476l29316k0020J18298K22510q9322k2971n7725K98966
$$ 7308006 7404368 7550844 7221528 7201508 7319806 7542316 7452994 7430023 7372298 7671264
13544G671264M63291J25975q6430k69057Q3958M68427j86123L265j81915M08927
$$ 7671264 8134555 8260530 8174100 7905043 7989001 8457428 8271305 8274570 8092655 8501582
13534H501582L51440K27564R5046k12598k21844J95123M49413R4888O1446j26379
$$ 8501582 8853022 9080586 9175632 8963034 8741190 8936313 9385726 9480614 9542060 9415681
13524I415681K69574M19274r2097K74824K52455M1798M46909k81772k6352K20665
$$ 9415681 9685255 10104529 10012432 10287256 10539711 10581509 11028418 10746646 10720294 10940959
13514A0940959j80285K24463K16212J11580L37198M14936j64271K41914l2909
$$ 10940959 10760674 10985137 11201349 11312929 11650127 12065063 11900792 12142706 12109797
13505A2109797O34118j04823k09338M2399K83905N76770P2934L40664L52942L58807
$$ 12109797 12743915 12639092 12429754 12472153 12756058 13332828 13405762 13746426 14099368 14458175
13495A4458175j49450n7928O76275J94451j92144J98206K80815M93412L21182
$$ 14458175 14308725 14250797 14927072 15121523 14929379 15127585 15408400 15901812 16222994
13486A6222994J20270l75709N61995L01953O160L64195K00546O37443O36165M87071
$$ 16222994 16343264 15967555 16529550 16831503 16837663 17201858 17402404 18039847 18676012 19163083
13476A9163083k36453K03955M76843j08236J63093L92959M11048J45482J57688
$$ 19163083 18926630 19130585 19607428 19499192 19662285 20055244 20466292 20611774 20769462
13467B0769462M08868L70108N69461J74304J02248N72459L80456O36371K16625
$$ 20769462 21178330 21548438 22117899 22292203 22394451 22966910 23347366 23983737 24200362
13458B4200362J06536L42865N99234L45974K77116N40759O83885K83321L66160
$$ 24200362 24306898 24649763 25248997 25594971 25872087 26412846 27096731 27380052 27746212
13449B7746212M16102R57317L77802L8102N88926R32982K58305Q15770Q48008
$$ 27746212 28162314 29119631 29497433 29535535 30124461 31057443 31315748 32131518 32979526
13440C2979526K10247K71643Q74479Q38540P26715M68627N53270R58794P83155
$$ 32979526 33189773 33461416 34335895 35174435 35901150 36369777 36923047 37881841 38664996
13431C8664996O59874P97862J218719J188959M11017M7166J013187J323027P25157
$$ 38664996 39324870 40122732 41341451 42530410 42941427 42988593 44001780 45324807 46049964
13422D6049964J106359J247157P77820O72659J122273J366165R99399R97917R71549
$$ 46049964 47156323 48403480 49181300 49853959 50976232 52342397 53341796 54339713 55311262
13413E5311262J323275J522779J315017J109233J378928J519128J271802J340574
$$ 55311262 56634537 58157316 59472333 60581566 61960494 63479622 64751424 66091998
13405F6091998J540916J790205J759853J703976J837418J596038J952663J804856
$$ 66091998 67632914 69423119 71182972 72886948 74724366 76320404 78273067 80077923
13397H0077923K128702K172111J787795K387785K368086K307945K169945K367507
$$ 80077923 82206625 84378736 86166531 88554316 90922402 93230347 95400292 97767799
13389I7767799K951647K647800K843903K926745K750085L304010L588112L446567
$$ 97767799 100719446 103367246 106211149 109137894 111887979 115191989 118780101 122226668
13381A22226668L027151L422520M123025L870101M183435M718932M802666M892362
$$ 122226668 125253819 128676339 132799364 136669465 140852900 145571832 150374498 155266860
13373A55266860M824408N082265N423161N471731N944903N774468O139481P201598
$$ 155266860 160091268 165173533 170596694 176068425 182013328 187787796 193927277 201128875
13365B01128875P132655O569357P564627P401851Q227367R249376Q319253R298850
$$ 201128875 208261530 214830887 222395514 229797365 238024732 247274108 255593361 264892211
13357B64892211R533381R612283J0625858J0561665J0376042J0719961J1237691
$$ 264892211 274425592 284037875 294663733 305225398 315601440 326321401 337559092
13350C37559092J1006716J1175105J0590301J0219005R961746R381784Q786069
$$ 337559092 348565808 359740913 370331214 380550219 390511965 399893749 408679818
13343D08679818Q155071O899183N264319M051498K768233R66065l93107j345352
$$ 408679818 416834889 423734072 428998391 433049889 435818122 436784187 436391080 435045728
13335D35045728l053375n200432o192352p579351p894212r120845j0062241r788742
$$ 435045728 431992353 426791921 420599569 413020218 405126006 396005161 385942920 376154178
13327C76154178j0880385j1351349j1382879j0799907j1022398j1546345j0808609
$$ 376154178 365273793 353922444 342539565 331739658 320717260 309170915 298362306
13320B98362306j0368971j0378786j0012270r470794r453227q901619q756227
$$ 298362306 287993335 277614549 267602279 258131485 248678258 239776639 231020412
13313B31020412q788055p866785p633840p083077o953733o779907o703848o157689
$$ 231020412 222232357 214365572 206731732 199648655 192694922 185915015 179211167 173053478
13305A73053478n903634n691299n849951n338455m355001m600776m409939m548852
$$ 173053478 167149844 161458545 155608594 150270139 145915138 141314362 136904423 132355571
13297A32355571l911906l434462m091347l761573l524202m090643l272348k847854
$$ 132355571 128443665 125009203 120917856 117156283 113632081 109541438 106269090 103421236
13289A03421236l076085k988848k538218k367984k528591k422874k361281k251627
$$ 103421236 100345151 97356303 94818085 92450101 89921510 87498636 85137355 82885728
13281H2885728k291279k083721k319427j961422k344339j420968j777523k096336
$$ 82885728 80594449 78510728 76191301 74229879 71885540 70464572 68687049 66590713
13273F6590713j657863j625045j552937j369193j136188j781483j607659j766073
$$ 66590713 64932850 63307805 61754868 60385675 59249487 57468004 55860345 54094272
13265E4094272j520922o33355p87203j451798j145064j162518j046563j267206
$$ 54094272 52573350 51939995 51152792 49700994 48555930 47393412 46346849 45079643
13257D5079643j149258j391065m69663p04779j069764r76786j163936p42156p16781
$$ 45079643 43930385 42539320 42069657 41364878 40295114 39318328 38154392 37412236 36695455
13248C6695455n84643p21020o87141o59703q24801r51195k66989j62507j030631
$$ 36695455 36110812 35389792 34702651 34042948 33218147 32266952 31999963 31837456 30806825
13239C0806825q18186o75779j12676n77030o50275l67325m87065m16102o35491
$$ 30806825 29988639 29312860 29200184 28623154 27972879 27605554 27118489 26702387 26066896
13230B6066896o38285q42220l39214o25337m03691K8979j99844k75643p5197q31653
$$ 26066896 25428611 24586391 24247177 23621840 23218149 23247128 23047284 22771641 22696444 21864791
13220B1864791o68603n21586k51901n46612l58383l1797l16604j7374n31204l11981
$$ 21864791 21196188 20674602 20422701 19876089 19517706 19485909 19169305 19151931 18620727 18308746
13210A8308746l17348m26382l00067m89472k6411n09483o9737n80863R2664j06818
$$ 18308746 17991398 17565016 17264949 16775477 16749066 16239583 16169846 15588983 15681647 15574829
13200A5574829n81839m48155k21900k24994O65650o0072l94573k46198n7434M0113
$$ 15574829 14992990 14544835 14322935 14097941 14763591 14703519 14308946 14062748 14005314 14045427
13190A4045427k47540r67036j24397L69391j91033k69510k10064l04039n85409
$$ 14045427 13797887 12830851 12706454 13075845 12884812 12615302 12405238 12101199 11515790
13181A1515790Q3646K32222j57578k68042K87241M4485l89902j89022j57680j87020
$$ 11515790 11599436 11831658 11674080 11406038 11693279 11737764 11347862 11158840 11001160 10814140
13171A0814140l68721o33925K7580k0021K4900r0572r0076J40721k87911l86863
$$ 10814140 10445419 9811494 9839074 9819053 9843953 9753381 9663305 9804026 9516115 9129252
13161I129252l947j20586K94875N6750k54000l65948J05993k64892n8539R4733
$$ 9129252 9125305 9004719 9299594 9356344 9102344 8736396 8842389 8577497 8518958 8613691
13151H613691q3508l54964l0980O2047K61750n03845j13861L62513k30010l51064
$$ 8613691 8530183 8175219 8144239 8206286 8468036 7964191 7850330 8212843 7982833 7631769
13141G631769J74498N472j4137k04159l90640m97060N42607j04591l20309L3708
$$ 7631769 7806267 7811739 7797602 7593443 7202803 6705743 7248350 7143759 6823450 6857158
13131F857158K4226M0599M6061Q7921p3437l21396k67372J28311k03152K4644
$$ 6857158 6881384 6921983 6968044 7055965 6982528 6661132 6393760 6522071 6318919 6343563
13121F343563j05136j8470k336j8730M2242p52220k47020K79592K12215n88083
$$ 6343563 6238427 6219957 6217621 6198891 6241133 5488913 5241893 5521485 5733700 5145617
13111E145617M06688j92540J45438n5253K2106l3658l82682m32894j00115L58213
$$ 5145617 5552305 5359765 5505203 5449950 5472056 5438398 5055716 4622822 4522707 4880920
13101D880920l57113M0935K06259J36453j6680K76342n17405l48713P0050J47235
$$ 4880920 4523807 4564742 4771001 4907454 4890774 5167116 4649711 4300998 4371048 4518283
13091D518283n64411j49186N15105j01943j26038k02465L15418J32770p8731l1711
$$ 4518283 3953872 3804686 4319791 4217848 4091810 3889345 4204763 4337533 4258802 4227091
13081D227091l03395M56033m28880p25497K27008l73189J44479K7939m47956N32650
$$ 4227091 3923696 4379729 3950849 3225352 3452360 3079171 3223650 3251589 2803633 3336283
13071C336283l2295K43604j83697K2271j45099j23681o691K55568l08201L21061
$$ 3336283 3303988 3547592 3363895 3386166 3241067 3117386 3110695 3366263 3058062 3379123
13061C379123J10680j55156Q0198k36218k45385K45369k83725q351M76878j97150
$$ 3379123 3489803 3334647 3414845 3178627 2933242 3178611 2894886 2886535 3363413 3166263
13051C166263K16090J76561m81047n86278K21115O3002j73759M9858K07021N8897
$$ 3166263 3382353 3558914 3077867 2491589 2712704 2775706 2601947 2651805 2858826 2917723
13041B917723l36728o5503j54711j58924J1774M30632l65236k83842J1972K10371
$$ 2917723 2580995 2515492 2360781 2201857 2213631 2644263 2279027 1995185 2007157 2217528
13031B217528K10194M31416r3749j92804p46102o2790M88263j16229m63669L50765
$$ 2217528 2427722 2859138 2765389 2572585 1826483 1763693 2251956 2135727 1672058 2022823
13021B022823M03141r6986m10794J49298k69623p0849J52188j22880j80393K49757
$$ 2022823 2425964 2328978 1918184 2067482 1797859 1727010 1879198 1756318 1575925 1825682
13011A825682K58504o30372K23153K97630l05032n41835J23150N7776L30372L09588
$$ 1825682 2084186 1453814 1676967 1974597 1669565 1127730 1250880 1308656 1639028 1948616
13001A948616n4712l35771l78758j89810O12660M7p5322J47998J10168o4078L5008
$$ 1948616 1893904 1558133 1179375 989565 1602225 1602272 1526950 1674948 1785116 1721038 1756046
12990A756046J16146J81846l87170l74617j24046j10801K26635O588k55928L21442
$$ 1756046 1872192 2054038 1666868 1292251 1168205 1057404 1284039 1290627 1034699 1356141
12980A356141j34309K29794J30807j82658r5849k9369j93346m6296L17387l78358
$$ 1356141 1221832 1451626 1582433 1399775 1303926 1274557 1081211 1034915 1352302 973944
12970I73944j46375M12958m5957l54591p4897j45039J09856j49919j01993J49773
$$ 973944 827569 1240527 1194570 839979 765082 620043 729899 579980 477987 627760
12960F27760J11545K46227Q5377J16991j23630l02251K77435O84743m23654n7317
$$ 627760 739305 985532 1070909 1187900 1064270 762019 1039454 1724197 1300543 1243226
12950A243226J91193j40575j77219l41947L1232K46802L55317k60611J75974K29056
$$ 1243226 1434419 1293844 1116625 774678 805910 1052712 1408029 1147418 1323392 1552448
12940A552448o07266m30890J13348O12370m63804K9384J07962j87066j1730L14797
$$ 1552448 945182 514292 627640 1240010 776206 805590 913552 726486 714756 1029553
12930A029553p9837k49293j23024k3772J79874K22520J30903j85953k79590K0349
$$ 1029553 949716 700423 577399 553627 733501 956021 1086924 900971 621381 641730
12920F41730J53927J34633J83251J7306J72508k24091l25024j94471J07423J62122
$$ 641730 795657 930290 1113541 1130847 1303355 1079264 754240 559769 667192 829314
12910H29314l29871J37553k1543O6359J5819M00972m49517J43581J3010m04828
$$ 829314 499443 636996 615453 681812 697631 1098603 649086 792667 805677 400849
12900D00849J65008M80007r2886Q270Q1645P384k83662l38711L52518o1032l59081
$$ 400849 565857 1045864 952978 961248 1042893 1050277 766615 427904 780422 719390 360309
12889C60309J14205J6278l66195N04550J31349q2771m51295p695P1096K41223
$$ 360309 474514 490792 124597 629147 760496 677725 226430 218735 289831 531054
12879E31054l1151L85264M172k66946j91372M02504l7283J58786k40608K7127
$$ 531054 499903 885167 889339 622393 431021 833525 796242 955028 714420 741547
12869G41547j83158J33307j72538p04818L28234L96437J02743j42986M3924k54724
$$ 741547 558389 691696 519158 -185660 142574 539011 641754 498768 542692 287968
12859B87968j61724K0226k27711Q8981j32360R8645M07812j96516k71285L38384
$$ 287968 126244 146470 -81241 7740 -124620 -25975 381837 185321 -85964 252420
12849B52420m9811J35397L80607m92211J83056Q4155R2373M02592N9613m43507
$$ 252420 202609 338006 718613 226402 409458 493613 585986 988578 1048191 604684
12839F04684k24377l41112L5024K21296J24415M24787n47398l69869J76789L56658
$$ 604684 380307 39195 74219 295515 419930 844717 297319 -72550 104239 460897
12829D60897j29234k711k51809j82269L04404J57675J53189k15275j80920K67804
$$ 460897 331663 328952 77143 -105126 199278 356953 510142 294867 113947 381751
12819C81751K16837Q1575k96528k61191J75733o2318J42257P8378N4514j15848
$$ 381751 598588 680163 383635 122444 298177 235859 378116 456494 511008 395160
12809C95160k45365m6746N9163K1630k35445o7089M58538k75620k53544J40778
$$ 395160 149795 103049 162212 183842 -51603 -118692 339846 64226 -189318 -48540
12799d8540j93059K08128J55312M33128j35681k63428k87060j97962j84817K20051
$$ -48540 -241599 -33471 121841 554969 419288 155860 -131200 -329162 -513979 -293928
12789b93928K80998J37179J1045j81055j13907K13010L22905K35786l31766n9238
$$ -293928 -12930 124249 135294 -45761 -159668 53342 376247 612033 280267 221029
12779B21029m89414o9879N00040L08736j61014k78615j41535j2869J69451K46770
$$ 221029 -268385 -338264 161776 470512 309498 30883 -110652 -123521 45930 292700
12769B92700K66574k09502r9258n29846P7160J63976k48411J69076K49465l0571
$$ 292700 559274 349772 250514 -279332 -202172 -38196 -286607 -117531 131934 101363
12759A01363l3540m58190m903M86516J47674m923o8387Q910l56536L8245J09267
$$ 101363 67823 -390367 -395270 91246 238920 233997 165610 174520 -182016 -143771 -34504
12748c4504l91488M96396m6519J70708P1467j32711o8093K8400j78147K74445
$$ -34504 -425992 70404 23885 194593 266060 133349 65256 93656 -84491 189954
12738A89954j04534l28668N0249J00699l76384L2339J32339J86171l07256J93865
$$ 189954 85420 -243248 -192999 -92300 -468684 -436345 -304006 -117835 -425091 -231226
12728b31226o8069k70751M48631K98429M9709k35422q5133o0186Q7055K02222
$$ -231226 -299295 -570046 -121415 177014 226723 -8699 -93832 -154018 -66963 135259
12718A35259q5307K1057k89247k62982K85943J39001k88662J60438m86966l50915
$$ 135259 49952 71009 -218238 -481220 -195277 -56276 -344938 -184500 -671466 -1022381
12708a022381P0087K70894N55260K84422j09750J19279j95627l12650m3264J58044
$$ -1022381 -952294 -681400 -126140 158282 48532 167811 -27816 -340466 -383730 -225686
12698b25686M8969j99000j12239j30311Q2820L53850k68885k29606k86169l17189
$$ -225686 -176717 -375717 -487956 -618267 -535447 -181597 -450482 -680088 -966257 -1283446
12688a283446O13087L36953L90171L88959k45166m6790l03921o2940k37541j55395
$$ -1283446 -670359 -333406 56765 445724 200558 153768 -150153 -213093 -450634 -606029
12678f06029N88719j21461K41078k81993J31932J46296k42736l59601N5988M87429
$$ -606029 -17310 -138771 102307 -179686 -47754 98542 -144194 -503795 -447807 39622
12668C9622R6047L2951Q5126k35913l169J10370k51961m25990M06188J18542P0024
$$ 39622 135669 168620 253746 17833 14664 125034 -126927 -552917 -146729 -28187 41837
12657D1837n62921J33872m446j84443k89809M28465j21957L1736L77194l61762
$$ 41837 -521084 -387212 -391658 -576101 -865910 -437445 -559402 -527666 -150472 -512234
12647e12234N06256k74242k89511J99693J3796k05515K65895J46749N43379M02295
$$ -512234 -5978 -280220 -569731 -370038 -356242 -561757 -295862 -149113 394266 796561
12637G96561q40944k61314j52223Q2401j48975K80122l53578J51911J73397r6190
$$ 796561 -44383 -305697 -457920 -375519 -524494 -244372 -597950 -446039 -272642 -368832
12627c68832l6949q4145Q5213j57085R2947N306j77416k040M47832M2931L06257
$$ -368832 -405781 -489926 -404713 -561798 -468851 -463545 -640961 -643001 -195169 -152238 154019
12616A54019P9018J88715o56463l26204j01503M72838K01098j56730J86080o3829
$$ 154019 233037 421752 -234711 -560915 -662418 -189580 11518 -145212 40868 -22961
12606b2961R9918j52981Q3031j77420l5912R5133o3596J70379l80313J8837o6662
$$ -22961 76957 -76024 7007 -170413 -206325 -111192 -174788 -4409 -384722 -365885 -432547
12595d32547p9697Q3098j52419R2308j5069r1036J13376n2203j20928K01061l0780
$$ -432547 -512244 -429146 -581565 -489257 -504326 -595362 -481986 -534189 -655117 -454056 -484836
12584d84836n4039M3136L1883k44257r1466M18303K06905l60783k0661L69682
$$ -484836 -538875 -495739 -463856 -708113 -799579 -381276 -174371 -535154 -555815 -186133
12574a86133q7975k28378K7471P2843K74879o7434k54713l29996K76546K05549
$$ -186133 -274108 -502486 -475015 -402172 -127293 -194727 -449440 -779436 -502890 -297341
12564b97341m9405k36681l60427J86479N36748Q9921j71921K55217k18401k6424
$$ -297341 -346746 -583427 -943854 -757375 -220627 -130706 -302627 -47410 -265811 -292235
12554b92235K77989k06757J48239P9876j49400J6193K42552k84924K55198Q5126
$$ -292235 -14246 -221003 -72764 7112 -142288 -126095 116457 -168467 86731 171857
12544A71857m05116l58728K49194j18830O484J89926j62094L73290q5733j1370
$$ 171857 -233259 -591987 -342793 -461623 -455139 -265213 -427307 -54017 -139750 -151120
12534a51120K0126m64275j87443P94712n44202j43J44122K90060j23759M15483
$$ -151120 -130994 -595269 -782712 12000 -532202 -532345 -388223 -98163 -221922 193561
12524A93561l76940K41299K03438r1693M6397m49450j05216j42208P6352j69381
$$ 193561 -183379 57920 261358 169665 216062 -233388 -338604 -480812 -404460 -573841
12514e73841j17187K44590K74618j2927o4386M43316j68911k50469N7607j63404
$$ -573841 -691028 -446438 -171820 -184747 -249133 194183 25272 -225197 -167590 -330994
12504c30994O3038J19763j41762J87734K28192J20709R8078j32376l79359k49389
$$ -330994 -267956 -148193 -289955 -102221 125971 246680 344758 212382 -166977 -416366
12494d16366j42826L9741J79818l02319k0990L37001K66848k56293m1089J4786
$$ -416366 -559192 -519451 -339633 -641952 -662942 -325941 -59093 -315386 -356475 -341689
12484c41689J43217k20250k19886K00578J58996m19624J42535O0417P9528j69410
$$ -341689 -198472 -418722 -638608 -438030 -279034 -698658 -556123 -495706 -416178 -585588
12474e85588p888J20820Q7188r4034J06354j50451q8835K99506j40799J67792
$$ -585588 -593476 -472656 -385468 -479502 -373148 -523599 -612434 -312928 -453727 -285935
12464b85935O3906N4395l90348Q7714p4840q241L15947N5912n455j89148J46770
$$ -285935 -222029 -167634 -557982 -470268 -545108 -553349 -237402 -181490 -186945 -376093 -229323
12453b29323o0294k5199J69201j30k30097k1229L53982K78447k73782m37492K21456
$$ -229323 -289617 -314816 -145615 -145745 -375842 -397071 -43089 235358 -38424 -475916 -254460
12442b54460k21065K83248l16550q4736J59474k59096N51248J30552m00832l4817
$$ -254460 -475525 -192277 -508827 -593563 -434089 -693185 -141937 -11385 -412217 -447034
12432d47034L89294j51112k50508M4020m5995P2538J13978q0085M10111j65873
$$ -447034 -57740 -208852 -459360 -415340 -461335 -388797 -274819 -354904 55207 -110666
12422a10666j22503k51986K1245J86208K6444l33526J14912q5834K781j65514
$$ -110666 -233169 -485155 -463910 -277702 -251258 -584784 -469872 -555706 -552925 -718439
12412g18439M9813k571j56418L72100M81197o599m41313J34795j54811J55019
$$ -718439 -668626 -671197 -827615 -455515 25682 19083 -422230 -287435 -442246 -287227
12402b87227m937j11482L03516J0612j36796K71574J73893l07164j71227L24322
$$ -287227 -292164 -403646 -100130 -89518 -226314 45260 219153 -88011 -259238 65084
12392F5084M3162k0070L8341j30602Q2752l19002l09657K67150j45147N17811
$$ 65084 108246 88176 126517 -4085 78667 -240335 -549992 -282842 -427989 89822
12382H9822J86429l00871m33923l15916N36864j43450l8173O6477j72494n51908
$$ 89822 276251 -24620 -458543 -774459 -237595 -381045 -419218 -352741 -525235 -1077143
12372a077143M75624L2519N89461J3443k11009J22601k77838j31329n85496N79750
$$ -1077143 -601519 -569000 20461 33904 -177105 -54504 -332342 -463671 -1049167 -469417
12362d69417P9803r8370k57179P30683J82355l36256J55385l57345l33714o3621
$$ -469417 -389614 -487984 -745163 -14480 167875 -168381 -12996 -370341 -704055 -767676
12352g67676K14855O76026j4453m41046k23910l67336j13603J12616L08271j94952
$$ -767676 -552821 123205 108752 -332294 -556204 -923540 -1037143 -924527 -616256 -811208
12342h11208J3754J1350L36384r3114K42418J63295l32067k38622M68007j86096
$$ -811208 -797454 -786104 -449720 -542834 -300416 -137121 -469188 -707810 -239803 -425899
12332d25899j26234L92357k93482p4472L01269j34580m18106M8089j46677N69435
$$ -425899 -552133 -159776 -453258 -527730 -226461 -361041 -779147 -731058 -877735 -308300
12322c08300q9864m16427N5883J97157M5621R1812j69598L83938J29099l34502
$$ -308300 -398164 -814591 -758708 -561551 -515930 -424118 -593716 -209778 -80679 -415181
12312d15181l82742M13198k98332J25081K87707J5141k36919k59482K05630l9886
$$ -415181 -797923 -384725 -683057 -557976 -270269 -255128 -492047 -751529 -545899 -585785
12302e85785R2078K8773l07027k79182L34996M87838k15127k25004K91334L50015
$$ -585785 -493707 -464934 -771961 -1051143 -716147 -228309 -443436 -668440 -377106 -27091
12292b7091j1832l84412J05119r8248M807j98448K67286J40522k88826k04170
$$ -27091 -38923 -423335 -318216 -416464 -411657 -610105 -342819 -202297 -491123 -695293
12282f95293k78173N65610j40461l15552K93303L762j6162q0595n0034L32478
$$ -695293 -973466 -407856 -548317 -863869 -570566 -566804 -582966 -663561 -713595 -381117
12272c81117q7010K76112J7411j09373J8583K08914j12235k48879N0336K50429
$$ -381117 -468127 -192015 -174604 -283977 -265394 -56480 -168715 -417594 -367258 -116829
12262a16829j66237l48583Q9677k28160K72976M34505L6289m08735M1037L34144
$$ -116829 -283066 -631649 -541972 -770132 -497156 -62651 -26362 -435097 -394060 -59916
12252e9916k96274J36915k51905l34896J73268j49499K40447J32978m5969k38643
$$ -59916 -356190 -219275 -471180 -806076 -632808 -782307 -541860 -408882 -454851 -693494
12242f93494J51320J03859J29103m61948L08888K624q9416q4109M6185m2499k35145
$$ -693494 -542174 -438315 -309212 -771160 -462272 -459648 -549064 -633173 -586988 -629487 -864632
12231h64632l50586n4109K26075J58870k5975L77750j55788K11036m339o3649
$$ -864632 -1215218 -1269327 -1043252 -884382 -910357 -532607 -688395 -477359 -481698 -545347
12221e45347K06699N5528j96928r8314M4305n2803K13366q3389J62470l41566
$$ -545347 -338648 -283120 -480048 -578362 -534057 -586860 -373494 -456883 -294413 -635979
12211f35979R4197J08017N6444l76020J35135j20614J79097J68684K3254k75406
$$ -635979 -541782 -433765 -377321 -753341 -618206 -738820 -559723 -391039 -367785 -643191
12201f43191L8659L73707j59262j65117k22479K4048M30762l57278j33419J03426
$$ -643191 -604532 -230825 -390087 -555204 -777683 -753635 -322873 -680151 -813570 -710144
12191g10144k58283N0757L41891L46358l58380j89728J90662L21699k46985Q9780
$$ -710144 -968427 -917670 -575779 -229421 -587801 -777529 -586867 -265168 -512153 -422373
12181d22373j05014K63891n6557o4021K08682m82284q4299o4279J50080K84743
$$ -422373 -527387 -263496 -320053 -384074 -175392 -657676 -741975 -806254 -656174 -371431
12171c71431j15837M1459j51399K04659K32771j92332l59025j13411L44827J69931
$$ -371431 -487268 -445809 -597208 -392549 -159778 -352110 -711135 -824546 -479719 -309788
12161c09788K7278k16712l26894M6381j9969k54124O40953M45311m50605j26939
$$ -309788 -282510 -499222 -826116 -779735 -799704 -1053828 -412875 32436 -418169 -545108
12151e45108P2351l16386M61188l20081n43857M05627K05845N1550J40850K96156
$$ -545108 -472757 -789143 -327955 -648036 -1191893 -786266 -580421 -528871 -388021 -91865
12141i1865m79771p0946M89130J10575k02013m04004j60715N174M17874l4063
$$ -91865 -571636 -642582 -153452 -42877 -244890 -648894 -809609 -804435 -386561 -420624
12131d20624n4255K8635q5730m65930p2431L80028M8264n5929K98997n6086m3042
$$ -420624 -474879 -446244 -531974 -997904 -1070335 -690307 -642043 -697972 -398975 -455061 -498103
12120d98103o4725n31256K01723K2494R9876J20197L54224M21546m82242j02641
$$ -498103 -562828 -1094084 -892361 -869867 -769991 -649794 -295570 125976 -356266 -458907
12110d58907l58915N52536K81362l80296l32576k76341P66868j48488r5183l29833
$$ -458907 -817822 -265286 16076 -364220 -696796 -973137 -206269 -354757 -449940 -779773
12100g79773j17469M22802p6097N6552k55467K95499K94440l14269o9878J81027
$$ -779773 -897242 -474440 -550537 -493985 -749452 -453953 -159513 -473782 -543660 -362633
12090c62633K63345J61667n4889j29980q2344R2044m49935K60639L36829l07241
$$ -362633 -99288 62379 7490 -122490 -204834 -112790 -562725 -302086 34743 -272498
12080b72498J71728Q8126k22837L79225P937o88785K5984K27731l8511q8173J48398
$$ -272498 -100770 -12644 -235481 143744 151681 -537104 -511120 -283389 -321900 -410073 -261675
12069b61675P300k00346l84643J43558Q3135m8235J6812L86182r236j60814q753
$$ -261675 -254375 -454721 -839364 -695806 -612671 -660906 -644094 -257912 -267148 -427962 -436715
12058d36715J20436k88361J55551j10074q1748q9408O3460j36717N64684p9675
$$ -436715 -316279 -604640 -449089 -559163 -640911 -730319 -666859 -803576 -238892 -318567
12048c18567P2740J57521r9142J22396m64569K95229J45020j9524n59234q0079
$$ -318567 -245827 -88306 -187448 -65052 -529621 -234392 -89372 -108896 -668130 -748209
12038g48209K73660K8516L1074P1343l65677J26814L81722j01541j23475m6912
$$ -748209 -474549 -446033 -414959 -343616 -709293 -582479 -200757 -302298 -425773 -472685
12028d72685n8674J29953j38585J78036k76446M07485J41904l29987Q176r8802
$$ -472685 -531359 -401406 -539991 -361955 -638401 -230916 -89012 -418999 -410823 -509625
12018e09625K0745k54477o0273J66510K76766j86992o932K50003k98034J12027
$$ -509625 -488880 -743357 -803630 -637120 -360354 -547346 -554278 -304275 -602309 -490282
12008d90282M20984J92284j13205k56988L1259o0873K55278J83906l84322k69743
$$ -490282 -69298 122986 9781 -247207 -215948 -276821 -21543 162363 -221959 -491702
11998d91702j34445j0779L72142R5637K78433j6725p04760J05477P9344k1391
$$ -491702 -626147 -636926 -264784 -169147 109286 92561 -612199 -506722 -427378 -448769
11988d48769j34477k8021J17469J19473m58229k10251K04966J45542K88152j12943
$$ -448769 -583246 -611267 -493798 -374325 -832554 -1042805 -837839 -692297 -404145 -517088
11978e17088J27069L56216k58163J3234j43349k09606q8983L2581J52193K29982
$$ -517088 -390019 -33803 -291966 -278732 -422081 -631687 -720670 -688089 -535896 -305914
11968c05914j11734p8246r8253l5170J56812K5146K52006J80036J56449k41839
$$ -305914 -417648 -495894 -594147 -629317 -472505 -447359 -195353 -15317 141132 -100707
11958a00707q3610p5147J01633j49069j35095k4744j90706l75870j12185N51364
$$ -100707 -184317 -259464 -157831 -306900 -441995 -466739 -657445 -1033315 -1145500 -594136
11948e94136L79825k31253K24884j43549K7043L50750j99291k34930l84771k16717
$$ -594136 -214311 -445564 -220680 -364229 -337186 13564 -185727 -420657 -805428 -1022145
11938a022145L61734M66715J80602L3531L28941m51590k30232L2047j60294o5327
$$ -1022145 -660411 -193696 -13094 20437 349378 -102212 -332444 -300397 -460691 -526018
11928e26018K11432K68145R4320J58631l74430q0329K29107M9448j14998J15799
$$ -526018 -314586 -46441 47879 206510 -167920 -248249 -19142 30306 -84692 31107
11918C1107j37836l8936j33181K93263J92220J15421J34799l3487L3319n763l72057
$$ 31107 -106729 -145665 -278846 14417 206637 322058 456857 423370 456689 450926 78869
11907G8869k06343N66863J13294n24149k48323Q4004l6423N27717J04664j46162
$$ 78869 -127474 439389 552683 28534 -219789 -135785 -172208 355509 460173 314011
11897C14011J12800K16190L9914k91750L22641j036Q4785L06292m97665j17809
$$ 314011 426811 643001 682915 391165 713806 712770 797555 1103847 606182 488373
11887D88373m10118L8666L71014k54583K19879j01533K49983o8016K49777O3482
$$ 488373 78255 116921 487935 233352 453231 351698 601681 533665 783442 846924
11877H46924l03681L0090m7462J95754K2810K20848K45443J91106K6704l2951
$$ 846924 543243 573333 525871 721625 744435 965283 1210726 1401832 1428536 1395585
11867A395585p11283r8955K93807K78581m37678o75709N98007M23061m39326L34672
$$ 1395585 684302 585347 879154 1157735 720057 44348 642355 1065416 626090 960762
11857I60762K81706J32025p1709m3589j29015k01316K40052m4884n4831K7327
$$ 960762 1242468 1374493 1302784 1259195 1130180 928864 1168916 1124032 1069201 1096528
11847A096528N76394J50993o2104J19426l87960N6824K26547m02354L40514L65837
$$ 1096528 1672922 1823915 1761811 1881237 1493277 1550101 1776648 1374294 1714808 2080645
11837B080645j13233K90240j32733K58903Q626j43050j25086J0315M47498k6371
$$ 2080645 1967412 2257652 2124919 2383822 2392448 2249398 2124312 2134627 2582125 2555754
11827B555754J69960L2540O1781K42572l45057k18006q9865J87191K62514J28916
$$ 2555754 2725714 2758254 2820035 3062607 2717550 2499544 2409679 2596870 2859384 2988300
11817B988300K82568L57584m39576N3010J66743k52363k43694J27438M43950J15871
$$ 2988300 3270868 3628452 3188876 3241886 3408629 3156266 2912572 3040010 3483960 3599831
11807C599831K47745j43904K28173N591l9805k21162N37897L63541j94389o61642
$$ 3599831 3847576 3703672 3931845 3937436 3897631 3676469 4214366 4577907 4383518 3721876
11797C721876r2047O7537K64215N08275N6975n4384k10820K80750j53512L48697
$$ 3721876 3629829 3697366 3961581 4469856 4526831 4472447 4261627 4542377 4388865 4737562
11787D737562l7035r6543n8185j94643J04622K55964K95967l47754l63593k57663
$$ 4737562 4700527 4603984 4545799 4351156 4455778 4711742 5007709 4659955 4296362 4038699
11777D038699M47507P8624q7787K40063j96303Q7738K32157J88416J56005m83832
$$ 4038699 4486206 4564830 4477043 4717106 4520803 4608541 4840698 5029114 5185119 4701287
11767D701287n64460J26741P9960n87275k06622M82809K16935K61643j87925j73448
$$ 4701287 4136827 4263568 4343528 3756253 3549631 4032440 4249375 4511018 4323093 4149645
11757D149645J30240P2297L74052n07832k1014l87218l01783Q4901O00052n87005
$$ 4149645 4279885 4352182 4726234 4218402 4197388 3810170 3508387 3593288 4193340 3606335
11747C606335J04056K46054j27191j77523r8650j58252j06101J08204j15963j12791
$$ 3606335 3710391 3956445 3829254 3651731 3553081 3394829 3288728 3396932 3280969 3168178
11737C168178p2768M7046q1592L56301Q135m94962J43555J88511P4710m02288
$$ 3168178 3095410 3142456 3060864 3417165 3425300 2930338 3073893 3262404 3337114 2934826
11727B934826j83160j38347J31314J20651l09124M62195J39290k33339q2038j25053
$$ 2934826 2751666 2613319 2744633 2865284 2556160 3018355 3157645 2924306 2842268 2717215
11717B717215j76140K08182o55285k2128L12869J78244k48070k87121j39214l56712
$$ 2717215 2541075 2749257 2093972 2071844 2384713 2562957 2314887 2027766 1888552 1531840
11707A531840j01740K58409k07842K85332j52501O272j47853K38226j76555k06781
$$ 1531840 1430100 1688509 1480667 1765999 1613498 1619770 1471917 1710143 1533588 1326807
11697A326807P8917j28457K02001L5933k11166j00828J48953K28223J22706k21575
$$ 1326807 1405724 1277267 1479268 1515201 1304035 1203207 1352160 1580383 1703089 1481514
11687A481514l7351q078n62739k11339K55451K08264j59684l93555J58430N58082
$$ 1481514 1444163 1436085 873346 662007 917458 1125722 966038 572483 730913 1288995
11677A288995r2577R731j45417P1930m12427n9995M15827J85732J32832k62190
$$ 1288995 1196418 1206149 1060732 1132662 720235 660240 1076067 1261799 1394631 1132441
11667A132441j43110J66330J42044k83847o1582L54769l74594k75478J34195J41433
$$ 1132441 989331 1155661 1297705 1013858 952276 1307045 932451 656973 791168 932601
11657I32601K87130J49458n70067J24474j76723k35401l70933J37586K77691K45782
$$ 932601 1219731 1369189 799122 923596 746873 511472 140539 278125 555816 801598
11647H01598k50604l02682J76685M56797J36343k55781p5813j28322m3270r2294
$$ 801598 550994 248312 424997 881794 1018137 762356 686543 558221 514951 422657
11637D22657N50568m52159N5689k01560j75060K23229M2787L7444K70444P3923
$$ 422657 973225 521066 576755 375195 200135 423364 466151 503595 774039 847962
11627H47962N7371k36732o8093j26572K64182k8988K96098K9807o8336J80557
$$ 847962 905333 668601 600508 473936 738118 709130 1005228 1035035 966699 1147256
11617A147256R2752k98261K8947k686o4817r8733L4556L93336j85596m19283l5378
$$ 1147256 1240008 941747 970694 968008 903191 804458 839014 1232350 1046754 627471 592093
11606E92093L8963Q7819J19124J588j72402J61042O07326j98338o6840o2461l19246
$$ 592093 631056 718875 837999 839587 667185 828227 1435553 1237215 1170375 1107914 788668
11595G88668j50654k23360M65696J20397o660k89135J97191J32066j22334J24146
$$ 788668 638014 414654 880350 1000747 994087 704952 902143 1034209 911875 1036021
11585A036021K7098J97336j82773P7250j14338K97728l03190j55449K87305j68578
$$ 1036021 1063119 1260455 1077682 1154932 1040594 1338322 1035132 879683 1166988 998410
11575I98410k43043K6733j60372J24070K68882k26882N27205l63065J3082j12840
$$ 998410 755367 782100 621728 745798 1014680 787798 1315003 951938 965020 852180
11565H52180n2508k0794j76065k12197k82903J74148O75222j69582j15324j84252
$$ 852180 799672 778878 602813 390616 107713 281861 957083 787501 672177 487925
11555D87925q1265j14523J40178R02177j64934j71749R521m0825J41590K08869
$$ 487925 406660 292137 432315 1334492 1169558 997809 1007330 966505 1108095 1316964
11545A316964J26553r6005m06215k64360R2137k15274L52062k42755j3740L84188
$$ 1316964 1443517 1347512 941297 676937 769074 553800 905862 663107 649367 1033555
11535A033555l82213Q0386J17466K57852k85435j21757P7608k87032m34869J38427
$$ 1033555 651342 731728 849194 1107046 821611 699854 777462 490430 55561 193988
11525A93988Q1081l71319j82017K36756J57486K85829m62069m5478L87420q2653
$$ 193988 275069 -96250 -278267 -41511 115975 401804 -60265 -105743 281677 199024
11515A99024n75254J63065K65793R068K80014Q40q5937j56468q3282j8883N5683
$$ 199024 -376230 -213165 52628 61696 341710 342550 256613 100145 16863 -2020 53663
11504E3663K81215k28465l16935k5772k5334j66873L15779M79265k43057n32177
$$ 53663 334878 106413 -210522 -236294 -261628 -428501 -112722 366543 123486 -408691
11494d08691L09189k29431K96660k51228l50697N72169q4350k55910M40028p0634
$$ -408691 -99502 -328933 -32273 -283501 -634198 -62029 -146379 -402289 37739 -32895
11484c2895k12450J33228p4352J79513J89759m574n25325l68413M83820K02728
$$ -32895 -245345 -112117 -186469 -6956 182803 178229 -347096 -715509 -231689 -28961
11474b8961j446p5562M086j05820k54434J20238r6778L8478J80195k75317O32848
$$ -28961 -30407 -105969 -101883 -207703 -462137 -341899 -438677 -400199 -220004 -495321 137527
11463A37527o402M60j66342k45727J00196l58961L1074j60681M44789j38418r4826
$$ 137527 131125 131585 -34757 -280484 -180288 -539249 -508175 -668856 -224067 -362485 -457311
11452d57311J27746K66L8153J78893k29901l3368K37777j85163k88506J01855
$$ -457311 -329565 -329299 -291146 -112253 -342154 -375522 -137745 -322908 -611414 -509559
11442e09559M16800K30424k77810p5105N5931j2483p0228k0042P8073K54982r5462
$$ -509559 -92759 137665 -140145 -215250 -159319 -171802 -242030 -262072 -183999 70983 -24479
11431b4479j86691J42987K8768m45564Q1609q0185M23119j69k21185j12938m35511
$$ -24479 -211170 -68183 -39415 -484979 -403370 -483555 -60436 -60605 -281790 -394728 -830239
11420h30239N68596j3464k3420J02030j97243o2860K12917K4155J19619j34847
$$ -830239 -261643 -275107 -298527 -196497 -393740 -456600 -243683 -219528 -99909 -234756
11410b34756P6532q2528K19897n8235J46789O58452o43061n84799K30246K19775
$$ -234756 -158224 -240752 -20855 -79090 67699 726151 83090 -501709 -271463 -51688
11400e1688k32083p863k90794K74179q3882j82094J55597N214M40029K00135n10507
$$ -51688 -283771 -291634 -582428 -308249 -392131 -574225 -418628 -413414 26615 226750 -283757
11389b83757P6041j06436K52344l2090m87346K75973L1053J63258L97409m78856
$$ -283757 -207716 -314152 -61808 -93898 -581244 -305271 -274218 -110960 286449 -192407
11379a92407L28450l63689l15190J12157J02304K6716J49077j55833j39309M42256
$$ -192407 136043 -227646 -542836 -430679 -328375 -301659 -152582 -308415 -447724 -5468
11369e468k09870k62953l47113J15225J97770J58214N6515l82385k5319L22320
$$ -5468 -215338 -478291 -825404 -710179 -512409 -354195 -297680 -680065 -705384 -383064
11359c83064J37524j0085l98582J26600N3419P4283R3281J40356l19334l62553
$$ -383064 -245540 -255625 -654207 -527607 -474188 -399905 -306624 -166268 -485602 -848155
11349h48155O35965J73588p023k11823l32350J64413L71345m28287m61850K34512
$$ -848155 -212190 -38602 -45625 -257448 -589798 -425385 -54040 -482327 -944177 -709665
11339g09665J15324N26796l77198J1575J46542k22280j49044O0435l42551J48409
$$ -709665 -594341 -67545 -444743 -433168 -286626 -508906 -657950 -597515 -940066 -791657
11329g91657N79360J54680j67531j8679K35364j62017j78280J40922k88729J5318
$$ -791657 -212297 -57617 -225148 -243827 -8463 -170480 -348760 -207838 -496567 -481249
11319d81249J3792k65128J18970R0511J856J50586k9869K26699q8781n7187M2563
$$ -481249 -467457 -732585 -613615 -523104 -521248 -370662 -400531 -173832 -262613 -319800 -277237
11308b77237p0374k49241J37534J57371l6328J26176K87385N3927m75024l06096
$$ -277237 -347611 -596852 -459318 -301947 -338275 -212099 75286 129213 -345811 -651907
11298f51907q8969l7809M6026Q4219L10328q0771K80467j03233m04642J35134
$$ -651907 -740876 -778685 -732659 -648440 -338112 -418883 -138416 -241649 -646291 -511157
11288e11157j24076o5630K34319j12074m00753K51950K78405L36823m20624q0518
$$ -511157 -635233 -700863 -466544 -578618 -979371 -727421 -449016 -112193 -532817 -613335
11278f13335k50741N37474J94728R4394m20507p0520Q7551J32302L36213j99518
$$ -613335 -864076 -326602 -131874 -37480 -457987 -528507 -440956 -308654 27559 -171959
11268a71959m16236q2439K55730j13922J48535K55736P5199L742j46468r4528
$$ -171959 -588195 -670634 -414904 -528826 -380291 -124555 -49356 -45614 -192082 -286610
11258b86610K1382j47583m25859M06270N43668j77271n5769j33766k3211N9363
$$ -286610 -265228 -412811 -838670 -432400 111268 -66003 -121772 -255538 -278749 -219386
11248b19386q2272l10255J16034K22231k94785k42138O2941K07090j10302k5782
$$ -219386 -301658 -611913 -495879 -273648 -568433 -810571 -747630 -540540 -650842 -676624
11238f76624K14014K4695j11360J7657K12120j99914k27344L207m1569P5436J00624
$$ -676624 -462610 -437915 -549275 -531618 -319498 -519412 -746756 -743549 -785118 -709682 -609058
11227f09058j60338J43662K49605P1605p6364j04081j35667q58j45717P9689M65932
$$ -609058 -769396 -625734 -376129 -304524 -380888 -484969 -620636 -621494 -767211 -687522 -221590
11216b21590j16562O701j32223L3988K02147j93733j35716k39859J55362r4589
$$ -221590 -338152 -331451 -463674 -429686 -227539 -421272 -556988 -796847 -641485 -736074
11206g36074j22170L25308K90059k60563M5603m05340L56044J22988o1756L03829
$$ -736074 -858244 -532936 -242877 -503440 -457837 -863177 -507133 -384145 -445901 -142072
11196a42072N4377l60595P6875M968n8295K63982k27539m42722J04391J20857
$$ -142072 -87695 -448290 -371415 -366447 -424742 -160760 -388299 -831021 -726630 -605773
11186f05773m08515J7943N96208m68398P4002M88563k05356j97506M5389K40525
$$ -605773 -1014288 -996345 -400137 -868535 -794533 -305970 -511326 -708832 -663443 -422918
11176d22918j75569K80354L78192j69393R2862j25088m48672L62887N0815K1569
$$ -422918 -598487 -318133 60059 -109334 -16472 -141560 -590232 -227345 -176530 -154961
11166a54961j48475l9166J81813K7278p1141j92700L3199K08836N3837j00182
$$ -154961 -303436 -342602 -160789 -133511 -204652 -397352 -364153 -155317 -101480 -201662
11156b01662o58172Q2674M93352j7746L43188n3201n03612M50492k43453k55715
$$ -201662 -859834 -777160 -283808 -301554 41634 -11567 -515179 -64687 -308140 -563855
11146e63855R4303j47587j52709J2211M65697j56109k80835O78006j07722j79506
$$ -563855 -469552 -617139 -769848 -757637 -291940 -448049 -728884 -50878 -158600 -338106
11136c38106m74032j25825J56883M27466j1326m90537R3635N70732j6810l26318
$$ -338106 -812138 -937963 -781080 -353614 -364940 -855477 -761842 -191110 -207920 -534238
11126e34238L65290J37993k06889q4389l03224j21016M62777j56915J64241P1669
$$ -534238 -168948 -30955 -237844 -322233 -625457 -746473 -283696 -440611 -276370 -204701
11116b04701l52162j58179M42250l40040j19102J27494N59917l93146J6701M6164
$$ -204701 -556863 -715042 -272792 -612832 -731934 -604440 -44523 -437669 -420968 -374804
11106c74804m81243r1095J7326K49567J93727m6398k08147L24236k91757N25953
$$ -374804 -856047 -947142 -929816 -680249 -486522 -532920 -741067 -416831 -708588 -182635
11096a82635o6290j09922k07888l6246K73514J34420j33635n88170n2637P05154
$$ -182635 -248925 -358847 -566735 -602981 -329467 -195047 -328682 -916852 -969489 -264335
11086b64335R356N0569N8035j30675k20558K79690P6940p660J26334m89823K78857
$$ -264335 -254979 -204410 -146375 -277050 -497608 -217918 -140978 -148638 -22304 -512127 -233270
11075b33270J81556l65804J53274L39519m22063k88953j43647J56769N3890O6728
$$ -233270 -51714 -417518 -264244 75275 -346788 -635741 -779388 -622619 -568729 -502001
11065e02001J4659K74762Q0094Q3809L22007j33907k34504o19122L53174j38156
$$ -502001 -487342 -212580 -132486 -48677 273330 139423 -95081 -714203 -361029 -499185
11055d99185j95053j54958K74889k27006J945O34337J80170K02508k69350p9626
$$ -499185 -694238 -849196 -574307 -801313 -799368 -165031 15139 217647 -51703 -131329
11045a31329O1935p9519o03328l1037j11898P8289J00187j3842K33192N46144
$$ -131329 -69394 -148913 -752241 -783278 -895176 -816887 -716700 -730542 -497350 48794
11035D8794j35392L2927l39249J205J23468j77095k09641k2800K75224k10695
$$ 48794 -86598 -53671 -392920 -391715 -268247 -445342 -654983 -677783 -402559 -613254
11025f13254j37198N73725q942L3394J10784M50416l97046j48528j9755j43967
$$ -613254 -750452 -176727 -185669 -152275 -41491 408925 11879 -136649 -156404 -300371
11015c00371L6900k04119j89734J22936j97151p4826j77637J46012n024j05408
$$ -300371 -263471 -467590 -657324 -534388 -731539 -806365 -984002 -837990 -843014 -948422
11005i48422M18951J92356L7645l68923j50705J30422M84945r2789Q1294k85829
$$ -948422 -529471 -337115 -299470 -668393 -819098 -688676 -203731 -296520 -215226 -501055
10995e01055K94461l72173J59589k07541l41271L94827m39531K41108K09716k12184
$$ -501055 -206594 -578767 -419178 -626719 -967990 -573163 -1012694 -771586 -561870 -774054
10985g74054L69106O0498j14116K65583k05905J32342K61688j34798J12673j77308
$$ -774054 -404948 -344450 -458566 -192983 -398888 -266546 -4858 -139656 -26983 -204291
10975b04291j31601J33232L15141j10529j61704k97320L5810K24004L4532L25886
$$ -204291 -335892 -202660 112481 1952 -159752 -457072 -421262 -197258 -162726 163160
10965A63160j37557l09257n1902m4902J4702K29696J11853k56938K13336N8951
$$ 163160 25603 -283654 -335556 -380458 -365756 -136060 -24207 -281145 -67809 -8858
10955h858k6712l5099N3545r8810L41158l69855k96058K71955q375K06990j68401
$$ -8858 -35570 -70669 -17124 -115934 225224 -144631 -440689 -168734 -177109 29881 -138520
10944a38520P7911j68235N5679J9525m35812L21815o3979K4036K90922J55239
$$ -138520 -60609 -228844 -173165 -153640 -589452 -267637 -331616 -307580 -16658 138581
10934A38581j70210q0323l7703M89091J51696k92582L77937O5623l40259r7065
$$ 138581 -31629 -111952 -149655 339436 491132 198550 576487 642110 301851 204786
10924B04786O45562k36974l27693l55193J74717j08026J24356m04539M21381k05474
$$ 204786 850348 613374 285681 -69512 105205 -2821 121535 -283004 138377 -67097
10914f7097k15944N90207N1756n26665L57313Q794l42962J10056k49620j07880
$$ -67097 -283041 307166 358922 -167743 189570 198364 -144598 -34542 -284162 -392042
10904c92042N8228N8727k66553j05152L65178K97800j10344k93405j43907j06440
$$ -392042 -333814 -275087 -541640 -646792 -281614 16186 -94158 -387563 -531470 -637910
10894f37910m1795Q74278L18191j03165p3832k3246k50339M9485J92762m86415
$$ -637910 -679705 194573 512764 409599 335767 312521 62182 111667 304429 -181986
10884a81986k8671n8670m72569M43205J27979j68167j76812L26148n8443j97261
$$ -181986 -210657 -269327 -741896 -298691 -170712 -338879 -515691 -189543 -247986 -445247
10874d45247j66211M92220m20798J25114R7388j73097J47880k76974m9148l3218
$$ -445247 -611458 -119238 -540036 -414922 -317534 -490631 -342751 -619725 -668873 -702091
10864g02091N5984M72205K21844l85936l91406l88029K61576J11111K70674J00048
$$ -702091 -646107 -173902 47942 -337994 -729400 -1117429 -855853 -744742 -474068 -374020
10854c74020m36913K33832K51713j1842L84758J18911o07299L35636J12153q5408
$$ -374020 -810933 -577101 -325388 -337230 47528 166439 -440860 -105224 6929 -78479
10844g8479L15392k89429k8885R5191p0401k08295P7285l01912j6994J42321M8480
$$ -78479 236913 -52516 -81401 13790 -56611 -264906 -187621 -489533 -506527 -364206 -315726
10833c15726O10993P774k06340P3068n9829k13683M02870l21301k29779m12086
$$ -315726 295267 303041 96701 169769 109940 -103743 299127 -22174 -251953 -664039
10823f64039j10814J69662j12461K83717J93327l82743J52037K39559M6662k40977
$$ -664039 -774853 -605191 -717652 -433935 -240608 -623351 -471314 -231755 -185093 -426070
10813d26070J02296O62192k46909l6900q69084J73554N7563J61435K99111l18107
$$ -426070 -323774 338418 91509 54609 -814475 -640921 -583358 -421923 -122812 -440919
10803d40919R9766P9549m06246J79711J15707q4707K04015j85287j81475L71129
$$ -440919 -341153 -261604 -667850 -488139 -372432 -457139 -253124 -438411 -619886 -248757
10793b48757J42575k83149j49815j77497Q4090j64388o9497K1656j02236K24657
$$ -248757 -106182 -389331 -539146 -716643 -632553 -796941 -866438 -844782 -947018 -722361
10783g22361J06070o08267L88904K53635k65266l45388J35723P78151j14811N9213
$$ -722361 -616291 -1224558 -835654 -582019 -847285 -1192673 -1056950 -278799 -393610 -334397
10773c34397k80796k19269j30299m3097J10932N9162J52613N00686r1350k10584
$$ -334397 -615193 -834462 -964761 -1007858 -896926 -837764 -685151 -184465 -275815 -486399
10763d86399K8228l51749j89304N50543q9833M5569K6952r0002J88832l8945n38177
$$ -486399 -458171 -809920 -999224 -448681 -538514 -492945 -465993 -555995 -367163 -406108 -944285
10752i44285K59170k95527p7009L08527j58859O0957N4690r2115K33880L2458
$$ -944285 -685115 -980642 -1057651 -749124 -907983 -847026 -792336 -884451 -650571 -618113
10742f18113m06394K03247L90551j62672l61313M58439J97565k28949J4728K19293
$$ -618113 -1024507 -821260 -430709 -593381 -954694 -496255 -298690 -527639 -512911 -293618
10732b93618L9276j71581l75374J17151J15599K18686j68992K22862j1521r03338
$$ -293618 -254342 -425923 -801297 -684146 -568547 -349861 -518853 -295991 -307512 -1210850
10722a210850J38876n9464K27609M0154o3474J78297L86347k64358k5114J00744
$$ -1210850 -1071974 -1131438 -903829 -863675 -927149 -748852 -362505 -626863 -651977 -551233
10712e51233j32209L1233K10662r0616J60330K75374l0717k75097n7579j25688
$$ -551233 -683442 -652209 -441547 -532163 -371833 -96459 -127176 -402273 -459852 -585540
10702e85540j09442Q7935k04174J03600K9600L79066J88143j3190j75882M61270
$$ -585540 -694982 -607047 -811221 -707621 -678021 -298955 -110812 -124002 -299884 161386
10692A61386l23424l31200j10675L53777l07048K87560Q2337l24855p4679J33085
$$ 161386 -162038 -493238 -603913 -250136 -557184 -269624 -187287 -512142 -586821 -453736
10682d53736R7484Q5302l6924j47369j38113p6471j21470J01422O28527L2544
$$ -453736 -356252 -270950 -307874 -455243 -593356 -669827 -791297 -689875 -61348 -28804
10672b8804l03716k31418k3927N63809l9967j37509j08378k00658l42765K04171
$$ -28804 -332520 -563938 -587865 -24056 -64023 -201532 -309910 -510568 -853333 -649162
10662f49162R2239K4037L69174L13408k94760j4657k95428l45474J09061L38460
$$ -649162 -556923 -532886 -163712 149696 -145064 -159721 -455149 -800623 -691562 -353102
10652c53102O0611l01491L7678N77820J55583n75789l86463J20608k53364j82027
$$ -353102 -292491 -593982 -556304 21516 177099 -398690 -785153 -664545 -917909 -1099936
10642a099936l1699R1365M09106L92455k24939n96670N69868L80953m9513j17319
$$ -1099936 -1131635 -1040270 -631164 -238709 -463648 -1060318 -490450 -109497 -159010 -276329
10632b76329m01168j68682r8124N69194k43494k13282J77967N2317L07444j44992
$$ -276329 -677497 -846179 -944303 -375109 -618603 -831885 -653918 -601601 -294157 -439149
10622d39149j63464K85339L03804j84057k09008p5416K49263l56440l64197M33117
$$ -439149 -602613 -317274 -13470 -197527 -406535 -481951 -232688 -589128 -953325 -520208
10612e20208p7408j45566k7362M1182Q3701p4131N01351K7394K47410o14243O1349
$$ -520208 -597616 -743182 -770544 -729362 -645661 -719792 -218441 -191047 56363 -557880 -496531
10601d96531J85683K60277k86451K97463l69052R744j20872n87762L40041L33559
$$ -496531 -310848 -50571 -337022 -39559 -408611 -398867 -519739 -1107501 -767460 -433901
10591d33901P3857K05045j51578J0027J0245m43700k00596M26756P9160j20063
$$ -433901 -360044 -154999 -306577 -296550 -286305 -730005 -930601 -503845 -424685 -544748
10581e44748J86912K37335k17187L61117l1018l89630K73888j93175L56102n5783
$$ -544748 -357836 -120501 -337688 23429 -7589 -397219 -123331 -316506 39596 -16187
10571a6187l8486p1080m5513J65892l89223K19917k04641j0179K37435k86863
$$ -16187 -54673 -125753 -171266 -5374 -394597 -174680 -379321 -389500 -152065 -438928
10561d38928k59963Q184K48198N916O5094K7210K44050j35462j03661k47222k9635
$$ -438928 -698891 -690707 -442509 -436593 -371499 -344289 -100239 -235701 -339362 -586584 -616219
10550f16219K72152j61045K62152L2301m8350j02011R2510p6429k82040j34883
$$ -616219 -344067 -505112 -242960 -210659 -259009 -361020 -268510 -344939 -626979 -761862
10540g61862K14691J75484o6919L90761N8979k30953L36138j39630K94233J54725
$$ -761862 -547171 -371687 -438606 -47845 11134 -219819 116319 -23311 270922 425647
10530D25647n65190K67087n468m13495k90245L54443K58658O1047k41929l5805
$$ 425647 -139543 127544 122076 -291419 -581664 -227221 31437 92484 -149445 -185250
10520a85250k30539l7367J06284K80070O6491j33323N8160k90485M57859J70766
$$ -185250 -415789 -453156 -346872 -66802 -311 -133634 -75474 -365959 91900 262666
10510B62666l97253Q2856p4724o7031J26488l4060J82931k21856n47695Q0816
$$ 262666 -134587 -51731 -126455 -193486 -66998 -101058 81873 -139983 -687678 -606862
10500f06862K40907L76041K00k30220k51983l4256M14013M17377l75985r2932
$$ -606862 -365955 10086 10286 -219934 -471917 -506173 -92160 325217 -50768 -143700
10490a43700j68737L10488k0337O4665J70053M06705m88304J087J14287m5049
$$ -143700 -312437 -1949 -22286 42379 212432 619137 130833 131920 246207 201158
10480B01158J78858m06270k20502j57229M43573M18863k15308k68413p6988Q3650
$$ 201158 380016 -26254 -246756 -403985 39588 458451 243143 -25270 -102258 -18608
10470a8608K93346n77864o959K85228j36762P1869m8442j06099L33000o51196
$$ -18608 274738 -303126 -310085 -24857 -161619 -89750 -138192 -244291 88709 -562487
10460e62487l78728N14268J77991K35619o4610L29300j97302n1581J70315L17723
$$ -562487 -941215 -426947 -248956 -13337 -77947 251353 54051 2470 172785 490508
10450D90508p5580k98100M14213j44854j16156j0990N9793m52737R8373n4446
$$ 490508 414928 116828 531041 386187 270031 259041 318834 -133903 -35530 -89976
10440h9976j76197M86146L23820P5743p57210O7711K58452L4219k9550j9786j0416
$$ -89976 -266173 219973 543793 619536 -137674 -69963 188489 222708 193158 173372 162956
10429A62956K32854j85171l95215j2426K65507L04859l62337J08726R4727r7854
$$ 162956 395810 210639 -184576 -197002 68505 373364 11027 119753 214480 116626
10419A16626L15398J36862l28032q1311J2646K99847K24622M4499j15698k91253
$$ 116626 432024 568886 240854 159543 172189 472036 696658 741157 625459 334206
10409C34206m5736K19779k0157o6440L42140j25449j92889k02277j99601M7534
$$ 334206 288470 508249 488092 421652 763792 638343 445454 243177 43576 91110
10399I1110J82328K51404Q5229K6010p3977K06331n06360K53439N07488k54820
$$ 91110 273438 524842 610071 636081 562104 768435 262075 515514 1023002 768182
10389G68182k24525K75860l8601j54861k54196j39284L82172l36729M018L96486
$$ 768182 543657 819517 780916 626055 371859 232575 614747 278018 282036 678522
10379F78522n0343j35716o6214q1570L50460k47909j71396O01005k26522J6773
$$ 678522 628179 492463 426249 344679 695139 447230 275834 876839 650317 667090
10369F67090O2434l43047K20949K62773m1237m40620l52932K82163j30391J98081
$$ 667090 729524 386477 607426 870199 828962 388342 35410 317573 187182 385263
$$ [...]
##END NTUPLES=NMR SPECTRUM
##END=
