##TITLE=1H_CA-9160-3x
 CDCl3
 24 sc, 
 15.6.2023
##JCAMPDX= 6.0         $$ Bruker NMR JCAMP-DX V2.0
##DATA TYPE= NMR SPECTRUM
##DATA CLASS= NTUPLES
##ORIGIN= UXNMR, Bruker Analytische Messtechnik GmbH
##OWNER= root
$$ XWIN-NMR		Version 3.5
$$ Thu Jun 15 11:36:10 2023 Russian Standard Time (UT+4h)  she@DPX200
##.OBSERVE FREQUENCY= 200.13135
##.OBSERVE NUCLEUS= ^1H
##.ACQUISITION MODE= SIMULTANEOUS
##.ACQUISITION SCHEME= undefined
##.AVERAGES= 24
##.DIGITISER RES= 18
##SPECTROMETER/DATA SYSTEM= spect
##.PULSE SEQUENCE= zg30
##.SOLVENT NAME= Acetone
##.SHIFT REFERENCE= (INTERNAL, Acetone, 0, 15.8009)
##AUDIT TRAIL= $$ (NUMBER, WHEN, WHO, WHERE, WHAT)
$$ ##TITLE= Audit trail, XWIN-NMR		Version 3.5
$$ ##JCAMPDX= 5.01
$$ ##ORIGIN= Bruker BioSpin GmbH
$$ ##OWNER= she
$$ F:/spectra/data/she/nmr/H-F/1/pdata/1/auditp.txt
$$ ##AUDIT TRAIL=  $$ (NUMBER, WHEN, WHO, WHERE, WHAT)
(   1,<2023-06-15 11:34:59.42 +0400>,<she>,<DPX200>,
      <continue with go, POWCHK disabled, PULCHK disabled
       configuration hash MD5:
       00 E9 B6 7A A2 85 ED C7 34 08 36 98 17 FE 4E 26
       data hash MD5: 16K
       9A BB 51 12 DF 19 6A C4 8C 8E 2F AB D2 C9 1C 6A>)
(   2,<2023-06-15 11:35:02.18 +0400>,<she>,<DPX200>,
      <Start of raw data processing
       efp BC_mod = 2 LB = 0.24 FT_mod = 6 PKNL = 1 PHC0 = -20783.62 PHC1 = 11.45272 SI = 16K 
       data hash MD5: 16K
       10 4B 4E F1 E8 68 93 5A C0 F1 5E 79 CE 34 33 87>)
(   3,<2023-06-15 11:35:05.54 +0400>,<she>,<DPX200>,
      <abs ABSG = 5 
       data hash MD5: 16K
       7D 00 9E 3C 4A B7 E5 CB CC 16 36 BE 8C EB 6B 2C>)
(   4,<2023-06-15 11:35:18.71 +0400>,<she>,<DPX200>,
      <pk PHC0 = -0.2366386 PHC1 = 1 
       data hash MD5: 16K
       60 49 C9 5D 1F 89 D4 07 F4 36 7A B3 A3 5E 04 EC>)
(   5,<2023-06-15 11:35:22.76 +0400>,<she>,<DPX200>,
      <abs ABSG = 5 
       data hash MD5: 16K
       5C A8 69 D6 31 12 65 5E 2E 2C 72 15 2E E0 20 EC>)
$$ ##END=
$$ 
$$ hash MD5
$$ 06 5E 14 F5 BB FB 2A EF E0 DC 7A 37 63 1E 94 95
##$RELAX= 
##$RELAX= 
##$RELAX= 
##$RELAX= 
##$RELAX= 
##$RELAX= 
$$ Bruker specific parameters
$$ --------------------------
##$DU= <F:/spectra>
##$EXPNO= 1
##$NAME= <H-F>
##$PROCNO= 1
##$TYPE= <nmr>
##$USER= <she>
##$AMP= (0..31)
100 100 100 100 100 100 100 100 100 100 100 100 100 100 100 100 100 100 
100 100 100 100 100 100 100 100 100 100 100 100 100 100 
##$AQSEQ= 0
##$AQ_mod= 1
##$AUNM= <au_zg>
##$AUTOPOS= <>
##$BF1= 200.13
##$BF2= 200.13
##$BF3= 200.13
##$BF4= 200.13
##$BF5= 200.13
##$BF6= 200.13
##$BF7= 200.13
##$BF8= 200.13
##$BYTORDA= 1
##$CFDGTYP= 0
##$CFRGTYP= 5
##$CHEMSTR= <none>
##$CNST= (0..31)
1 1 145 1 1 1 1 1 1 1 1 1 1 1 1 1 1 1 1 1 1 1 1 1 1 1 1 1 1 1 1 1 
##$CPDPRG= <>
##$CPDPRG1= <>
##$CPDPRG2= <>
##$CPDPRG3= <>
##$CPDPRG4= <mlev>
##$CPDPRG5= <mlev>
##$CPDPRG6= <mlev>
##$CPDPRG7= <mlev>
##$CPDPRG8= <mlev>
##$CPDPRGB= <>
##$CPDPRGT= <>
##$D= (0..31)
0 1.2 0 0 0 0 0 0 0 0.06 0 0.03 0 0 0 0 0.0002 0 0 0 0 0 0 0 0 0 0 0 0 
0 0 0 
##$DATE= 1686814419
##$DBL= (0..7)
$$ [...]
##$SUBNAM3= <"">
##$SUBNAM4= <"">
##$SUBNAM5= <"">
##$SUBNAM6= <"">
##$SUBNAM7= <"">
##$SUBNAM8= <"">
##$SUBNAM9= <"">
##$SW= 18.05172834244
##$SWIBOX= (0..15)
0 0 2 0 0 0 0 0 0 0 0 0 0 0 0 0 
##$SW_h= 3612.71676300578
##$TD= 16384
##$TD0= 1
##$TE= 0
##$TE2= 300
##$TE3= 300
##$TEG= 300
##$TL= (0..7)
0 120 120 120 120 120 120 120 
##$TP= (0..7)
150 150 150 150 150 150 150 150 
##$TP07= 0
##$TPNAME0= <>
##$TPNAME1= <>
##$TPNAME2= <>
##$TPNAME3= <>
##$TPNAME4= <>
##$TPNAME5= <>
##$TPNAME6= <>
##$TPNAME7= <>
##$TPOAL= (0..7)
0.5 0.5 0.5 0.5 0.5 0.5 0.5 0.5 
##$TPOFFS= (0..7)
0 0 0 0 0 0 0 0 
##$TUNHIN= 0
##$TUNHOUT= 0
##$TUNXOUT= 0
##$USERA1= <user>
##$USERA2= <user>
##$USERA3= <user>
##$USERA4= <user>
##$USERA5= <user>
##$V9= 5
##$VALIST= <valist>
##$VCLIST= <CCCCCCCCCCCCCCC>
##$VD= 0
##$VDLIST= <DDDDDDDDDDDDDDD>
##$VPLIST= <PPPPPPPPPPPPPPP>
##$VTLIST= <TTTTTTTTTTTTTTT>
##$WBST= 1024
##$WBSW= 4
##$XGAIN= (0..3)
0 0 0 0 
##$XL= 0
##$YL= 0
##$YMAX_a= 63397
##$YMIN_a= -62104
##$ZGOPTNS= <>
##$ZL1= 120
##$ZL2= 120
##$ZL3= 120
##$ZL4= 120
##$ABSF1= 15.77664
##$ABSF2= -2.275209
##$ABSG= 5
##$ABSL= 3
##$ALPHA= 0
##$AQORDER= 0
##$ASSFAC= 0
##$ASSFACI= 0
##$ASSFACX= 0
##$ASSWID= 0
##$AUNMP= <proc_1d>
##$AZFE= 0.1
##$AZFW= 0.1
##$BCFW= 0
##$BC_mod= 2
##$BYTORDP= 0
##$COROFFS= 0
##$CY= -3
##$DATMOD= 1
##$DC= 0
##$DFILT= <>
##$DTYPP= 0
##$F1P= 0
##$F2P= 0
##$FCOR= 1
##$FTSIZE= 16384
##$FT_mod= 6
##$GAMMA= 0
##$GB= 0
##$INTBC= 1
##$INTSCL= 3.70164e-10
##$ISEN= 128
##$LB= 0.24
##$LEV0= 0
##$LPBIN= 0
##$MAXI= 10000
##$MC2= 0
##$MEAN= 0
##$ME_mod= 0
##$MI= 1.114404
##$NCOEF= 0
##$NC_proc= -9
##$NLEV= 6
##$NOISF1= 3.799351
##$NOISF2= 2.8
##$NSP= 0
##$NTH_PI= 0
##$NZP= 0
##$OFFSET= 15.80088
##$PC= 1
##$PHC0= -20783.86
##$PHC1= 12.45272
##$PH_mod= 1
##$PKNL= yes
##$PPARMOD= 0
##$PSCAL= 0
##$PSIGN= 0
##$REVERSE= no
##$SF= 200.129994129361
##$SI= 16384
##$SIGF1= 3
##$SIGF2= 2
##$SINO= 5.538805
##$SIOLD= 16384
##$SREGLST= <1H.CDCl3>
##$SSB= 0
##$STSI= 16384
##$STSR= 0
##$SW_p= 3612.71676300578
##$SYMM= 0
##$S_DEV= 0
##$TDeff= 16384
##$TDoff= 0
##$TI= <>
##$TILT= no
##$TM1= 0
##$TM2= 0
##$TOPLEV= 0
##$USERP1= <user>
##$USERP2= <user>
##$USERP3= <user>
##$USERP4= <user>
##$USERP5= <user>
##$WDW= 1
##$XDIM= 16384
##$YMAX_p= 312014629
##$YMIN_p= -7143852
$$ End of Bruker specific parameters
$$ ---------------------------------
##NTUPLES= NMR SPECTRUM
##VAR_NAME=  FREQUENCY,     SPECTRUM/REAL,   SPECTRUM/IMAG
##SYMBOL=    X,             R,               I
##VAR_TYPE=  INDEPENDENT,   DEPENDENT,       DEPENDENT
##VAR_FORM=  AFFN,          ASDF,            ASDF
##VAR_DIM=   16384,         16384,           16384
##UNITS=     HZ,            ARBITRARY UNITS, ARBITRARY UNITS
##FACTOR=    0.220516191357247, 1,           1
##FIRST=     3162.23010812069, 0,            0
##LAST=      -450.486654885087, 0,           0
##MIN=       -450.486654885087, -7143852,    0
##MAX=       3162.23010812069, 312014629,    0
$$ Real data points
##PAGE= N=1
##DATA TABLE= (X++(R..R)), XYDATA
$$ [...]
7014 -369390 149979 -92625 -42030 -298068 -112215 -365409 -307356 15706 379996 39067
7004 39067 83708 247805 -37999 -267823 -150066 57519 -332229 -435399 312613 75051
6994 75051 -594129 -234848 -169198 210131 36256 -300260 -556202 -470742 -319533 -93729
6984 -93729 119380 380458 118183 -32786 94017 179776 332726 276623 100776 298985
6974 298985 -150295 -119612 -21217 1767 -173984 731090 632978 577300 347939 353331 -36265
6963 -36265 -333564 -108485 -59486 -302667 -298235 63679 -124249 221511 272393 230513 594672
6952 594672 315620 -48672 67797 -93375 -23733 327692 288423 -29013 533839 271187
6942 271187 95219 444008 129072 320432 121298 346705 576983 199014 480410 170974
6932 170974 107504 186009 355672 546505 854685 637780 395094 506135 532930 311360
6922 311360 166297 5524 -146937 396857 1032521 388432 313475 594611 1327109 1431837
6912 1431837 891070 152655 -217769 129316 301907 102724 142693 378763 104270 -149261
6902 -149261 -19143 118392 638900 736127 523303 385633 182714 -14897 -197181 280710
6892 280710 665167 308903 -103123 -196881 -195613 55536 -384121 -535313 -535562 -469469 39361
6881 39361 305508 357659 -36111 -525885 -694430 -326554 -415228 -472572 -546423 -406338 -355441
6870 -355441 -419782 -463515 -134500 -23057 77334 -138031 140010 143204 -124094 -176826 526349
6859 526349 546074 515214 427466 281567 321842 288899 -2908 -172638 410022 576328 567869
6848 567869 505498 46901 -195738 -65005 155622 268160 287708 89404 -412543 -206015
6838 -206015 408951 272648 -71243 145444 453219 898297 674129 431759 53111 128570
6828 128570 816807 706799 289445 53575 -436747 501462 736482 342161 187389 579681
6818 579681 445168 -33924 -147542 -313384 -315745 -260152 453822 950526 1351560 1148323
6808 1148323 1263447 1062620 677941 501027 854073 823168 229714 172801 770171 373138
6798 373138 43621 345231 351958 1198933 1207641 1030574 426761 122766 -517470 -129700
6788 -129700 378036 767215 609330 -95991 -94262 89531 158229 100450 214525 450355
6778 450355 343836 460078 455529 425429 593507 281215 -171313 113644 346261 1059324
6768 1059324 544401 568183 558299 635575 68161 316813 633930 463012 520415 798139
6758 798139 1017762 1201019 1127285 227965 -189271 564091 790043 522869 368388 -233557
6748 -233557 388417 351135 467309 503549 220812 695777 926214 854839 379417 428644
6738 428644 803402 944553 520944 488452 425770 721099 993383 577485 269932 34699
6728 34699 345778 677805 830693 592199 648176 471070 554069 813577 931414 494218
6718 494218 492408 136896 349734 387326 261938 -13017 278104 155093 -53662 274001
6708 274001 581627 613111 876582 809098 612930 659650 633820 780165 959438 1037304 863567
6697 863567 372016 12690 86469 -42669 139105 171055 255129 154869 95701 1062234
6687 1062234 467659 585877 675970 612557 530646 -41318 662232 777732 631780 862264
6677 862264 601026 459926 300462 911037 827819 732091 231935 339081 433420 566432
6667 566432 451848 523447 574347 572905 812368 653059 454041 630115 316297 511436
6657 511436 489494 465381 407769 382181 401089 258225 165217 -99849 279827 492419 -56796
6646 -56796 180301 627743 689335 651425 804267 800354 555661 613591 527647 628033 740163
6635 740163 611097 241021 581558 915759 780451 539382 751303 936874 1199427 431968
6625 431968 342009 244288 841039 941705 1069806 941219 814163 1152818 1674868 878209
6615 878209 775422 987836 1340773 1422170 1279210 1009422 730103 951079 744962 1300589
6605 1300589 1479448 1373974 1531143 1387604 1404340 883364 1200171 1237417 1146206 759120
6595 759120 837814 799363 1303467 1353395 1491794 1582447 1477449 1115129 1059646 1162244 1364442
6584 1364442 1617146 1704241 1661804 1440159 1725633 1711233 1149117 1415668 1670220 1439015
6574 1439015 1343909 1444920 1698589 1184666 985486 1214383 1704590 1765025 1756098 1296884
6564 1296884 1065018 1237447 1807798 1615988 1355169 1618120 1671301 1595906 1514519 2012330
6554 2012330 2545673 2027954 1780999 1940479 1892473 1683240 1743732 1835993 2062636 2232713
6544 2232713 2617708 1941603 1749211 2036078 1626244 1695494 1703442 1823187 2218151 1825689
6534 1825689 2238365 2513150 2404588 2273916 2027651 1696577 1956953 1796381 1435337 1794665
6524 1794665 1877946 2049961 2055288 1841574 1940550 1987112 2496065 2683249 2727977 2434211 2017697
6513 2017697 2165835 2812511 2359837 2088793 2467485 2379317 2488891 2543074 2313409 2529150
6503 2529150 2498142 2876706 2920859 2873019 2819656 2379058 2381621 2360180 2653006 2654334 2580256
6492 2580256 2107960 2278735 2613388 2699050 2327178 2362523 2627883 2577823 2595024 2669658
6482 2669658 2383613 2321097 2586009 2621987 2284183 2367088 2322007 2125208 2376618 2299485
6472 2299485 2393867 2476803 2517410 2736195 2135655 2036525 2412708 2358482 2629725 2600642 2910589
6461 2910589 2545823 2310458 2377612 2070198 1803246 1967642 1818051 2214558 2294894 2691922
6451 2691922 3120646 3045570 2387613 2136706 2275582 2503702 2470367 2428155 2355329 2232199
6441 2232199 2686084 2649564 2580117 2185446 2803708 2543965 2828424 3006864 2541569 2604507
6431 2604507 2882866 2652584 2827720 2923960 2621141 2394343 2606589 2625391 2198174 2062423
6421 2062423 2397396 2685535 3100723 2529525 2401668 2404415 2650158 2726971 2630693 2637680 2368361
6410 2368361 2389143 2742558 2855343 2824084 2799878 2636629 2455246 2808983 2527090 2443129
6400 2443129 2461093 2728092 3240204 3090594 3312264 2773079 2329704 2324250 2410278 2743022
6390 2743022 2382922 2034477 2578532 2454744 2218915 2640127 2587700 2962956 3227325 2650789
6380 2650789 2679888 2595371 2362011 2420660 2572769 2567180 2743621 2802575 2780940 2193881 2627957
6369 2627957 2553708 2618795 2744499 2943436 3029375 2911943 2547083 2900528 3484676 3935377
6359 3935377 3614223 3481081 3431260 3340601 3202364 2636716 2644962 2959739 2679592 3228421
6349 3228421 3775849 3948671 3587337 3403199 3384475 3296431 3164273 3426942 3567708 3186228
6339 3186228 3564524 3604716 3853057 3867058 3820289 3424456 3285110 3506455 3989680 3888181
6329 3888181 3666978 3268025 3735041 3708741 3813569 3917029 3732396 3874511 4224961 4326500
6319 4326500 4728502 4532940 4448396 4800743 4221049 4534260 4900337 4150404 3748553 3822955
6309 3822955 4087276 4248845 4472787 4447318 5099295 4779004 4460577 4928764 4931256 5125831
6299 5125831 5176901 5385369 5563169 5293137 5208406 5384614 5352256 5489328 5922575 5404214
6289 5404214 5070441 5378135 5369979 5321273 5543942 5758685 5781009 6332790 5965136 5900133
6279 5900133 5941058 6352786 6793560 6727737 7283673 7525458 7572443 7793698 7573434 7172542
6269 7172542 6892315 7000075 7732266 8414722 8601126 8835676 9062228 9435278 9807479 9852534
6259 9852534 9639953 10586474 10634445 10085896 10423857 10715307 11210889 11465821 11989818 12248897
6249 12248897 13053255 13328648 13387522 13892615 14511627 15638383 15874767 16069406 16310635
6240 16310635 16587629 17055290 17565782 17294645 17695568 18429333 18457765 18615010 18865866 18869307
6230 18869307 19227107 19690171 19275510 19316184 19395673 19919786 19798037 19670142 19255947 19159275
6220 19159275 18922478 18375714 17798704 17700002 17670993 17608868 17617465 17099259 16985759 17189234
6210 17189234 17130273 16647452 16442713 15953854 15763269 15765621 15844106 15843102 16138562 16054773 15638614
6199 15638614 15900034 16427591 16465768 16383527 16386142 16785527 17009134 17423910 17606969 18235814
6189 18235814 18095240 18638505 18993277 19696996 20222032 20171809 20663900 20661204 21347647 22445464
6179 22445464 22767021 22701878 22930807 23460519 24135859 24648793 24444788 24395644 24825167 25130736
6169 25130736 25222671 25051854 24712842 24708205 25198922 24914802 24840070 24751827 23823316 23603048
6159 23603048 23307980 22834722 22100790 21787934 21223784 20949519 21065552 20857048 20628066
6150 20628066 19907731 19153511 18459157 18641617 17842418 17193499 16808766 16331987 16091967
6141 16091967 16231914 15612769 15239540 15477866 15366926 14716906 14473949 14052420 13651523
6132 13651523 13345055 13228066 13220138 13391190 13623365 13247859 13243934 12953900 12747323 12313564
6122 12313564 12264555 12646864 12957442 12608435 12390696 12611883 12514661 12576230 12250149 12087817
6112 12087817 11654648 12227106 12261099 12347630 12011297 12236272 11919112 11755122 12156559 12336338
6102 12336338 12224518 12004745 12290407 12028157 11554027 11519172 11701171 11874897 11971598 11697193
6092 11697193 11233536 11064714 11109829 11210437 10922319 11191945 11004806 10725028 10142290 9866764
6082 9866764 10322974 9920899 10298124 10107466 10011329 10147186 10197470 9650283 9678729 9454191
6072 9454191 9364363 9642109 9532392 8726573 8308409 8934660 8851546 8559670 8540797 9220981
6062 9220981 9336389 8657822 8318230 8715000 8504174 8185685 8497535 8246209 8289275 7393691
6052 7393691 7305105 7826723 7850069 7302922 7053412 6847814 6724328 6781937 7165202 7039728
6042 7039728 7155361 6908455 6793511 6579893 7077107 6560929 6078844 6507717 6598540 6565209
6032 6565209 6275866 6228006 6194685 6394861 6436987 6474757 6465154 6280618 5644807 5628544 5885415
6021 5885415 5756784 5777476 5509840 5605205 5750419 5851867 5901566 5768677 5779638 5543518
6011 5543518 5471622 5520037 5496957 5430413 5409456 5241125 5178366 4819824 5302903 5272502 4804927
6000 4804927 4860162 5274461 5302017 5421208 5344982 5251696 5257602 5495484 5241662 4915072 4899596
5989 4899596 5187046 5437594 4919867 4840735 5238270 4998651 5092809 5203646 4955015 5106933
5979 5106933 4959376 4903106 5108570 4952746 5023265 5139731 5118422 4972503 4735127 4798846
5969 4798846 5113314 5219961 5245997 5180737 5552365 5434870 5342362 5345920 5596502 5532361 4935671
5958 4935671 4845298 5135736 5228779 5048945 5520523 5347720 5247150 5124327 4960100 5444578
5948 5444578 5048596 5217184 5006030 4788688 5171651 5181982 5041647 4565920 4411123 4672426
5938 4672426 4850793 4830335 5272744 4972207 5287136 5324491 5553953 5433165 4771714 5155190
5928 5155190 5016651 4954362 5487247 5590257 5584426 5245815 5611836 5710381 5726596 5570104
5918 5570104 5529294 5763371 5718913 5893459 5544241 5497573 5693600 6029802 6084465 5860585
5908 5860585 5696662 5553003 5702836 5627161 5236873 5610051 6138276 5210936 5029118 5450734
5898 5450734 5780357 6145570 5800577 6238300 6372389 6111196 6351219 6075259 6307157 6775943
5888 6775943 6073165 5950115 6189853 5802925 6101295 6175937 6252150 6363603 6055160 6293478
5878 6293478 6519627 6123586 5704601 6074975 6447809 6666140 6520230 5742310 6003437 6955205
5868 6955205 7024966 6887422 6722547 7075202 6701761 6446772 6728837 6378839 6500881 6608177
5858 6608177 6531006 6896498 7002368 7022491 6778779 6765719 6413840 6643225 7029504 7153871
5848 7153871 7562964 7609522 7944633 7807166 7876704 7897786 8110432 8458077 8370621 7921737
5838 7921737 8113940 8656153 8997202 8819669 8936503 8652182 8911049 9376482 9562562 9513755
5828 9513755 9626969 9859196 9882752 9952649 9931502 10024383 10080624 10431827 10107341 10175422 10296183
5817 10296183 10687306 10989533 10822750 11149884 11543721 11562574 12393435 12233713 11914665 12120229
5807 12120229 13091697 13215480 13577264 13899133 13778699 13712784 13787099 14547419 15816575 16461199
5797 16461199 16523064 17098792 17243598 17642334 17604798 17884899 18645892 19464629 19170396 19338277
5787 19338277 19855535 20157156 20929047 21590155 21775249 22118827 22545713 22816371 23152027
5778 23152027 23102532 23155681 23531579 23675072 23544313 23420408 23732068 24403317 24808086 24791780
5768 24791780 24422994 24417154 24366096 24416024 24656311 24999357 25627380 25989140 26491868 26149477
5758 26149477 25925724 26123653 26601078 26521065 26668652 26844963 27040178 27317729 26971637 26865991
5748 26865991 27083215 27377937 27140989 27056966 27285786 27164581 26350297 25904838 25728087 25770418
5738 25770418 25691733 25634693 25415601 25148951 24893383 25440846 25321053 25009618 24967828 25355561
5728 25355561 25848267 25921261 25972751 25624449 25507374 25806095 25771568 26018584 26505513 26558467
5718 26558467 26357585 25582407 25716239 26390941 26847663 26650842 26702202 25875564 25507532 25684641
5708 25684641 25366597 25151604 25294035 25539929 25505722 24911793 24868119 25159717 24859975 25027493
5698 25027493 24989230 24657441 24477699 24045074 24327184 24391346 24390846 24171951 24268974 23910342
5688 23910342 23909309 23450803 23176566 23423103 22464838 22355691 22232260 22078783 21578453 21201528
5678 21201528 21027908 20430207 20137520 19951260 19382696 18918174 19058869 19042927 18028833
5669 18028833 17878648 17601031 17471587 17242360 17012966 16757756 16188529 15583741 15947166
5660 15947166 15793911 15417217 15636994 15174089 15280616 14883927 14710176 14741918 13987586 13764907
5650 13764907 13548306 13081479 13327629 13289982 13306527 13461672 13198057 13406319 13487064 13005194
5640 13005194 12818158 13139595 13044399 13292064 13280625 12988365 12871491 12888584 12793089 12454228
5630 12454228 12753563 12451737 12187141 12060565 11977247 12289118 12599981 12110702 11766632 11831664
5620 11831664 11813859 11896271 12021326 12146738 12684238 12192800 11772975 11943816 11552043 11648789
5610 11648789 11609306 11434874 11233752 12034698 11859188 11585945 11644184 11739728 12042304 11933348
5600 11933348 11775365 11507304 11295270 11170146 11124131 11096971 10896787 10918366 11728666 11660285
5590 11660285 11265318 10924532 11035266 11420240 11595455 11257634 10958111 11196256 11750452
5581 11750452 11590218 11132291 11204069 10654743 10263424 10322400 10928633 10552682 10382599 10708634
5571 10708634 10413845 10234509 10682068 11007610 11042998 11061132 10680244 10409984 10582083 10810706
5561 10810706 10607300 10827354 10881289 10415404 10747262 10776259 11191160 11050466 10689233 10493764
5551 10493764 10552751 10646207 10314224 10844728 11126941 10700222 10504093 10188018 10261791 10795123
5541 10795123 10769941 10504699 10732183 10377511 10219762 9939238 10247444 10904459 10487316 10536312
5531 10536312 10666496 10609535 10565527 10375172 10351478 10572382 10289301 10401869 10393904 10675381
5521 10675381 10887575 11301341 11232404 10998324 10877658 10718848 10892158 11192837 11230814 11163876
5511 11163876 10887824 11042839 11129698 11434522 11357156 11113963 11345289 12362639 12188339 12397145
5501 12397145 12221706 11725674 11699298 11546177 12109659 12163284 12147470 12192279 12207126 11935694
5491 11935694 12270897 12356511 12154735 12895029 12850779 12702889 12599647 12700969 12807586 13046798
5481 13046798 13450332 13444344 13267715 13544344 13478440 13336476 13899734 13257856 13065315 13393352
5471 13393352 13650506 13316069 13958836 13917036 13743280 13866998 13634022 13768270 13970953 14123813
5461 14123813 14669983 14684071 14673599 14591457 14808569 15074547 14930656 14506765 14633831 14650815
5451 14650815 14720754 15489519 15580580 15696128 16101791 16239997 16234436 16441781 16469239 16437942
5441 16437942 16449380 16770063 16722598 16807291 16927992 16922921 17033288 17897523 18515859 18741860
5431 18741860 18637838 18608548 18665154 18834294 18775498 19424977 19523658 19445962 19921861 20178779
5421 20178779 20206756 20333807 21160626 21189406 21680794 22129313 22532295 23098894 23999885 24622846
5411 24622846 25678867 27121745 28052892 28509841 28664846 27830465 27382252 27219509 26216072
5402 26216072 25776596 24975923 24618329 24207316 24058945 23654759 23356337 23484154 23838702
5393 23838702 23560153 22742953 22426973 22537624 22787823 22572501 22516269 22725872 22576901 22413579
5383 22413579 23044943 23008704 23121034 23243793 23581772 23881139 23751615 23390171 23363582 23850631
5373 23850631 24024750 24230482 24467560 24601750 24982720 24949601 24836732 25302307 25369329 25555942
5363 25555942 25458380 25085151 25576096 25760407 26001052 26125498 26257259 26274859 25877606 26004528
5353 26004528 25965474 26213408 26658736 27040219 27144221 27445170 27314808 27341500 28124603 28215745
5343 28215745 28367586 28372267 28289285 28330733 28511479 28599335 29194933 29556737 29519211 29716087
5333 29716087 30127339 30036031 30515378 30453856 30570890 30769942 31057451 31177089 31536902 31590110
5323 31590110 31819648 32322362 32817675 33136551 33174186 33404776 33691284 33537169 33391492 33858212
5313 33858212 34081316 34319792 34651405 34910895 35019618 35227378 35371670 36155400 36709261
5304 36709261 36938371 37177194 37179344 37520156 38202693 38398392 38826002 39292057 39874822 40423994
5294 40423994 41336299 41019288 41213126 41823499 42273061 42649566 42812678 43026865 43577509
5285 43577509 44080862 44649873 45054700 44996771 45251012 45214500 44797522 45479806 45634266 45516233
5275 45516233 45530507 45492884 45980382 46148724 46311835 47087874 46642690 46849396 46429634 46222511
5265 46222511 46289497 46303126 46675120 46594223 46662040 47223507 47499136 47330842 46999026 46921079
5255 46921079 47246488 47521800 47545029 47685672 47788463 47649633 47751300 47231455 46960084 47366382
5245 47366382 47167564 47121357 47650847 47576151 47318680 47223308 46857068 47359978 47138123 46880370
5235 46880370 46311236 45536201 46324389 46705687 46223711 45880369 45775634 45282330 45352406 45348577
5225 45348577 45319186 45091667 44849943 45385498 44990813 44261177 44362296 43741796 43797816 43428726
5215 43428726 42892549 42372915 42231078 42534902 43056389 42038595 42045040 42027402 41628544 41374450
5205 41374450 40527308 40540359 40609341 39948833 39770006 40101965 39647526 39331842 38622495 38711650
5195 38711650 39203213 39017212 38602581 38340803 38382212 37758093 38172062 37888567 37977472 37883982
5185 37883982 37406428 37082538 36990373 37178485 37367245 36922110 36674291 36648454 36356222 36546960
5175 36546960 37096360 37100829 36951078 37206400 37701036 38383891 38949380 39220639 39935892 40561977
5165 40561977 41187243 41463708 40763323 39872032 38448220 37747776 37441153 37233694 36911250
5156 36911250 36711497 36876327 36752290 36412879 35990966 36011193 35984463 35855444 35832936 35703322
5146 35703322 35476522 35377217 35461504 34973729 35174847 34888814 34575495 34967643 35094006 35329212
5136 35329212 35099009 35219038 35301510 35009548 35044292 34853327 34825114 35047391 35022829 34543505
5126 34543505 34943233 35277615 35748328 35412452 34843166 34677079 34642504 34927489 35591923 35427384
5116 35427384 35468878 35484468 35315369 35010853 34921381 34416216 34110467 34411701 34557587 34486621
5106 34486621 34186396 34480621 34653163 34303991 34121814 34507747 34532129 34411858 34412293 34163211
5096 34163211 33652986 33765840 34144907 34262259 33825750 33919308 33999868 34050379 33981799 33690475
5086 33690475 33870970 33764427 34001230 33827193 34131205 34343771 34682562 34210195 34157871 34159363
5076 34159363 34554692 35058360 35080662 35188112 35074275 35298741 35311515 35157926 35187732 35794281
5066 35794281 36008176 36066780 35808603 36233921 36408364 36689587 37386063 37904812 38172151 38462962
5056 38462962 38362905 39073646 39390370 39516909 39715713 40292391 40706220 40676436 40915034 40917081
5046 40917081 41296679 41014360 41450342 41447033 41670319 41653134 41700144 41363337 40837040 40663524
5036 40663524 40878732 40527287 40180547 40176250 40090407 40318030 39835922 39774793 39189884 39064968
5026 39064968 38422744 38711699 38331474 37722046 37579449 37384652 37066587 36695254 36859070
5017 36859070 36835215 36789019 36355488 36088751 35535608 35249468 34796583 34983521 35786603 34802296
5007 34802296 34343997 34222981 34400766 34354784 33871716 33734218 33621991 33948835 33126692 32841688
4997 32841688 32907396 32564165 32244160 32257340 32569677 32286146 31828051 32043011 32253102 31992753
4987 31992753 31723821 31532996 31467513 31266305 30940092 31158854 31002368 30682537 30559736 30591014
4977 30591014 30335354 30368701 30372458 29855251 29937233 29736843 29359514 29399719 29509413 29239603
4967 29239603 29229360 29068280 28767210 28432179 28363886 28150915 27799445 28115307 28082761 27575317
4957 27575317 27731674 27384990 26794535 26539111 26799389 26667527 26700901 27239598 26798756 26178629
4947 26178629 25933708 25922735 25787283 25816176 25609648 25230059 25210116 25141955 24832612 24710212
4937 24710212 24469289 24008234 23666388 23556546 23625600 23252562 23161549 23306786 23197311 22677255
4927 22677255 22245224 22274078 22485073 22407615 22201039 22152244 22494974 22327497 21968677 21954854
4917 21954854 21923435 21671656 21222886 21289671 21005849 21215412 20810679 21096474 21507152 21136467
4907 21136467 20805058 20351005 20387374 20439425 20689811 20816737 20634218 20286241 20238574 20536286
4897 20536286 20696965 20273224 19835627 20004470 19976384 20488030 20790046 20580264 20586126 20408096
4887 20408096 19691047 19698742 20012362 20066866 19807141 19917090 19828268 19995840 20117142 20326687
4877 20326687 20380948 19983296 20131899 19742241 19915001 19882888 19721292 19395094 19418392 19612744
4867 19612744 19941474 19791400 19581777 19583083 19309162 19573760 19540819 19598688 19853963 19738947
4857 19738947 19825350 19202926 19692856 20025199 20004166 19824662 20115023 19899301 19853082 20186199
4847 20186199 20232043 20408694 20424011 20585890 20265567 20099563 20399087 20614482 20593004 20710844
4837 20710844 20634023 20614841 20983561 21127460 20715560 21086914 21337691 21090076 20800037 21104683
4827 21104683 21375516 21245568 21550355 22045327 21477121 21692560 22403312 22357118 22508644 22514807
4817 22514807 22318545 22702174 22841546 23180859 23791922 24354415 24670381 24660709 24576578 25073597
4807 25073597 24837646 25011852 25553680 26002173 26088210 26707411 27306722 27270891 27592927 27962176
4797 27962176 28293583 28982325 29034656 29033192 29937317 30467659 30970494 31279532 31983827 32576680
4787 32576680 32869648 33506805 34088612 34721605 34976181 35016192 35768430 36750657 36976494 37444341
4777 37444341 37745291 38505028 39165861 39534710 40493683 40902399 41009109 41686777 42573779
4768 42573779 43241686 44438150 45010948 45018483 45491613 46031104 46715022 47138962 47480919 48086919
4758 48086919 48720662 48913844 49828488 50323115 51012481 51886885 52365625 52786178 53252735
4749 53252735 53908134 54832809 56132009 57132501 58646016 59476039 60578103 61873015 63387372
4740 63387372 64653295 67081192 69056185 70484679 71970887 73768007 76261249 77968472
4732 77968472 79701411 82718569 85392130 88098919 90782403 93537922 96436453 99221420
4724 99221420 101922414 104715970 106753863 109192778 111203272 113115948 114095765 114738189
4716 114738189 115508570 115320158 115198212 115953801 116283264 116362415 116682225 116574079 116562731 117121299
4706 117121299 117695033 117779215 117768474 117229799 116991602 116345317 115474593 114159888 112718166
4697 112718166 110973328 108609394 106663506 104020430 101557617 98920143 95404894 92727397
4689 92727397 89947263 87280331 84850670 81851640 79061025 77037794 74826274 72304024
4681 72304024 70229062 68256317 66279098 64578072 63004387 61681366 60248188 58709266
4673 58709266 56935768 55558996 54019099 52819734 51596045 50511388 49784014 48598920
4665 48598920 47792846 46863577 45970284 45175405 43641546 42507016 41467257 40483617 39550228
4656 39550228 38826372 38039785 36395600 35512881 34310254 33311907 32669328 31927740 31328725
4647 31328725 30040463 29798199 29246094 28440482 27709914 27061907 26661222 26410066 25343564
4638 25343564 24601346 24368261 23925583 23505608 23263417 22624100 21854814 21130253 20684869
4629 20684869 20825406 20599841 20007274 19679337 19089398 18792763 18654621 18241378 18216205 17916145
4619 17916145 17670543 17214824 16917789 16935048 16724815 16409350 16342941 15982941 15549640 15286584
4609 15286584 15129509 14731227 14556728 14597556 14805593 14877203 14383897 14104025 14002978 14220758
4599 14220758 13780594 13481710 13314106 13143998 12787465 12645414 12301178 11915550 12139010
4590 12139010 12710723 12664483 12539674 12346052 11972846 11943286 11898163 12137388 12108225 12103163
4580 12103163 12149352 11983965 11863482 12011915 12121632 12042496 12259466 11838971 11243380 11433066
4570 11433066 11317895 11248955 11125424 10997719 11166688 11094574 11262398 11601197 11398705 10709274
4560 10709274 10862030 10583882 10079000 10223923 10636766 10646941 10627331 10696742 10354033 10127407
4550 10127407 9946955 10413149 10780785 10658137 9964239 9791608 9774479 9812878 9756428 9667788
4540 9667788 9672643 9755161 9609034 9215431 9178663 9469070 9141209 9405472 9309691 9114178
4530 9114178 9103660 9425645 8943220 9036539 9051488 8560613 8448094 8614958 8635072 8614363
4520 8614363 8760996 8697974 8785543 8830038 8785143 8682479 8644515 8576082 8454858 8381384 8365247
4509 8365247 8541905 8290796 8653476 8553326 8447629 8482686 7920230 8569106 8388932 8413324
4499 8413324 8432140 8154190 8050336 8281684 7910197 7448126 7682844 7474857 6973246 7457056
4489 7457056 7404493 7418428 7356937 7553097 7690410 7413743 7592985 7366014 7350927 7407627
4479 7407627 7348006 7122322 6498992 6583926 6853600 6669827 6751298 6579585 6886553 7056994
4469 7056994 7031887 6942273 6766437 6393466 6530134 6889764 6409899 6385633 6844602 7055173
4459 7055173 7339811 7420352 7641522 6968159 6717413 6706989 6164842 5951686 6003461 6329769
4449 6329769 7114193 6855146 7172640 7979188 7431439 7034865 7011227 7074619 7027497 7227872
4439 7227872 7684207 7429297 7186878 7655039 7462315 7879449 7550766 7429164 7405158 6923914
4429 6923914 7003353 7424216 6810077 7089216 7420147 7438385 7689373 8414785 8244931 7767610
4419 7767610 7887778 8483038 8961018 9298158 9742602 9363779 9668519 10215928 10489979 10661993
4409 10661993 11426447 11742416 11849707 12337588 13525364 13799128 13675057 13506480 13619837
4400 13619837 13715743 13930169 14116704 14685394 15159528 15167662 14884733 14230119 14085125 13959492
4390 13959492 13423799 13097421 13429595 13658336 13525869 13378791 12602903 11823750 11888867 11988334
4380 11988334 12354967 11900793 11227945 11028331 10831898 10397331 10123920 9684526 9264269
4371 9264269 9387584 9966481 9892836 10234507 9685052 9129963 9190183 9013569 9069297 9567171
4361 9567171 9485078 9199891 9224231 9269101 9705942 9710482 9325025 9467648 9312482 9655787
4351 9655787 9517430 9581714 9338744 8859068 9346459 9558957 9582335 9847060 9879232 9286123
4341 9286123 9483323 9378536 9568346 9499792 9467614 9235971 9174506 9509300 9822764 9809773
4331 9809773 9744265 10047232 10499627 10600706 10168520 10592818 10441759 10265475 10631156 10709140
4321 10709140 10538613 10647444 10961852 11020890 11425483 11475906 12136530 12162728 12024950 12258136
4311 12258136 12508006 12858578 12931838 13251848 13668743 13816245 14108022 14359999 14591358 14456126
4301 14456126 14509982 14715771 14526329 14730889 14797927 14936469 15640370 15742332 15814850 16264219
4291 16264219 16912586 16932696 16408892 16762241 17979026 18283085 18542825 18849684 19254146
4282 19254146 19509559 19800519 20536606 21328433 21242228 22200184 22712328 23338553 23767358 24183244
4272 24183244 24361962 24631717 25186335 26134589 27195542 27832074 28571726 28815712 29878250
4263 29878250 30551076 31161805 32066726 32893309 33808411 35264401 36532211 37057209 38491173
4254 38491173 39835242 40174520 41132853 41807426 43050246 44333976 45407882 45946061 46980076
4245 46980076 48704831 50309931 51994629 53783946 55657335 58146078 60441434 63023455
4237 63023455 65984060 69384365 73456824 78862922 84644987 90605853 97574991 105533603
4229 105533603 114601975 125280679 136787962 150046834 165330440 181350383 196668205
4222 196668205 210299071 220049179 224191930 221442230 213332181 201307588 187028991 172220525
4214 172220525 158246027 145594343 134195019 125398615 118231396 112694526 108452097 104550041
4206 104550041 100927262 97399477 93464973 89074215 84926173 80536296 76615642 72452733
4198 72452733 68051075 64185645 60989162 57940596 54816742 52382344 50067231 47895729
4190 47895729 45801134 44275370 42646944 40698500 39089577 38165886 37265054 35806723
4182 35806723 34707883 33858341 32713720 31824392 31360890 30818072 29829883 29335502 28998423
4173 28998423 27940573 27012772 26729342 26758927 26439712 26501465 25969696 25419941 25057986 24254293
4163 24254293 23715428 23641947 23776717 23805889 23961930 23799348 23738903 23046804 22950383 23119136
4153 23119136 23090428 22805907 22668075 22448531 22660809 22019435 21660515 21192075 21759655 21768392
4143 21768392 21937538 21742779 21370540 21528127 21400904 21650631 21596691 21836974 22084876 22185854
4133 22185854 22257890 22284399 22205416 22871153 22830323 22554920 22794473 23239909 23195620 23627328
4123 23627328 23646203 24325098 24510042 24475646 24713996 25244719 25462405 25852852 26617756 27590083
4113 27590083 27584555 27555189 27692928 28054330 28505211 28797618 28634077 28225709 28388397 28322740
4103 28322740 28484003 28954070 29205767 29235596 29541925 29432729 29900631 30412923 30867721 30728303
4093 30728303 30882896 30638873 31213487 31726464 31756815 31821485 32350818 33342027 33576315 33977059
4083 33977059 33756038 33779039 33964726 34321254 34991555 34792816 35403029 36097801 36283228 36751047
4073 36751047 37163347 37425857 37659391 38081264 38560058 38517929 39431711 40234610 40748327 41248744
4063 41248744 41877318 42056531 42139249 42942976 43353017 43727955 43430756 44207974 45018746 45959087
4053 45959087 46608865 47427463 48051533 48643259 49193578 49479535 50412897 50876659 51588272
4044 51588272 52231177 52710535 54029411 55433616 56164973 57289056 58972708 60199146 61973019
4035 61973019 64174179 66922644 69848971 73281270 76784311 80230338 84302849 89820377
4027 89820377 96523046 104778995 116297449 133102065 156590243 187700615 211976164
4020 211976164 216923815 205074872 177119697 148719355 128783514 114639271 104846793
4013 104846793 98212009 93052007 89791944 87334750 85055442 83076627 81577130 79986499
4005 79986499 78660147 77564450 76284687 76181789 75802643 75280779 75004404 74803407 74798543
3996 74798543 74236980 74462238 74851208 74685959 74949556 75719786 75016567 74494741 75368956
3987 75368956 75952015 76458976 76807383 76747045 76333594 76634438 76409815 76444307 76009755 75728997
3977 75728997 75700447 75515613 74841724 73959708 73429761 72924370 72278089 72240439 71792895 70961193
3967 70961193 70869181 70610177 69537607 69022333 68478143 68142287 67540533 67047531 66328055
3958 66328055 65985868 66113536 65511763 64908578 63878516 63628790 62693526 62087786 61566288
3949 61566288 60767062 60721571 60249266 59751966 59442213 59817308 59538674 59062782 58543873 57973887
3939 57973887 57648081 57580825 57916999 58009609 58032115 58115990 58027958 57810158 57786588 57312787
3929 57312787 57150808 57111248 56916537 56466146 56588878 56422221 55937090 56057878 56544666 56362578
3919 56362578 56608254 57414050 57667241 57620185 57718924 58023311 58146204 58189008 58380861 58489819
3909 58489819 58602729 59116571 59875729 59666186 59250587 59272263 59484739 59095249 58559757 58499706
3899 58499706 58172460 57254033 57480873 58350177 57973605 56949685 56672223 56487535 56349713
3890 56349713 55646684 55017853 55055938 54474418 54230022 53991955 53778301 53511453 53729524 53200380
3880 53200380 53158364 53028710 52517253 51916347 51544227 51657355 51625716 51544735 51594028 51230387
3870 51230387 50880176 50753321 50892827 50990708 50479463 51018733 51638894 51480282 51052347 51091922
3860 51091922 51605469 51696308 51989266 52239796 52247306 52266878 52672620 52760758 52781275 53026777
3850 53026777 53915446 54245093 54276602 54139074 54136566 54876699 55356698 55823372 55694848 55581210
3840 55581210 55953918 55792946 55815472 56058965 55630625 54797369 54476189 54132516 53804015 53795381
3830 53795381 53221836 52816396 52330704 51943114 51918159 51660081 50777839 49977214 49305884 48725010
3820 48725010 47891181 47293802 46680378 46346621 45834842 45098769 44674657 44572229 44213359
3811 44213359 43595124 43351612 42869551 42136897 41532936 40792316 40656466 40000389 39464017
3802 39464017 38978448 38960257 38603391 37848341 37552781 37032718 36148384 35706383 35422213 35097468
3792 35097468 35034285 34256558 34330121 33352425 32261260 31499112 31093921 30741051 29814775 29548305
3782 29548305 28812906 28583668 28189025 27799037 27650277 26851738 26212810 26003274 25558419
3773 25558419 25009960 24292413 24689987 24883406 24631041 24807432 24562071 24112058 24156700 24778108
3763 24778108 25232285 25036305 24900415 24796372 24901246 24867820 24041618 24109219 24022007 23772170
3753 23772170 23111747 22853737 22664169 22559842 22088966 21587224 21441916 21396884 20963391 20706255
3743 20706255 20542484 20034698 20162512 20063396 20063414 19859929 19664102 19608716 19396080 19398281 19172403
3732 19172403 19074831 19082379 19089323 19039925 18741475 18268708 18031439 18211124 18281669 17600572 17026690
3721 17026690 16987226 16781621 16444520 16730655 17263495 17379488 16786445 16722090 16577260 16277052
3711 16277052 16539941 16369682 16060881 16037510 16036684 15976681 16130884 15938577 15636874 16056034
3701 16056034 16256480 15963805 16307711 16116033 16605963 16817201 16167702 16057437 15991890 16127376
3691 16127376 16275879 16376723 16224451 16086808 16663794 17446983 17156134 16947224 17378507
3682 17378507 17398740 17583509 17559375 17981589 18303481 18358156 18691552 19344606 19931806 20021333
3672 20021333 20090958 20682398 20582128 20677977 20773643 20929937 21262391 21262099 21445221 21706156
3662 21706156 21688379 22087184 22450578 22477057 23004643 22442784 22573361 23010043 23077507 23020621
3652 23020621 23211895 23343167 23578300 23619812 23680715 23985042 24239372 23978017 24440279 24644812
3642 24644812 25041211 25309229 25210082 25263338 25410265 25984427 26229979 25940370 26269569 26965310
3632 26965310 27134018 27616474 28392941 28666917 28801288 29587235 30005243 30394751 30764472
3623 30764472 30850074 31186753 32424564 33227242 33663769 34337116 34765758 35340383 36104859
3614 36104859 37181292 37975696 38450943 38965706 39968206 40574155 41209668 42502304 43158602
3605 43158602 44156831 45083404 45862924 46967033 47689265 49300198 50390701 51615927 53063569
3596 53063569 54255950 56087368 57589447 59263316 60695880 62669207 63999798 65025361
3588 65025361 66592186 68533469 70043516 71801578 73297284 75253682 77234362 78714915
3580 78714915 80764064 83198653 85132408 87600092 90285260 92196656 94100410 96301222
3572 96301222 98612639 100750785 102538536 104457669 106307281 108708956 110368042 111604257
3564 111604257 113075708 114598451 115861921 116490645 117382851 118590130 119637779 120155427
3556 120155427 120717468 121499163 121785893 121985579 122197425 121413084 120577528 119951142 119463737
3547 119463737 118555800 117567835 115982683 114759527 113137775 111676705 109401894 107405251
3539 107405251 105977076 103895102 102073820 100411511 97982800 95493747 93485100 91538586
3531 91538586 89600024 86742389 84169891 81206892 79337965 77470767 75238286 73165435
3523 73165435 70759003 68221259 66160453 64265370 62474629 60264844 58939958 57473299
3515 57473299 55968850 53920840 52601012 51911348 50539737 49783471 48272307 47190193
3507 47190193 46125466 45031005 43928627 43417836 42306320 41430000 40501389 39280932 38877363
3498 38877363 38177048 37289387 37029476 36051891 35440524 34798960 34253846 33370237 32550077
3489 32550077 32232835 31462796 30670184 29769039 28864415 28440226 27917397 27282666 26999451
3480 26999451 26079517 25045432 24799222 24325379 23845184 22992148 22391460 21726444 20941753
3471 20941753 20822832 20704800 20239044 19475558 18764522 18107359 17505344 17237773 17346678
3462 17346678 16801597 16245880 16332641 16196172 15604505 15342442 15305901 15099868 14305161 13881692
3452 13881692 13365262 13538600 13458435 13215840 12688748 12347379 12686573 12685865 12738769 12495999
3442 12495999 12421742 11903364 11671920 11166835 11386943 10886282 10858339 10371808 10084268 10451230
3432 10451230 10183472 9609408 9542264 9394973 9278838 9294776 9144245 8923275 8819623 8712444
3422 8712444 8211132 8636539 8584088 8718128 8736381 8768701 8079812 7491327 7531358 7525000 7722785
3411 7722785 7695965 7525368 7396081 7815196 7485866 7192384 6910670 6855883 7029814 7048794
3401 7048794 7388359 7145512 6651943 6505643 6569829 6392190 6786889 6398874 6255440 6022409
3391 6022409 6215782 6178591 6304742 6099361 5888143 5774421 5570150 5685527 6060024 5524997
3381 5524997 5436464 5857890 5963066 5691656 5852643 5945173 5511571 5391125 5845041 5900795
3371 5900795 5717398 5917270 5735259 5574559 5048217 5146762 5168124 5162139 5109246 5213114
3361 5213114 4798809 4509586 5029856 4959615 4756196 4833158 4705137 4766534 4653305 4326526
3351 4326526 4726673 5006201 5348356 5132751 4974453 5014897 4756149 4743449 4601863 4451154
3341 4451154 4931216 4499329 4521461 5378751 5025390 5026435 5231548 5108669 5156186 4734407
3331 4734407 4551912 4493217 4377348 4799776 4551111 4714106 4685129 4400063 3952436 4029077
3321 4029077 4107745 4198560 4319064 4104818 4264479 4427512 4519267 4704308 4762289 4520960
3311 4520960 4386636 4450737 5132298 5110554 4838714 4257142 4142686 4458468 4520331 4462445
3301 4462445 4242620 4921888 4821715 4546275 4332531 4046586 4072145 4117086 4440922 4441397
3291 4441397 4120491 4485315 4581145 4774505 4867676 5311276 4963777 4292636 3999972 4091309
3281 4091309 4500364 4919004 4786012 4711325 4528312 4221148 4156660 4503557 4695233 4874818
3271 4874818 4683782 4960733 4973539 5129920 5150061 5089584 5257019 4880527 5063292 5029182
3261 5029182 4745622 4916123 5654734 5882279 5784717 6043214 6176339 5981905 5407976 5184883
3251 5184883 5439711 5621058 5457513 5263019 4951054 5141875 5439885 5286377 5429164 5324970
3241 5324970 5691694 5389368 5088817 5317221 5260625 5431509 5818445 6020420 5761709 6133277
3231 6133277 6151120 5485634 6009362 5850922 6169622 6286358 6937431 6588900 6323880 6326430
3221 6326430 6709639 6874816 6436557 6265172 6467699 6831943 6932161 7168436 7450305 7395748
3211 7395748 7664195 7856269 7874260 8215651 8353923 8649590 8326389 8019874 7969488 8448113
3201 8448113 8934808 9159989 9307648 9209946 9645540 10157286 10874594 11080172 11705712 12813051
3191 12813051 13611776 14185859 15171166 16289330 17432850 18578709 19424497 20151248 20741022
3182 20741022 20585055 19871047 19571931 18683959 17396556 16228582 15483937 14566256 13459470
3173 13459470 12246977 11597426 10762640 9972816 9796637 9351171 8887931 8633137 8388030
3164 8388030 7955835 7497989 7243829 6815899 6721460 6095984 5610213 5934415 6021665 5819790
3154 5819790 5934037 5279400 5120296 4955141 4484809 5090914 5264460 4901220 4912844 4917596
3144 4917596 4803353 3812169 3641336 3672591 3958553 4297171 3678137 3586556 3679604 3398129
3134 3398129 3563787 3704268 3429918 2955595 3474672 3847531 3436497 3228485 3232716 2939613
3124 2939613 2851441 2761496 3216757 3151188 3039090 3279164 3372075 3392529 3336302 2979597 3044462
3113 3044462 3534795 2965686 2509636 2769893 3143097 3082142 2410753 2144819 2614062 2518740
3103 2518740 2513258 1978940 1569954 1601202 1627217 1817297 1988610 2248010 2461843 2348355
3093 2348355 2483881 2406803 2421878 1871967 1717128 2057320 2167091 1743198 1780374 1877346
3083 1877346 1789460 1792891 1937887 1494244 1620962 1247304 1735071 1752969 1420322 1042499
3073 1042499 722042 1258495 1565021 1686344 1306847 1586872 1764640 1601622 1465525 1049269
3063 1049269 1171135 1379633 1855820 1955198 1555410 1442947 1547321 1803259 1093916 1241302
3053 1241302 1684487 1217590 951010 1398393 1333858 1347937 1195862 1033504 1040661 1415883
3043 1415883 1341743 1404807 1684976 1740009 1940554 1510776 1322198 1031964 527340 626780
3033 626780 735826 814396 1224091 1143721 1432083 1130471 1361532 1157883 1080516 1582512
3023 1582512 1539610 1672085 1690951 959179 918464 1404644 1066408 979719 1004734 1193670
3013 1193670 1239251 1187459 1172396 1511010 1578772 1213642 729299 1309166 1459241 732374
3003 732374 951703 1565753 1540943 1391578 1207135 1290108 1506901 1644703 1383982 992980
2993 992980 1061833 1221001 1442437 1162996 1261652 970643 849060 1210712 786345 1157292
2983 1157292 1053998 1585287 1424521 1119454 1050915 1182559 899704 722366 826936 1208910
2973 1208910 942688 1202643 1369524 1290044 1187742 784607 1364382 1827632 1529565 1144108
2963 1144108 1313272 1547173 1204809 1218294 1370571 1045658 794262 603847 892869 1543694
2953 1543694 1725755 2054397 1715160 1606475 1917504 2224458 2045951 1741422 1544255 1449288
2943 1449288 1418113 1441584 1543904 1161866 1505011 1638202 2048923 2090839 2235679 2008749
2933 2008749 2086352 1754619 1814913 1532246 1916772 2226307 2226403 2013302 1545705 1496052 1351350
2922 1351350 1404223 1554191 1749936 1728496 1795000 2093149 2255244 2470496 1916143 1583551
2912 1583551 1728706 2128190 2496626 2460410 2612890 3572807 3482789 3018828 3178918 2947418
2902 2947418 3401859 3038005 2791490 2718043 2369380 2860192 3070713 3037056 2833214 3048385
2892 3048385 2810852 2182602 1998566 2301116 2399225 2816362 3048515 2946008 2628133 2290934
2882 2290934 2337274 2871502 2779714 2692849 2825130 2196869 2373652 2404729 2808191 3497306
2872 3497306 3708004 3388215 3339921 3560573 3409956 3688688 3273247 2877177 3174297 3564389
2862 3564389 3668030 3565110 3318200 3043208 3377669 3626050 3460120 3227535 2922635 3006312
2852 3006312 2944919 3322807 3826614 3925960 3874010 4190070 4815266 4916650 4721543 5082697
2842 5082697 5239562 4711290 4085221 4133054 4040806 3468351 3760886 3521762 3040038 2918470
2832 2918470 3198561 3341301 3153541 3123280 3199718 3392268 3604405 3136445 3194478 2865208
2822 2865208 2632206 2870865 2926691 3264565 3214283 2973106 3007358 2891384 3355995 3050684
2812 3050684 3197852 3040115 2626320 2187452 2358139 2480337 2759194 2688560 2298667 2741945
2802 2741945 3139242 2811371 2293403 2172469 1912301 1852807 1992722 1661536 1943266 1859862
2792 1859862 1841884 1699184 1781542 1840172 1893519 1889481 1827190 1669270 1163703 1223538 1226485
2781 1226485 2239078 1622503 1380491 1152380 1184523 1208730 713372 398350 425986 804143
2771 804143 941880 794392 1077612 1108438 955228 1080304 795262 730184 614038 1007128
2761 1007128 1094332 728440 686902 684318 594326 910707 1565942 1334850 595414 361267
2751 361267 601040 508438 528370 629447 680358 848032 561903 511851 259808 557616
2741 557616 470518 474607 715823 596911 386693 382967 436263 367721 696309 615171 246100
2730 246100 134741 -113022 71308 331154 389496 332042 230740 582674 573050 511380 414546
2719 414546 307718 855554 359451 -132234 42654 15739 373530 573573 240300 27686
2709 27686 162690 -42474 817367 1143596 761316 71267 24553 253676 290009 319142
2699 319142 246163 341759 -66102 -6082 535722 366444 487049 526807 -126054 -157158 424344
2688 424344 342099 20381 263898 551342 494564 427017 288260 299543 112861 131831 -353971
2677 -353971 -445841 -51738 390766 -126421 -483719 -143221 -113927 347103 257492 271321
2667 271321 762101 473998 200416 285432 320030 181151 79984 112097 -113910 179640
2657 179640 138380 420811 576828 56333 466879 185740 137578 210007 -53435 179352
2647 179352 162652 210769 254001 39916 590368 385795 339411 588149 781713 899494
2637 899494 266035 453 228954 355538 -9453 -44540 -31316 369556 559929 143001
2627 143001 2264 155853 23160 47299 546641 816206 142325 -413448 -517464 -178255
2617 -178255 -10670 33921 -45688 -132277 228006 128472 -63490 -50279 -278738 -354281 -271624
2606 -271624 -406308 -224551 -294822 -251603 -15058 149789 419674 558699 383885 -150687
2596 -150687 255728 285551 371713 313734 254976 463571 1073138 812091 586149 495170 576742
2585 576742 197543 -61147 170037 -511362 -81705 398525 409923 972886 704398 496493
2575 496493 7557 -128729 328263 569104 397240 133932 57974 46909 57133 175689
2565 175689 -440140 -243118 90181 129477 360637 601885 587235 513861 245596 182712
2555 182712 295142 80964 -107738 347770 503356 329017 70304 51665 858545 551271
2545 551271 563256 733697 480470 117155 -27296 -154181 -444296 -227830 304904 44383
2535 44383 25450 91791 466175 637531 521191 172556 191121 504295 444111 1122274 1182786
2524 1182786 643583 935163 799369 461203 958386 1417827 605334 672275 701741 379864
2514 379864 298837 217641 157270 75007 259790 -64922 52240 584519 794732 812606 619666
2503 619666 527943 831032 769952 595823 699854 259310 343770 425394 361746 325942 405205
2492 405205 436478 514324 658639 421909 199162 -23106 239280 283868 -89506 232319
2482 232319 114226 -18618 227547 110461 -110595 6554 82131 543022 438479 -35030
2472 -35030 176580 235812 -38638 349941 367641 287541 292250 272295 -97976 411169 513040
2461 513040 224218 -68212 -108773 473899 230122 152521 -69329 -125381 177875 -53303
2451 -53303 503202 794166 456335 526164 225370 250766 333350 -52112 370549 576164
2441 576164 224306 291586 -531873 141430 370723 -295448 -470457 -100545 429158 293252
2431 293252 -228647 -115482 -148388 -485689 -331874 19147 120779 179903 259972 -52777
2421 -52777 -80389 -484764 -118323 -64296 -250260 -193276 -99003 -594596 -646062 -373247 -596109
2410 -596109 -131949 79708 -516736 -982599 -579567 85784 267437 13635 51772 -123496
2400 -123496 47991 -673067 -372771 -32392 -143006 -11779 -33630 -141800 -345425 -97464
2390 -97464 -7533 -496805 -227060 114045 -239467 -399818 130866 1959 -265431 -473627
2380 -473627 -350835 -497791 -651422 -598273 -465789 -460838 -629889 -326746 -345494 -883063
2370 -883063 -613433 -113015 214230 171830 -205517 -399244 -305466 369945 183174 -8545
2360 -8545 212070 -53001 126549 408444 446603 185849 -397470 -647022 -351232 221464
2350 221464 81730 -461782 -798175 -246666 -8660 4875 254959 424876 27214 -89831
2340 -89831 -93440 -171 92306 -155784 -183732 -316745 -24072 106104 2691 -121486 -66534
2329 -66534 -287379 -674292 -505550 -490240 -374652 26197 116893 310905 585770 162873
2319 162873 309133 366228 339637 463308 571200 1070265 1278622 1336252 1709980 1847528
2309 1847528 1288965 947152 1182082 990955 677091 872910 440047 -29977 98965 140629
2299 140629 340540 458442 368482 479633 494459 507477 471122 864940 963694 1122869 745818
2288 745818 206908 860116 734695 338895 -279403 -168330 343837 146280 -121471 260898
2278 260898 436167 684461 449762 192582 -124171 16930 15011 234097 176892 486051
2268 486051 553803 368042 584348 823316 1092172 653536 348932 528587 506793 313226
2258 313226 243466 297970 483854 -60425 -15440 141863 324596 347817 152203 133746 306908
2247 306908 188728 -112353 -351593 117734 692163 720278 183852 253868 144023 447519
2237 447519 441834 421710 342466 429213 465340 548454 641038 360358 518548 317056 708575
2226 708575 440937 444360 693769 640829 532656 440119 588359 836994 712764 537173
2216 537173 459994 561162 917265 923526 980486 792094 680611 1281769 1141654 1149315 687252
2205 687252 366837 490985 862432 1025845 1214065 1063216 743777 749458 726522 805418
2195 805418 711983 757971 887146 880662 891993 793037 1037669 1112821 1082259 1064160 880923
2184 880923 1051085 1040124 1080733 1109908 1011264 1270389 1460552 1408418 980724 1220283 1725228
2173 1725228 1044576 830888 1287764 1665525 1572157 1607622 1681569 1638720 1882481 1701307
2163 1701307 1513382 1509456 774649 892760 1351516 1173877 1565207 1711654 1674644 1871087
2153 1871087 1738135 1816310 1687449 1440620 1362020 1835389 1632159 1826269 2133650 2316144
2143 2316144 2151014 2665308 2779114 2732762 2670157 2910924 2712786 2808557 3038678 3520428
2133 3520428 3503374 3407552 3585758 3356807 3530111 3260202 3084072 3190771 3371064 3933469
2123 3933469 3746475 3843067 4079826 4312290 4755257 4979905 4969460 5583789 5374020 5158203
2113 5158203 5564785 5320642 6181407 6579277 6406852 6880754 6667203 6815722 6708656 6951966
2103 6951966 7104499 6738447 7201719 7501758 7940076 8180410 7905853 7864723 8506502 8713905
2093 8713905 9283212 9337097 9790866 9962843 10314997 10541075 10957206 11540774 12423358 12861382
2083 12861382 13287377 13364591 13651686 14260612 14886818 16381453 17161049 17841258 19013408
2074 19013408 19962312 20842184 21193642 22158942 23209993 23806756 24542564 25496656 26525861
2065 26525861 28204062 30063085 32655205 34999209 37491545 41280554 44772080 47940802
2057 47940802 50745096 53819980 58287056 63403304 70629476 78998315 89572728 102617465
2049 102617465 119344432 142872063 176490228 223342683 279872267 312014629 308628156
2042 308628156 273504067 216771567 169484469 136557946 112165209 93841574 80706082
2035 80706082 70675585 62995052 56820752 52532478 49704491 47651033 45231908 42233532
2027 42233532 38808201 35428815 32141488 29934971 27397570 25293734 23597530 22372316
2019 22372316 21163103 20008597 18980725 18393371 17683952 16798361 15777185 14904537 14206811
2010 14206811 13333774 12836539 12071579 11745873 11392419 10989978 10375508 10197842 9654444
2001 9654444 9594025 9922852 9133625 8410222 8161827 7931173 7766764 7600462 6933586 7140445
1991 7140445 7372636 6893610 6336217 6188721 5855434 5809874 5390408 5469430 5215034 4642639
1981 4642639 4614116 4704186 4741292 4590916 4548723 4187231 4216296 3646336 3088815 3755051
1971 3755051 4138579 3903737 3479511 3538461 3547863 3536511 3896327 3506030 3356376 3244290
1961 3244290 3025372 2820550 3293381 3088205 2095056 2720277 3079857 2924105 2632297 2814001
1951 2814001 3142633 2517912 2528935 2279043 2047306 2173406 2255730 2164238 2138444 2124821
1941 2124821 1862373 2124416 1689302 2515909 2312002 1709464 1327094 1207337 1268017 1353212
1931 1353212 1522983 1559777 1464881 1655258 1620723 1103761 1270390 1658437 1382271 1680835
1921 1680835 1410210 1135881 1582743 1663067 1224329 1241185 1247076 1179620 1105983 1163315 1559499
1910 1559499 1201354 987825 1091157 1387093 1364916 1326514 1137299 1013377 921450 596641
1900 596641 779294 764151 503404 540461 452879 275800 610178 853356 284408 749975
1890 749975 664391 1005446 1187163 777372 634957 653141 611494 854742 833164 886125 475608
1879 475608 344085 356337 323488 687756 528049 297662 646986 700096 438651 66953
1869 66953 415887 448223 479574 453586 535901 130228 53700 -183 117386 11328 639991
1858 639991 373987 -8907 691287 662428 239549 355558 838021 701443 363939 668996
1848 668996 541591 154287 176866 -77265 265196 680948 915553 640394 428462 36058
1838 36058 -210487 60244 10276 -559845 -148626 289396 -293021 -459621 -336267 -526537
1828 -526537 -139996 338052 -153323 -361943 -278802 80738 662650 719011 565681 303874
1818 303874 -237246 -185968 393551 445288 564527 357373 -30218 -242844 274644 184606
1808 184606 788298 628923 296482 -127288 -47247 437766 144160 -296038 -469764 58222
1798 58222 109949 250250 302894 539027 286430 59016 140109 447125 355850 175137 403485
1787 403485 751996 1030348 615105 150869 252294 209466 405016 454826 304977 822790
1777 822790 1248936 1551710 1615675 1489510 1122873 1315872 843665 550914 387524 571143
1767 571143 439617 768479 417052 230842 462787 438752 233273 125233 368506 402325
1757 402325 538219 741453 571038 313950 966441 750766 145276 -98969 237145 158091
1747 158091 152830 575970 408491 -126462 -265787 192098 -5285 -264900 -38717 263931
1737 263931 581600 770253 685880 787284 605439 431330 287991 100335 -200213 -513720
1727 -513720 -587581 -720518 -441767 37554 139150 399977 253063 -108046 -342553 -377331
1717 -377331 -360338 -31320 -192461 -103815 -94920 29461 -144503 -426356 -93266 -410046
1707 -410046 -354810 -249875 247828 328656 293492 357823 -103346 -594309 -158887 -359929
1697 -359929 -497789 -934347 -449029 -260871 -329673 87267 252378 301337 122839 -477016
1687 -477016 -417052 -182289 -37187 161499 -163854 -160785 -478595 -406005 -290551 -530270
1677 -530270 -298943 -140863 -137280 -527798 7290 549965 305781 271024 -156592 133934
1667 133934 94465 121579 278641 -116463 -172014 -47953 -192965 -212941 -159320 32700 363097
1656 363097 53306 -591904 -992202 -546433 67146 508846 226989 -97136 -182828 -484640
1646 -484640 -631759 -217437 -808057 -561095 -283970 -296130 -636088 -567085 -178892 324473
1636 324473 -94006 -408533 -2175 -203843 8941 114528 503642 314791 364439 279683
1626 279683 -322914 -828709 -639251 -52687 109291 -445916 -412828 -87758 138151 182571
1616 182571 134103 84574 -117325 -256367 91220 415052 -132506 -7245 182209 185399
1606 185399 339236 442993 380395 228380 464975 241639 23975 -331030 -161186 294812
1596 294812 59222 -165538 -190694 -284974 -322414 -165064 -513124 -148963 251054 139068
1586 139068 -173295 -335270 -80088 -147075 -54416 -266863 -623714 -563599 -577279 -308369
1576 -308369 2378 98312 636218 142381 -443893 -607488 -254690 1114 209910 -395932
1566 -395932 -724056 -1164209 -720954 -583847 -614051 -839211 -683556 -500903 -715135 -511190
1556 -511190 -485099 -318486 -273452 -205073 -315931 -391980 8915 -10999 -337908 -92482 268357
1545 268357 363007 515105 47270 -34753 -503807 9281 25441 -225448 -328259 -528973
1535 -528973 164548 168279 205561 -188314 -251841 -207944 -256511 -397643 -179693 65387 -91477
1524 -91477 57615 193062 21212 130254 -14004 -496529 -637915 -163436 -45851 106844
1514 106844 420663 614166 174670 95561 -62338 -391972 -542667 -193147 -305899 -298495
1504 -298495 -314739 152667 368628 32864 118334 74808 293296 608300 594728 692313 400397
1493 400397 304008 -275341 -516797 -602966 -552574 -144090 81649 14116 -309642 -394554 -327202
1482 -327202 -486881 -143289 -816752 -790334 24140 118691 109495 146542 81431 64283 68794
1471 68794 -482146 -386259 232445 101533 -204345 -85305 -120845 -480841 -121940 33687
1461 33687 -45601 1252 -91600 -469301 -316131 371732 371243 -82453 28754 334587 -522987
1450 -522987 -193096 -271190 -356132 -277978 -454385 -512208 -706182 -570392 -89951 561988
1440 561988 513332 141937 149081 387540 58585 265464 361980 -292659 -628118 -817395
1430 -817395 -793197 -553945 -407984 -783701 -485770 -144862 106499 -761595 -531223 -486038
1420 -486038 -399438 -330046 -65992 -44338 -462245 -418778 -256778 -609593 -622023 -495939 -406702
1409 -406702 -619877 -551129 -459400 -626896 -345509 -124323 -465298 -650206 -492647 -611167
1399 -611167 -14421 81352 -34693 51649 249842 -357150 -625123 -623077 -345610 67254
1389 67254 -363804 -535930 -25145 -114818 -155507 -359356 -149925 -538154 -373592 -32653
1379 -32653 -426653 -242189 -16081 -23989 216684 145146 298026 -151550 -562436 -125105
1369 -125105 185256 96237 -66516 -393260 -349305 -27137 15030 108029 234939 281544 192059
1358 192059 266445 448457 66552 190457 -135087 -513641 -111281 -742873 -789584 -627013
1348 -627013 -545449 -294973 -579086 -870225 -1151697 -1245336 -687390 -331501 -140432 -375413
1338 -375413 -592131 -852094 -739788 -242820 -149087 160691 -218022 -291261 -120325 -492439
1328 -492439 -308513 -590548 -212385 -83111 -19618 -156728 -490185 -71577 -133738 -230480
1318 -230480 277620 175995 189758 399391 -191875 -389026 -78943 -363237 -361834 -382756
1308 -382756 -277226 -427321 -560132 24066 -277538 -508133 -7796 -54525 101623 425182
1298 425182 195259 260914 684721 -22809 -100266 236011 241251 153052 -5046 -45211 -393233
1287 -393233 -399947 -478178 -456425 -171056 -160438 -135917 -529352 -566460 -352929 -544861 -137748
1276 -137748 178982 -353418 -397273 -437447 -915866 -532880 151209 66689 -253157 -591792
1266 -591792 -850071 -846198 -923639 -365191 -252724 -4662 54528 -118445 -303438 90153
1256 90153 66859 146797 -293375 -314158 -364276 105970 533515 295700 -154735 -201162 123009
1245 123009 -619569 -152326 56673 -344853 38448 -96500 -499585 -520027 -786808 -425947
1235 -425947 -365466 -463779 -163220 -166904 290711 -235270 -312275 -403533 155114 30149 -200052
1224 -200052 212920 542228 532521 593788 370846 45985 543803 210857 -205982 -541037
1214 -541037 -668450 -116225 -80468 -230624 -43796 -204572 -44757 -62033 -134166 -450825
1204 -450825 -278853 -297769 84859 -109260 -163636 -309307 -409227 -596294 -154136 194348
1194 194348 -92262 -114721 29534 -315830 -667487 -612177 -744248 -314269 -213251 -601704
1184 -601704 -343473 -84538 -210141 -18744 -199545 -149722 220732 35115 -471503 -13257
1174 -13257 431375 167805 -338550 -279620 -197089 -303886 -113152 42168 -350876 -825212
1164 -825212 -213015 -220467 -277270 -638657 -750946 -644530 -373517 -376768 -72689 232553 405879
1153 405879 524638 -282997 -525926 -15106 51226 152939 -416456 -389041 43076 -262328
1143 -262328 -234533 168509 -72473 -638820 -545298 -137342 -216790 -776771 -705045 -289943
1133 -289943 -26561 -342982 -349039 -196172 -125209 -235671 -235911 125950 160015 -287670 -39117
1122 -39117 -117445 199335 -55985 -441514 -136701 207133 76582 -426884 -82169 -49040
1112 -49040 -180803 -283113 -404833 -181741 -420034 -92683 -287824 -393338 137708 547556
1102 547556 489075 231169 316992 9892 133025 -368640 -564805 -460805 9101 271068
1092 271068 395667 -110991 -588152 -232495 -344219 -532132 -521544 -86367 -343992 189880
1082 189880 386960 -76553 216111 535331 600846 321107 -91979 54571 500417 636233
1072 636233 38325 -413389 -168268 -121217 -154679 -299006 -290918 -161322 -485149 -330644
1062 -330644 -267418 -536595 -574093 -563116 -344207 -456891 -537705 62162 180500 -106770
1052 -106770 -613548 -282530 -366382 -477506 -50665 54318 -7509 246534 10093 -765234
1042 -765234 -550893 -249691 -989 -481718 -252988 -219349 -459376 -467533 -113087 435292
1032 435292 93731 -145837 187791 73819 120862 -129890 -171119 110014 -200390 -392561
1022 -392561 -458329 -129327 5626 -232835 63431 -116598 -26257 61046 61548 143281 173821
1011 173821 131887 -187681 -283423 -283655 24729 324618 752543 549078 349330 386243 96828
1000 96828 -164778 -129940 -170871 -259465 -390045 -719526 -191822 98227 201686 -45292
990 -45292 75912 584939 541344 609938 200109 99847 -689831 -703639 -721559 -826493 -213931
979 -213931 -97299 -660345 -442628 -410042 -431705 -324065 -191074 -67523 78767 159444
969 159444 -166698 -93222 -262315 153392 133490 -245328 -200642 359814 332375 -381859 -175295
958 -175295 -383758 -327949 -512665 -417188 -248326 -198505 -74020 -39196 336729 76526 349085
947 349085 83433 -253952 -131048 -69662 -215414 275531 384816 187761 -276220 155873
937 155873 401694 108711 70260 -66108 -47845 -36795 -198777 -164365 -13067 220434 -449733
926 -449733 -328847 -99346 -218524 182846 129713 -284882 -69942 28375 51161 104871 -88821
915 -88821 28940 -348742 -148322 145646 -201171 -199782 -47250 -87609 -316954 78211 186275
904 186275 -178091 152005 -229027 -233002 -536994 -454200 -43515 128631 -90953 315322
894 315322 222051 -200580 -492933 -299925 -183633 -384877 -273185 74017 72935 -72551
884 -72551 -153970 6782 502505 397703 -145055 -254871 -178209 247884 -49615 103620
874 103620 41302 -578584 -700904 -515669 -145897 -221445 152613 -63840 -487104 -438395
864 -438395 -258633 -218519 -184951 -177224 -510944 -753121 -354271 309555 325411 -19419 -141938
853 -141938 -246827 -419040 -532657 342329 -278539 -222212 -71087 -204568 -443256 -353855
843 -353855 -380280 -575057 -491127 -652954 -644592 21263 -18208 -446120 -222271 -381462 125694
832 125694 -260120 -359712 364313 369746 68740 -314475 174358 183653 -106392 271967 -3653
821 -3653 -528464 -5357 46717 338686 4844 161390 247061 -308607 -90281 -244311 -369042
810 -369042 -388676 201342 357152 327478 239510 475782 97298 -403551 -616893 -25080
800 -25080 239684 397551 406252 227834 -7635 -23584 6159 170468 233263 -253841 -282595
789 -282595 -21696 108152 423181 192163 23883 176358 -82890 -459626 51318 481576
779 481576 14924 -111381 119791 -315176 40527 -61961 121947 486186 30634 -377135
769 -377135 -17662 -278344 -662465 -357155 -250492 -27979 -24481 101437 90220 -413153
759 -413153 -487837 -43565 34939 -337521 -217787 76147 137649 104287 25114 416966 405257
748 405257 265574 -275160 -307445 -22144 90882 112211 -229278 -153694 114628 -43495
738 -43495 76251 30469 169985 -321805 -311335 -363671 -500941 -604794 -563725 -177459 -66991
727 -66991 216113 -50650 192840 535786 675791 85021 -61438 433878 151503 -50674
717 -50674 57130 180889 -39621 496288 605690 227195 265139 850476 601988 762626
707 762626 308484 29592 194325 259818 -79897 -12809 -162517 -144639 -377847 -253105
697 -253105 150756 79523 304310 499526 126010 -302451 -313845 109783 182117 444563
687 444563 279609 555778 737344 320597 582903 350702 576099 235329 420413 117826
677 117826 -307780 -426080 -134867 9108 -67469 -39872 -20839 -34155 -172922 -116687 -545654
666 -545654 -410237 -108297 -82308 -407073 -183964 410537 -44440 432560 463983 -167588
656 -167588 185861 170648 255874 1042953 744664 405069 -38620 545375 66172 29488
646 29488 30222 300227 -85140 -653267 -161666 239351 276532 -27333 -400636 -200178 -150175
635 -150175 110359 183351 -161915 -283709 -407806 -16126 452750 657998 360579 -111349
625 -111349 64987 52797 227008 193537 277680 32661 -407441 -162943 -180084 -506639 -572642
614 -572642 -540881 -124918 462229 -48138 -337444 -57494 -400355 -154889 260102 5928
604 5928 117067 -66213 -106649 -428088 -58050 186996 338109 -240295 -46683 -48005 98300
593 98300 179393 30486 8456 -7276 -380531 -75828 118322 -394702 -185122 -344395 -726291
582 -726291 -481454 -546515 -321987 -72272 229267 -8382 -287035 -50703 10609 296117
572 296117 147287 -209948 -86507 -209724 403184 550688 331077 257575 -61794 478406
562 478406 353692 311109 239588 167152 -94283 113770 -28546 -280606 -234395 -486442 -118526
551 -118526 177507 350872 159060 21187 185124 203304 178354 118062 -229642 -76757
541 -76757 -6090 30375 184866 -37851 -7454 55018 -57360 -279416 -327787 -285121 -77444
530 -77444 103446 221638 -148571 25395 321202 306911 308959 135729 54887 -165930 -315434
519 -315434 -319210 -202188 -26811 -510214 -127119 59252 4139 -15408 -9133 -198657 -271897
508 -271897 -69472 10163 -25522 205576 -262990 -263070 300713 222207 120857 250582 477622
497 477622 390584 328369 103560 51810 388953 502755 -115252 -47681 -368858 -322954 304
486 304 211958 119286 -38319 -26802 127058 129872 128258 344393 520482 345340 335264 83728
474 83728 -370985 -452074 35525 267867 536898 227407 20136 260391 -148013 -123175
464 -123175 116508 399675 687572 712408 327588 -77268 -314998 -984319 -451115 87837
454 87837 384330 745002 223560 143069 -80317 49313 1636 15845 -37566 164131 57262
443 57262 -113962 -205501 -411162 -671812 -403514 -198338 -161382 9718 -9223 -150134 193034
432 193034 207754 -150331 -233501 -65455 137585 253511 374349 592895 85873 251904
422 251904 -246344 85997 218686 -214736 8155 379390 598576 337043 529950 377224
412 377224 129757 221843 670808 154951 352547 699518 416967 118815 243465 608254
402 608254 1156050 790605 541481 480337 233037 419281 788113 385090 256598 313049
392 313049 271591 186451 193283 -62651 -159387 175224 167697 195603 385368 311775 927212
381 927212 928123 754942 138455 -176426 25419 717336 1043206 482098 526950 581039 354834
370 354834 -197798 -143586 161041 426597 319634 520066 443881 631057 799661 490335
360 490335 513173 278637 58998 379876 204929 40514 271956 235394 110335 -222860
350 -222860 -242709 71470 650423 844294 333291 222102 501067 975442 567945 453921
340 453921 335744 -10190 160595 451897 403677 790978 1007520 743992 423065 500056
330 500056 335233 524790 760902 558928 787509 789427 488530 241634 544884 356765
320 356765 77132 420100 577487 257942 194831 102829 324955 171927 -98273 -76357
310 -76357 317331 589860 709283 711469 705871 777994 867293 839335 905541 140552 -233495
299 -233495 348078 30470 190531 -63239 496435 283134 569858 456528 205131 485122
289 485122 193441 202894 52121 135215 428087 490367 545377 1004588 720213 430218 437588
278 437588 147384 647490 910187 590546 492474 686776 796055 936277 590341 583262
268 583262 515178 -1471 161238 331287 518074 -23788 -91264 186086 914691 425429
258 425429 98587 -272510 -281781 187583 284302 810977 744359 302006 -45600 -16871 390941
247 390941 502417 739223 762791 495521 168544 -60309 -159172 286614 390226 336171
237 336171 608582 127842 370246 51461 -56106 11985 476556 389944 81831 628324
227 628324 428958 402484 211301 910540 1035001 961456 348445 982903 901673 758033
217 758033 715441 351995 689334 415712 635672 795459 286099 78260 26628 -138504
207 -138504 293161 720311 538733 167221 220018 325561 427091 101186 472356 844381
197 844381 789927 345706 390938 482999 69747 122730 -270933 -149964 78292 -83600 -641181
186 -641181 -414081 609530 813553 822018 215128 384971 77426 143290 323044 416560
176 416560 562124 533815 472063 -180331 -16270 383829 557796 698245 620458 700833 651132
165 651132 635814 418929 458555 572367 386536 272711 705446 521279 477261 400768 429853
154 429853 525110 375992 431713 493419 493803 484130 105787 542077 758976 979747 1221949
143 1221949 1182457 1098706 676936 516425 466609 327393 350030 531824 687193 403182
133 403182 448603 709045 775841 688016 286330 790307 642010 237052 635475 499261
123 499261 519696 397598 24045 236069 279911 -378908 -81882 -41701 229829 482264
113 482264 436436 430962 437876 433152 337922 215785 88626 322044 535396 545939 301037
102 301037 170751 -51150 350136 190001 603526 463895 371213 331306 412590 65748
92 65748 67443 363912 405694 476644 779176 713710 748356 252230 266330 421381 563504
81 563504 462654 426414 502266 68068 109481 386511 406468 526028 768122 609683 430842
70 430842 410294 271070 144367 -108255 155254 542878 584598 568199 428135 375224 342363
59 342363 448285 693200 661964 545424 474717 463660 339364 114594 172878 211420 294259
48 294259 587931 8756 267402 770904 501965 188511 467344 515326 708032 529528
38 529528 366479 567923 150312 333739 235315 342275 531417 373273 672521 558511
28 558511 356130 361080 534483 717037 408321 487359 527006 620035 714202 753190 499233
17 499233 801369 564974 429590 506418 575062 287531 538076 473214 757240 728506 216611
6 216611 371256 -65619 -251494 162753 213021 419118
0 419118
$$ Imaginary data points
##PAGE= N=2
##DATA TABLE= (X++(I..I)), XYDATA
16383 -2722656 -2484157 -2592875 -2530121 -2476505 -2399300 -2444769 -2482903 -2515550 -2249554 -2237128 -2323503
16372 -2323503 -2222165 -2288887 -2330460 -1922248 -2008451 -1781662 -1973884 -2028168 -1715269 -1816515
16362 -1816515 -1687273 -1652234 -1581899 -1490862 -1218346 -1385229 -1279322 -1228502 -941964 -1136455
16352 -1136455 -1277373 -1258231 -1052088 -962271 -1078896 -926548 -1018987 -944515 -1078748 -1010811
16342 -1010811 -1177663 -810114 -1031508 -913140 -686727 -511629 -466660 -22595 -14572 -220654
16332 -220654 -261198 -430262 -762346 -602182 -857909 -370318 -445039 -472504 -87859 27693
16322 27693 64443 -55798 -200846 -162847 31980 145044 104799 91903 18845 35105 395181
16311 395181 378863 359759 419855 581335 866720 526639 664945 583298 144451 457992
16301 457992 957247 991531 656116 363817 617415 626110 717882 598136 434454 327717
16291 327717 568149 786865 341026 430395 595370 1124903 995432 1013521 954745 969703
16281 969703 1206019 1220709 1134320 925558 1125727 1179004 1400581 1267893 1037405 1226708
16271 1226708 1275969 1305209 1190836 1599452 1592590 1761450 1710900 1665425 1458589 1543769 1561009
16260 1561009 1356190 1243344 1493961 1740589 1839810 1828925 1660180 1686530 1937240 1850759
16250 1850759 1758013 1891585 1907753 1743683 1978656 2058565 2254744 2134699 2257819 2208738
16240 2208738 2086056 2096761 2183361 2515460 2481264 2682647 2375074 2256412 2303639 2404298
16230 2404298 2426219 1942734 2423017 2663824 2740455 2546585 2205891 1990880 2168581 2314251
16220 2314251 2367521 2320700 2751836 2631897 2715310 2637686 2618281 2755975 2536916 2623086
16210 2623086 2687478 2870769 2532439 2528980 2867665 2349613 3011017 3156254 2772715 3202635
16200 3202635 3048580 2795574 3037275 3173723 2767142 2919493 2718295 2947957 2824317
16191 2824317 3316989 3247044 3035327 3248800 3481516 3511484 3698402 3597488 3522252 3485026
16181 3485026 3530255 3306357 3256609 3477321 3553551 3508257 3619791 3276866 3651900 3370064
16171 3370064 3403082 3714929 3476074 3638120 3464492 3523903 3611043 3522182 3550261 3697643
16161 3697643 3327924 2970064 3124718 3055970 3143132 3108175 3320108 3206136 3556430 3707111
16151 3707111 3451334 4036841 3634700 3113018 3326446 3518748 3702418 3438203 3501428 2894169
16141 2894169 3055679 3167121 3383846 3432870 3289246 3937971 3742842 3663282 3211179 3346743
16131 3346743 3409536 3960274 4044021 3812575 3593876 3515415 3340400 3575696 3795998 3851136
16121 3851136 3467198 3136894 3340931 3622136 3494498 3732489 3676359 3558105 3126697 3008971
16111 3008971 3662154 3819598 3287009 3714806 3730882 3638213 3947478 3950936 3753154 3603260
16101 3603260 3583774 3379747 3526248 3809128 3691483 3807023 3826306 3845791 4017201 3567847
16091 3567847 3721668 3639755 3582104 3808399 3637395 3309041 3323236 3461949 3674104 3463070
16081 3463070 3785459 4220135 3765432 3901450 4156315 3900398 3637978 3655801 3552182 3116459
16071 3116459 3147649 3385729 4120323 4074075 4149179 3723439 3931659 3363953 2945270 3598555
16061 3598555 3493653 3486443 3382703 3693294 3569097 3547873 3795899 3826282 3600081 3805152
16051 3805152 3885278 3625322 3745954 4069122 3521955 3400364 3982933 3970180 3968137 3989423
16041 3989423 3702130 3823828 3944063 3728395 3867275 4019565 3638407 3331793 4087755
16032 4087755 3890180 3616502 3743437 3990225 4285660 4000597 3984153 3772930 3344965 3555377
16022 3555377 3723773 4070799 3865321 3795537 4264226 3995618 3586225 3614424 3943391 3946412
16012 3946412 4066193 4123556 4063541 4132299 3803078 3922638 4125262 3962260 3928690 4098066
16002 4098066 4593159 4463002 4297471 4213011 3961368 4042847 3967462 3620322 3713368 3850551
15992 3850551 3919838 3958814 4103846 3527890 3671498 3962642 3804627 3454325 3649984 3949979
15982 3949979 4187157 4353018 4336980 4269413 3928145 4335402 4684538 4583434 4675512 4531417
15972 4531417 4132390 4060532 4222445 4011275 4223838 4072539 3089029 3530974 4019912 4145277
15962 4145277 3882096 3720660 4076439 3720327 4084301 4340189 4040478 4104029 4351852 4262865
15952 4262865 3981465 3849126 4057933 4623013 4313177 3949349 4135762 4103144 3861375 4227549
15942 4227549 4198753 4039810 3844574 3905620 4410368 4693860 4290127 4413677 4059762 4125364
15932 4125364 4120902 3850829 3919385 4161366 4487988 4112897 4071284 3860400 3940387 3624431
15922 3624431 3760827 3578795 3507793 3340328 3648484 3704520 3563973 3845730 3619059 3625919
15912 3625919 3586195 3784126 3789403 3635625 3577970 3937831 3676866 3469690 3205949 3807304
15902 3807304 4318667 3993205 3705303 3466038 3465125 3655325 2968453 3075922 3758665 4064372
15892 4064372 4213771 4514947 4374379 3815050 3905422 3773972 4251202 3885662 3787733 4056467
15882 4056467 3759731 3753603 3979953 3469788 3476129 3653781 3144482 3579929 4022200 4184551
15872 4184551 4330343 4146294 3981168 4497077 4604222 4340808 3971710 3579043 3727593
15863 3727593 4090088 3992091 3997111 4340992 4137710 3635830 3688243 3937714 3415024 3749368
15853 3749368 3600741 3988292 3811367 3782087 3916234 3790367 3689469 3743507 4150577 3934278
15843 3934278 4029023 4085069 3605901 3473477 3891233 4337297 4478006 4292148 3879348 4264887
15833 4264887 4265444 3927125 3721315 3318571 4245345 4227131 3861019 4449118 4298059 4005730
15823 4005730 4074030 3969629 4072702 3820012 3952832 4284139 4082014 3984853 3601145 3316203
15813 3316203 3571978 3725345 3524470 3721826 3986116 4229830 4270828 4182738 4181572 3811839
15803 3811839 3705947 3319131 3376237 3855494 4052473 3755454 3889856 3758232 3660879 3575236
15793 3575236 3721383 3766271 3886213 4363253 4047925 3510558 3546537 3711871 4479964 4176646
15783 4176646 4124181 4323251 4242052 4007480 3820348 3902865 3788033 3982171 4489331 4592943
15773 4592943 4289597 4295664 4089606 3585661 3585740 3852957 4514279 4232814 3829742 3835294 4011947
15762 4011947 3773306 3548035 3958236 3672172 3767778 3786485 3869571 3665577 3945989 4411533
15752 4411533 4227343 4570292 4646850 4482796 4891225 4465265 4046716 4069870 4359258 3715775
15742 3715775 3887860 4209221 3658139 3541204 3648835 3400814 3352615 3817243 4133910 4160641
15732 4160641 4255088 4008975 4120056 4084452 4558171 4225927 3797778 3859520 4136802 4585381
15722 4585381 4114604 4293692 4505592 3956315 4108831 4549395 4218550 3824460 4119680
15713 4119680 4216754 3849389 3834254 4511685 4212643 3888289 4034299 3909714 4173090 3895995
15703 3895995 3930479 4054443 3948669 4103347 4172545 4296042 4462903 4432693 4324392 4208535
15693 4208535 4094258 4068123 4361345 4303226 3905525 3948296 3916482 3862669 3940119 3747266
15683 3747266 4183286 4499067 4546933 4666726 4355955 4583550 4869076 4412839 4194226 4263671
15673 4263671 4173638 3929549 3998806 3900586 4121686 4142251 4669337 3892184 3648150 4454190
15663 4454190 4699319 4833066 4180069 4341177 4480709 4389829 4533984 4634884 4553836 4409852
15653 4409852 4428221 4364492 4168566 4474644 4416891 4188482 4460326 4858880 4388944 4232416
15643 4232416 4271569 4257512 4097485 4326391 4350510 4243860 4367841 4152358 4142845 4160024
15633 4160024 4448071 4414707 3753497 3683325 4363394 4241123 4442707 4455263 4547267 3927524
15623 3927524 3441962 3601772 3691028 3875642 4123183 4107473 4099722 3942875 3759895 3866566
15613 3866566 4211889 4024536 3652604 3812495 3818340 3792192 3944506 3880391 3719697 3894711
15603 3894711 4092863 4302036 4088856 4478493 4618319 4365198 4586719 4372489 4423973 4089572
15593 4089572 4026584 4274613 4209579 4239433 4266298 4431999 4517234 4782956 4302024 3798425
15583 3798425 3985493 4350265 3997487 3535698 3915031 4278370 4158653 3704301 3965519
15574 3965519 3861228 4471365 4625866 4338941 4120472 4028650 4395972 4361355 3927003 4061956
15564 4061956 4308840 3518811 4295852 4424305 3841941 4056287 3945932 4200414 4274212 4378872
15554 4378872 4294871 3898999 3950430 3891253 4083406 3921578 3547511 3851284 3959625 4082971
15544 4082971 4119038 4324279 4134427 4269392 4352910 3731204 3794190 4080727 4048943 3643524
15534 3643524 3818544 4015880 4628719 4473395 4085512 4253923 4358200 3855237 4018613
15525 4018613 4217698 4411433 4249295 4327357 4313476 4190132 3648128 3768938 4032298 3915338
15515 3915338 3834772 3993541 3929440 3760111 3902131 4240900 4248545 4091071 4108536 4109254 4301881
15504 4301881 3910330 3907960 4024662 4031551 4149364 4010299 4033453 4197667 4112678 4375115
15494 4375115 4537751 4123545 4029945 4299158 4029649 4229103 4173215 4129070 4152850 4223853
15484 4223853 4128905 4190161 4077593 4361060 4182287 4298955 4450079 4222261 4364534 4646157
15474 4646157 4657524 4202336 3993167 4702105 4619949 4639121 4178160 3884717 4506686 4118936
15464 4118936 3897170 3833530 4130929 4265840 4095490 4151384 4255462 4609104 4875356 5035628
15454 5035628 4914562 4496539 4667457 4221882 3765644 3432436 3737504 3840871 4050123
15445 4050123 4214854 4210795 4111694 4106286 4285463 4547616 4129310 3697674 4080062 4342157
15435 4342157 4582052 4445576 4093223 4341098 4364775 4225869 4066852 3879203 4353683 4196648
15425 4196648 4130825 3970911 3648654 3743127 4025356 3934892 4274390 4767324 4946537 4492434
15415 4492434 4093627 4285941 4062210 3702960 3734718 3773146 3867668 4135864 3994451 3902685
15405 3902685 4144301 4121497 4538511 4594139 4098602 4109831 4379937 4286104 4280390 4203750 4852534
15394 4852534 4755280 4503984 3924505 4209417 4521810 4274408 4177536 3919788 4045978 3890534
15384 3890534 3781562 4176730 4174910 4322518 4389453 3941482 4264672 4421442 4872543 4245969
15374 4245969 3829071 4055145 4328639 4013592 4365447 5224659 4523611 4186031 4400457
15365 4400457 4101583 3984289 4042003 4214002 3871321 4278449 4475718 4584522 4570164 3852974
15355 3852974 3916009 3801224 3821716 3891439 3664954 4029705 4383844 3698227 3911562 3845305
15345 3845305 3962499 4321537 4643394 4468944 4531151 4413012 3939797 3618197 3992448 4612993
15335 4612993 4472245 4919795 4626216 4607293 4391734 4375025 4189360 4375814 4308894 4357218
15325 4357218 4114416 4031526 4280138 4519632 4348751 4221169 3983132 3944938 3868712 4069704
15315 4069704 4018691 3978035 4458472 4388314 4127964 3835424 3577906 3606496 3696357 3780345
15305 3780345 4040867 3948372 3829569 3975034 4634106 4750325 4331073 4325149 4326204 4032554
15295 4032554 4272528 4373301 4071387 4135256 4448184 4219966 4485413 4609359 4146250 3240685
15285 3240685 3525048 4255229 4163162 3969332 3955953 3875333 3997586 4071098 4034675 4317700
15275 4317700 4616125 4853669 4553095 4584865 3955879 4055861 4066401 4335336 4509524 4056151
15265 4056151 4687451 4527255 4110443 4325715 4554208 4524982 4510754 4763335 4851021 4771442
15255 4771442 4864675 4671287 4662798 4301673 3504401 3791719 4063854 4085216 4277195 4126133
15245 4126133 4289999 4350605 4547715 4708635 4690720 4607398 4714218 4345264 3982531 4122101
15235 4122101 4059594 3851259 3927528 4405624 4382319 4435848 4463148 4591160 4496900 4260922
15225 4260922 4277103 4507793 4389211 4261994 4669438 4269920 3719062 3684447 4128905 4398986
15215 4398986 4349559 4143964 4180891 4230294 4554043 4285259 4154825 3854622 3694413 4022230
15205 4022230 4279069 4513988 4361139 3955721 4170777 4120390 4056491 3857728 3645102 3534751
15195 3534751 3789699 4203379 4271069 4287958 4688192 4310109 4378684 4145425 3878674 4294326
15185 4294326 4223745 4508317 4309643 3780800 3647701 4440287 4364652 4279687 4279568 4122845
15175 4122845 4055944 4122430 4145344 4094867 4097945 4106732 4281374 4483159 4292446 4065132 4035197
15164 4035197 3825244 4258751 4498737 4650248 4411046 4360514 4737237 4650285 4405773 3847730
15154 3847730 3618177 3871064 4080666 4019084 4021550 3893737 4268709 4202828 3993101 4278823
15144 4278823 4168361 4205670 5006879 4498453 4543005 4412346 4667599 4780927 4608323 4488781
15134 4488781 4564601 4562493 4641758 4868976 4659732 4663571 4740457 4620446 4396352 4833155 4939499
15123 4939499 4519779 4267244 4237431 4135818 4379414 4660839 4713298 4125624 4128271 4593653
15113 4593653 4622540 4564672 3981247 4190510 4302638 3987452 3875924 4107098 4081441 4306526
15103 4306526 4300892 3902544 4022142 4490806 4096228 4064646 4394277 4028908 3940835 4459428
15093 4459428 4870232 4718216 4873038 4473984 4735871 4541152 4197377 4368280 4284677 4075919
15083 4075919 4359017 4736795 4642923 4455066 4748910 4897033 4911613 4618107 4516952 4238427
15073 4238427 4373582 4446343 4593292 5103626 4818361 4722618 4962196 4728969 4650247 4529932
15063 4529932 4002081 3869213 4113430 4314471 4512807 4341666 4310549 4477138 4212090 4106106
15053 4106106 4345114 4896178 4967507 4854075 4903508 4848195 4510577 4357385 4460338 4447010
15043 4447010 4258715 4093403 4162477 4299909 4395368 4522542 4934292 4861157 4711839 4365800
15033 4365800 4423895 4477507 4905423 4966325 4776420 4654376 4706190 4623067 4478594 4331543
15023 4331543 4251513 4280721 4692955 4863783 5125758 5354527 4608171 4420707 4652932 4537782
15013 4537782 4751748 4778008 4542040 4665296 4757366 4377037 4414729 5008672 4810217 5011986
15003 5011986 4933943 4558400 4025857 4432674 4382729 4629240 5033929 4491027 4449852 4285513
14993 4285513 4429599 4733481 4732345 4538263 4101366 4230743 4072990 4087164 4343814 4804414
14983 4804414 4965809 4902194 4836151 4971318 4952700 4578893 4702396 4721267 3905533 4032485
14973 4032485 4260175 3678532 4245886 4338887 4000714 4683458 4934871 4673575 3981827 4323819
14963 4323819 4554183 4713523 4653785 4519274 4702228 4667092 4674818 4638929 4422696 4462235
14953 4462235 5224766 4927470 4263430 4555562 4479895 4176089 4408901 4185718 4239332 4509626
14943 4509626 4639690 4251625 4496307 5058516 5152266 5703079 4367212 4186612 5252132
14934 5252132 5174212 4785109 4780336 4872350 4654248 4537957 4543676 4711405 4929372 5144986
14924 5144986 4453432 4738978 4516225 4537807 3905215 3415798 4216163 4600675 4783962 4901832
14914 4901832 4722375 4630545 4638570 4683431 4600167 4507255 4948945 5333502 4928148 4748877
14904 4748877 4824430 4972276 4642406 4249899 4426289 5254041 5237169 4747793 4151668 4431568
14894 4431568 4422457 4892529 4781381 4651398 5185638 5324755 4812365 4566226 4908411 5199288
14884 5199288 4808740 4663153 4838267 4555281 4761577 4577970 4668286 4054744 4642840 4888357
14874 4888357 4883495 4784150 4759861 4978669 4925764 4868211 4884530 4161726 4197709 4299811 4309998
14863 4309998 4419264 4661279 4932669 5288423 4832496 4915463 4869770 4324160 4249270 5049727
14853 5049727 5359882 4866192 4625510 4338964 4698049 4645159 4846667 4917467 4775528 4653765
14843 4653765 4567325 4467524 4683530 4935795 4993197 5202408 4504474 4226713 4902917 4949110
14833 4949110 4997909 4676171 4220654 3998817 4263964 4636456 4481067 4446957 4629898 4594929
14823 4594929 4413487 4489096 4645293 4548181 4743833 4949474 4703542 4544500 4669931 4448687
14813 4448687 4911816 5124959 4893633 4501328 4770971 5165426 4990031 4884791 4586289
14804 4586289 4710049 4843464 4938217 4723550 4629905 4615256 4883720 5340747 4897126 4559683
14794 4559683 5021991 4728674 4673858 4751197 4547451 4440673 4646503 4438196 4268670 4491635
14784 4491635 4783167 4640387 4768804 4572704 4346121 4344646 4082636 3721193 3683803 4413230
14774 4413230 4110610 4251736 4069186 3525265 3781579 4480241 4246319 3876977 3731632
14765 3731632 3988017 3768230 3864621 4443589 4544811 4595524 4458870 4468422 4300884 4401534
14755 4401534 4585051 4650309 4315787 4655236 4505818 4614408 4883707 4958193 5390394 5144133
14745 5144133 4973345 4707252 4815847 4516383 4448796 4639972 4702774 4806074 4872757 4965361
14735 4965361 5082336 4900016 4921681 4823113 4539718 4877998 4479991 4732880 4707475 4540801
14725 4540801 4999525 5008985 5307579 5295072 5205481 4992133 4769700 4643401 5072593 5002123
14715 5002123 5290916 5177383 4744915 5163447 4740445 4916639 5210221 4710650 4762577 5045826
14705 5045826 5162899 4879756 4734515 4859408 4867756 5038076 5063408 4903927 4827171 4396519
14695 4396519 4293637 4310046 4320303 4610742 4933647 5356322 5105132 4652424 4325797 4264847
14685 4264847 4255008 4214387 4277661 4421729 4606762 4699361 4306813 4792234 4858816 4700698
14675 4700698 4869976 4989156 4686572 4174324 4135752 4634665 4187344 4253181 4788468 4666307
14665 4666307 5085874 4387248 4183552 4369001 4516314 4537501 4931195 4778121 4826374 4808160
14655 4808160 4550117 4869347 5086371 5304869 4365171 4006428 4183786 4361774 4521989
14646 4521989 4269828 4648310 4765218 4208903 4539740 4726782 4284307 4445481 4503534 4229803
14636 4229803 4360082 4242154 4422518 4582115 4392725 4475329 4744976 4422774 4730853 4712758
14626 4712758 4431639 4882423 4709303 4867802 4973904 5103495 5162573 5114231 5046575 4624541
14616 4624541 4384149 4284758 4608598 4752425 4820217 5108495 4979705 4340630 4537090 4290188
14606 4290188 4411597 4771468 4803200 4744155 5093880 5560591 5334991 4974836 5065814 4860573
14596 4860573 4450624 4911029 4413235 4276959 4463306 4806861 4640000 4429000 4528689 4841739
14586 4841739 4826757 4862188 4724579 5089496 5343156 5330874 5626998 5414672 5353052 4944544
14576 4944544 4877966 4550716 4591098 4902492 4830020 4413568 4605285 4682975 4542989 4613680
14566 4613680 4324165 4197436 4049162 4121535 4557992 4740359 4767328 4912863 5367396 5720945
14556 5720945 4901071 4579629 4203678 4500849 5011534 4970697 4785143 4797446 4335452 4616743
14546 4616743 4326202 3983773 4521762 5190921 4892022 4748072 5039835 4856801 5038958
14537 5038958 4970444 4352330 4265347 4714998 4363812 4896851 4860078 4675342 4402753 4881658
14527 4881658 4995658 5219617 5346647 5270297 4907510 4332164 4283970 4622386 4636480 4619338
14517 4619338 4898249 5177842 4916738 5064151 5302781 4974484 5070091 5069367 5232745 4934390
14507 4934390 5029840 4737070 4764764 4625655 4654342 4487331 4448092 4942298 5457732 5596469
14497 5596469 5290947 5320406 5106628 5446998 4929518 4656887 4591110 4568721 5143840 5135191
14487 5135191 5103194 5092834 4507203 3978312 4390656 4518005 4637819 4573208 4703409 4917361
14477 4917361 5370822 4971389 4765237 4848710 5058760 4713232 4745559 5265158 4727723 4067432
14467 4067432 4474310 4557347 4372705 4881287 4954031 5078718 4802101 4896369 4676592 4742444
14457 4742444 4389153 4689378 4504521 4467554 4584696 4570337 4555642 4300989 4253452 4292580
14447 4292580 4422642 4739830 4865784 4839286 4799778 5133398 5126588 4656027 5079059 5372563
14437 5372563 5115943 5439026 5259198 4741335 4475837 4569863 4733061 5065535 5183165 4999442
14427 4999442 4939301 4955680 4450083 3715758 4084495 4374778 4436666 4657736 4695183 4663882
14417 4663882 4768937 5029346 4812031 4999297 5141489 5136864 4849427 4278879 4594432 4668445
14407 4668445 4917835 4634573 4808485 5062675 4727172 5320056 5493727 5067298 5339488
14398 5339488 5373876 5316999 5174335 5475856 5330081 5149025 5024033 5810693 5472739 5109594
14388 5109594 5258954 4968562 4460666 4687315 4617042 4819818 4548034 5007342 5214316 4883429
14378 4883429 4408490 4321812 4547597 4753050 5269181 5127786 5579942 5714112 5809229 5205043
14368 5205043 5340558 4959792 5020151 5168026 5277608 5135525 4970765 4935742 5056839 5023909
14358 5023909 5117344 5196607 4954248 4738547 4734418 5160999 5182358 5052215 4877917 4675743
14348 4675743 4733512 4939774 4807057 4849109 4860239 5059222 5116692 4802208 5411763 5296730
14338 5296730 5151777 4711073 4561164 5067463 4949981 4800603 5140212 5242070 5146081 4717319
14328 4717319 4937541 5225118 4922768 4883627 5421519 5093139 4804953 5019687 4759640 5231657
14318 5231657 5232372 5096620 4666699 4682005 5066652 5036112 5206144 5150524 4913426 4956963 5294815
14307 5294815 5054261 4759876 4972883 4534137 4996656 5954444 5720326 4712612 4844231
14298 4844231 5048359 5296467 5433888 4971713 4804127 4555540 4782685 5006661 4903047
14289 4903047 5291807 5097451 4740586 5016525 5159881 5021272 4957642 4954555 4864645 4912942
14279 4912942 4901930 5281218 4730827 4376209 4737548 5086660 4964086 4912477 5160507 5307419
14269 5307419 5169895 5346198 5066193 5460723 5228986 5139830 5067355 5033484 5031977 4829487
14259 4829487 5048035 4967838 5256933 5230654 5373644 5227140 5400077 5314279 5159942 5023135
14249 5023135 4825098 5140443 5652478 5499620 5027147 5309461 5718819 5100468 5065677 5193984
14239 5193984 5339099 5417444 5580587 5625158 5270800 5037709 5059288 4954437 5439158 5829962
14229 5829962 5472203 5722083 5907655 5237246 5516037 5600703 5050744 4893165 5120589 5237010
14219 5237010 5400462 5302540 5153646 5204704 5028551 4860801 4916156 4731022 4499391 4876522
14209 4876522 5333996 5625013 5764480 5284154 5377974 5142513 4675280 5027609 5052431 5220418
14199 5220418 5163001 4965063 4757543 5067720 4825866 4334380 4464418 4763277 4625811 4780961
14189 4780961 4795461 5011280 5444647 5238178 5165970 5117216 5270192 5329653 5244683 4755201
14179 4755201 5096694 5053914 5362414 5380490 4903458 5340930 5583836 5535634 5056939 5045812
14169 5045812 5064674 4935181 5411782 5670702 5546437 5196422 5016585 5742741 5110073 5009619
14159 5009619 4948564 4511838 4730773 5095961 5384298 4702837 4813072 5311704 5386667 4722640
14149 4722640 4666005 5073118 4977880 4553787 4756804 4875310 5048897 5069474 5323819 5279551
14139 5279551 4889683 5045326 4759926 5060314 4953361 4956840 5259586 5296771 5165871 5525340
14129 5525340 5157075 5429463 5082079 4937173 5303348 5561767 5278378 5156082 4956679
14120 4956679 5362828 5676531 5326329 5119920 5252430 4929735 4887344 5240578 4689115 4441844
14110 4441844 4561054 5384218 5199906 4789945 4716599 5209905 5413381 5270712 5192020 5447294
14100 5447294 5642694 5628457 5570880 5402872 5575805 5102526 4988507 5082374 4805089 5128425
14090 5128425 5134749 4817499 4659664 4920630 5195651 5543457 5721281 5318549 5095779 4672207
14080 4672207 5064378 5320915 5246108 4977418 5116544 5183148 5597152 5683593 5338679 5733566
14070 5733566 5408201 5052176 5052139 5233034 5611342 5582058 5153440 4949099 5146730 5233293
14060 5233293 5256250 4733509 4723548 4350222 4687055 5427041 4916463 5258400 5558003 5794213
14050 5794213 5859823 5695660 5631319 5295524 4701182 4598176 4806688 5352151 5305247 5385718
14040 5385718 5399147 5335324 5946386 6076629 5110749 5092203 5308584 5264600 5148005 5400028
14030 5400028 5710716 5484297 4994310 5391399 5337740 5323962 4767453 5044793 5002474 4982739
14020 4982739 4913437 4613197 4586187 4667952 5071267 4795872 5052146 5522346 5647439 5136199
14010 5136199 5318009 5324419 4943275 4936952 4474596 4560315 4869492 5226617 5267884 4990576
14000 4990576 5226530 5740675 5547323 5518579 5239403 5277873 5754684 5204960 4888039 5725669
13990 5725669 6106849 5481084 5753639 5615708 5461861 5135456 4598005 5484595 5352643
13981 5352643 5000431 5053159 5355515 5276774 5317668 5168343 5243167 5276448 4761780 5076499
13971 5076499 5750451 5766800 5536535 5600700 5409147 5554943 5372784 5810093 5678846 5125016
13961 5125016 5329419 5046631 5265269 5694071 5304837 5946195 5868743 5301132 4977224 5459324
13951 5459324 5663089 6055549 5542158 5504068 5752710 5531463 5480788 5820630 5409121 5371925
13941 5371925 5409039 5520224 5663410 5967553 5731012 5952685 6051307 5876705 5380765 5240890
13931 5240890 4872200 4852647 5369685 5491386 5446602 5469021 5271638 5255931 5329009 4820867
13921 4820867 4898217 5505933 5252679 5700106 5681089 5369661 5493098 5674347 5554193 5596793
13911 5596793 6035448 5602126 5612218 5718176 5897934 5118286 5100012 5634120 5582485 5727042
13901 5727042 5618154 5380546 5256730 5302717 5506026 5263409 5433647 5486381 5733688 5760194
13891 5760194 6023987 5948170 5947127 5937892 5908059 5567760 5314475 5736325 5812541 5757349 5874088
13880 5874088 5893168 5706655 5132435 4973603 4985831 5731532 6416977 6171945 5666137 6085962
13870 6085962 5709328 5247475 5468278 5801255 6112167 6137148 5458195 5531869 5493503 5182985
13860 5182985 4832007 5040866 5344858 5747186 5456655 5789539 5742753 5095591 4704391 5531169
13850 5531169 5857377 5524886 5858945 6074094 5980936 6078525 6263546 6074781 5915639 5909573
13840 5909573 5339658 5268323 5526038 5459657 5894325 5729832 5717628 5530056 5906486 5894165
13830 5894165 5927024 5906997 5049866 5445515 5784456 5569596 5987022 5409172 5560535 5518708
13820 5518708 5484603 5752748 6050947 6009925 5801204 5900444 5851109 5655808 5626506 5671063
13810 5671063 5884970 5953666 5504247 4975092 5140992 5397978 5130155 5156854 5432806 5238886
13800 5238886 5390540 5481389 5333677 5543386 5580101 5662886 5574081 5403343 5225549 5432147
13790 5432147 5217705 5786600 6072202 5955184 5738193 5280931 5567033 5695121 5445958
13781 5445958 5553765 5723016 5428235 5895180 5434458 5636265 5926166 5989903 5378220 5629744
13771 5629744 5878983 6000022 5901229 5867138 5348460 5518850 5936958 5655583 5745565 5626543
13761 5626543 5631742 5685303 5744562 6122142 6436347 6122995 6001141 5903731 5900040 5677653 6081413
13750 6081413 6156107 6127258 5817284 5942543 6213790 5977406 6367236 5856384 5493240 5958468
13740 5958468 5729169 5489444 5229987 5514878 5575843 5482155 5942601 5788284 5749289 5678225
13730 5678225 5975411 6137060 5627106 5248316 5208281 5484295 5603467 6306028 6014867 5873472
13720 5873472 6384331 6654283 6171939 6328359 6583215 6211854 5617151 5213469 5541142
13711 5541142 5920319 6037964 6319583 6305241 5821428 5922252 6112935 5830289 5627323 5540557
13701 5540557 5181503 5816934 6173087 5736565 5466415 5997651 6263332 6465750 6415859 6415813
13691 6415813 5988453 6163675 6043716 6140739 6111293 5986119 5844765 5743009 5910502 5759984
13681 5759984 6263443 6181005 6006128 6129019 6232399 6065483 5949084 6395046 6522652 6074423
13671 6074423 6543112 6618222 6049683 5995199 6286382 6743237 6506692 6179222 6615273 6172344
13661 6172344 6383426 6375132 6339042 6592704 6518513 6515607 6273059 5750167 5773799 5772664 5917608
13650 5917608 6052646 5933631 5854509 5870614 6300138 6326851 5909019 6159701 6124204 6164738
13640 6164738 6130047 6296802 6664806 6715175 6371851 6156136 6288754 5809111 5751775 5923345
13630 5923345 6191958 6262275 6003503 5967982 6058074 6076216 6050829 6252071 6022668 5647685
13620 5647685 5354706 5776184 5955204 6042048 5567915 5588029 5922015 6101761 5839428 5998630
13610 5998630 6451390 6233878 6360831 6163478 6396631 6477821 6429402 6009518 5850333 6306422
13600 6306422 5890377 6046039 6084399 5715462 6022199 6059541 6194267 6245339 6557057 6811032
13590 6811032 7003417 6859689 6200403 6004770 6587702 6611959 6684288 6598317 6570385 6647189
13580 6647189 6564233 6304542 6134027 6165919 6337789 6181206 5934381 5587096 6276894 6309887
13570 6309887 6440728 6494128 5677626 5923913 6075124 6441069 6625039 6095179 6213878 6332450
13560 6332450 6274941 5999625 5920858 6359700 6435976 6306962 5853095 5972326 6233249 6280082
13550 6280082 6112345 6081902 6275574 6520825 6921464 6535214 6422404 6355048 6861701 6391611
13540 6391611 6373390 6523100 6130185 6045497 6041118 6518191 6508193 6839713 6900367 6719001 6740092
13529 6740092 6589454 6181830 6141129 6314364 6728297 6739888 6242842 6209952 6419019 6722378
13519 6722378 7076810 7076618 7362822 7039024 6979179 6838533 6739333 6668734 6486892 6548079 6258336
13508 6258336 6054467 6326183 6942971 6793564 6479744 6106807 6108996 5974525 5830371 5490512
13498 5490512 6014664 6368577 5910257 6068376 5978958 6149597 6058887 6472158 6833999 6246252
13488 6246252 6261840 6409481 6944304 6834783 6802025 6684394 6183695 5830957 5575514 6055028
13478 6055028 6605956 6623276 6560976 6671470 6852092 7284094 6987253 6518488 6116998 6256599
13468 6256599 6424435 6578341 6297344 6410894 6479626 6222134 6004347 6246310 6484520 6496481
13458 6496481 6302616 6819581 6976534 6443076 6497091 6614429 6737958 6791100 6169968 6258387
13448 6258387 6219701 6115866 6593725 6725637 6722643 6888487 6995337 6669271 6676871 6445203
13438 6445203 6413273 6777754 6483624 6721422 6730017 6378521 6470667 6594851 6672006 6425700
13428 6425700 6365378 6634509 7083343 6932692 6222360 5780696 6263152 6476063 6330299 6591876
13418 6591876 6299925 6337818 6747896 6521189 6542130 6617201 7054680 7303692 7218800 7046891
13408 7046891 7019285 6602460 6177406 6448758 6935079 6943773 7086429 7089105 6910227 6999044
13398 6999044 6509692 6771496 7097755 7251860 7350990 7135986 6711141 7080478 7062800 6489798
13388 6489798 6137075 6747885 6994969 6947118 7100075 6680923 6688402 6957112 6881782 6573202
13378 6573202 7168367 6861373 6451882 7118037 7143733 6950227 7192206 7330461 7499940 7631597
13368 7631597 7694856 7600456 7174809 7120148 7145265 7110879 7426071 6772342 6875212 6594203
$$ [...]
##END NTUPLES=NMR SPECTRUM
##END=
