##TITLE=1H_CA-9160-3
 CDCl3
 8 sc, 
 13.6.2023
##JCAMPDX= 6.0         $$ Bruker NMR JCAMP-DX V2.0
##DATA TYPE= NMR SPECTRUM
##DATA CLASS= NTUPLES
##ORIGIN= UXNMR, Bruker Analytische Messtechnik GmbH
##OWNER= root
$$ XWIN-NMR		Version 3.5
$$ Tue Jun 13 14:02:46 2023 Russian Standard Time (UT+4h)  she@DPX200
##.OBSERVE FREQUENCY= 200.13135
##.OBSERVE NUCLEUS= ^1H
##.ACQUISITION MODE= SIMULTANEOUS
##.ACQUISITION SCHEME= undefined
##.AVERAGES= 8
##.DIGITISER RES= 18
##SPECTROMETER/DATA SYSTEM= spect
##.PULSE SEQUENCE= zg30
##.SOLVENT NAME= CDCl3
##.SHIFT REFERENCE= (INTERNAL, CDCl3, 0, 15.7193)
##AUDIT TRAIL= $$ (NUMBER, WHEN, WHO, WHERE, WHAT)
$$ ##TITLE= Audit trail, XWIN-NMR		Version 3.5
$$ ##JCAMPDX= 5.01
$$ ##ORIGIN= Bruker BioSpin GmbH
$$ ##OWNER= she
$$ F:/spectra/data/she/nmr/H-F/1/pdata/1/auditp.txt
$$ ##AUDIT TRAIL=  $$ (NUMBER, WHEN, WHO, WHERE, WHAT)
(   1,<2023-06-13 14:01:34.90 +0400>,<she>,<DPX200>,
      <created by zg, POWCHK disabled, PULCHK disabled
       configuration hash MD5:
       00 E9 B6 7A A2 85 ED C7 34 08 36 98 17 FE 4E 26
       data hash MD5: 16K
       C4 B2 C8 59 16 8D 78 C1 C6 31 24 60 A9 27 11 25>)
(   2,<2023-06-13 14:01:37.17 +0400>,<she>,<DPX200>,
      <Start of raw data processing
       efp BC_mod = 2 LB = 0.24 FT_mod = 6 PKNL = 1 PHC0 = -20340.64 PHC1 = 9.85272 SI = 16K 
       data hash MD5: 16K
       ED 8F 55 3E F4 A6 7B CD 36 16 E2 90 8F 15 BE F4>)
(   3,<2023-06-13 14:01:56.64 +0400>,<she>,<DPX200>,
      <pk PHC0 = -3.659136 PHC1 = 3.8 
       data hash MD5: 16K
       8C 5C F9 27 E8 9F 4F A4 90 1E 7D 95 C8 CA E9 98>)
(   4,<2023-06-13 14:02:00.07 +0400>,<she>,<DPX200>,
      <abs ABSG = 5 
       data hash MD5: 16K
       69 56 74 0F FA ED DA B9 13 E5 86 67 FC 98 CD 74>)
$$ ##END=
$$ 
$$ hash MD5
$$ C3 A9 9B 4E 12 17 E6 00 86 F0 BC 9C 95 10 C7 20
##$RELAX= 
##$RELAX= 
##$RELAX= 
##$RELAX= 
##$RELAX= 
##$RELAX= 
$$ Bruker specific parameters
$$ --------------------------
##$DU= <F:/spectra>
##$EXPNO= 1
##$NAME= <H-F>
##$PROCNO= 1
##$TYPE= <nmr>
##$USER= <she>
##$AMP= (0..31)
100 100 100 100 100 100 100 100 100 100 100 100 100 100 100 100 100 100 
100 100 100 100 100 100 100 100 100 100 100 100 100 100 
##$AQSEQ= 0
##$AQ_mod= 1
##$AUNM= <au_zg>
##$AUTOPOS= <>
##$BF1= 200.13
##$BF2= 200.13
##$BF3= 200.13
##$BF4= 200.13
##$BF5= 200.13
##$BF6= 200.13
##$BF7= 200.13
##$BF8= 200.13
##$BYTORDA= 1
##$CFDGTYP= 0
##$CFRGTYP= 5
##$CHEMSTR= <none>
##$CNST= (0..31)
1 1 145 1 1 1 1 1 1 1 1 1 1 1 1 1 1 1 1 1 1 1 1 1 1 1 1 1 1 1 1 1 
##$CPDPRG= <>
##$CPDPRG1= <>
##$CPDPRG2= <>
##$CPDPRG3= <>
##$CPDPRG4= <mlev>
##$CPDPRG5= <mlev>
##$CPDPRG6= <mlev>
##$CPDPRG7= <mlev>
##$CPDPRG8= <mlev>
##$CPDPRGB= <>
##$CPDPRGT= <>
##$D= (0..31)
0 1.2 0 0 0 0 0 0 0 0.06 0 0.03 0 0 0 0 0.0002 0 0 0 0 0 0 0 0 0 0 0 0 
0 0 0 
##$DATE= 1686650494
##$DBL= (0..7)
120 120 120 120 120 120 120 120 
##$DBP= (0..7)
150 150 150 150 150 150 150 150 
##$DBP07= 0
##$DBPNAM0= <>
##$DBPNAM1= <>
##$DBPNAM2= <>
##$DBPNAM3= <>
##$DBPNAM4= <>
$$ [...]
##$SUBNAM3= <"">
##$SUBNAM4= <"">
##$SUBNAM5= <"">
##$SUBNAM6= <"">
##$SUBNAM7= <"">
##$SUBNAM8= <"">
##$SUBNAM9= <"">
##$SW= 18.05172834244
##$SWIBOX= (0..15)
0 0 2 0 0 0 0 0 0 0 0 0 0 0 0 0 
##$SW_h= 3612.71676300578
##$TD= 16384
##$TD0= 1
##$TE= 0
##$TE2= 300
##$TE3= 300
##$TEG= 300
##$TL= (0..7)
0 120 120 120 120 120 120 120 
##$TP= (0..7)
150 150 150 150 150 150 150 150 
##$TP07= 0
##$TPNAME0= <>
##$TPNAME1= <>
##$TPNAME2= <>
##$TPNAME3= <>
##$TPNAME4= <>
##$TPNAME5= <>
##$TPNAME6= <>
##$TPNAME7= <>
##$TPOAL= (0..7)
0.5 0.5 0.5 0.5 0.5 0.5 0.5 0.5 
##$TPOFFS= (0..7)
0 0 0 0 0 0 0 0 
##$TUNHIN= 0
##$TUNHOUT= 0
##$TUNXOUT= 0
##$USERA1= <user>
##$USERA2= <user>
##$USERA3= <user>
##$USERA4= <user>
##$USERA5= <user>
##$V9= 5
##$VALIST= <valist>
##$VCLIST= <CCCCCCCCCCCCCCC>
##$VD= 0
##$VDLIST= <DDDDDDDDDDDDDDD>
##$VPLIST= <PPPPPPPPPPPPPPP>
##$VTLIST= <TTTTTTTTTTTTTTT>
##$WBST= 1024
##$WBSW= 4
##$XGAIN= (0..3)
0 0 0 0 
##$XL= 0
##$YL= 0
##$YMAX_a= 10528
##$YMIN_a= -9402
##$ZGOPTNS= <>
##$ZL1= 120
##$ZL2= 120
##$ZL3= 120
##$ZL4= 120
##$ABSF1= 15.6301
##$ABSF2= -2.421747
##$ABSG= 5
##$ABSL= 3
##$ALPHA= 0
##$AQORDER= 0
##$ASSFAC= 0
##$ASSFACI= 0
##$ASSFACX= 0
##$ASSWID= 0
##$AUNMP= <proc_1d>
##$AZFE= 0.1
##$AZFW= 0.1
##$BCFW= 0
##$BC_mod= 2
##$BYTORDP= 0
##$COROFFS= 0
##$CY= -3
##$DATMOD= 1
##$DC= 0
##$DFILT= <>
##$DTYPP= 0
##$F1P= 0
##$F2P= 0
##$FCOR= 1
##$FTSIZE= 16384
##$FT_mod= 6
##$GAMMA= 0
##$GB= 0
##$INTBC= 1
##$INTSCL= 3.70164e-10
##$ISEN= 128
##$LB= 0.24
##$LEV0= 0
##$LPBIN= 0
##$MAXI= 10000
##$MC2= 0
##$MEAN= 0
##$ME_mod= 0
##$MI= 1.114404
##$NCOEF= 0
##$NC_proc= -12
##$NLEV= 6
##$NOISF1= 3.799351
##$NOISF2= 2.8
##$NSP= 0
##$NTH_PI= 0
##$NZP= 0
##$OFFSET= 15.71934
##$PC= 1
##$PHC0= -20344.3
##$PHC1= 13.65272
##$PH_mod= 1
##$PKNL= yes
##$PPARMOD= 0
##$PSCAL= 0
##$PSIGN= 0
##$REVERSE= no
##$SF= 200.130010445729
##$SI= 16384
##$SIGF1= 3
##$SIGF2= 2
##$SINO= 5.538805
##$SIOLD= 16384
##$SREGLST= <1H.CDCl3>
##$SSB= 0
##$STSI= 16384
##$STSR= 0
##$SW_p= 3612.71676300578
##$SYMM= 0
##$S_DEV= 0
##$TDeff= 16384
##$TDoff= 0
##$TI= <>
##$TILT= no
##$TM1= 0
##$TM2= 0
##$TOPLEV= 0
##$USERP1= <user>
##$USERP2= <user>
##$USERP3= <user>
##$USERP4= <user>
##$USERP5= <user>
##$WDW= 1
##$XDIM= 16384
##$YMAX_p= 376852703
##$YMIN_p= -14195944
$$ End of Bruker specific parameters
$$ ---------------------------------
##NTUPLES= NMR SPECTRUM
##VAR_NAME=  FREQUENCY,     SPECTRUM/REAL,   SPECTRUM/IMAG
##SYMBOL=    X,             R,               I
##VAR_TYPE=  INDEPENDENT,   DEPENDENT,       DEPENDENT
##VAR_FORM=  AFFN,          ASDF,            ASDF
##VAR_DIM=   16384,         16384,           16384
##UNITS=     HZ,            ARBITRARY UNITS, ARBITRARY UNITS
##FACTOR=    0.220516191357247, 1,           1
##FIRST=     3145.91174332251, 0,            0
##LAST=      -466.805019683268, 0,           0
##MIN=       -466.805019683268, -14195944,   0
##MAX=       3145.91174332251, 376852703,    0
$$ Real data points
##PAGE= N=1
##DATA TABLE= (X++(R..R)), XYDATA
$$ [...]
$$ plain form
7170 -170066 -517069 -213858 -17778 -180889 -274313 -340295 -30955 879 -414749 -864141
7160 -864141 -482329 52173 300580 497188 506233 362332 321749 -123562 218760 -36163
7150 -36163 -156973 -430192 -278760 45966 -316443 -540548 -266736 -263277 -529144 -575499
7140 -575499 -546984 207872 652955 267339 -48964 -264200 27731 245865 -261984 -731337
7130 -731337 -270366 -204619 -294405 -253893 39773 -249436 -30583 186850 -67431 143421
7120 143421 -82330 -431591 -359453 -319979 -171547 49143 -272874 -216793 -64297 457591
7110 457591 332786 101535 -249061 60630 -10631 -254535 -424646 139762 -151475 44106
7100 44106 -180609 -402099 -472612 -288949 -480625 -148308 -99856 7278 25430 304975
$$ packed form
7170a70066l47003L03211J96080j63111r3424o5982L09340L1834m15628m49392
7160h64141L81812N34502K48407J96608R045j43901m0583m45311L42322k54923
7150c6163j20810k73219J51432L24726l62409k24105K73812L459k65867m6355
7140e75499K8515P54856M45083l85616l16303k15236K91931K18134n07849m69353
7130g31337M60971O5747q9786M0512K93666k89209K18853K17433k54281K10852
7120A43421k25751l49261P2138L9474J48432K20690l22017N6081J52496N21888
7110D57591j24805k31251l50596L09691p1261k43904j70111N64408k91237J95581
7100D4106k24715k21490p0513J83663j91676L32317M8452J07134J8152K79545
$$ plain form
7090 304975 403618 318390 363329 -24268 150158 215807 202171 46714 -113343 -517960 16065
7079 16065 220595 27740 -379217 -253497 112003 -120140 -238017 18209 394834 369994
7069 369994 337266 314743 212804 -232059 283373 -238776 -608276 -696893 -501991 -1425383
7059 -1425383 -817359 1764496 1131462 1422709 709967 661903 676571 416155 448655 337861
7049 337861 241957 224375 288077 316444 501306 677310 722440 417036 174956 69060 78892
7038 78892 292420 321283 241424 -4273 90223 239680 143282 355127 134977 472681 483352
7027 483352 442097 507431 131971 93239 204055 294074 446516 759741 603740 325093
7017 325093 489907 344490 710893 636708 637241 459559 895066 823361 864654 899596 698256
$$ packed form
7090C04975R8643q5228M4939l87597J74426O5649j3636j55457j60057m04617N34025
7079A6065K04530j92855m06957J25720L65500k32143j17877K56226L76625k4840
7069C69994l2728k2523j01939m44863N15432n22149l69500q8617J94902r23392
7059a425383O08024K581855o33034K91247p12742m8064J4668k60416L2500j10794
7049C37861r5904j7582O3702K8367J84862J76004M5130l05404k42080j05896R832
7038G8892K13528K8863p9859k45697R4496J49457r6398K11845k20150L37704J0671
7027D83352m1255O5334l75460l8732J10816R0019J52442L13225j56001k78647
7017C25093J64814j45417L66403p4185N33j77682M35507p1705M1293L4942k01340
$$ plain form
7006 698256 721493 362283 462860 271545 500278 736093 861026 474770 394074 686357
6996 686357 1003037 1032477 904919 924756 818158 835130 798524 1257013 1556533 1320919
6986 1320919 1557207 1372806 1580869 1658494 1498630 1357175 1679937 1545794 1596062 1433549
6976 1433549 1339246 1346962 1327362 1564186 1803314 1713243 1704920 1842013 1632638 1484736 1580950
6965 1580950 1890877 1925604 2201859 2353202 2273525 2178022 2783776 2791636 2732974 2975048 3339503
6954 3339503 3510940 3577567 3281008 3426966 3722812 3403920 3252982 3528160 3846699 3889135
6944 3889135 3907714 3904643 4286202 4723586 4602811 4915870 5147203 5711790 5999692 6467561
6934 6467561 6622397 6862881 7404421 7980226 8908808 9729707 10275644 10958213 12044243
$$ packed form
7006F98256K3237l59210J00577j91315K28733K35815J24933l86256q0696K92283
6996F86357L16680K9440j27558J9837j06598J6972l6606M58489K99520k35614
6986A320919K36288j84401K08063P7625j59864j41455L22762j34143N0268j62513
6976A433549r4303P716j9600K36824K39128r0071q323J37093k09375j47902R6214
6965A580950L09927L4727K76255J51343p9677r5503O05754P860n8662K42074L64455
6954C339503J71437O6627k96559J45958K95846l18892j50938K75178L18539M2436
6944C889135J8579l071L81559M37384j20775L13059K31333N64587K87902M67869
6934F467561J54836K40484N41540N75805R28582Q20899N45937O82569J086030
$$ plain form
6925 12044243 12943017 13709715 15236686 17056546 19453472 21875383 24880555 29253972
6917 29253972 35680551 44691564 55824929 67444650 68548536 56155766 41398334 31295392
6909 31295392 24341512 19539063 15662228 13367579 11921912 10519793 9355428 8336216
6901 8336216 7094050 6672537 6306442 6207693 5645991 5053706 4803622 4519959 4138085 4325694
6891 4325694 4512554 4122317 3747884 3488639 3420835 3148756 2685279 2901227 2597257 1827549
6881 1827549 2066364 2145007 1746975 1976491 2188134 1911422 2113257 1983759 1955822 1825652
6871 1825652 1839048 1890273 2023395 1925357 1692402 2022030 2039764 1718995 1931983 1869920
6861 1869920 1130765 1256326 1342596 1011656 1329779 1204916 1001899 1266732 1164915 1416218
$$ packed form
6925A2044243Q98774P66698J526971J819860K396926K421911L005172M373417
6917B9253972O426579R011013J1133365J1619721J103886j2392770j4757432j0102942
6909C1295392o953880m802449l876835k294649j445667j402119j164365j019212
6901H336216j242166m21513l66095r8749n61702n92285k50084k83663l81874J87609
6891D325694J86860l90237l74433k59245o7804k72079m63477K15948l03970p69708
6881A827549K38815P8643l98032K29516K11643k76712K01835j29498k7937j30170
6871A825652J3396N1225J33122r8038k32955L29628J7734l20769K12988o2063
6861A869920p39155J25561Q6270l30940L18123j24863k03017K64833j01817K51303
$$ plain form
6851 1416218 1632316 1493914 1235549 1165587 1364995 1557373 1234083 923606 1160583 814625
6841 814625 405635 617694 648805 1019581 1339305 1483003 1387519 1302884 916706 570601
6831 570601 691802 615110 847849 669425 1060576 721580 365444 632433 541419 466612
6821 466612 709809 1243808 1258205 549801 395654 752977 898289 633981 409728 207923
6811 207923 440701 761476 691694 857939 894305 735021 603437 595288 368836 193411
6801 193411 394338 52252 222373 393665 659689 550969 340420 444447 420349 548224
6791 548224 683750 675818 442327 577617 435437 474780 315771 54196 305104 783474
6781 783474 1089591 763476 555823 344448 163789 586283 861952 568931 649013 518001
$$ packed form
6851A416218K16098j38402k58365o9962J99408J92378l23290l10477K36977l45958
6841H14625m08990K12059L1111L70776L19724J43698r5484q4635l86178l46105
6831E70601J21201p6692K32739j78424L91151l38996l56136K66989r1014p4807
6821D66612K43197N33999J4397p08404j54147L57323J45312k64308k24253k01805
6811B07923K32778L20775o9782J66245L6366j59284j31584q149k26452j75425
6801A93411K00927l42086J70121J71292K66024j08720k10549J04027k4098J27875
6791E48224J35526p932k33491J35290j42180L9343j59009k61575K50908M78370
6781G83474L06117l26115k07653k11375j80659M22494K75669k93021Q0082j31012
$$ plain form
6771 518001 237904 549050 822299 655813 589122 679834 941610 647036 498412 736091
6761 736091 1282537 861713 262005 4398 366327 548634 430282 477849 387058 471550
6751 471550 759120 454771 125036 266413 497368 643435 270143 56880 352711 281789
6741 281789 601817 1102967 826568 739217 776291 609559 419026 265824 223203 472938
6731 472938 256254 454892 126202 350347 423018 208706 -20478 150507 374133 139326
6721 139326 -199414 -7688 -267927 -22183 443120 567469 337170 133521 276506 -24309
6711 -24309 11457 28648 204952 9585 152400 217115 344004 156589 170894 72156 -31288
6700 -31288 436516 343748 409442 429465 629251 516321 597442 776676 549648 236691 220059
$$ packed form
6771E18001k80097L11146K73249j66486o6691R0712K61776k94574j48624K37679
6761G36091N46446m20824n99708k57607L61929J82307j18352M7567r0791Q4492
6751D71550K87570l04349l29735J41377K30955J46067l73292k13263K95831p0922
6741B81789L20028N01150k76399q7351L7074j66732j90533j53202m2621K49735
6731D72938k16684J98638l28690K24145P2671k14312k29184J70985K23626k34807
6721A39326l38740J91726k60239K45744M65303J24349k30299k03649J42985l00815
6711b4309L5766J7191J76304j95367J42815O4715J26889j87415J4305r8738j03444
6700c1288M67804r2768O5694K0023J99786j12930Q1121J79234k27028l12957j6632
$$ plain form
6689 220059 88112 129993 502728 354527 284089 240919 35038 298307 343634 319405 343284
6678 343284 485846 609162 738228 852430 798848 569401 408493 -118327 -81789 239486
6668 239486 166584 140527 -181247 237988 201782 83218 489595 569636 311334 256761 124099
6657 124099 53691 135708 30724 562198 471432 371101 419231 647971 647812 581636 172626
6646 172626 48871 -152350 -146019 -25706 -242787 -417274 -300021 -250060 -266293 -93570
6636 -93570 203309 57194 -1987 180720 499746 416530 187772 335620 140026 183477
6626 183477 515289 425387 194528 182848 579444 294675 551593 800138 776834 1064877
6616 1064877 734646 533846 426676 549284 291518 501036 380942 122034 40169 106028
$$ packed form
6689B20059j31947M1881L72735j48201p0438m3170k05881K63269M5327k4229K3879
6678C43284J42562J23316J29066J14202n3582k29447j60908n26820L6538L21275
6668B39486p2902k6057l21774M19235l6206j18564M06377Q0041k58302n4573j32662
6657A24099p0408Q2017j04984N31474r0766j00331M8130K28740j59o6176m09010
6646A72626j23755k01221O331J20313k17081j74487J17253M9961j6233J72723
6636i3570K96879j46115n9181J82707L19026q3216k28758J47848j95594M3451
6626A83477L31812q9902k30859j1680L96596k84769K56918K48545k3304K88043
6616A064877l30231k00800j07170J22608k57766K09518j20094k58908q1865O5859
$$ plain form
6606 106028 -190326 872876 469923 336086 287664 40329 -10710 146490 304372 -84625
6596 -84625 19044 102720 211374 199804 17293 435005 231190 418374 382660 94941
6586 94941 313091 473966 867465 671821 393789 337389 365522 285915 568962 681382
6576 681382 263608 472483 489514 333934 270021 372938 479179 174751 168434 306940
6566 306940 476455 362070 -38339 -267484 -140552 440637 522371 48998 39964 139687
6556 139687 228384 241608 343429 454012 693778 623177 638507 560383 788269 334720 -201759
6545 -201759 200318 380506 375400 61833 313425 246637 -121325 82285 376370 -76046
6535 -76046 225764 280776 221544 289238 187099 88559 -100001 -18796 257978 298184 239020
$$ packed form
6606A06028k96354J063202m02953j33837m8422k47335n1039J57200J57882l88997
6596h4625J03669Q3676J08654j1570j82511M17712k03815J87184l5714k87719
6586I4941K18150J60875L93499j95644k78032n6400K8133p9607K83047J12420
6576F81382m17774K08875J7031j55580o3913J02917J06241l04428o317J38506
6566C06940J69515j14385m00409k29145J26932N81189Q1734m73373r034R9723
6556A39687Q8697J3224J01821J10583K39766p0601J5330p8124K27886m53549n36479
6545b01759M02077J80188n106l13567K51592o6788l67962K03610K94085m52416
6535g6046L01810N5012n9232O7694j02139r8540j88560Q1205K76774M0206n9164
$$ plain form
6524 239020 459611 188965 719920 793351 555551 200278 376270 847743 498120 143493
6514 143493 178504 528784 1279319 976572 610211 680521 1021512 881808 597835 642689
6504 642689 279333 6174 -61707 491311 834446 708561 443056 178529 -198696 233855
6494 233855 409598 500178 426950 128747 -38143 -335707 109498 -69353 282509 103457
6484 103457 -191784 89810 132993 115802 520304 488123 537919 598345 255377 223293 151408
6473 151408 7861 76400 298696 174557 248528 183044 615250 628741 764288 490760
6463 490760 428123 669839 433927 -166920 -182115 416536 519148 306512 57101 275908
6453 275908 178004 29860 43153 322328 249350 -41536 -143471 186531 552254 605540
$$ packed form
6524B39020K20591k70646N30955P3431k37800l55273J75992M71473l49623l54627
6514A43493L5011L50280P50535l02747l66361P0310L40991j39704k83973M4854
6504F42689l63356k73159o7881N53018L43135j25885k65505k64527l77225M32551
6494B33855J75743R0580p3228k98203j66890k97564M45205j78851L51862j79052
6484A03457k95241K81594M3183j7191M04502l2181M9796O0426l42968l2084p1885
6473A51408j43547O8539K22296j24139P3971o5484M32206J3491J35547k73528
6463D90760o2637K41716k35912o00847j5195N98651J02612k12636k49411K18807
6453B75908r7904j48144J3293K79175p2978k90886j01935L30002L65723N3286
$$ plain form
6443 605540 347294 263577 32286 77544 160415 367454 178970 -119957 82784 457608
6433 457608 539542 784903 354295 -197431 112982 449558 430530 449444 757817 1046294
6423 1046294 971095 1010470 585552 146624 236157 538051 960075 975556 721543 717881 634352
6412 634352 677161 883283 526761 653869 426207 181790 386704 364217 765715 904754
6402 904754 439850 442443 891644 966029 765968 788056 587758 562892 804680 467013 476724
6391 476724 804259 896740 568239 755504 631509 157003 254977 596795 742023 884697
6381 884697 1069936 782436 838001 1002293 804249 962400 1087321 1000419 961483 941915
6371 941915 1077372 869837 956136 894527 1214737 979214 647521 935687 1009964 965880
$$ packed form
6443F05540k58246q3717k31291M5258Q2871K07039j88484k98927K02741L74824
6433D57608Q1934K45361m30608n51726L10413L36576j9028J8914L08373K88477
6423A046294p5199L9375m24918m38928Q9533L01894M22024J5481k54013l662q3529
6412F34352M2809K06122l56522J27108k27662k44417K04914k2487M01498J39039
6402I04754m64904K593M49201P4385k00061K2088k00298k4866K41788l37667R711
6391D76724L27535R2481l28501J87265j23995m74506R7974L41818J45228J42674
6381H84697J85239k87500N5565J64292j98044J58151J24921q6902l8936j9568
6371I41915J35457k07535Q6299o1609L20210k35523l31693K88166P4277m4084
$$ plain form
6361 965880 840008 430993 596702 269908 737364 1059687 1074698 875785 951122 1044350
6351 1044350 1166088 803083 1065212 1105354 1182487 1177882 726023 629212 825749 864576 844914
6340 844914 738952 1104981 1276526 1207484 964629 1007045 1357767 1006622 654404 839018
6330 839018 1146520 841234 800771 968667 1044702 661655 1176771 1263745 640926 708877
6320 708877 728650 543937 670124 445702 832898 715869 835198 566972 405219 868183
6310 868183 730598 643177 953457 1169236 698603 540640 719652 806666 969173 556714
6300 556714 536801 452392 191128 212610 795436 906760 862794 1007259 951284 802431 609972
6289 609972 892175 732772 723758 1230841 689401 637159 383923 240647 554583 199000
$$ packed form
6361I65880j25872m09015J65709l26794M67456L22323J5011j98913P5337R3228
6351A044350J21738l63005K62129M0142P7133m605m51859r6811J96537L8827j9662
6340H44914j05962L66029J71545o9042k42855M2416L50722l51145l52218J84614
6330H39018L07502l05286m0463J67896P6035l83047N15116Q6974o22819O7951
6320G08877J9773j84713J26187k24422L87196j17029J19329k68226j61753M62964
6310H68183j37585q7421L10280K15779m70633j57963J79012Q7014J62507m12459
6300E56714j9913q4409k61264K1482N82826J11324m3966J44465n5975j48853j92459
6289F09972K82203j59403r014N07083n41440n2242k53236j43276L13936l55583
$$ plain form
6279 199000 406411 399675 569592 85044 550309 449619 271174 475043 577768 474385
6269 474385 466119 108766 20608 565027 755921 636515 635676 390332 -206824 -179828 -62001
6258 -62001 82716 -268267 -51311 348728 528869 405980 328648 364616 812359 549371
6248 549371 400093 281158 164550 240278 456686 631285 1042093 1192915 929452 823239
6238 823239 763227 966620 835306 910281 1503008 1524965 1358709 922910 748942 615251
6228 615251 523620 763870 868798 690775 861839 913367 1090871 901312 895621 513070
6218 513070 1034256 1089321 630256 720950 1190995 975431 547102 450341 519595 577969 706561
6207 706561 1145682 1057236 992217 896895 1270987 1405445 1476950 1668176 1801169 1938032
$$ packed form
6279A99000K07411o736J69917m84548M65265j00690j78445K03869J02725j03383
6269D74385q266l57353q8158N44419J90894j19406q39k45344n97156K6996J17827
6258f2001J44717l50983K16956M00039J80141j22889p7332L5968M47743k62988
6248E49371j49278j18935j16608P5728K16408J74599M10808J50822k63463j06213
6238H23239o0012K03393j31314P4975N92727K1957j66256m35799j73968j33691
6228F15251r1631K40250J04928j78023J71064N1528J77504j89559n691l82551
6218E13070N21186N5065m59065R0694M70045k15564m28329r6761O9254N8374J28592
6207G06561M39121q8446o5019r5322L74092J34458P1505J91226J32993J36863
$$ plain form
6197 1938032 1819623 2062047 1762122 1380486 1429363 1086137 746090 421133 438851 261498
6187 261498 225752 470044 884789 1028538 913338 689083 544322 400773 454782 280986
6177 280986 924794 817077 1075486 944531 776335 848300 463119 299773 904074 1169741
6167 1169741 1116180 892828 845291 887418 868094 1018673 859313 570748 501390 544786 246083
6156 246083 113501 221813 247006 46723 339951 656797 855940 549762 695488 922329
6146 922329 529771 284737 483759 675142 810701 872596 895493 857308 883105 1089142
6136 1089142 433910 361896 380562 327803 397883 753112 488009 675675 789994 785283 949414
6125 949414 380218 690207 816276 328426 677326 894531 1172892 1159194 961577 731373
$$ packed form
6197A938032j18409K42424k99925l81636M8877l43226l40047l24957J7718j77353
6187B61498l5746K44292M14745J43749j15200k24255j44761j43549N4009j73796
6177B80986O43808j07717K58409j30955j68196P1965l85181j63346O04301K65667
6167A169741n3561k23352m7537M2127j9324J50579j59360k88565o9358M3396k98703
6156B46083j32582J08312K5193k00283K93228L16846J99143l06178J45726K26841
6146I22329l92558k45034J99022J91383J35559O1895K2897l8185K5797K06037
6136A089142o55232p2014J8666n2759P0080L55229k65103J87666J14319m711J64131
6125I49414n69196L09989J26069m87850L48900K17205K78361j3698j97617k30204
$$ plain form
6115 731373 518894 917855 1025408 1338494 1328803 1264630 1187523 1053317 1333700 1271193 983845
6104 983845 506260 923222 1079461 641047 661068 1016985 996356 575043 540692 738244
6094 738244 819258 945090 1121362 947695 1054752 1101279 970552 1090876 1145470 1000554
6084 1000554 1065450 1241202 1408267 986613 641868 663727 666040 989778 715964 905880
6074 905880 1188304 1172332 1212098 642620 639602 839639 1146629 855168 1244094 1004886
6064 1004886 1204977 1240431 961012 1314199 1139606 1431457 1904135 1625208 1175790 1238484
6054 1238484 1486776 1450557 1667134 1256201 1132390 1453005 1417785 1632256 1743294 1495344
6044 1495344 1695920 1322134 1421503 1894992 1820087 1811624 1679136 1749325 1468504 1312759
$$ packed form
6115G31373k12479L98961J07553L13086r691o4173p7107j34206K80383o2507k87348
6104I83845m77585M16962J56239m38414K0021L55917k0629m21313l4351J97552
6094G38244Q1014J25832J76272j73667J07057M6527j30727J20324N4594j44916
6084A000554O4896J75752J67065m21654l44745K1859K313L23738k73814J89916
6074I05880K82424j5972L9766n69478l018K00037L06990k91461L88926k39208
6064A004886K00091L5454k79419L53187j74593K91851M72678k78927m49418O2694
6054A238484K48292l6219K16577m10933j23811L20615l5220K14471J11038k47950
6044A495344K00576l73786R9369M73489p4905q463j32488P0189k80821j55745
$$ plain form
6034 1312759 1571482 1422416 1722629 1951091 1794626 1570140 1248061 1126459 1307528 1293157
6024 1293157 1308844 1302680 1446210 1484266 1880254 1910941 1921770 2139034 1804919 2059382 1867482
6013 1867482 2198984 2277310 2228200 1841775 1660522 1653587 1434085 1368286 1403314 1236459 1690995
6002 1690995 1505065 1650561 1649242 1708601 1867359 1635501 1931516 1613950 1141537 1273763
5992 1273763 1587809 1634760 1900352 1744094 1708284 1458107 1346043 1497761 1782677 1753992
5982 1753992 1222553 1471221 1433155 1275267 1688305 1660004 1225210 1323842 1270499 1348523
5972 1348523 1424931 1353659 1387437 1267274 1446865 1372678 1538734 1433867 1033021 872734
5962 872734 1080904 1254339 1454025 1417946 1429793 1279751 1478748 1505447 1667129 1540233
$$ packed form
6034A312759K58723j49066L00213K28462j56465k24486l22079j21602J81069j4371
6024A293157J5687o164J43530L8056L95988L0687J0829K17264l34115K54463j91900
6013A867482L31502P8326m9110l86425j81253o935k19502o5799L5028j66855M54536
6002A690995j85930J45496j319N9359J58758k31858K96015l17566m72413J32226
5992A273763L14046M6951K65592j56258l5810k50177j12064J51718K84916k8685
5982A753992n31439K48668l8066j57888M13038k8301m34794R8632n3343P8024
5972A348523P6408p1272L3778j20163J79591p4187J66056j04867m00846j60287
5962H72734K08170J73435J99686l6079J1847j50042J98997K6699J61682j26896
$$ plain form
5952 1540233 1552070 1704390 2011691 1780507 1638343 1793486 1759579 1705360 1470656 2002822
5942 2002822 1685966 1554052 1402425 1410951 1627812 1596145 1596618 1881702 1871011 1843276 1653383
5931 1653383 1573760 1318556 1043439 1109290 1543389 1278652 1068250 1333198 1806070 1943280
5921 1943280 1885186 1876741 1750479 1707810 1533987 1399365 1444317 2005911 2096354 1886838 1861218
5910 1861218 1605245 1472776 1626904 1554248 1548090 1538267 1422615 1797915 2189872 2586272
5900 2586272 2038474 2086924 2486716 2279443 1747869 1575124 1862328 1886606 2028158 1873254
5890 1873254 2039367 1874327 1855783 1687339 2023694 2591121 2377094 2290673 1939241 1640738
5880 1640738 1822932 2480469 2613752 2201707 2237803 2552815 2487493 2263444 2402958 2374686
$$ packed form
5952A540233J1837J52320L07301k31184j42164J55143l3907n4219k34704N32166
5942B002822l16856j31914j51627Q526K16861l1667M73K85084j0691k7735j89893
5931A653383p9623k55204k75117O5851M34099k64737k10402K64948M72872J37210
5921A943280n8094q445j26262m2669j73823j34622M4952N61594R0443k09516k5620
5910A861218k55973j32469J54128p2656o158r823j15652L75300L91957L96400
5900B586272n47798M8450L99792k07273n31574j72745K87204K4278J41552j54904
5890A873254J66113j65040j8544j68444L36355N67427k14027q6421l51432k98503
5880A640738J82194O57537J33283m12045L6096L15012o5322k24049J39514k8272
$$ plain form
5870 2374686 2644165 2941216 3154801 2974681 3253165 3252947 3143249 3059683 2941651 2925554
5860 2925554 3064697 3359995 2864128 2766009 2798615 2940353 2439037 2129454 2761213 2702147
5850 2702147 2709337 2760716 2773806 3026703 2782011 2664142 2301543 2173839 1868923 2399482
5840 2399482 2905675 2873991 2888730 2587423 2613530 2531723 2547033 2596216 2878823 2824115 2721993
5829 2721993 2455740 2757492 2859099 2607844 2370609 2315504 2397430 2553199 2770275 2976810
5819 2976810 2941373 2998093 3260883 3475868 3333136 3180734 3375410 3321149 3211470 3142108
5809 3142108 3035133 3090921 3068382 3181596 2972955 3104335 3362802 3158896 2898711 2939718
5799 2939718 3313799 3403640 3641013 3710911 3760071 3750764 3652521 3592181 3735496 3905560 4020999
$$ packed form
5870B374686K69479K97051K13585j80120K78484k18j09698q3566j18032j6097
5860B925554J39143K95298m95867r8119L2606J41738n01316l09583O31759n9066
5850B702147P190N1379J3090K52897k44692j17869l62599j27704l04916N30559
5840B399482N06193l1684J4739l01307K6107q1807J5310M9183K82607n4708j02122
5829B721993k66253L01752J01607k51255k37235n5105Q1926J55769K17076K06535
5819B976810l5437N6720K62790K14985j42732j52402J94676n4261j09679o9362
5809C142108j06975N5788k2539J13214k08641J31380K58467k03906k60185M1007
5799B939718L74081Q9841K37373O9898M9160r307r8243o0340J43315J70064J15439
$$ plain form
5788 4020999 3950882 3856181 3787374 3963275 4307969 3951394 3891445 4318471 4536120 4345545
5778 4345545 4554337 5016482 5144335 5098245 5339638 5089603 4996640 5093493 5195522 5402676
5768 5402676 5370856 5454539 5213111 5361271 5410468 5846531 5964488 6254861 6345131 6352405 6469965
5757 6469965 6759278 6584521 7199871 7267849 6973664 7455662 7984124 8365043 8717392 8808578
5747 8808578 9015559 9675262 10434141 10722484 11154718 11760897 12679916 13414976 14128065 15345152
5737 15345152 16033304 17267864 18584076 19510115 19823035 20686438 20831199 20292830 19642335
5728 19642335 19362160 18454258 17602525 17009787 16523869 15832172 15417138 15119848 15079899 15072127
5718 15072127 14911154 15384035 15798338 16316263 16547954 17131196 18179557 19374014 20316800
$$ packed form
5788D020999p0117r4701o8807J75901L44694l56575n9949M27026K17649j90575
5778D345545K08792M62145J27853m6090K41393k50035r2963R6853J02029K07154
5768E402676l1820Q3683k41428J48160M9197M36063J17957K90373R0270P274J17560
5757F469965K89313j74757O15350O7978k94185M81998N28462L80919L52349R1186
5747H808578K06981O59703P58879K88343M32234O06179R19019P35060P13089J217087
5737A5345152O88152J234560J316212R26039L12920Q63403J44761n38369o50495
5728A9642335k80175r07902q51733n92738m85918o91697m15034k97290l9949p772
5718A5072127j60973M72881M14303N17925K31691N83242J048361J194457R42786
$$ plain form
5709 20316800 21376712 22337002 23806781 24778094 25042300 25148256 24281634 22922948 21434916
5700 21434916 19395706 16798822 16129693 15413848 14346805 13199896 12183714 11312248 10457729
5691 10457729 9719015 9362571 8788805 8282418 8265751 8002102 7935024 7716166 7579503 7580149
5681 7580149 7224322 6972817 6970258 6086769 5896311 6567139 6485344 6131049 5910171 5623715
5671 5623715 5650876 5677939 5677765 5670828 5434320 5311950 5394749 5138342 5417623 5741343 5673675
5660 5673675 5254491 5267292 5724382 5148926 4869938 5136340 4960518 4751604 4871981 5215483
5650 5215483 5019070 4709811 5075647 5147106 4982679 4808374 5114044 5198853 4987590 4858964
5640 4858964 4829704 4716782 4745757 4918943 4893097 4653170 4696698 4956428 4874576 4857351 4948629
$$ packed form
5709B0316800J059912R60290J469779R71313K64206J05956q66622j358686j488032
5700B1434916k039210k596884o69129p15845j067043j146909j016182q71466q54519
5691A0457729p38714l56444n73766n06387j6667k63649o7078k18858j36663O46
5681G580149l55827k51505k559q83489j90458O70828q1795l54295k20878k86456
5671E623715K7161K7063j74o937k36508j22370Q2799k56407K79281L23720o7668
5660E673675m19184J2801M57090n75456k78988K66402j75822k08914J20377L43502
5650E215483j96413l09259L65836P1459j64427j74305L05670Q4809k11263j28626
5640D858964k9260j12922K8975J73186k5846k39927M3528K59730q1852j7225R1278
$$ plain form
5629 4948629 5184655 5307987 5217990 4827564 5070540 5231957 4934179 5004136 4999905 4993940 5199317
5618 5199317 5219337 5697685 5535199 5720567 5736690 6057832 5718506 5242929 5020037 5374874
5608 5374874 5684691 5436647 5449323 5339854 4979004 4785008 5367357 5336453 5501084 5569074
5598 5569074 5362840 5484030 5553088 5779390 6037894 6152346 5652739 5652446 6235065 6343307
5588 6343307 6108455 6565911 6986926 7318396 7207333 7376298 7858055 8093997 8061222 7974287
5578 7974287 7943185 7805855 7948812 8036234 8126412 8305482 8256046 7987074 8473749 8336069
5568 8336069 8724599 9090129 9032030 8845762 9254832 9368278 9459450 9695775 9573439 9612419
5558 9612419 9827463 10004015 10047824 9881341 9889540 10336972 10682878 10664943 10892604 11310684
$$ packed form
5629D948629K36026J23332q9997l90426K42976J61417k97778O9957m231n965K05377
5618E199317K0020M78348j62486J85368J6123L21142l39326m75577k22892L54837
5608E374874L09817k48044J2676j09469l60850j93996N82349l0904J64631O7990
5598E569074k06234J21190O9058K26302K58504J14452m99607k93N82619J08242
5588F343307k34852M57456M21015L31470j11063J68965M81757K35942l2775q6935
5578G974287l1102j37330J42957Q7422R0178J79070m9436k68972M86675j37680
5568H336069L88530L65530n8099j86268M09070J13446R1172K36325j22336L8980
5558I612419K15044J76552M3809j66483Q199M47432L45906j7935K27661M18080
$$ plain form
5548 11310684 10986037 10925606 11108518 11423082 11146573 11390513 11928171 11945915 11701548 11663191
5538 11663191 11535900 11716789 11918528 11858878 12012832 11773649 11888348 11960612 11823859 11746940
5528 11746940 11658234 11586139 12204762 12722852 12423288 12320193 12470795 12521065 12683714 12881255
5518 12881255 13138820 13102422 13062931 12384478 12515695 12312647 12715968 13086209 13058783 12751258
5508 12751258 12648353 12727353 12899007 13122179 13497854 13599590 13908274 13770720 13390964 13167449
5498 13167449 13521083 13254438 13468639 14233493 13730755 13609839 13504916 13411242 13681170 14078558
5488 14078558 14128645 14527548 14455169 14469340 14883075 15120212 14757077 14984821 14981988 15013617
5478 15013617 15428248 15736396 15857422 16305892 16538070 16727880 16963401 16844792 17060427
$$ packed form
5548A1310684l24647o0431J82912L14564k76509K43940N37658J7744k44367l8357
5538A1663191j27291J80889K01739n9650J53954k39183J14699P2264j36753p6919
5528A1746940q8706p2095O18623N18090k99564j03095J50602N0270J62649J97541
5518A2881255K57565l6398l9491o78453J31217k03048M03321L70241k7426l07525
5508A2751258j02905P9000J71654K23172L75675J01736L08684j37554l79756k23515
5498A3167449L53634k66645K14201P64854n02738j20916j04923r3674K69928L97388
5488A4078558N0087L98903p2379J4171M13735K37137l63135K27744k833L1629
5478A5013617M14631L08148J21026M48470K32178J89810K35521j18609K15635
$$ plain form
5469 17060427 17544549 17867139 18171815 18618098 19238818 19659731 19685901 19942061 20342816 21296395
5459 21296395 22020135 22552710 23358527 24128198 24843729 25430196 26283209 27173754 28128046
5450 28128046 29107533 29926729 30922110 31991630 33234082 34135940 35499136 36969758 38089138
5441 38089138 39927001 41404492 43357163 45029901 46805573 49443542 52197128 55199587
5433 55199587 58085702 61660445 66319810 71019582 76117314 81881884 88170082 94511422
5425 94511422 102084759 110455404 120079298 130063111 139506594 148502098 156655843 164432575
5417 164432575 171253649 177584523 182823461 185994675 186303800 182706923 175347247 165649015
5409 165649015 154117060 141319246 129122386 116893541 105558983 94952814 85962041
$$ packed form
5469A7060427M84122L22590L04676M46283O20720M20913K6170K56160M00755R53579
5459B1296395P23740N32575Q05817P69671P15531N86467Q53013Q90545R54292
5450B8128046R79487Q19196R95381J069520J242452R01858J363196J470622J119380
5441C8089138J837863J477491J952671J672738J775672K637969K753586L002459
5433E5199587K886115L574743M659365M699772N097732N764570O288198O341340
5425I4511422P573337Q370645R623894R983813R443483Q995504Q153745P776732
5417A64432575O821074O330874N238938L171214L09125l596877p359676r698232
5409A65649015j1531955j2797814j2196860j2228845j1334558j0606169q990773
$$ plain form
5402 85962041 77846298 70655150 64708464 59592756 54889154 50670490 47515516 44639216
5394 44639216 41713400 39675898 38383091 37465718 36238006 34540128 32908928 31877724
5386 31877724 30581726 30044689 29218869 28237105 27603109 27124161 26268018 25300025 24705912
5377 24705912 24014853 23534218 22794052 22621475 22439219 22263493 22043002 21916602 21502478
5368 21502478 20854555 20600813 20306693 19702261 19642638 19515050 19157441 18607664 18236085 18018645
5358 18018645 18267611 17989649 17537348 17347064 16806052 16360801 16124670 15760590 15772503 15797555
5348 15797555 15665367 15473023 15618332 15527602 15202520 14700557 14313649 14544868 14397254 14157758
5338 14157758 14226446 14164528 13804521 13273254 13454286 13581648 13188538 12926396 12929888 12680174
$$ packed form
5402H5962041q115743p191148n946686n115708m703602m218664l154974k876300
5394D4639216k925816k037502j292807r17373j227712j697878j631200j031204
5386C1877724j295998n37037q25820r81764o33996m78948q56143r67993n94113
5377B4705912o91059m80635p40166j72577j82256j75726k20491j26400m14124
5368B1502478o47923k53742k94120o04432n9623j27588l57609n49777l71579k17440
5358A8018645K48966k77962m52301j90284n41012m45251k36131l64080J1913K5052
5348A5797555j32188j92344J45309r0730l25082n01963l86908K31219j47614k39496
5338A4157758O8688o1918l60007n31267J81032J27362l93110k62142L492k49714
$$ plain form
5328 12680174 12755525 12499793 12163574 12092753 12050476 11565361 11446286 11547509 11453468 11214231
5318 11214231 11503110 11344704 11440923 11418827 11366516 11134411 11215251 11031982 11098369 11119947
5308 11119947 11225318 10878508 10528508 10190790 10570943 10428234 10331476 10479725 10282878 9993233
5298 9993233 9912286 9686208 9584428 9754190 9903271 10226925 10345640 10309980 10276926 10656132
5288 10656132 9590803 9364871 9094784 9112301 8876017 8824816 8878843 8626311 8622130 8815897
5278 8815897 8515676 8084447 7940265 8295703 8196057 8104343 7765414 7649457 7653407 7618788
5268 7618788 7621438 7688950 7971811 7933655 7469465 7362556 7222259 7006313 7107061 7167059
5258 7167059 7279418 7520592 7249287 7093341 6999008 7211031 7450336 7307733 7389763 7490917
$$ packed form
5328A2680174P5351k55732l36219p0821m2277m85115j19075J01223r4041k39237
5318A1214231K88879j58406R6219k2096n2311k32105Q0840j83269O6387K1578
5308A1119947J05371l46810l50000l37718L80153j42709r6758J48249j96847k89645
5298I993233q0947k26078j01780J69762J49081L23654J18715l5660l3054L79206
5288A0656132j065329k25932k70087J7517k36284n1201N4027k52532m181J93767
5278H815897l00221m31229j44182L55438r9646r1714l38929j15957L950l4619
5268G618788K650O7512K82861l8156m64190j06909j40297k15946J00748N9998
5258G167059J12359K41174k71305j55946r4333K12023K39305j42603Q2030J01154
$$ plain form
5248 7490917 7360758 7266537 6674147 6775158 6879201 6405451 6149696 6004043 6064431 6148676
5238 6148676 5978502 5974053 5850398 5963343 5976527 5770870 5366607 5258884 5730183 5475765
5228 5475765 5058125 4893158 5431329 5225907 4818154 4679459 4668822 4638188 4651247 4708197
5218 4708197 4824562 5103123 4797029 5007691 4854144 4790250 4783030 4540485 4650637 4781285
5208 4781285 4722000 4709899 4714194 4660250 4338244 4352808 4749392 4313831 4143212 3941040 3977089
5197 3977089 4028812 3523004 3789634 4197996 4394685 4132828 4217875 4286539 3925051 3796737
5187 3796737 4306013 4812775 4625006 4697878 4603919 4529388 4515612 4581973 4543890 4508058 4321560
5176 4321560 4448597 4618520 4439044 4647880 4839186 4515855 4239543 4234624 4494627 4524115
$$ packed form
5248G490917j30159r4221n92390J01011J04043m73750k55755j45653O0388Q4245
5238F148676j70174m449j23655J12945J3184k05657m04263j07723M71299k54418
5228E475765m17640j64967N38171k05422m07753j38695j0637l0634J3059N6950
5218D708197J16365K78561l06094K10662j53547o3894p220k42545J10152J30648
5208D781285n9285j2101M295n3944l22006J4564L96584m35561j70619k02172L6049
5197C977089N1723n05808K66630M08362J96689k61857Q5047O8664l61488j28314
5187C796737N09276N06762j87769P2872r3959p4531j3776O6361l8083l5832j86498
5176D321560J27037J69923j79476K08836J91306l23331k76312m919K60003K9488
$$ plain form
5166 4524115 4085329 4268146 4773938 4343342 4181477 4143283 3885418 4009376 4322965 4431305
5156 4431305 4529515 4933933 4487894 4035495 4188401 3979245 4302943 4426312 4048152 3915281
5146 3915281 4372431 4614592 4586213 4297562 4313405 4480678 4288815 4404822 4832078 4565164
5136 4565164 4741159 4773217 4575039 5104185 4686713 4296513 4204186 4333014 4316229 4468477
5126 4468477 3916281 3857232 3965048 3704655 3952391 4116152 4098750 4051745 4461045 4353203
5116 4353203 4111119 4040960 4031119 4515004 4498265 4339314 4597712 4532051 4504053 4428062 4099091
5105 4099091 3839688 3867853 4118360 4066722 4218147 4020447 3378971 3095834 3472166 3225604
5095 3225604 3263091 3393808 3160690 3766860 3581301 3460070 3588779 3807979 3417619 3537404
$$ packed form
5166D524115m38786J82817N05792m30596j61865l8194k57865J23958L13589J08340
5156D431305R8210M04418m46039m52399J52906k09156L23698J23369l78160j32871
5146C915281M57150K42161k8379k88651J5843J67273j91863J16007M27256k66914
5136D565164J75995L2058j98178N29146m17472l90200r2327J28828j6785J52248
5126D468477n52196n9049J07816k60393K47736J63761j7402m7005M09300j07842
5116D353203k42084p0159r841M83885j6739j58951K58398o5661k7998p5991l28971
5105D099091k59403K8165K50507n1638J51425j97700o41476k83137L76332k46562
5095C225604L7487J30717k33118O06170j85559j21231J28709K19200l90360J19785
$$ plain form
5085 3537404 3120415 2804672 3001437 2742815 2897699 3500451 2968802 2650599 3037684 3175550
5075 3175550 2839261 3017663 2747335 3306442 3416341 2687786 2790426 2952203 3285867 3081077
5065 3081077 3297044 3190997 3426795 3287943 3214343 3434528 3450990 3484258 3743311 4119867
5055 4119867 3758195 3649326 3810511 3760026 4068456 4406244 4317971 4390787 4403928 4423741
5045 4423741 4610316 4441235 4930881 4673666 4715327 4577587 4294570 4066001 3921386 3812148
5035 3812148 4082608 4392821 4026815 3737190 3799236 4043648 4250697 3983397 3735632 3821230
5025 3821230 3898283 3933236 4265100 4293481 4150665 4072144 4237866 4104144 3892062 3939014
5015 3939014 3680303 3887363 3909901 3887548 3809258 3889874 3831574 3865992 3853919 3725156 3817426
$$ packed form
5085C537404m16989l15743J96765k58622J54884O02752n31649l18203L87085J37866
5075C175550l36289J78402k70328N59107J09899p28555J02640J61777L33664k04790
5065C081077K15967j06047K35798j38852p3600K20185J6462L3268K59053L76556
5055D119867l61672j08869J61185n0485L08430L37788q8273P2816J3141J9813
5045D423741J86575j69081M89646k57215M1661j37740k83017k28569j44615j09238
5035C812148K70460L10213l66006k89625O2046K44412K07049k67300k47765Q5598
5025C821230P7053L4953L31864K8381j42816p8521J65722j33722k12082M6952
5015C939014k58711K07060K2538k2353p8290Q0616n8300L4418j2073j28763R2270
$$ plain form
5004 3817426 3702553 3522805 3972524 3752107 3846539 3823719 3749384 3928606 3657142 3831117
4994 3831117 4205941 4317491 3959509 4269577 4532284 4668127 4404663 4139025 4377256 4261511
4984 4261511 4607636 4846416 4682549 4742833 4571693 4422857 4785968 4317331 4192395 4556219
4974 4556219 4735178 4629177 4876701 4789244 4427537 4551782 4355911 4720878 5151776 5426932
4964 5426932 5249392 4944026 4807997 4811887 4808668 4994174 5266675 5633110 5339419 5110784
4954 5110784 5378532 5333121 5121636 5232626 5070017 4832959 5174600 5411701 5462390 5000295
4944 5000295 4744406 5181286 5249514 5104214 5271304 5722952 5665795 6008384 6013446 5857702
4934 5857702 5952263 6105866 6058410 5901809 5872928 5854015 5740037 6004344 6175450 6232251
$$ packed form
5004C817426j14873j79748M49719k20417R4432k2820p4335J79222k71464J73975
4994C831117L74824J11550l57982L10068K62707J35843k63464k65638K38231j15745
4984D261511L46125K38780j63867O0284j71140j48836L63111m68637j24936L63824
4974D556219J78959j06001K47524q7457l61707J24245j95871L64967M30898K75156
4964E426932j77540l05366j36029L890l219J85506K72501L66435k93691k28635
4954E110784K67748m5411k11485J10990j62609k37058L41641K37101N0689m62095
4944E000295k55889M36880O8228j45300J67090M51648n7157L42589N062j55744
4934E857702R4561J53603m7456j56601k8881j8913j13978K64307J71106N6801
$$ plain form
4924 6232251 6071729 6065056 6297743 5828149 5806281 6207560 6368191 6082257 6062529 6280558
4914 6280558 6425600 6351445 6314887 6628013 6915221 7397715 7485854 7520083 7627004 7791911
4904 7791911 7835038 8053384 8034039 7871617 7333590 6879204 6921124 7159735 7650466 7358356
4894 7358356 7480746 7294407 7330399 7365261 7451921 7784795 7573146 7252864 8001973 7847828
4884 7847828 7618863 7990124 8117268 7944637 8029096 7688302 7467153 7719295 7789163 7861641
4874 7861641 7900991 7664266 7694742 7602905 7441868 7671713 7867126 7726968 7376051 7787399
4864 7787399 7820130 7750487 7779143 7891643 7919026 7921549 8005095 8052424 8355671 8313046 8131171
4853 8131171 7994683 8164496 8001517 7584992 7543931 8166206 8179811 8142739 8032923 8101098
$$ packed form
4924F232251j60522o673K32687m69594k1868M01279J60631k85934j9728K18029
4914F280558J45042p4155l6558L13126K87208M82494Q8139L4229J06921J64907
4904G791911M3127K18346j9345j62422n38027m54386M1920K38611M90731k92110
4894G358356J22390j86339L5992L4862Q6660L32874k11649l20282P49109j54145
4884G847828k28965L71261J27144j72631Q4459l40794k21149K52142O9868P2478
4874G861641L9350k36725L0476r1837j61037K29845J95413j40158l50917M11348
4864G787399L2731o9643K8656J12500K7383K523Q3546M7329L03247m2625j81875
4853H131171j36488J69813j62979m16525m1061O22275J3605l7072j09816O8175
$$ plain form
4843 8101098 8072248 7809587 7797475 7653474 7315750 7531070 7534681 7602496 7472536 7299686
4833 7299686 7437221 7561915 7658654 7963762 7483629 7608558 7806952 7781171 7756656 7766554
4823 7766554 8045405 8016400 7912582 8352196 8732968 8620245 8462810 8329219 8495724 8051694
4813 8051694 8072372 8117753 8491385 8793445 9157169 8975621 8907580 8661151 8981420 8947513
4803 8947513 9217322 9272074 9759734 9710084 9801553 9604670 9598129 9876833 9724637 9878962
4793 9878962 9937237 9761710 10222478 10624421 11367081 11868337 12576504 13202623 14015426 14584842
4783 14584842 14747642 14417373 13397494 12842289 12708710 12627538 12477704 12412088 12109897 12353508
4773 12353508 12182095 12209441 12727814 12864030 12819513 13073613 13277431 13453964 13417453 13783849
$$ packed form
4843H101098k8850k62661j2112j44001l37724K15320L611O7815j29960j72850
4833G299686J37535J24694R6739L05108m80133J24929J98394k5781k4515R898
4823G766554K78851k9005j03818M39614L80772j12723j57435j33591J66505m44030
4813H051694K0678M5381L73632L02060L63724j81548o8041k46429L20269l3907
4803H947513K69809N4752M87660m9650R1469j96883o541K78704j52196J54325
4793I878962N8275j75527M60768M01943P42660N01256P08167O26119Q12803N69416
4783A4584842J62800l30269j019879n55205j33579q1172j49834o5616l02191K43611
4773A2353508j71413K7346N18373J36216m4517K54100K03818J76533l6511L66396
$$ plain form
4763 13783849 14353150 14452106 14591888 14864182 14946744 15293342 15371428 15458467 15218013 15629618
4753 15629618 15294359 15124055 15099095 15072426 15501606 15904456 15662400 15759937 15908802 16398232
4743 16398232 16624566 16823020 17311739 17584811 17965970 18593180 19245696 19320921 19792475 20088959
4733 20088959 20525610 20866155 21652600 22151720 23070340 23961950 24844676 25379556 25772252
4724 25772252 26278397 26030270 25257364 24576197 24947342 24740494 24330643 24026694 23870863
4715 23870863 24268231 24839901 24733845 24957397 25042869 24900863 25476114 25874033 26346327 26243329
4705 26243329 26195190 26262799 26715347 27084470 27623028 27877898 28357155 28950887 29197611 29720443
4695 29720443 30532866 31009761 31453242 32166723 33112572 34117509 34560515 35440889 36724744
$$ packed form
4763A3783849N69301R8956J39782K72294Q2562L46598P8086Q7039k40454M11605
4753A5629618l35259j70304k4960k6669M29180M02850k42056R7537J48865M89430
4743A6398232K26334J98454M88719K73072L81159O27210O52516P5225M71554K96484
4733B0088959M36651L40545P86445M99120R18620Q91610Q82726N34880L92696
4724B5772252N06145k48127p72906o81167L71145k06848m09851l03949j55831
4715B3870863L97368N71670j06056K23552Q5472j42006N75251L97919M72294j02998
4705B6243329m8139O7609M52548L69123N38558K54870M79257N93732K46724N22832
4695B9720443Q12423M76895M43481P13481R45849J004937M43006Q80374J283855
$$ plain form
4686 36724744 37620931 38143862 39196266 40540676 41856786 42506989 43410044 44144197 44556180
4677 44556180 45272510 45770984 46180617 46892846 47358650 48727557 49495057 50309458 51033140
4668 51033140 51776418 52721658 53438773 54590882 55990271 57385510 58773649 59844571 61387518
4659 61387518 63415604 65073053 67215988 69841381 72306896 73906671 75885369 78150854
4651 78150854 80428954 82379148 84631322 87260393 90412390 93719813 96846865 100191570
4643 100191570 104205654 109049116 114588169 120668278 126745515 134174699 142358637 152019809
4635 152019809 163454062 175602067 188332806 201647410 213855365 224096932 234201945
4628 234201945 244791346 255350524 265206519 274312833 281055854 283992265 282546154 276536264
$$ packed form
4686C6724744Q96187N22931J052404J344410J316110O50203R03055P34153M11983
4677D4556180P16330M98474M09633P12229M65804J368907P67500Q14401P23682
4668E1033140P43278R45240P17115J152109J399389J395239J388139J070922J542947
4659F1387518K028086J657449K142935K625393K465515J599775J978698K265485
4651G8150854K278100J950194K252174K629071L151997L307423L127052L344705
4643A00191570M014084M843462N539053O080109O077237P429184Q183938R661172
4635A52019809J1434253J2148005J2730739J3314604J2207955J0241567J0105013
4628B34201945J0589401J0559178R855995R106314O743021K936411j446111o009890
$$ plain form
4620 276536264 265797870 252846773 238324974 223151565 208708352 195156516 182315478
4613 182315478 170094622 159017000 148927624 139167940 130430541 122618083 115973019 109811020
4605 109811020 103962894 98984249 94229261 89582439 85157272 81094043 77266955 73761402
4597 73761402 70712901 67676565 64836738 62489372 60416955 58962875 57129223 55063187
4589 55063187 53348015 51741236 50431586 49073283 47857076 47156127 46460746 46414009 45918096
4580 45918096 45174077 44815939 44184597 43891324 43725600 43069739 43026219 42311630 41393472 40741011
4570 40741011 39852839 38878307 38405736 37230623 36022702 35746765 35053198 34740168 34046315
4561 34046315 33715572 32855510 32104776 32135631 31879251 31767092 32075320 32271487 31941444 32043316
$$ packed form
4620B76536264j0738394j2951097j4521799j5173409j4443213j3551836j2841038
4613A82315478j2220856j1077622j0089376r759684q737399p812458o645064o161999
4605A09811020n848126m978645m754988m646822m425167m063229l827088l505553
4597G3761402l048501l036336k839827k347366k072417j454080j833652k066036
4589E5063187j715172j606779j309650j358303j216207p00949o95381m6737m95913
4580D5918096p44019l58138o31342k93273j65724o55861m3520p14589r18158o52461
4570D0741011q88172r74532m72571j175113j207921k75937o93567l13030o93853
4561C4046315l30743q60062p50734L0855k56380j12159L08228J96167l30043J01872
$$ plain form
4551 32043316 32333098 32262119 31861435 32153025 32000279 31484614 31258496 31669605 31943901 31442026
4541 31442026 31756912 31673650 31212231 31060030 31069273 31007668 31014806 30981314 30998756 31116375 30875602
4530 30875602 30365930 30268022 30330905 29929103 29793971 29808196 29853740 29804575 29993455 29884511
4520 29884511 29736520 29877869 29629377 29611585 29508725 29747578 29559686 29766266 29838309 29685187
4510 29685187 29649472 29621823 29866933 30313714 30437397 31061844 31328170 31405361 31878864 32567305
4500 32567305 33069618 33590414 34471908 34911250 35632470 36156699 36261833 36010816 35926574 35722796
4490 35722796 35532025 35337549 35508329 35804748 36048723 36395785 36702495 36897822 37994102
4481 37994102 38996844 39070536 39616140 39992510 39690589 39390371 39399474 39104820 39187321 39437079
$$ packed form
4551C2043316K89782p0979m00684K91590j52746n15665k26118M11109K74296n01875
4541C1442026L14886q3262m61419j52201R243o1605P138l3492J7442J17619k40773
4530C0875602n09672r7908O2883m01802j35132J4225M5544m9165J88880j08944
4520B9884511j47991J41349k48492j7792j02860K38853j87892K06580P2043j53122
4510B9685187l5715k7649K45110M46781J23683O24447K66326P7191M73503O88441
4500C2567305N02313N20796Q81494M39342P21220N24229J05134k51017q4242k03778
4490C5722796j90771j94476J70780K96419K43975L47062L06710J95327J096280
4481C7994102J002742P3692N45604L76370l01921l00218R103k94654Q2501K49758
$$ plain form
4471 39437079 38970600 39135332 39304917 39790615 39983076 40141914 40786791 41432989 42104268
4462 42104268 42869690 43577302 44337058 45537246 46517529 47784943 48952496 50266116 51900658
4453 51900658 53054535 54099525 55771650 57066991 58151308 59532754 60937368 62217026
4445 62217026 63693213 65596137 67987646 71238962 74645651 78084844 82115257 86570220
4437 86570220 92237946 98357030 103619167 109626940 115437121 122137358 129605861 138009280
4429 138009280 148580906 160837092 175844356 194643772 218683885 248731600 285700446
4422 285700446 326298501 362086122 376852703 358762917 318119263 272997621 234219764
4415 234219764 203360304 179958360 162887769 150530268 141144586 134849561 130868687
$$ packed form
4471C9437079m66479J64732J69585M85698J92461J58838O44877O46198O71279
4462D2104268P65422P07612P59756J200188R80283J267414J167553J313620J634542
4453E1900658J153877J044990J672125J295341J084317J381446J404614J279658
4445F2217026J476187J902924K391509L251316L406689L439193M030413M454963
4437H6570220N667726O119084N262137O007773N810181O700237P468503Q403419
4429A38009280J0571626J2256186J5007264J8799416K4040113L0047715L6968846
4422B85700446M0598055L5787621J4766581j8089786m0643654m5121642l8777857
4415B34219764l0859460k3401944j7070591j2357501r385682o295025l980874
$$ plain form
4408 130868687 128947411 128845152 129826103 131638113 133320964 134014226 131544879 126163271
4400 126163271 118739720 110829212 103132158 96264994 90462399 85381941 81135677 77521166
4392 77521166 74640148 72394459 70184254 68011958 65913013 64064944 62280175 60879667
4384 60879667 59969564 59255999 58067082 57468292 56766983 55636399 55049038 54419760 53659543
4375 53659543 53134975 52668978 52590826 52321049 51983627 52114336 51606359 51570456 51669457 51844992
4365 51844992 51799146 51961241 52363129 53209126 54313464 55205539 56225591 56773068 58481641
4356 58481641 59619542 60433020 61877067 63103638 64307994 65666545 66724449 67865844
4348 67865844 68732354 69497686 71087539 72454163 73448783 75287878 76822917 78244809 80700185
$$ packed form
4408A30868687j921276j02259R80951J812010J682851O93262k469347n381608
4400A26163271p423551p910508p697054o867164n802595n080458m246264l614511
4392G7521166k881018k245689k210205k172296k098945j848069j784769j400508
4384F0879667r10103p13565j188917n98790p01309j130584n87361o29278p60217
4375E3659543n24568m65997p8152k69777l37422J30709n07977l5903R9001J75535
4365E1844992m5846J62095M01888Q45997J104338Q92075J020052N47477J708573
4356E8481641J137901Q13478J444047J226571J204356J358551J057904J141395
4348F7865844Q66510P65332J589853J366624R94620J839095J535039J421892K455376
$$ plain form
4339 80700185 83686571 87491083 89942516 93265777 97538974 102606115 108659208 115394890
4331 115394890 123521666 132838072 144009608 156191173 168864007 181059753 191633639
4324 191633639 200474077 208870803 216475025 225919010 238854174 257212305 282210142 310224726
4316 310224726 335503546 352875258 359877060 354386969 334911978 305191967 269413886
4309 269413886 231148955 196763948 169190896 148224291 131796520 119363756 109645547
4302 109645547 101748541 95167648 89580225 83729066 78497985 73574677 69237169 65791568
4294 65791568 62646180 59617672 57208125 55077158 53144068 51474594 49888224 48026866
4286 48026866 46482892 45099600 43279415 42225092 41087540 40296778 39401599 38849713 38570505
$$ packed form
4339H0700185K986386L804512K451433L323261M273197N067141O053093O735682
4331A15394890Q126776R316406J1171536J2181565J2672834J2195746J0573886
4324A91633639Q840438Q396726P604222R443985J2935164J8358131K4997837K8014584
4316C10224726K5278820J7371712P001802n490091j9474991k9720011l5778081
4309B69413886l8264931l4385007k7573052k0966605j6427771j2432764r718209
4302A09645547p897006o580893n587423n851159n231081m923308m337508l445601
4294F5791568l145388l028508k409547k130967j933090j669474j586370j861358
4286D8026866j543974j383292j820185j054323j137552p90762q95179n51886k79208
$$ plain form
4277 38570505 38392996 37998568 37026091 36233968 35025922 33932957 33282331 32322975 31595284
4268 31595284 31302225 30556422 30005279 29927867 29154146 28860618 28023773 27338248 27057368 26510931
4258 26510931 26206175 25851652 25456448 25340414 25213670 24435548 23629511 23664351 23422542 23136905
4248 23136905 22787970 22371960 21920911 21595129 21483023 20984176 20956852 20660187 20184106 20127006
4238 20127006 19819465 19489200 19517323 19511289 18964467 18576044 18280921 18435437 18500986 18437469
4228 18437469 18168960 18161131 17867473 17738188 17816020 17842630 17831294 17677440 17839124 17811475
4218 17811475 17358588 17067434 17241097 16776342 16906917 16658193 16414198 16800441 17067991
4209 17067991 16982548 16980740 16871214 16369664 16171460 15760231 16043117 16074730 15935617 15926658
$$ packed form
4277C8570505j77509l94428r72477p92123j208046j092965o50626r59356p27691
4268C1595284k93059p45803n51143p7412p73721k93528q36845o85525k80880n46437
4258B6510931l04756l54523l95204j16034j26744p78122q06037L4840k41809k85637
4248B3136905l48935m16010m51049l25782j12106m98847k7324k96665m76081n7100
4238B0127006l07541l30265K8123o034n46822l88423k95123J54516O5549o3517
4228A8437469k68509p829k93658j29285P7832K6610j1336j53854J61684k7649
4218A7811475m52887k91154J73663m64755J30575k48724k43995L86243K67550
4209A7067991q5443j808j09526n01550j98204m11229K82886L1613j39113q959
$$ plain form
4199 15926658 15911168 15993013 16047913 16169802 15933640 16317924 16442541 16768550 17071444 17352734
4189 17352734 17294879 17889051 18438802 18654602 18605774 18803784 19155827 19605842 19647838 19530454
4179 19530454 19683154 19435580 19515237 19640448 19703761 20056723 20719324 21961342 23118040
4170 23118040 23195485 23124782 21905647 21213017 21209049 20903909 20856830 20677450 20406279 20064540
4160 20064540 20456456 20978506 21548535 21470661 21400843 21286026 20701288 20583097 20246346 19881161
4150 19881161 20483697 21162149 21392209 22094788 22638541 22705371 22310516 21823974 20958953 19698407
4140 19698407 18558465 17792552 17328410 16753748 16145017 15720030 15620358 15365688 14835835
4131 14835835 14562021 14771748 14774910 14834201 15082640 14799105 14375862 14200540 14800172 14849461
$$ packed form
4199A5926658j5490Q1845N4900J21889k36162L84284J24617L26009L02894K81290
4189A7352734n7855N94172N49751K15800m8828J98010L52043M50015M1996j17384
4179A9530454J52700k47574P9657J25211O3313L52962O62601J242018J156698
4170B3118040P7445p0703j219135o92630l968l05140m7079j79380k71171l41739
4160B0064540L91916N22050N70029p7874o9818j14817n84738j18191l36751l65185
4150A9881161O02536O78452K30060P02579N43753O6830l94855m86542q65021j260546
4140A9698407j139942p65913m64142n74662o08731m24987r9672k54670n29853
4131A4835835k73814K09727L162N9291K48439k83535m23243j75322N99632M9289
$$ plain form
4121 14849461 14554690 14785892 15408450 15961891 16221376 15864248 15653148 15707878 15090274 15164234
4111 15164234 14880451 14373481 14709476 14497852 14364670 14383157 14449904 14604315 14873341 15107854
4101 15107854 15257924 15274521 15480913 15712507 15922130 16068023 16078070 16699323 17001239 17437459
4091 17437459 18270501 18977724 20192306 21343476 22899073 25143173 28003079 29718451
4083 29718451 28552971 25785468 23085700 21503430 20430521 19097688 18357401 17812001
4075 17812001 17380647 17413692 17511176 17623775 17543718 17344265 17150390 16989774 16508206 17265271
4065 17265271 17527905 17584958 17315721 17786658 17895020 17633564 18306144 18562015 18142114 18231948
4055 18231948 18259110 18528609 18520993 18359144 19046473 19284826 19095590 19100503 19549043 19762490
$$ packed form
4121A4849461k94771K31202O22558N53441K59485l57128k11100N4730o17604P3960
4111A5164234k83783n06970L35995k11624j33182J8487O6747J54411K69026K34513
4101A5107854J50070J6597K06392K31594K09623J45893J0047O21253L01916M36220
4091A7437459Q33042P07223J214582J151170J555597K244100K859906J715372
4083B9718451j165480k767503k699768j582270j072909j332833p40287n45400
4075A7812001m31354L3045R7484J12599q0057j99453j93875j60616m81568P57065
4065A7265271K62634N7053k69237M70937J08362k61456O72580K55871m19901Q9834
4055A8231948K7162K69499p616j61849O87329K38353j89236M913M48540K13447
$$ plain form
4045 19762490 20209716 20342900 20848596 21190811 21671732 22637324 23266055 23257929 23539885 24313067
4035 24313067 25226462 25261345 25904696 26228144 26943369 27856972 28682741 29217660 30268401
4026 30268401 31179672 31795668 32257303 32717718 33862058 34914384 35735585 36711959 37824214
4017 37824214 39056195 40029150 41168580 42379198 43512162 45483193 47136337 48471002
4009 48471002 49395925 50614852 52149987 53868822 55155018 56166881 57771654 59821477
4001 59821477 61549093 62949021 64289274 65828677 67489259 68765049 70115182 71848262
3993 71848262 73194665 74404363 75601017 76896662 77700000 78647790 79688091 80580230 81277463
3984 81277463 82015847 82568127 83368418 83734445 84415389 84997366 84943384 84985310 84747424 84578863
$$ packed form
4045A9762490M47226J33184N05696L42215M80921R65592O28731q126K81956P73182
4035B4313067R13395L4883O43351L23448P15225R13603Q25769N34919J050741
4026C0268401R11271O15996M61635M60415J144340J052326Q21201R76374J112255
4017C7824214J231981R72955J139430J210618J132964J971031J653144J334665
4009D8471002R24923J218927J535135J718835J286196J011863J604773K049823
4001E9821477J727616J399928J340253J539403J660582J275790J350133J733080
3993G1848262J346403J209698J196654J295645Q03338R47790J040301Q92139O97233
3984H1277463P38384N52280Q00291L66027O80944N81977n3982M1926k37886j68561
$$ plain form
3974 84578863 84370595 84388960 84104251 83867217 83661877 82800329 82130441 81560183 81064173 80236528
3964 80236528 79364798 78467804 77392676 76448264 75532670 74335020 73045810 71900068 70865741
3955 70865741 69733469 68049911 66970761 66342663 65510701 63977520 62658991 61449526
3947 61449526 60272295 58707476 57602195 56350214 54742463 53001621 51656979 50726714
3939 50726714 49029960 47848814 46529268 45162040 43779452 42600399 41259352 40233396
3931 40233396 38985997 37379382 36023896 35608216 34495947 33107681 32331835 31486160 30482453
3922 30482453 29550522 28498597 27221261 26229581 25040087 24824634 24593191 23520870 22433222
3913 22433222 21919880 21455593 20522724 20058669 19420903 18830851 18595098 18308929 17939173
$$ packed form
3974H4578863k08268J8365k84709k37034k05340q61548o69888n70258m96010q27645
3964H0236528q71730q96994j075128r44412r15594j197650j289210j145742j034327
3955G0865741j132272j683558j079150o28098q31962j533181j318529j209465
3947F1449526j177231j564819j105281j251981j607751j740842j344642r30265
3939E0726714j696754j181146j319546j367228j382588j179053j341047j025956
3931D0233396j247399j606615j355486m15680j112269j388266p75846q45675j003707
3922C0482453r31931j051925j277336r91680j189494k15453k31443j072321j087648
3913B2433222n13342m64287r32869m64055o37766n90052k35753k86169l69756
$$ plain form
3904 17939173 17935962 17648226 17416945 17155084 16683128 16494327 16409687 16035551 15666798 16148446
3894 16148446 16108431 15868501 15919410 16030595 15734456 15988308 16060731 15569547 15765324 15944409
3884 15944409 15662033 15408974 15025324 14907061 15009246 14803451 14835915 14846862 14642896 14547905
3874 14547905 14177213 14393453 13903798 13447006 13705404 13659737 13567928 13608714 13125966 13227992
3864 13227992 12878942 12662711 13011373 12799012 13117588 13179334 13025150 13042103 12823114 12383494
3854 12383494 12155584 12203625 11953585 12017235 11879940 11637937 11363096 11302583 11252922 11070635
3844 11070635 10874627 10987385 10603207 10235880 10780750 10532779 10380330 10347125 10264027 10520127
3834 10520127 10406040 10004409 9868676 9858156 9823764 9707547 9438728 9463590 9135884 8960925
$$ packed form
3904A7939173l211k87736k31281k61861m71956j88801q4640l74136l68753M81648
3894A6148446m0015k39930N0909J11185k96139K53852P2423m91184J95777J79085
3884A5944409k82376k53059l83650j18263J02185k05795L2464J0947k03966r4991
3874A4547905l70692K16240m89655m56792K58398m5667r1809M0786m82748J02026
3864A3227992l49050k16231L48662k12361L18576O1746j54184J6953k18989m39620
3854A2383494k27910M8041k50040O3650j37295k42003k74841o0513m9661j82287
3844A1070635j96008J12758l84178l67327N44870k47971j52449l3205q3098K56100
3834A0520127j14087m01631j35733j0520l4392j16217k68819K4862l27706j74959
$$ plain form
3824 8960925 8842228 8752598 8997619 9086504 8980318 8757003 8831500 8755328 8473701 8210709
3814 8210709 8250503 8374913 8634671 8438929 8619553 8501463 8433897 8509325 8425443 8024712
3804 8024712 8047103 8435449 8354079 8588409 8627242 8208001 8458466 8099198 8458444 8052905
3794 8052905 8048031 8031679 8332154 8808376 8726292 8952207 8203174 8568277 8714799 8450759
3784 8450759 8316436 8535489 8624662 8750130 8915219 9256612 9141283 8688552 8998843 9501153
3774 9501153 9684017 9667259 10157940 10847992 11019325 10738160 10606509 10630247 10948484 10895327
3764 10895327 10865229 10953841 11235710 11268441 11323493 11630980 12073022 12180174 11888483 11919039
3754 11919039 12259618 12594360 12498794 12612337 12519139 12797348 13053257 13045790 13004900 13053448
$$ packed form
3824H960925j18697q9630K45021Q8885j06186k23315P4497p6172k81627k62992
3814H210709L9794J24410K59758j95742J80624j18090o7566P5428q3882m00731
3804H024712K2391L88346q1370K34330L8833m19241K50465l59268L59246m05539
3794H052905m874j6352L00475M76222q2084K25915p49033L65103J46522k64040
3784H450759j34323K19053Q9173J25468J65089L41393j15329m52731L10291N02310
3774I501153J82864j6758M90681O90052J71333k81165j31651K3738L18237n3157
3764A0895327l0098Q8612K81869L2731N5052L07487M42042J07152k91691L0556
3754A1919039L40579L34742r5566J13543r3198K78209K55909p467m0890M8548
$$ plain form
3744 13053448 13126221 13630237 13553108 13951694 14255711 14258083 14559208 14714713 15073012 15292879
3734 15292879 15739921 16142671 16347989 16425325 16576211 16378691 17171211 17872210 17676837 17749703
3724 17749703 18061070 18579842 18919058 19190938 19294543 19675404 19600379 20266200 20368281 20134913
3714 20134913 20304725 20397084 20697147 21165940 21635651 21884612 22297174 22626671 22605204 22539659
3704 22539659 22986456 23661984 24228814 24342905 24547817 25018572 25456132 25933145 26461712
3695 26461712 27084110 27442336 27769562 28163729 28883131 29628500 30224115 30763937 31812391
3686 31812391 32600405 33046396 33924500 34479273 35763727 36890731 37665794 38320909 39444253
3677 39444253 40085204 40687888 41421543 42595110 43702321 44679781 45989678 47105363 48269582
$$ packed form
3744A3053448P2773N04016p7129L98586L04017K372L01125J55505L58299K19867
3734A5292879M47042M02750K05318P7336J50886j97520P92520P00999j95373P2866
3724A7749703L11367N18772L39216K71880J03605L80861p5025O65821J02081k33368
3714B0134913J69812R2359L00063M68793M69711K48961M12562L29497k1467o5545
3704B2539659M46797O75528N66830J14091K04912M70755M37560M77013N28567
3695B6461712O22398L58226L27226L94167P19402P45369N95615N39822J048454
3686C1812391P88014M45991Q78104N54773J284454J127004P75063O55115J123344
3677C9444253O40951O02684P33655J173567J107211R77460J309897J115685J164219
$$ plain form
3668 48269582 49497435 50761097 51744274 53209563 54437422 55430904 56938017 58015941
3660 58015941 59096146 60801533 61870419 63166847 64670218 66175624 67609436 68700449
3652 68700449 70400802 71856268 73024972 74564660 76226761 77917773 78890859 79904136
3644 79904136 81167409 82519724 83773763 85417121 86777149 88145666 89219021 90075189
3636 90075189 91449884 92643916 93822001 95723379 97229728 98144553 99118962 100325881
3628 100325881 102084469 103651905 105206536 106965877 108906396 110809047 113249270 115021977
3620 115021977 117039775 119713967 122084256 124387160 127203700 129690960 132611633 134992438
3612 134992438 137460737 140127421 142588752 145471984 148588696 150939309 153739637 156544941
$$ packed form
3668D8269582J227853J263662R83177J465289J227859R93482J507113J077924
3660E8015941J080205J705387J068886J296428J503371J505406J433812J091013
3652F8700449J700353J455466J168704J539688J662101J691012R73086J013277
3644G9904136J263273J352315J254039J643358J360028J368517J073355Q56168
3636I0075189J374695J194032J178085J901378J506349R14825R74409J206919
3628A00325881J758588J567436J554631J759341J940519J902651K440223J772707
3620A15021977K017798K674192K370289K302904K816540K487260K920673K380805
3612A34992438K468299K666684K461331K883232L116712K350613K800328K805304
$$ plain form
3604 156544941 159003963 162080673 164913836 167761393 170882858 174048856 176774390 179636628
3596 179636628 182184338 185113452 187774041 190350303 192951679 195439095 198011080 199876207
3588 199876207 201951122 204604402 206779240 208623505 210388617 212274004 214019003 215391866
3580 215391866 216319300 217400607 218156889 219054573 219365720 219246361 219525369 219484901 219038084
3571 219038084 218369346 217793814 216626883 215299862 213530587 211881362 210442724 207690203
3563 207690203 205114976 202622941 199181570 195770314 192374712 188708782 185387043 181888051
3555 181888051 178010673 174631943 171096737 167139737 163581083 160490810 157418804 154126993
3547 154126993 150843529 147644928 145315018 142096163 138609118 135687695 132262088 129009693
$$ packed form
3604A56544941K459022L076710K833163K847557L121465L165998K725534K862238
3596A79636628K547710K929114K660589K576262K601376K487416K571985J865127
3588A99876207K074915K653280K174838J844265J765112J885387J744999J372863
3580B15391866R27434J081307P56282Q97684L11147j19359K79008m0468m46817
3571B19038084o68738n75532j166931j327021j769275j649225j438638k752521
3563B07690203k575227k492035l441371l411256l395602l665930l321739l498992
3555A81888051l877378l378730l535206l957000l558654l090273l072006l291811
3547A54126993l283464l198601k329910l218855l487045k921423l425607l252395
$$ plain form
3539 129009693 125528869 122588228 119808332 116798475 113795347 111292365 108761792 106278382
3531 106278382 104009399 101760234 99529238 97054331 94722806 91829450 89019830 86641156
3523 86641156 83974087 81372645 79222095 77301470 75052425 72991319 71556237 70116860
3515 70116860 68847420 67789462 66820805 65885079 64734361 63742716 62932649 62372341 61407230
3506 61407230 60658013 60562198 59799474 59504509 59339881 59244584 59354199 58879675 58900095 58564908
3496 58564908 58320310 58289356 58286016 58639486 59196051 59463728 59560426 60076466 60582206 61203304
3486 61203304 61968463 63285622 64498981 65603504 66935053 68015010 69673369 71550979
3478 71550979 73020147 74932674 76398888 78282595 80017248 82271751 83898083 84794715
$$ packed form
3539A29009693l480824k940641k779896l009857l003128k502982k530573k483410
3531A06278382k268983k249165k230996k474907k331525k893356k809620k378674
3523H6641156k667069k601442k150550j920625k249045k061106j435082j439377
3515G0116860j269440j057958r68657r35726j150718r91645q10067n60308r65111
3506F1407230p49217r5815p62724k94965j64628r5297J09615m74524K0420l35187
3496E8564908k44598l0954l340L53470N56565K67677R6698N16040N05740O21098
3486F1203304P65159J317159J213359J104523J331549J079957J658359J877610
3478G1550979J469168J912527J466214J883707J734653K254503J626332Q96632
$$ plain form
3470 84794715 85498488 85750937 86275985 86009386 86037630 85436361 84783871 84420598 83362249
3461 83362249 82096184 80952563 79627965 77849336 76027974 73641202 70989863 68282113
3453 68282113 65196008 62455624 59851862 57087266 54032106 51774996 49529988 47236081
3445 47236081 44798457 42374199 40506820 38791788 37194841 35382314 33616068 32173268
3437 32173268 30669138 29305167 27820080 27040765 26669567 25380075 24028995 23445479 22674239
3428 22674239 21973775 21287206 20924027 20712663 20038719 19992214 19696435 19436012 19041558 18754307
3418 18754307 18260970 18158565 18188182 17979638 17295640 17257951 17460287 17381594 16795616 16631706
3408 16631706 16266298 15698009 15499570 15273022 15086105 14579647 14509164 14172801 14006151 14153328
$$ packed form
3470H4794715P03773K52449N25048k66599K8244o01269o52490l63273j058349
3461H3362249j266065j143621j324598j778629j821362k386772k651339k707750
3453F8282113l086105k740384k603762k764596l055160k257110k245008k293907
3445D7236081k437624k424258j867379j715032j596947j812527j766246j442800
3437C2173268j504130j363971j485087p79315l71198j289492j351080n83516p71240
3428B2674239p00464o86569l63179k11364o73944m6505k95779k60423l94454k87251
3418A8754307m93337j02405K9617k08544o83998l7689K02336p8693n85978j63910
3408A6631706l65408n68289j98439k26548j86917n06458p0483l36363j66650J47177
$$ plain form
3398 14153328 13917851 13477358 13193805 12938481 12964294 12908336 12810359 12117076 11845157 11677044
3388 11677044 11278208 10901725 10454652 10714408 10654215 10128486 9949715 10007027 10067148 9723934
3378 9723934 9321696 9291803 9599377 9215628 9298306 9201239 8884159 8904221 8690026 8567069
3368 8567069 8742743 8420535 8143076 8126985 8266797 8479164 8503911 8268705 8023570 8027308
3358 8027308 8134584 8207742 8176970 7795770 7324634 6879436 7327121 7256336 6957539 7220248
3348 7220248 7167404 7142525 7237325 7081968 7535424 7379946 6901534 7029952 6784105 6859414
3338 6859414 6930018 6909542 6810996 6853480 6544152 6754664 6918982 6632558 6660550 7157483
3328 7157483 7162004 7174011 7126175 7289639 7194706 6882721 6731529 6783084 7238558 6960675 6983406
$$ packed form
3398A4153328k35477m40493k83553k55324K5813n5958r7977o93283k71919j68113
3388A1677044l98836l76483m47073K59756o0193n25729j78771N7312O0121l43214
3378I723934m02238k9893L07574l83749Q2678r7067l17080K0062k14195j22957
3368H567069J75674l22208k77459j6091J39812K12367K4747k35206k45135L738
3358H027308J07276P3158l0772l81200m71136m45198M47685p0785k98797K62709
3348G220248n2844k4879R4800j55357M53456j55478m78412J28418k45847P5309
3338F859414P0604k0476r8546M2484l09328K10512J64318k86424K7992M96933
3328G157483M521J2007m7836J63464r4933l11985j51192N1555M55474k77883K2731
$$ plain form
3317 6983406 7062402 7386747 7252941 6783127 7095394 7307801 7262789 6954937 6897572 7048229
3307 7048229 7015759 6753434 6974259 6890406 7224117 7054248 7006050 6821408 7257943 7776886
3297 7776886 7990163 7979183 8232242 8300119 8293832 8311131 8176823 8235020 8394869 8438399 8530569
3286 8530569 8614888 8541188 9128269 9770016 9356031 9361730 9487461 9460354 9446061 9471766 9517803
3275 9517803 9620755 9913173 10337589 10344421 10363706 10761039 11658623 12001851 11794188 12427442
3265 12427442 12742614 13244202 13574550 14199463 14544132 15404756 16286525 17172801 17617932
3256 17617932 17772010 17730280 17938941 17684062 16183996 14966738 14406627 13055079 12031535
3247 12031535 11747053 11260219 10574275 10276608 10095065 9852408 9744177 9469846 9209471
$$ packed form
3317F983406P8996L24345j33806m69814L12267K12407m5012l07852n7365J50657
3307G048229l2470k62325K20825q3853L33711j69869m8198j84642M36535N18943
3297G776886K13277j0980K53059O7877o287J7299j34308N8197J59849M3530R2170
3286H530569Q4319p3700N87081O41747m13985N699J25731k7107j4293K5705M6037
3275I517803J02952K92418M24416O832J9285L97333Q97584L43228k07663O33254
3265A2427442L15172N01588L30348O24913L44669Q60624Q81769Q86276M45131
3256A7617932J54078m1730K08661k54879j500066j217258n60111j351548j023544
3247A2031535k84482m86834o85944k97667j81543k42657j08231k74331k60375
$$ plain form
3238 9209471 8953099 8276548 8070952 7621585 7256373 7062646 6607529 6014400 6330159 6036191
3228 6036191 6078468 6037217 6294693 6199388 5854357 5953872 5457170 5138962 4707624 5139239
3218 5139239 5094511 4731592 4427351 4231522 4368025 4579454 4731657 4394599 4349117 4182176
3208 4182176 4560692 4668468 3876159 3974323 3930934 3817988 3907957 3987026 4076964 4142096 4255215
3197 4255215 4029048 3770711 4221043 3992141 4190024 3735168 3538179 3602989 3707544 3543300
3187 3543300 3547790 3593458 3697367 3671184 3572282 3685090 3237507 2961297 2947966 2834279 3157093
3176 3157093 3501970 3245543 3378109 3063837 2617164 2765049 3195953 3479669 3156824 2793494
3166 2793494 3232462 3083591 3139579 2988259 3173942 3312996 3137938 2867217 2869233 2858585
$$ packed form
3238I209471k56372o76551k05596m49367l65212j93727m55117n93129L15759k93968
3228F036191M2277m1251K57476r5305l45031R9515m96702l18208m31338M31615
3218E139239m4728l62919l04241j95829J36503K11429J52203l37058m5482j66941
3208D182176L78516J07776p92309R8164m3389j12946Q9969P9069Q9938O5132J13119
3197D255215k26167k58337M50332k28902J97883m54856j96989O4810J04555j64244
3187C543300M490M5668J03909k6183r8902J12808m47583k76210j3331j13687L22814
3176C157093L44877k56427J32566l14272m46673J47885M30904K83716l22845l63330
3166B793494M38968j48871N5988j51320J85683J39054j75058k70721K016j0648
$$ plain form
3156 2858585 2539221 2493818 2601937 2055859 2409436 3020563 2857583 2611265 2496494 2616429
3146 2616429 2364158 2476592 2952037 2628214 2136442 2269288 2135353 2136295 2214322 2418132
3136 2418132 2507189 2386316 1937758 2132224 2054650 2011448 2070478 2369860 2736281 2326480
3126 2326480 1948719 2624419 2196514 1980384 2139909 2301211 2216087 2038223 2137167 2335059
3116 2335059 2343798 2140431 2074118 2240165 2119581 2075195 2062128 2160752 2174570 2225196 2647900
3105 2647900 2326718 2347023 2075374 2157822 2671946 2690900 2576266 2548946 1928798 2252269
3095 2252269 2366971 2354254 2367231 2249498 2070636 2121275 2296746 2057443 2263701 2334026
3085 2334026 2435158 2357764 2285692 2556289 2648146 2511214 2405458 2329780 1827252 1826556 2215594
$$ packed form
3156B858585l19364m5403J08119n46078L53577O11127j62980k46318j14771J19935
3146B616429k52271J12434M75445l23823m91772J32846j33935R42P8027K03810
3136B418132Q9057j20873m48558J94466p7574m3202N9030K99382L66421m09801
3126B326480l77761O75700m27905k16130J59525J61302q5124j77864R8944J97892
3116B335059Q739k03367o6313J66047j20584m4386j3067R8624J3818N0626M22704
3105B647900l21182K0305k71649Q2448N14124J8954j14634k7320o20148L23471
3095B252269J14702j2717J2977j17733j78862N0639J75471k39303K06258P0325
3085B334026J01132p7394p2072K70597R1857j36932j05756p5678n02528o96L89038
$$ plain form
3074 2215594 1990858 2322813 2341124 2214459 2124348 1461186 1877821 2275861 2286059 2093795
3064 2093795 1748974 1981864 2365498 2241019 2058359 2138791 1858072 1792355 1914147 1968762
3054 1968762 1725952 1500767 1676894 2009268 2380081 1778282 1507442 1303820 1626929 1977774
3044 1977774 2044539 2068139 2044467 1818197 1596685 1942384 2158109 2096286 1922922 1841040
3034 1841040 2054961 2465609 2130825 1680964 1954375 1989102 2424337 2515671 2422222 2417988
3024 2417988 2018120 2360129 2149810 1871965 1980811 1781918 1798183 1977755 2000038 2323281
3014 2323281 2604869 2690326 2653447 2816696 2461324 2461913 2663286 2326441 2437398 2416658 2016438
3003 2016438 2361689 2285296 2348204 2390801 2363985 2456095 2399517 2466188 2416554 2548723 2729012
$$ packed form
3074B215594k24736L31955J8311j26665r0111o63162M16635L98040J0198j92264
3064B093795l44821K32890L83634j24479j82660Q0432k80719o5717J21792N4615
3054A968762k42810k25185J76127L32374L70813o01799k70840k03622L23109L50845
3044A977774O6765K3600k3672k26270k21512L45699K15725o1823j73364q1882
3034A841040K13921M10648l34784m49861K73411L4727M35235R1334r3449m234
3024B417988l99868L42009k10319k77845J08846j98893J6265J79572K2283L23243
3014B323281K81588Q5457l6879J63249l55372N89K01373l36845J10957k0740m00220
3003B016438L45251p6393O2908M2597k6816R2110n6578O6671m9634J32169J80289
$$ plain form
2992 2729012 2853106 3100324 2598721 2218546 2240537 2428616 2925075 3029430 3073906 3040666
2982 3040666 3335562 3423773 3720966 3724060 3952087 3937817 3289287 3369575 3044639 2908962
2972 2908962 2899424 3067171 3092593 2897957 2792837 2940376 2871846 2395018 2339009 2522982
2962 2522982 2570810 2342024 2301176 2428821 2725903 2545946 2413074 2719351 2891469 2608241
2952 2608241 2940572 2939881 2757719 3113062 2969437 2629480 2773706 3340025 3712055 3559662
2942 3559662 3713851 3956354 4340957 4500526 3945323 3957539 3615634 3384569 3544721 3553421
2932 3553421 3245831 3134465 2837679 2529340 2659791 2897401 2833872 2629721 2864134 2977865
2922 2977865 3190432 3002234 2951741 2527701 3233963 3182797 2925317 3236860 3203101 3513391
$$ packed form
2992B729012J24094K47218n01603l80175K1991J88079M96459J04355M4476l3240
2982C040666K94896Q8211K97193L094K28027j4270o48530Q0288l24936j35677
2972B908962r538J67747K5422j94636j05120J47539o8530m76828n6009J83973
2962B522982M7828k28786m0848J27645K97082j79957j32872L06277J72118k83228
2952B608241L32331o91j82162L55343j43625l39957J44226N66319L72030j52393
2942C559662J54189K42503L84603J59569n55203J2216l41905k31065J60152Q700
2932C553421l07590j11366k96786l08339J30451K37610o3529k04151K34413J13731
2922B977865K12567j88198n0493m24040P06262n1166k57480L11543l3759L10290
$$ plain form
2912 3513391 3358914 3585267 3412372 3372844 3196438 3236453 3112288 2794318 2421785 2207587
2902 2207587 2749338 2928726 2945246 3076726 2556512 2410248 2681763 2676324 2804747 2344356
2892 2344356 2583336 2576443 2723726 2793875 2887210 3032003 2959955 2806899 2617386 2721758
2882 2721758 2619213 2562232 2477362 2462674 2482116 2534753 2261795 2674340 2986917 3125932
2872 3125932 3438463 3449673 3643689 3589583 3557371 3342407 3332564 3122761 3174626 3106726 2786095
2861 2786095 3149882 2564704 2200845 2521801 2493619 2566540 2382523 2138179 2328522 2092241
2851 2092241 2236352 2166983 2211739 2219450 2034531 1506820 1400332 1013030 974398 1290631
2841 1290631 1604175 1176115 871144 1120897 1157667 918332 1153792 1270781 1264697 841153
$$ packed form
2912C513391j54477K26353j72895l9528j76406M0015j24165l17970l72533k14198
2902B207587N41751J79388J6520J31480n20214j46264K71515n439J28423m60391
2892B344356K38980o893J47283P0149R3335J44793p2048j53056j89513J04372
2882B721758j02545n6981q4870j4688J9442N2637k72958M12545L12577J39015
2872C125932L12531J1210J94016n4106l2212k14964r843k09803N1865o7900l20631
2861B786095L63787n85178l63859L20956k8182P2921j84017k44344J90343k36281
2851B092241J44111o9369M4756P711j84919n27711j06488l87302l8632L16233
2841A290631L13544m28060l04971K49753L6770k39335K35460J16989o084m23544
$$ plain form
2831 841153 790609 743081 654173 563377 16480 168308 -67766 375453 534930 565109 449487
2820 449487 171173 248521 396056 238207 540442 47644 123235 350848 567571 107801
2810 107801 204873 509549 131317 287184 584898 361537 487534 799598 508245 593822
2800 593822 598090 438711 476094 574700 528882 320754 356373 361245 493799 424005 -108304
2789 -108304 21512 353414 639372 499289 477913 367537 342501 578099 384394 24313
2779 24313 -15533 487102 459611 293007 209509 133096 -65303 -191440 279464 190832 137912
2768 137912 -144155 -267276 -186899 -210643 -377092 -86863 59752 -81110 -288645 94668
2758 94668 -90034 178173 301483 298402 282506 -110846 42854 86380 -101219 384056 428552
$$ packed form
2831H41153n0544m7528q8908r0796n46897J51828k36074M43219J59477L0179j15622
2820D49487k78314P7348J47535j57849L02235m92798P5591K27613K16723m59770
2810A07801R7072L04676l78232J55867K97714k23361J25997L12064k91353Q5577
2800E93822M268j59379L7383R8606m5818k08128L5619M872J32554o9794n32309
2789a08304J29816L31902K85958j40083k1376j10376k5036K35598j93705l60081
2779B4313l9846N02635k7491j66604q3498p6413j98399j26137M70904q8632n2920
2768A37912k82067j23121Q0377k3744j66449K90229J46615j40862k07535L83313
2758I4668j84702K68207J23310l081j5896l93352J53700M3526j87599M85275M4496
$$ plain form
2747 428552 206597 400332 89181 56948 -7413 -50616 207193 -193030 -258363 190237
2737 190237 236765 216171 240244 98099 265223 372582 -50552 -314788 -241047 50029
2727 50029 -93696 -206539 -463512 -152950 144178 172458 -436635 -129972 -73467 -230233
2717 -230233 -259118 -136817 -81440 -123346 -15448 197777 379403 702848 354129 268882
2707 268882 176825 42634 -251846 -280073 -303586 -296971 -267749 225898 491985 316304 290005
2696 290005 373841 586887 51753 180009 -40369 58454 380991 318307 407660 247540
2686 247540 -112349 219055 225994 -80892 -227908 -95782 212915 602761 99975 -217591
2676 -217591 -222782 -193077 -80766 142471 385964 489852 531742 157249 -63466 54143
$$ packed form
2747D28552k21955J93735l11151l2233o4361m3203K57809m00223o5333M48600
2737A90237M6528k0594K4073j42145J67124J07359m23134k64236P3741K91076
2727E0029j43725j12843k56973L10562K97128K8280o09093L06663N6505j56766
2717b30233k8885J22301N5377m1906J07898K13225J81626L23445l48719q5247
2707B68882r2057j34191k94480k8227k3513O615K9222M93647K66087j75681k6299
2696B90005Q3836K13046n35134J28256k20378R8823L22537o2684Q9353j60120
2686B47540l59889L31404O939l06886j47016J32126L08697L89846n02786l17566
2676b17591n191K9705J12311K23237K43493J03888M1890l74493k20715J17609
$$ plain form
2666 54143 421305 606907 655674 412202 513464 397371 96937 -15212 327930 695108
2656 695108 517873 322000 -163860 139311 458824 678670 241555 -267652 129729 44922
2646 44922 102121 649398 694585 724707 635757 486707 578078 776489 712317 801782 619422
2635 619422 572766 306548 425273 673790 888504 1158783 689520 803008 549396 518236
2625 518236 434984 189949 342911 412692 396998 414948 485656 473079 367254 828271 831418
2614 831418 418507 845152 858247 344236 157158 394809 409586 426577 221030 575529
2604 575529 891180 782114 928333 713159 598015 697879 846089 521013 222200 696399
2594 696399 729126 706532 331408 443436 906638 649089 507664 136220 259592 552778
$$ packed form
2666E4143L67162J85602M8767k43472J01262j16093l00434j12149L43142L67178
2656F95108j77235j95873m85860L03171L19513K19846m37115n09207L97381q4807
2646D4922N7199N47277M5187L0122q8950j49050R1371J98411o4172Q9465j82360
2635F19422m6656k66218J18725K48517K14714K70279m69263J13488k53612l1160
2625E18236q3252k45035J52962O9781j5694J7950P0708j2577j05825M61017L147
2614H31418m12911M26645J3095n14011j87078K37651J4777J6991k05547L54499
2604E75529L15651j09066J46219k15174j15144R9864J48210l25076k98813M74199
2594F96399L2727k2594l75124J12028M63202k57549j41425l71444J23372K93186
$$ plain form
2584 552778 454807 91472 471689 412779 -43816 26704 469590 864621 899058 503606
2574 503606 160472 248063 437602 665198 160188 16963 -117622 129985 -193774 83237
2564 83237 71187 385443 475296 368700 302010 -523244 -238192 -255193 -142791 81554 -86547
2553 -86547 34754 -209110 -83078 481365 413980 491498 204040 -85773 -261563 -357452
2543 -357452 -115648 61004 -219453 -32650 -408289 -264108 -36467 -174973 -13215 222174
2533 222174 352278 133549 -410286 -212609 -239819 78154 108562 -86798 240336 95467
2523 95467 -373163 -279356 -79199 -201261 -119900 -99111 11280 104216 -227034 -67505 17850
2512 17850 255698 605005 438744 122089 -41872 -34245 -40242 -89417 -270717 -260385 -442668
$$ packed form
2584E52778r7971l63335L80217n8910m56595P0520M42886L95031L4437l95452
2574E03606l43134Q7591J89539K27596n05010j43225j34585K47607l23759K77011
2564H3237j2050L14256Q9853j06596o6690q25254K85052j7001J12402K24345j68101
2553h6547J21301k43864J26032N64443o7385P7518k87458k89813j75790r5889
2543c57452K41804J76652k80457J86803l75639J44181K27641j38506J61758K35389
2533B22174J30104k18729n43835J97677k7210L17973L0408j95360L27134j44869
2523I5467m68630R3807K00157j22062Q1361K0789J10391R2936l31250J59529Q5355
2512A7850K37848L49307j66261l16655j63961P627n997m9175j81300J0332j82283
$$ plain form
2501 -442668 -421873 -119925 -60428 45637 -384538 -670478 -265305 -433329 -569314 104426
2491 104426 -27436 111049 -32077 -490130 -356033 -373955 -285374 -358342 -415855 -297864
2481 -297864 54807 -39179 55738 -269440 -414896 -464898 -264552 -239581 16706 -2553 -392038
2470 -392038 51632 556036 278220 20201 -198327 93221 -61335 -284135 -53906 129599
2460 129599 -153085 -18128 44900 -13767 -360522 -96153 -138024 7875 -298470 -242838
2450 -242838 80559 223513 25189 -195402 -282086 -92822 162340 -50378 20212 -92487
2440 -92487 -406477 -443767 85402 218041 31273 -468366 -461210 -105781 -230031 -518341
2430 -518341 -11001 -146856 49399 -46526 -104865 -48579 -24304 -332818 -16546 104183
$$ packed form
2501d42668K0795L01948N9497J06065m30175k85940M05173j68024j35985O73740
2491A04426j31862J38485j43126m58053J34097j7922Q8581p2968n7513J17991
2481b97864L52671r3986R4917l25178j45456n0002K00346K4971K56287j9259l89485
2470c92038M43670N04404k77816k58019k18528K91548j54556k22800K30229J83505
2460A29599k82684J34957O3028n8667l46755K64369m1871J45899l06345N5632
2450b42838L23397J42954j98324k20591q6684J89264K55162k12718P0590j12699
2440i2487l13990l7290N29169J32639j86768m99639P156L55429j24250k88310
2430e18341N07340j35855J96255r5925n8339N6286K4275l08514L16272J20729
$$ plain form
2420 104183 180362 -18180 -127742 -318836 67801 -57879 -356297 -97608 41121 -101909
2410 -101909 79152 -38133 -14430 217463 22721 -350590 -355758 23117 17198 -80130 224551
2399 224551 239164 31281 169411 -139471 -304925 302463 802818 455287 450695 390405
2389 390405 502523 507223 488954 771460 774203 807173 502123 577629 821685 877455 813952
2378 813952 523410 539336 308971 147341 389323 247711 305663 663268 507021 396320
2368 396320 -48259 526313 402739 -4879 208301 408225 175305 153529 213701 60311
2358 60311 478239 575872 421771 385178 96876 72056 381945 220466 -39233 268244
2348 268244 500671 565121 540377 374468 392132 264160 -227644 -209140 45209 318074
$$ packed form
2420A04183P6179j98542j09562j91094L86637j25680k98418K58689J38729j43030
2410a01909J81061j17285K3703K31893j94742l73311n168L78875n919r7328L04681
2399B24551J4613k07883J38130l08882j65454O07388N00355l47531m592o0290
2389C90405J12118M700j8269K82506K743L2970l05050P5506K44056N5770o3503
2378H13952k90542J5926k30365j61630K41982j41612N7952L57605j56247j10701
2368C96320m44579N74572j23574m07618K13180J99924k32920k1776O0172j53390
2358F0311M17928R7633j54101l6593k88302k4820L09889j61479k59699L07477
2348B68244K32427O4450k4744j65909J7664j27972m91804J8504K54349K72865
$$ plain form
2338 318074 71138 -225722 119014 280562 -78517 131385 234605 259332 9181 -400194
2328 -400194 -60427 -172838 63924 88908 -128156 133556 373332 173521 242937 401980
2318 401980 326010 180620 62744 243381 9772 344505 528323 620784 366707 144374
2308 144374 150689 71097 -153278 -124898 -272994 36774 34349 -24980 -63964 -178181 -183179
2297 -183179 12852 200513 -53912 212044 343829 94834 -158025 208964 154645 37688
2287 37688 105222 593063 658067 524553 709416 733160 626478 592277 470787 112020 153400
2276 153400 210572 198970 130378 139234 -3621 187454 604601 474960 287622 -251 91530
2265 91530 250986 526634 117552 231149 260814 60108 91822 84732 185895 594877 400181
$$ packed form
2338C18074k46936k96860L44736J61548l59079K09902J03220K4727k50151m09375
2328d00194L39767j12411K36762K4984k17064K61712K39776j99811O9416J59043
2318D01980p5970j45390j17876J80637k33609L34733J83818R2461k54077k22333
2308A44374O315p9592k24375K8380j48096L09768k425n9329l8984j14217m998
2297a83179J96031J87661k54425K65956J31785k48995k52859L66989n4319j16957
2287C7688O7534M87841O5004j33514J84863K3744j06682l4201j21490l58767M1380
2276A53400N7172j1602o8592Q856j42855J91075M17147j29641j87338k87873R1781
2265I1530J59456K75648m09082J13597K9665k00706L1714p090J01163M08982j94696
$$ plain form
2254 400181 507435 404843 840701 921374 887114 841267 621860 547388 546856 538677 304250
2243 304250 298420 390200 198279 223526 128386 500240 840124 728811 799825 839045 645701
2232 645701 606154 729751 602768 837989 956766 555367 539993 789835 826814 817108 790947
2221 790947 830850 738022 661509 239743 460060 507143 875888 939881 829719 939460 952843
2210 952843 838026 671105 841216 1218370 1437765 1860984 1531450 1466769 1674791 1416798
2200 1416798 1543222 1665753 1872630 1754863 1327300 1395416 1620747 1714591 1736144 1944190
2190 1944190 1784687 1582625 1773446 2217409 2297902 2244859 2256320 2567766 2787025 2597485
2180 2597485 2340095 2551958 2499938 2483909 2297522 2356918 2360057 2005557 2372607 2456635 2904771
$$ packed form
2254D00181J07254j02592M35858Q0673l4260m5847k19407p4472n32q179k34427
2243C04250n830R1780j91921K5247r5140L71854L39884j11313P1014L9220j93344
2232F45701l9547J23597j26983K35221J18777m01399j5374K49842L6979r706k6161
2221G90947L9903r2828p6513m21766K20317M7083L68745O3993j10162J09741J3383
2210I52843j14817j66921J70111L77154K19395M23219l29534o4681K08022k57993
2200A416798J26424J22531K06877j17767m27563O8116K25331R3844K1553K08046
2190A944190j59503k02062J90821M43963Q0493n3043J1461L11446K19259j89540
2180B597485k57390K11863n2020j6029j86387N9396L139l54500L67050Q4028M48136
$$ plain form
2169 2904771 2845102 2834308 3037731 2566267 2752949 3240777 3405049 3489145 4042826 3811518
2159 3811518 3536468 4099077 4263232 4557485 5119231 5375882 5667849 5752622 5761381 5736778
2149 5736778 5644294 6228657 6645882 6959475 7257138 7463728 7491613 7605170 8174767 8471779
2139 8471779 9504199 10623018 11406987 12376217 13599090 14594302 15647012 16755428 17609905
2130 17609905 18497630 19819403 21399906 23504561 26256473 29714629 33553339 38376619
2122 38376619 45743447 55731600 68950903 86861729 104703377 104437143 85426248 64768779
2114 64768779 49532438 39532852 32459675 26810292 22937219 19863604 17968760 16234755
2106 16234755 14800907 14163110 13277574 12491155 11478486 10658805 9703791 8951728 8454053
$$ packed form
2169B904771n9669j0794K03423m71464J86682M87828J64272Q4096N53681k31308
2159C811518k75050N62609J64155K94253N61746K56651K91967Q4773Q759k4603
2149E736778r2484N84363M17225L13593K97663K06590K7885J13557N69597K97012
2139H471779J032420J118819P83969R69230J222873R95212J052710J108416Q54477
2130A7609905Q87725J321773J580503K104655K751912L458156L838710M823280
2122C8376619P366828R988153J3219303J7910826J7841648k66234j9010895k0657469
2114F4768779j5236341r999586p073177n649383l873073l073615j894844j734005
2106A6234755j433848o37797q85536p86419j012669q19681r55014p52063m97675
$$ plain form
2097 8454053 7869123 7625415 7372853 7049075 6583789 6135954 5327790 4769619 4432745 4530416
2087 4530416 4077218 3883509 3934046 3727387 3660970 3467547 3354203 3502965 3304657 3262670
2077 3262670 3342562 3123903 3066738 2782898 2838355 2595748 2414152 2366139 2153610 2070007
2067 2070007 1998966 1713166 1897468 1877015 1545170 1399232 1354659 1698014 1765650 1970285
2057 1970285 1767569 1688845 2101227 1559397 1711065 1315383 1173738 1028826 1502985 1803535
2047 1803535 1819985 1542368 997053 1091247 1244776 1251024 793287 593280 518382 696144
2037 696144 785550 564899 748873 796259 742183 1273578 940910 783397 557813 392075
2027 392075 554314 1096585 1153116 836255 877926 758010 723854 908647 790185 304633
$$ packed form
2097H454053n84930k43708k52562l23778m65286m47835q08164n58171l36874R7671
2087D530416m53198j93709N0537k06659o6417j93423j13344J48762j98308m1987
2077C262670P9892k18659n7165k83840N5457k42607j81596m8013k12529q3603
2067B070007p1041k85800J84302k0453l31845j45938m4573L43355O7636K04635
2057A970285k02716p8724M12382n41830J51668l95682j41645j44912M74159L00550
2047A803535J6450k77617n45315R4194J53529O248m57737k00007p4898J77762
2037F96144Q9406k20651J83974M7386n4076N31395l32668j57513k25584j65738
2027C92075J62239N42271N6531l16861M1671j19916l4156J84793j18462m85552
$$ plain form
2017 304633 372860 532965 799777 247770 -147463 312194 430967 627557 562651 685268
2007 685268 636018 613642 350890 462691 308630 168760 214773 416330 381521 554275
1997 554275 569015 832288 823250 963682 925902 639531 -97517 354565 704243 536528
1987 536528 206021 79821 526255 407539 758093 518566 144682 -6911 403853 466944
1977 466944 370102 222306 118497 240032 594886 655104 791140 1029157 698914 706748
1967 706748 512008 440876 796833 660412 457265 230927 300558 93510 151155 108229
1957 108229 -23984 118263 8776 -185828 36725 402656 444538 39923 3056 55648
1947 55648 93304 148852 306928 56479 311249 148012 -12370 63328 -39005 -153178
$$ packed form
2017C04633O8227J60105K66812n52007l95233M59657J18773J96590o4906J22617
2007F85268m9250k2376k62752J11801j54061j39870M6013K01557l4809J72754
1997E54275J4740K63273r038J40432l7780k86371p37048M52082L49678j67715
1987E36528l30507j26200M46434j18716L50554k39527l73884j51593M10764O3091
1977D66944r6842j47796j03809J21535L54854O0218J36036K38017l30243P834
1967G06748j94740p1132L55957j36421k03147k26338O9631k07048N7645m2926
1957A08229j32213J42247j09487j94604K22553L65931M1882m04615l6867N2592
1947E5648L7656N5548J58076k50449K54770j63237j60382P5698j02333j14173
$$ plain form
1937 -153178 -174369 -307810 72957 279680 310441 18985 263958 81445 210198 410005
1927 410005 426782 357665 -1249 19473 -81080 20916 114498 65437 -163902 -205827 -154455
1916 -154455 -76869 -4366 329819 -23893 -32686 -124796 219769 -162189 -37227 187867 -224949
1905 -224949 -423593 281184 478215 -198770 -397823 -282604 -49103 35092 308762 375178
1895 375178 347567 282568 130329 374580 436482 -129214 -131552 -99296 -276822 -294668 -404007
1884 -404007 -410293 -462398 105384 465592 232852 104028 -154337 -188457 -97921 108111 -191729
1873 -191729 247649 428230 -101014 -252463 -444476 -507221 91891 -21338 75498 -30836
1863 -30836 -33519 221146 166254 52382 475593 274547 -215532 204861 177585 -113550 109540
$$ packed form
1937a53178k1191j33441L80767K06723L0761k91456K44973j82513J28753J99807
1927D10005J6777o9117l58914K0722j00553J01996R3582m9061k29339m1925N1372
1916a54455P7586P2503L34185l53712q793r2110L44565l81958J24962K25094m12816
1905b24949j98644P04777J97031o76985j99053J15219K33501Q4195K73670O6416
1895C75178k7611o4999j52239K44251O1902n65696k338L2256j77526j7846j09339
1884d04007o286n2105N67782L60208k32740j28824k58365l4120R0536K06032k99840
1873a91729M39378J80581n29244j51449j92013o2745N99112j13229R6836j06334
1863c0836k683K54665n4892j13872M23211k01046m90079M20393k7276k91135K23090
$$ plain form
1852 109540 315902 500899 486891 320277 380042 172033 240192 118415 492817 487178 155416
1841 155416 43519 149661 -250385 -231597 -109393 -310697 -8671 -101608 -107048 -166634 -107111
1830 -107111 -446165 -406072 50083 -148267 -213503 -371406 305998 292441 220596 154261 -399209
1819 -399209 -381473 -268627 -27147 205132 -324720 -7943 107636 280090 128853 382905
1809 382905 227275 -175107 -158332 -79988 -165226 -424022 -369995 -231986 -23549 -333189
1799 -333189 -462597 -196922 -177856 -311592 -354488 7909 121898 -52817 -418328 -422099
1789 -422099 -122552 -472596 -412752 -115871 82175 31040 -92764 -272803 -244867 -383534
1779 -383534 -261979 -62191 -209841 -418861 -27670 6618 -440257 -301247 -568141 -533373
$$ packed form
1852A09540K06362J84997j4008j66614N9765k08009O8159j21777L74402n639l31762
1841A55416j11897J06142m00046J8788J22204k01304L02026r2937n440n9586N9523
1830a07111l39054M0093M56155j98350o5236j57903O77404j3557p1845o6335n53470
1819c99209J7736J12846K41480K32279n29852L16777J15579J72454j51237K54052
1809C82905j55630m02382J6775P8344q5238k58796N4027J38009K08437l09640
1799c33189j29408K65675J9066j33736m2896L62397J13989j74715l65511l771
1789d22099K99547l50044N9844K96881J98046n1135j23804j80039K7936j38667
1779c83534J21555J99788j47650k09020L91191L4288m46875J39010k66894L4768
$$ plain form
1769 -533373 -357519 -270618 -222814 93338 -185376 -697143 -671483 -510724 -147166 -537362
1759 -537362 -658809 -291919 -194983 -413428 -405965 -407378 -125025 -177816 -215717 237943 -83384
1748 -83384 -154321 -202098 -84709 306015 66909 107452 -176826 130341 -302791 -574373
1738 -574373 -334754 -261859 5249 89619 -110124 -78929 -484644 -400260 -32399 109564
1728 109564 18796 -59017 -297387 -204854 -96407 -282301 -170771 -200948 -159654 -247120 -209214
1717 -209214 -183169 -72531 -241998 -51243 226302 209032 152972 -73001 10591 106756 198901
1706 198901 -69811 -175676 -178380 -119596 -113160 -194193 220769 70825 -257413 -491241 -323617
1695 -323617 -29470 26070 -458918 -496090 -546257 -562597 79191 57315 -220467 -75289 170044
$$ packed form
1769e33373J75854Q6901M7804L16152k78714n11767K5660J60759L63558l90196
1759e37362j21447L66890R6936k18445P463j413K82353n2791l7901M53660l21327
1748h3384p0937m7777J17389L90724k39106M0543k84278L07167m33132k71582
1738e74373K39619P2895K67108Q4370j99743L1195m05715Q4384L67861J41963
1728A09564r0768p7813k38370R2533J08447j85894J11530l0177M1294q7466L7906
1717b09214K6045J10638j69467J90755K77545j7270n6060k25973Q3592R6165R2145
1706A98901k68712j05865k704N8784O436q1033M14962j49944l28238k33828J67624
1695c23617K94147N5540m84988l7172n0167j6340O41788k1876k77782J45178K45333
$$ plain form
1684 170044 90302 45093 -97306 -83208 -227229 -202817 -37112 -95955 -37249 144865 177093
1673 177093 222096 55532 -30381 195146 -130902 -215070 -567797 -621028 -141082 -290661
1663 -290661 -228542 -67387 -77694 -28384 188215 -18452 -25360 -190794 -86788 348642 179075
1652 179075 109279 32877 -290463 -133093 -430185 -159564 -74945 -412280 162325 -55495
1642 -55495 -242309 -269473 -529792 -62067 218786 195896 -105579 -256570 -135630 32112
1632 32112 -278945 34673 306227 51848 182023 -277677 22297 49526 286484 117715
1622 117715 46267 -45297 288447 230913 161227 72499 470564 138046 144399 300335 -41633
1611 -41633 -455371 -452271 -312849 -506019 -100251 292664 24030 293729 163633 371961
$$ packed form
1684A70044p9742m5209j42399J4098j44021K4412J65705n8843N8706J82114L2228
1673A77093M5003j66564q5913K25527l26048q4168l52727n3231M79946j49579
1663b90661O2119J61155j0307M9310K16599k06667o908j65434J04006M35430j69567
1652A79075o9796p6402l23340J57370k97092K70621Q4619l37335N74605k17820
1642e5495j86814k7164k60319M67725K80853k2890l01475j50991J20940J67742
1632C2112l11057L13618K71554k54379J30175m59700K99974K7229K36958j68769
1622A17715p1448r1564L33744n7534o9686q8728L98065l32518O353J55936l41968
1611d1633m13738L100J39422j93170M05768L92915k68634K69699j30096K08328
$$ plain form
1601 371961 437556 -66006 -208467 -362277 -45061 100571 6614 115441 89645 -127475
1591 -127475 96154 306624 -142613 -205996 -38003 -170640 92584 -216828 -211319 41958
1581 41958 113430 32319 89872 -365227 -181392 -249684 387765 -23832 -358270 -53537 -174737
1570 -174737 -295858 -60413 -238906 -31397 225172 251841 150450 96650 -311733 -218360
1560 -218360 -117284 -78123 295235 -248749 26222 124270 209515 -193003 110365 131612
1550 131612 -4851 -55923 7424 -136374 104134 252672 73915 -56799 -50802 46740 188067
1539 188067 89975 -281218 -480322 -142357 -119796 -138792 -289507 -321747 -137928 -299561
1529 -299561 72859 141704 225342 -95716 40926 -69178 -287741 -128804 -94287 -339421
$$ packed form
1601C71961O5595n03562j42461j53810L17216J45632r3957J08827k5796k17120
1591a27475K23629K10470m49237o3383J67993j32637K63224l09412N509K53277
1581D1958P1472q1111N7553m55099J83835o8292O37449m11597l34438L04733j21200
1570a74737j21121K35445j78493K07509K56569K6669j01391n3800m08383R3373
1560b18360J01076L9161L73358n43984K74971R8048Q5245m02518L03368K1247
1550A31612j36463n1072O3347j43798K40508J48538j78757j30714N997R7542J41327
1539A88067r8092l71193j99104L37965K2561j8996j50715l2240J83819j61633
1529b99561L72420O8845Q3638l21058J36642j10104k18563J58937L4517k45134
$$ plain form
1519 -339421 -471521 -318392 -43178 -288731 -295762 -116520 -165642 175193 211698 -156675
1509 -156675 367616 38406 -269439 113976 439074 528702 108051 -6172 -320855 -343249
1499 -343249 10355 -68067 -297280 -311721 -269920 -158429 -462555 -556838 -26204 292154
1489 292154 402724 112857 96418 -47948 -231444 532198 544660 110294 -454964 -161875
1479 -161875 285218 -95861 -141950 -28165 -211526 -324957 -213711 -271149 112822 -49869
1469 -49869 -37107 85905 -250353 -268072 2099 -299456 -315837 -321573 -497499 -197534 97776
1458 97776 250333 -137729 -339567 102299 72548 -50914 -713273 -772203 -155659 -232466
1448 -232466 94898 -32764 -59748 -2948 -57791 368867 168209 -146885 -83910 289267
$$ packed form
1519c39421j32100J53129K75214k45553p031J79242m9122L40835L6505l68373
1509a56675N24291l29210l07845L83415L25098Q9628m20651j14223l14683k2394
1499c43249L53604p8422k29213j4441M1801J11491l04126r4283N30634L18358
1489B92154J10570k89867j6439j44366j83496P63642J2462m34366n65258K93089
1479a61875M47093l81079m6089J13785j83361j13431J11246n7438L83971j62691
1469d9869J2762J23012l36258j7719K70171l01555j6381n736j75926K99965K95310
1458I7776J52557l88062k01838M41866k9751j23462o62359n8930O16544p6807
1448b32466L27364j27662k6984N6800n4843M26658k00658l15094O2975L73177
$$ [...]
##END NTUPLES=NMR SPECTRUM
##END=
