##TITLE=1H_CA-9160-2
 CDCl3
 8 sc, 
 8.6.2023
##JCAMPDX= 6.0         $$ Bruker NMR JCAMP-DX V2.0
##DATA TYPE= NMR SPECTRUM
##DATA CLASS= NTUPLES
##ORIGIN= UXNMR, Bruker Analytische Messtechnik GmbH
##OWNER= root
$$ XWIN-NMR		Version 3.5
$$ Thu Jun  8 14:03:36 2023 Russian Standard Time (UT+4h)  she@DPX200
##.OBSERVE FREQUENCY= 200.13135
##.OBSERVE NUCLEUS= ^1H
##.ACQUISITION MODE= SIMULTANEOUS
##.ACQUISITION SCHEME= undefined
##.AVERAGES= 8
##.DIGITISER RES= 18
##SPECTROMETER/DATA SYSTEM= spect
##.PULSE SEQUENCE= zg30
##.SOLVENT NAME= CDCl3
##.SHIFT REFERENCE= (INTERNAL, CDCl3, 0, 15.7061)
##AUDIT TRAIL= $$ (NUMBER, WHEN, WHO, WHERE, WHAT)
$$ ##TITLE= Audit trail, XWIN-NMR		Version 3.5
$$ ##JCAMPDX= 5.01
$$ ##ORIGIN= Bruker BioSpin GmbH
$$ ##OWNER= she
$$ F:/spectra/data/she/nmr/H-F/1/pdata/1/auditp.txt
$$ ##AUDIT TRAIL=  $$ (NUMBER, WHEN, WHO, WHERE, WHAT)
(   1,<2023-06-08 14:02:25.01 +0400>,<she>,<DPX200>,
      <created by zg, POWCHK disabled, PULCHK disabled
       configuration hash MD5:
       00 E9 B6 7A A2 85 ED C7 34 08 36 98 17 FE 4E 26
       data hash MD5: 16K
       DA B5 C6 2D AF E5 0D 5F B1 7E 04 9B 28 F5 36 60>)
(   2,<2023-06-08 14:02:27.23 +0400>,<she>,<DPX200>,
      <Start of raw data processing
       efp BC_mod = 2 LB = 0.24 FT_mod = 6 PKNL = 1 PHC0 = -20064.36 PHC1 = 11.85272 SI = 16K 
       data hash MD5: 16K
       30 33 16 12 28 92 D2 90 23 DE 9D 6F 86 0B A2 82>)
(   3,<2023-06-08 14:02:46.40 +0400>,<she>,<DPX200>,
      <pk PHC0 = -201.5331 PHC1 = 0.7999998 
       data hash MD5: 16K
       CE 75 74 9B 1C 4D 8F 85 26 46 D4 10 10 21 FC FC>)
(   4,<2023-06-08 14:02:48.95 +0400>,<she>,<DPX200>,
      <abs ABSG = 5 
       data hash MD5: 16K
       91 6D 3D B3 A2 C8 9F A0 CF 66 42 1D 9B 1F 48 69>)
$$ ##END=
$$ 
$$ hash MD5
$$ 41 5E 63 28 95 90 3A 9E 68 9F F4 4E FD DB 42 53
##$RELAX= 
##$RELAX= 
##$RELAX= 
##$RELAX= 
##$RELAX= 
##$RELAX= 
$$ Bruker specific parameters
$$ --------------------------
##$DU= <F:/spectra>
##$EXPNO= 1
##$NAME= <H-F>
##$PROCNO= 1
##$TYPE= <nmr>
##$USER= <she>
##$AMP= (0..31)
100 100 100 100 100 100 100 100 100 100 100 100 100 100 100 100 100 100 
100 100 100 100 100 100 100 100 100 100 100 100 100 100 
##$AQSEQ= 0
##$AQ_mod= 1
##$AUNM= <au_zg>
##$AUTOPOS= <>
##$BF1= 200.13
##$BF2= 200.13
##$BF3= 200.13
##$BF4= 200.13
##$BF5= 200.13
##$BF6= 200.13
##$BF7= 200.13
##$BF8= 200.13
##$BYTORDA= 1
##$CFDGTYP= 0
##$CFRGTYP= 5
##$CHEMSTR= <none>
##$CNST= (0..31)
1 1 145 1 1 1 1 1 1 1 1 1 1 1 1 1 1 1 1 1 1 1 1 1 1 1 1 1 1 1 1 1 
##$CPDPRG= <>
##$CPDPRG1= <>
##$CPDPRG2= <>
##$CPDPRG3= <>
##$CPDPRG4= <mlev>
##$CPDPRG5= <mlev>
##$CPDPRG6= <mlev>
##$CPDPRG7= <mlev>
##$CPDPRG8= <mlev>
##$CPDPRGB= <>
##$CPDPRGT= <>
##$D= (0..31)
0 1.2 0 0 0 0 0 0 0 0.06 0 0.03 0 0 0 0 0.0002 0 0 0 0 0 0 0 0 0 0 0 0 
0 0 0 
##$DATE= 1686218544
##$DBL= (0..7)
120 120 120 120 120 120 120 120 
##$DBP= (0..7)
150 150 150 150 150 150 150 150 
##$DBP07= 0
##$DBPNAM0= <>
##$DBPNAM1= <>
##$DBPNAM2= <>
##$DBPNAM3= <>
##$DBPNAM4= <>
$$ [...]
##$SUBNAM3= <"">
##$SUBNAM4= <"">
##$SUBNAM5= <"">
##$SUBNAM6= <"">
##$SUBNAM7= <"">
##$SUBNAM8= <"">
##$SUBNAM9= <"">
##$SW= 18.05172834244
##$SWIBOX= (0..15)
0 0 2 0 0 0 0 0 0 0 0 0 0 0 0 0 
##$SW_h= 3612.71676300578
##$TD= 16384
##$TD0= 1
##$TE= 0
##$TE2= 300
##$TE3= 300
##$TEG= 300
##$TL= (0..7)
0 120 120 120 120 120 120 120 
##$TP= (0..7)
150 150 150 150 150 150 150 150 
##$TP07= 0
##$TPNAME0= <>
##$TPNAME1= <>
##$TPNAME2= <>
##$TPNAME3= <>
##$TPNAME4= <>
##$TPNAME5= <>
##$TPNAME6= <>
##$TPNAME7= <>
##$TPOAL= (0..7)
0.5 0.5 0.5 0.5 0.5 0.5 0.5 0.5 
##$TPOFFS= (0..7)
0 0 0 0 0 0 0 0 
##$TUNHIN= 0
##$TUNHOUT= 0
##$TUNXOUT= 0
##$USERA1= <user>
##$USERA2= <user>
##$USERA3= <user>
##$USERA4= <user>
##$USERA5= <user>
##$V9= 5
##$VALIST= <valist>
##$VCLIST= <CCCCCCCCCCCCCCC>
##$VD= 0
##$VDLIST= <DDDDDDDDDDDDDDD>
##$VPLIST= <PPPPPPPPPPPPPPP>
##$VTLIST= <TTTTTTTTTTTTTTT>
##$WBST= 1024
##$WBSW= 4
##$XGAIN= (0..3)
0 0 0 0 
##$XL= 0
##$YL= 0
##$YMAX_a= 775872
##$YMIN_a= -903337
##$ZGOPTNS= <>
##$ZL1= 120
##$ZL2= 120
##$ZL3= 120
##$ZL4= 120
##$ABSF1= 15.72621
##$ABSF2= -2.32564
##$ABSG= 5
##$ABSL= 3
##$ALPHA= 0
##$AQORDER= 0
##$ASSFAC= 0
##$ASSFACI= 0
##$ASSFACX= 0
##$ASSWID= 0
##$AUNMP= <proc_1d>
##$AZFE= 0.1
##$AZFW= 0.1
##$BCFW= 0
##$BC_mod= 2
##$BYTORDP= 0
##$COROFFS= 0
##$CY= -3
##$DATMOD= 1
##$DC= 0
##$DFILT= <>
##$DTYPP= 0
##$F1P= 0
##$F2P= 0
##$FCOR= 1
##$FTSIZE= 16384
##$FT_mod= 6
##$GAMMA= 0
##$GB= 0
##$INTBC= 1
##$INTSCL= 3.70164e-10
##$ISEN= 128
##$LB= 0.24
##$LEV0= 0
##$LPBIN= 0
##$MAXI= 10000
##$MC2= 0
##$MEAN= 0
##$ME_mod= 0
##$MI= 1.114404
##$NCOEF= 0
##$NC_proc= -6
##$NLEV= 6
##$NOISF1= 3.799351
##$NOISF2= 2.8
##$NSP= 0
##$NTH_PI= 0
##$NZP= 0
##$OFFSET= 15.70612
##$PC= 1
##$PHC0= -20265.89
##$PHC1= 12.65272
##$PH_mod= 1
##$PKNL= yes
##$PPARMOD= 0
##$PSCAL= 0
##$PSIGN= 0
##$REVERSE= no
##$SF= 200.130013091952
##$SI= 16384
##$SIGF1= 3
##$SIGF2= 2
##$SINO= 5.538805
##$SIOLD= 16384
##$SREGLST= <1H.CDCl3>
##$SSB= 0
##$STSI= 16384
##$STSR= 0
##$SW_p= 3612.71676300578
##$SYMM= 0
##$S_DEV= 0
##$TDeff= 16384
##$TDoff= 0
##$TI= <>
##$TILT= no
##$TM1= 0
##$TM2= 0
##$TOPLEV= 0
##$USERP1= <user>
##$USERP2= <user>
##$USERP3= <user>
##$USERP4= <user>
##$USERP5= <user>
##$WDW= 1
##$XDIM= 16384
##$YMAX_p= 396209395
##$YMIN_p= -401960
$$ End of Bruker specific parameters
$$ ---------------------------------
##NTUPLES= NMR SPECTRUM
##VAR_NAME=  FREQUENCY,     SPECTRUM/REAL,   SPECTRUM/IMAG
##SYMBOL=    X,             R,               I
##VAR_TYPE=  INDEPENDENT,   DEPENDENT,       DEPENDENT
##VAR_FORM=  AFFN,          ASDF,            ASDF
##VAR_DIM=   16384,         16384,           16384
##UNITS=     HZ,            ARBITRARY UNITS, ARBITRARY UNITS
##FACTOR=    0.220516191357247, 1,           1
##FIRST=     3143.26590863432, 0,            0
##LAST=      -469.450854371458, 0,           0
##MIN=       -469.450854371458, -401960,     0
##MAX=       3143.26590863432, 396209395,    0
$$ Real data points
##PAGE= N=1
##DATA TABLE= (X++(R..R)), XYDATA
$$ [...]
7270A2783K4063l9192n8145j5004k832P3558r1946n1760l5788J74669L0426j8719
7258B113M055o2028j2832j47676Q6250R3325K6460l5834q3143n543o4034J03331
7246i5556K2453P2163k0902j13420R4633J0022n5873M9324l3241j2335L0635j4030
7234f6127M4613n3084j08288M8714K8716L1770K2133k6639L5773r256l7211o4542
7222a53428R0006j4593P1360l4431r2290J07650R959j6014j748n5165L429N3909
7210c1356j0788J9205k5523n5130J30971o3978L046j7491L2787J16915R155j60660
7198e2847J5909O9325j01872o8410L4014N7042J09352l4320p8495J9530J9731
7187a1041l7306O3271k4551K5220o289k4689p8363N7290R9651n3890j791j21268
$$ y = [12783, 36846, -2346, -60491, -75495, -78327, -4769, -96715, -148475, -184263, -9594, 20832, 2113, 6168, -55860, -68692, -216368, -130118, -36793, -10333, -46167, -129310, -134853, -198887, -95556, -73103, -940, -21842, -135262, -40629, -30607, -86480, -37156, -70397, -82732, -52097, -66127, -21514, -74598, -182886, -134172, -105456, -73686, -51553, -78192, -42419, -51675, -88886, -153428, -63422, -78015, -6655, -41086, -133376, -25726, -15767, -31781, -33529, -88694, -85265, -31356, -42144, -22939, -48462, -103592, 27379, -36599, -33553, -51044, -18257, 98658, 107813, -52847, -36938, 32387, -69485, -137895, -103881, -46839, 62513, 28193, -50302, -30772, -11041, -48347, 14924, -9627, 15593, 9304, -15385, -93748, -36458, 63193, 9303, 7512, -113756]
7175a13756j4906K8702O8873J4196R324P025k0357n4102M2843N9832P2511l0428
7163F9757n0806m3943M9523p4748L659j7124K3493N3620j3855J16547P183L5626
7151A58932N3337n4423R3542l0754l1045k381J11545j18620p3960q1951P9584
7140A03806M2772m1225n360n5298l3078L1207R8808p2606q6419P8875r2765Q558
7128b2725Q0515O0057M5052j40625q0585j3497O1513R1448P9618q518K589M394
7116A59236n1561n1746O2942J03643n1859k4423l9517J815m5731j4587Q8276N193
7104A41681P3566o5786o3619j4724O3073l105j3615p3775N8489P0350j3557L4744
7092A93722q1373J1261N0418L1010J8829o1591Q6259o4233p6231J23819n606l9002
$$ y = [-113756, -128662, -99960, -31087, -16891, -7567, -542, -20899, -75001, -32158, 27674, 100185, 69757, 18951, -24992, 24531, -50217, -46558, -63682, -40189, 13431, -424, 116123, 123306, 158932, 212269, 157846, 251388, 220634, 189589, 187208, 298753, 180133, 106173, 24222, 103806, 146578, 105353, 99993, 44695, 11617, 42824, 141632, 69026, -17393, 61482, -31283, -22725, 57790, 117847, 162899, 22274, -58311, -71808, -10295, 81153, 160771, 152253, 154842, 159236, 107675, 55929, 118871, 222514, 170655, 146232, 106715, 108530, 62799, 48212, 136488, 141681, 215247, 149461, 85842, 71118, 134191, 131086, 117471, 43696, 102185, 172535, 158978, 193722, 112349, 123610, 174028, 205038, 223867, 162276, 248535, 184302, 108071, 231890, 226284, 187282]
7080A87282j6583k2704Q2459j0557q5327j4466O4889M0117o0707O9889j2360j5290
7068B06642P3333P2652L5983p5777p2824R306l4457P1418r322k2739O0601k3973
7056B90843m2068j3815M1288L376o3455N9250J92625J2075j36200J1871p0097
7045B85693j9449J8639l6379J87271k3614M3402j3139L4290k4016m9906K0809
7034D23601Q3892n8060O349j2401k1494Q6578P2675q8212l4359p155O9634J291
7022E22339q7885j16573n119k5109m3451J60807R758p9305J7418K0499Q321q8865
7010B92835L0741j8659m2443L8923n5787N4727p105n9608J6744K8206o2897L5949
6998B51626J37952n6845L8069k4023k9849o207q0034P014P169J85467L2062l4772
$$ y = [187282, 170699, 147995, 230454, 219897, 134570, 120104, 184993, 225110, 164403, 234292, 221932, 206642, 279975, 352627, 388610, 312833, 240009, 249315, 214858, 286276, 276954, 254215, 314816, 290843, 248775, 234960, 276248, 279624, 216169, 275419, 468044, 480119, 343919, 355790, 285693, 266244, 284883, 248504, 435775, 412161, 455563, 442424, 476714, 452698, 402792, 423601, 507493, 449433, 455782, 443381, 421887, 508465, 581140, 492928, 458569, 451414, 521048, 522339, 434454, 317881, 312762, 287653, 244202, 405009, 414767, 335462, 352880, 373379, 381700, 292835, 323576, 304917, 262474, 301397, 245610, 300337, 293232, 233624, 250368, 278574, 215677, 251626, 389578, 332733, 370802, 346779, 316930, 310723, 230689, 237703, 244872, 430339, 462401, 427629]
6986D27629J3323j59018n5038M9280r0141R9923N8408j2310k8284J9726K0780
6975C44278n7158q33Q4923O5629J22442q2234j16494K1589J29351K7077N3725
6964E92295j12372j04874J5303J4702K9339J32533l9231j19709L87n1517Q9868
6953D46724R1529J9600N3768L4613l4491n5771N122N5391m800O2185L9086J13
6941G13069q9259K3543O6959O5457L8056J4534J14528Q7543p1110l5982O5704
6930I93042J48303K3853Q1194J87865N3107L6454n4603R842j44494j33010L8201
6919A239754m6264j06169k5452P3457M2170K5784J07414N5951R3047n3825J12350
6908A518217P9906q2440Q9291k4310j06733O5128O8262M269n9263P4859O8924
$$ y = [427629, 440952, 281934, 226896, 276176, 186035, 285958, 344366, 332056, 303772, 323498, 344278, 287120, 286287, 371210, 436839, 559281, 477047, 360553, 382142, 511493, 538570, 592295, 479923, 375049, 390352, 405054, 434393, 566926, 527695, 407986, 408373, 356856, 446724, 538253, 557853, 611621, 646234, 611743, 555972, 561094, 616485, 611685, 673870, 712956, 713069, 623810, 647353, 714312, 779769, 817825, 832359, 946887, 1034430, 963320, 927338, 993042, 1141345, 1165198, 1246392, 1434257, 1487364, 1523818, 1469215, 1479057, 1334563, 1201553, 1239754, 1193490, 1087321, 1061869, 1135326, 1177496, 1203280, 1310694, 1366645, 1459692, 1405867, 1518217, 1598123, 1515683, 1604974, 1580664, 1473931, 1539059, 1607321, 1611590, 1552327, 1627186, 1696110]
6897A696110P8200O9404O5349L1536j7883k09938j81066j14178M1052j23105j0727
6886A324754r0999r5245O7183R4532R175j36486K6163q8706k0622R8432j16352
6875A071829M7048R2190l1867M583k36420J66162p7664q0394j29004j6256j4733
6864G95474m9874J1644r7856p8050R4005m6244J3997m349K9299n6551l9666j18477
6852D53352N6188l2504P590J9960r2779n8156J0563J38046k4216K8329p8718L3680
6840D61335k5147J5975n1266j09427k9470N9134Q7182K1113k6658L8533k8844
6829D12460M3858R0617p5927l845r2447J7029Q6633M196K8520J2928q6194p1087
6817C66741J7361O8205O5703q0816K2992j58375q3533Q9912O23K9914R7563n9790
$$ y = [1696110, 1774310, 1843714, 1909063, 1940599, 1922716, 1712778, 1531712, 1417534, 1458586, 1335481, 1324754, 1233755, 1138510, 1205693, 1300225, 1309400, 1172914, 1199077, 1110371, 1089749, 1188181, 1071829, 1118877, 1211067, 1179200, 1183783, 947363, 1113525, 1035861, 955467, 826463, 810207, 795474, 745600, 757244, 659388, 581338, 675343, 629099, 643096, 638747, 668046, 611495, 571829, 453352, 509540, 477036, 484626, 504586, 411807, 353651, 364214, 502260, 478044, 506373, 427655, 461335, 436188, 452163, 400897, 291470, 262000, 321134, 408316, 429429, 402771, 441304, 412460, 456318, 546935, 471008, 467163, 374716, 391745, 478378, 482574, 511094, 524022, 437828, 366741, 384102, 452307, 518010, 437194, 460186, 301811, 218278, 308190, 308813, 338727, 436290, 376500]
6805C76500M480m3380l1303p9649n8369J15033J01410k8030O223M4696m5627m7759
6793C14225L985O634j5666N7230p3182l174k207N7461p2312k8604O0383R793O4547
6780C79113O8477j2542j03203j7748J3690n774N4005L2876r5360N53p8639N8723
6768B94171J18766p7411K945l034l9777q8549K9227N9250r209J7208M6540r1453
6756B58674J18970m0490n1160m5963J02246J23906q8111m1977Q4386N3881n8370
6745D15992K6474q061m3656q177j6825p0370M9260j2353O2146o385R173j11609
6733B85609R2970q852l7492m2603j194K9535N2973m8755J5746M2675j200N1599
6721D31011m6811k2978m6193k0572J09948P0684j48163r8170L0356Q7667p0455
$$ y = [376500, 380980, 337600, 306297, 226648, 168279, 283312, 384722, 356692, 362915, 407611, 361984, 314225, 318210, 324844, 309178, 366408, 293226, 290052, 287845, 345306, 272994, 244390, 304773, 314566, 379113, 447590, 435048, 331845, 314097, 327787, 322013, 376018, 408894, 313534, 314087, 235448, 294171, 412937, 335526, 338471, 335437, 295660, 207111, 236338, 295588, 286379, 303587, 350127, 258674, 377644, 337154, 285994, 240031, 342277, 466183, 378072, 336095, 420481, 474362, 415992, 442466, 434405, 390749, 382572, 365747, 295377, 344637, 332284, 394430, 388045, 397218, 285609, 378579, 369727, 332235, 289632, 288438, 317973, 370946, 322191, 337937, 380612, 379412, 431011, 384200, 361222, 315029, 294457, 404405, 475089, 326926, 228756, 259112, 346779, 276324]
6710B76324k8835N6579J05962p4148M7278q030l9867K6393j09810L0100n4815
6699B27131n5647J9618p450J8020N086M249p2583J7422J42986j3380Q6529k7711
6687C44270l0650O020j27832K1112M4150l8853K2717j628m2790N1458K4906m7313
6675B25567L3148r533j06032L6439m5874J0180J32722J29155j03623J7208M3676
6664C63033p5914K662J3776n0271n0034J02894J3088k0359K7790p0994N0500m9015
6652B57156j00960N4501J7573K0163k7148r084K1452K7011k9981J22k2787J5353
6640B23371J7661J09270M554m7934q6103L1960J7791K8243o1338O0422m6404J4312
6628B65805Q0336N2426p9074m3210R9524o5537n3525j8667o560j8440P1209K0883
$$ y = [276324, 247489, 304068, 410030, 335882, 383160, 375130, 335263, 361656, 251846, 281946, 227131, 171484, 191102, 183652, 201672, 206758, 211007, 138424, 155846, 298832, 285452, 371981, 344270, 313620, 319640, 191808, 212920, 257070, 218217, 240934, 239306, 196516, 247974, 272880, 225567, 258715, 249182, 143150, 179589, 133715, 143895, 276617, 405772, 302149, 319357, 363033, 287119, 289781, 303557, 253286, 203252, 306146, 319234, 298875, 326665, 255671, 306171, 257156, 156196, 210697, 228270, 248433, 221285, 212201, 233653, 260664, 230683, 230805, 208018, 223371, 241032, 350302, 354856, 306922, 220819, 252779, 270570, 298813, 237475, 297897, 251493, 265805, 346141, 398567, 319493, 276283, 375807, 310270, 256745, 238078, 231518, 213078, 284287, 305170]
6616C05170k3642p4294k889J0666J32374k1310Q065p5738K3534N1585l363J62
6604C30320j03493l7140J02374M5099M9578Q690j74134K8584J4022J45827J45101
6593E54828L8168q2100k7426l6759l6040O5995j36016N9622J0693k9709J02186
6582D83442N9028o4269r383r3138o8637Q0304K9252K9422P7490Q78j51338j10346
6570B62705P6938j5969J05713p4231m2446r266R8815P61j22098M9426K4402l3866
6558C20884J34575r2789O4772j4041q3750Q0646N080O6323r5217l5040m7914J31508
6546D35037j8008q3678P3538M260K4893r1045l0501k4697J56430M1705r3746j13748
6534B80440o6739J00224q008o2896k0743N3500J7220J43385M4690L3077q7632
$$ y = [305170, 281528, 207234, 204345, 215011, 347385, 326075, 334140, 258402, 281936, 333521, 330158, 330320, 226827, 189687, 292061, 337160, 386738, 395428, 221294, 249878, 263900, 409727, 554828, 592996, 510896, 483470, 446711, 410671, 476666, 340650, 400272, 410965, 381256, 483442, 542470, 478201, 468818, 375680, 307043, 387347, 416599, 446021, 523511, 524389, 373051, 262705, 339643, 323674, 429387, 355156, 312710, 303444, 402259, 403020, 280922, 330348, 354750, 320884, 455459, 362670, 427442, 413401, 329651, 410297, 415377, 481700, 386483, 351443, 303529, 435037, 417029, 333351, 406889, 411149, 436042, 344997, 314496, 289799, 446229, 487934, 394188, 280440, 213701, 313925, 305917, 243021, 222278, 275778, 292998, 436383, 481073, 514150, 426518]
6523D26518n9000m5125J11909Q362N7411q7233L1659L3411L8686p3472m6247N9948
6511D56827L2332q2858j36676O1980j6921K2968o6516L7903J8054J15798m0789
6500D02102q7652J13283O737L1117j2164M268L4901K4477Q845n738M4250o4622
6488D99804l2879j1962j0459P181o1970M287N1796r399j06939k1640N1568L3668
6476C93056n788J3474M8858n9297k3945O9837r5911J17471m2743M5548M8220m6536
6464D62244m271m8770j09351M7214J17301l5028K7311M6963K1366O2965N2484
6453F40428p3640m9550N6685M127n2020R4817o8230l2777r604m6583O3592P8405
6441F05650J95558r0743j22433O0869K4721m0675o6962J12156N2326r3509l3152
$$ y = [426518, 367518, 322393, 434302, 442664, 500075, 412842, 444501, 477912, 516598, 443126, 396879, 456827, 489159, 406301, 269625, 331605, 314684, 337652, 271136, 309039, 327093, 442891, 402102, 314450, 427733, 434470, 465587, 453423, 457691, 492592, 517069, 525914, 520176, 564426, 499804, 466925, 454963, 444504, 451685, 389715, 394002, 445798, 436399, 329460, 307820, 359388, 393056, 387268, 400742, 449600, 390303, 366358, 436195, 340284, 457755, 415012, 460560, 508780, 462244, 457973, 409203, 299852, 347066, 464367, 429339, 456650, 503613, 524979, 587944, 640428, 566788, 517238, 573923, 578050, 526030, 620847, 552617, 519840, 510236, 463653, 527245, 605650, 801208, 710465, 588032, 648901, 673622, 632947, 565985, 678141, 730467, 636958, 603806]
6430F03806J6215N6359N0983j10481j2444K5102J91773M2947r5733M1994m2890
6419G67631l0599j3687M2349Q1148p2154L2053R456K0270j22542N9639j1088p3798
6407F88678N5409L4465q814L4639M4004r4503J05232L621j2496N1611j747J18946
6395A019045k5394J595J314K2826J7547r3651N0931N0586Q927j2876q1553L4181
6383I93478K5718n8242Q7088n6804Q080J23087N0922J74430O4727q5885j7728
6372A308871n8308K3288l477j7713k6540l3220m341l0647M3376j20189N2140R836
6360A143076l8241K2532l5255J2608M2612p48r6099R6925m9723l140N0211L78
6348A145136q6906L219N4144j06405M3865M0062l1757p3799K5598k1855j41494
$$ y = [603806, 620021, 676380, 727363, 616882, 604438, 629540, 821313, 864260, 768527, 810521, 767631, 737032, 723345, 765694, 846842, 774688, 806741, 816197, 836467, 713925, 773564, 762476, 688678, 744087, 778552, 769738, 804377, 848381, 753878, 859110, 862731, 850235, 901846, 900099, 1019045, 993651, 995246, 996560, 1019386, 1036933, 943282, 994213, 1044799, 1053726, 1040850, 959297, 993478, 1019196, 960954, 1048042, 991238, 999318, 1122405, 1173327, 1347757, 1412484, 1326599, 1308871, 1250563, 1273851, 1270374, 1252661, 1226121, 1192901, 1188560, 1157913, 1201289, 1081100, 1133240, 1143076, 1104835, 1127367, 1092112, 1104720, 1147332, 1146584, 1050485, 1147410, 1097687, 1094547, 1144758, 1145136, 1058230, 1061449, 1115593, 1009188, 1053053, 1093115, 1061358, 987559, 1013157, 991302, 849808]
6337H49808K6500J90401N4134k7291m9466J65537O2384k27375N3475n3827j16177
6326I28103J02869J07908J0462j25032l2921k7846K906l2943m3222L5303N9853
6315I85440J10944p055j57187J8071Q2082p1944j7689J04292N6235j03783K7971
6304A027377n743r1812Q3447j609R5388j08232j7456N1742L663O0828j19774j15657
6292H62162P3837R2291j61501j3942R2988k5439k0066J06375J6775N9689O5327
6281A148496q3488k7137L9324k4935n1616M2194P7177n638K4989m7159l3060Q2449
6269A141596l906o0559N7117k2313k9915j3422L6803l7724j03002k2236q8o696
6257I35655O2967K2854m472k2195P6511l8549p5404P4606N5442o4087M1456L5808
$$ y = [849808, 876308, 1066709, 1120843, 1093552, 1044086, 1209623, 1272007, 1044632, 1098107, 1044280, 928103, 1030972, 1138880, 1149342, 1024310, 991389, 963543, 966449, 933506, 890284, 925587, 985440, 1096384, 1089329, 932142, 950213, 1032295, 960351, 942662, 1046954, 1103189, 999406, 1027377, 1021634, 929822, 1013269, 1011660, 1107048, 998816, 981360, 1033102, 1036765, 1097593, 977819, 862162, 935999, 1028290, 866789, 852847, 945835, 920396, 900330, 1006705, 1023480, 1083169, 1148496, 1065008, 1037871, 1077195, 1052260, 1000644, 1042838, 1120015, 1114377, 1139366, 1092207, 1059147, 1141596, 1137690, 1077131, 1134248, 1111935, 1082020, 1068598, 1105401, 1067677, 964675, 942439, 942351, 935655, 998622, 1021476, 1017004, 994809, 1071320, 1032771, 957367, 1031973, 1087415, 1023328, 1064784, 1100592]
6245A100592K4504Q7877N5414q7348M0393N1133l0748j920R6943L5531q284l0955
6233A333132q1926K1927K9591m6690q5123R7697K9883m4597M8064o4474O954j5416
6221A229022K1460O5477K8858n6067K1101j0987p4623p8874n6767L8288N8990
6210A185878N4745M769r2841r9778N1957K2883J1393k4292O4253Q247Q6077Q7750
6198A361041l4186N5456J29779r5875K5464J50673J31200J53935J33847N4226
6188B065560J58870J16987J91412K33942R7194k12828j92339j81132k50618j21782
6178A905266k9158j85776j16047j19988j49495n1007k884O9682j919M2812k9324
6167A332162j11365M8884j27711P7123N8163K1579M8652K9265Q739J1529l7541
$$ y = [1100592, 1125096, 1212973, 1268387, 1181039, 1221432, 1272565, 1241817, 1239897, 1336840, 1372371, 1364087, 1333132, 1251206, 1273133, 1302724, 1256034, 1170911, 1268608, 1298491, 1253894, 1301958, 1237484, 1244438, 1229022, 1250482, 1315959, 1344817, 1288750, 1309851, 1298864, 1224241, 1145367, 1088600, 1126888, 1185878, 1240623, 1245392, 1152551, 1052773, 1104730, 1127613, 1139006, 1114714, 1178967, 1187214, 1273291, 1361041, 1326855, 1382311, 1512090, 1416215, 1441679, 1592352, 1723552, 1877487, 2011334, 2065560, 2224430, 2341417, 2532829, 2766771, 2863965, 2651137, 2458798, 2277666, 2027048, 1905266, 1876108, 1690332, 1574285, 1454297, 1304802, 1253795, 1250911, 1320593, 1318674, 1361486, 1332162, 1220797, 1269681, 1141970, 1219093, 1277256, 1298835, 1347487, 1376752, 1385491, 1397020, 1359479]
6156A359479j76455m8486M6797Q216k2208o5470k8595l8818Q190M9410m0839M9767
6144A100988K0184K1157q3625l9573K9136L2937j03573o1829J17330l5258M6273
6133A044147J22673n9298j15843q6732O1991K3440K7704M9170K6863N0750j5421
6122A129444j99964n248M7639o0893O3499L0787q9525k2742J19574O2606j17514
6111I57663J2470M2960r519N67R1049K419m3869j04713p5076n3026J5281J12755
6099I48961R0503m8742j77356R4502P8413q849K1892l7597L0086j255O1243J1767
6087A063568N9771r4269o7051Q30n503o043J402q406j14202K5623L9558L2676
6075I27954J10053o3728j81193Q864J54285J03630J4408m1892m5395m9672o7921
$$ y = [1359479, 1183024, 1134538, 1181335, 1189551, 1167343, 1101873, 1073278, 1034460, 1042650, 1092060, 1051221, 1100988, 1121172, 1142329, 1058704, 1019131, 1048267, 1081204, 977631, 915802, 1033132, 997874, 1044147, 1166820, 1107522, 991679, 904947, 966938, 990378, 1018082, 1067252, 1094115, 1144865, 1129444, 929480, 924232, 971871, 910978, 974477, 1005264, 915739, 892997, 1012571, 1075177, 957663, 970133, 1013093, 1003574, 1004141, 1095190, 1097609, 1053740, 949027, 873951, 820925, 836206, 948961, 1039464, 990722, 813366, 907868, 986281, 977432, 999324, 961727, 991813, 990558, 1051801, 1063568, 1123339, 1029070, 962019, 962849, 957346, 951303, 952705, 944299, 830097, 855720, 895278, 927954, 1038007, 974279, 793086, 801950, 956235, 1059865, 1074273, 1032381, 986986, 937314, 869393]
6064H69393j7154n77L0005R9184J08427Q829K200j42289k265M5952J17246N3677
6052A172628q6053r0871m8431o7480j4248J10871k143P7947r111M0834K6790K0147
6040A130880j2257o8611L2445n3082K9026L6086L5989j1157O3270l5547n664J70325
6028A311703j05981p2326P5079J23755j5802n8006N1432N6821j05663n4710M5501
6017A251803j06084K5219J17315p903k2541J11438J4693M453O1222K1673q4246
6006A387042M0054L0248O0989L4556j499J08451l5183N5010M3929m4566O1896
5995A740927l1348N9865P0226o8008o3714k7542P1763q0754q1544J13235J43691
5984A846797M0843m0134l4527J2881Q9978L8860q1585J23011J2735R3129O8186
$$ y = [869393, 852239, 851662, 881667, 980851, 1089278, 1098107, 1100307, 958018, 955753, 1001705, 1118951, 1172628, 1086575, 995704, 947273, 879793, 865545, 976416, 974273, 1052220, 1043109, 1083943, 1110733, 1130880, 1118623, 1050012, 1082457, 1029375, 1058401, 1094487, 1130476, 1119319, 1182589, 1147042, 1141378, 1311703, 1205722, 1133396, 1208475, 1332230, 1316428, 1258422, 1309854, 1366675, 1261012, 1206302, 1251803, 1145719, 1170938, 1288253, 1280350, 1257809, 1369247, 1383940, 1388393, 1449615, 1471288, 1387042, 1427096, 1457344, 1518333, 1552889, 1551390, 1659841, 1624658, 1679668, 1723597, 1679031, 1740927, 1709579, 1769444, 1839670, 1771662, 1707948, 1680406, 1752169, 1671415, 1589871, 1703106, 1846797, 1887640, 1847506, 1812979, 1825860, 1915838, 1954698, 1873113, 1996124, 2008859, 2101988, 2170174]
5973B170174j36297M3591L8026o5331N9328J8683j12829r5281L3663J25720j65375
5962A914072J2083O137L7984m9698o3260K1234o4105J5030R5966j02493m9571
5951A773379P0964l5388K377p8026J10472J05551l7481k7882Q51j4710Q1133L5189
5939A986429j37924o6965R4491O19l2408J9122Q5228n3425l2927J03982m6343
5928A919879K3347K5071p0811J00944j9165O9611Q9219m8856M6904J43526R2399
5917B372068j4310N4124p9933j87723n0002K1451N6979M3662k5630q1559k2784
5906B086343l0659l2127K9904J6943m5216P5489R1960k2966n7392j5908J7661
5895B114032M172o17k7782M7162l1555N2314N9113j585P075J62235N1741j03656
$$ y = [2170174, 2033877, 2077468, 2115494, 2050163, 2109491, 2128174, 2015345, 1920064, 1953727, 2079447, 1914072, 1926155, 1932292, 1970276, 1920578, 1857318, 1878552, 1814447, 1829477, 1925443, 1822950, 1773379, 1844343, 1808955, 1811332, 1733306, 1843778, 1949329, 1911848, 1883966, 1884817, 1870107, 1951240, 1986429, 1848505, 1781540, 1876031, 1876650, 1844242, 1863364, 1948592, 1895167, 1862240, 1966222, 1919879, 1943226, 1968297, 1897486, 1998430, 1979265, 2048876, 2138095, 2089239, 2136143, 2279669, 2372068, 2357758, 2411882, 2331949, 2144226, 2094224, 2115675, 2172654, 2216316, 2190686, 2109127, 2086343, 2055684, 2023557, 2053461, 2070404, 2025188, 2100677, 2192637, 2169671, 2112279, 2096371, 2114032, 2118204, 2117587, 2089805, 2136967, 2105412, 2157726, 2216839, 2215254, 2222329, 2384564, 2436305, 2332649]
5883B332649j43345P8924J8320K0778N4858n6735n8020R3128n4290L9277J11302
5872B436846r2015o6972K2950l1545N3727N4538P2899K8987L5583P6297j574L4103
5860B623824J1322K51232l9770N3513N5374k2565O6646k2720l5525q9849L5304
5849B886786p3825j35451M0961J0392K994j60740P1230l5103J27494N4206o6905
5838B722039l79M0919K8393K0038L9376l4974J10562l0218R8049o0722o814J15096
5826C041365O8761k8290K8077m6056M4193l6115j16545N8001l2102k2513J06510
5815C065286R3000k2366L2063j12805l7603j2577O4642M1924N3325l090L3220
5804C195019P1709J05907J10383l7421J02366R863m5912O5893P5982O6100K5192
$$ y = [2332649, 2189304, 2268228, 2286548, 2307326, 2362184, 2305449, 2247429, 2340557, 2286267, 2325544, 2436846, 2344831, 2277859, 2300809, 2269264, 2322991, 2377529, 2450428, 2479415, 2514998, 2591295, 2589721, 2623824, 2635146, 2886378, 2846608, 2900121, 2955495, 2932930, 2999576, 2976856, 2941331, 2851482, 2886786, 2812961, 2677510, 2718471, 2728863, 2731857, 2571117, 2642347, 2607244, 2734738, 2788944, 2722039, 2721660, 2762579, 2790972, 2811010, 2850386, 2815412, 2925974, 2895756, 2993805, 2933083, 2926269, 3041365, 3110126, 3081836, 3109913, 3063857, 3108050, 3071935, 2955390, 3013391, 2981289, 2958776, 3065286, 3158286, 3135920, 3167983, 3055178, 3017575, 3004998, 3069640, 3111564, 3164889, 3161799, 3195019, 3266728, 3372635, 3483018, 3445597, 3547963, 3557826, 3511914, 3577807, 3653789, 3719889, 3745081]
5793C745081n0428Q0773J04168P3739J46424N3208J9276n7850L3435J50084J9036
5782D316946p307L8181j05866O702M8643j1081l6437J39052O6485O375N1961k4674
5770D488980J30208J42077j7724o0239M6538J05597K13699J86611O9720J09959
5760E415426Q8251J60623K87403J98401K881O2596L7350P1073R5962j13959M2565
5749F348572j39778o9855n5380J1480J95658N7281j0311j3348o6838R2864J76032
5738F526377J87620J13305K03349J16083P3887J18682P3217O8388J8012k2124
5728G476796J42242J54045J53048O4419N3652K26562K32115M6594J99079J93569
5718H942121P6218L33709K45598J68127R0751K09372L30641K19723L08077K45475
$$ y = [3745081, 3694653, 3775426, 3879594, 3953333, 4099757, 4152965, 4172241, 4114391, 4147826, 4297910, 4316946, 4309639, 4347820, 4241954, 4248656, 4297299, 4286218, 4249781, 4388833, 4455318, 4461693, 4513654, 4488980, 4619188, 4761265, 4743541, 4683302, 4729840, 4835437, 5049136, 5235747, 5305467, 5415426, 5503677, 5664300, 5951703, 6150104, 6152985, 6215581, 6252931, 6324004, 6419966, 6306007, 6348572, 6208794, 6138939, 6083559, 6095039, 6290697, 6347978, 6337667, 6324319, 6257481, 6350345, 6526377, 6713997, 6827302, 7030651, 7146734, 7220621, 7339303, 7412520, 7480908, 7498920, 7476796, 7619038, 7773083, 7926131, 7990550, 8044202, 8270764, 8502879, 8549473, 8748552, 8942121, 9018339, 9352048, 9597646, 9765773, 9856524, 10065896, 10396537, 10616260, 10924337, 11169812]
5708A1169812K77069L50175K23519L96130N78385M68959M24936O06644P81700
5699A5277329P25600Q37122R27417P97082Q00163P69018O65744M93527L66483
5690B1659485Q4492p022k25340l73543m54611l89294m97847n18485l49195k71214
5680A8657426k54202j04726j1952P5790K08122M40235N43312N18523M69791N73020
5670B1115339M92058N33175N15776K49722J43245J1479j37908k06711l09224m38992
5660B1967959o24777o25072q08655r92694j044817r52426j025546q81322p23126
5651A4289524p98624o76199n45007m34907m25671m04537m30147j82351m09736
5642I982345k71689k43123n1848k35857k16639j16958k23840j00849j80140n8691
$$ y = [11169812, 11446881, 11797056, 12020575, 12416705, 12995090, 13464049, 13888985, 14495629, 15277329, 16002929, 16840051, 17767468, 18564550, 19364713, 20133731, 20799475, 21293002, 21659485, 21743977, 21736955, 21511615, 21138072, 20683461, 20294167, 19796320, 19277835, 18928640, 18657426, 18403224, 18298498, 18286546, 18362336, 18570458, 19010693, 19554005, 20072528, 20542319, 21115339, 21607397, 22140572, 22656348, 22906070, 23049315, 23060794, 22922886, 22716175, 22406951, 21967959, 21343182, 20718110, 19909455, 18916761, 17871944, 16919518, 15893972, 15012650, 14289524, 13490900, 12814701, 12269694, 11834787, 11409116, 11004579, 10574432, 10392081, 9982345, 9710656, 9467533, 9415685, 9179828, 8963189, 8846231, 8622391, 8521542, 8341402, 8282711]
5632H282711j1339q3817k02992r6162q6014j02230p0540k4245l1732n688M6052
5621G614004l0995o2736p9707N2530m2787R332j8421o952p5136j2534P4516j4741
5609G406373m3274N727m67n9844J00978M5479L4069J46424R0861Q8729P8915O8886
5597G962856J10641Q3257j9524j8525M6438L0763l7337J9372p3456r2130j02312
5586G910043j44161J00655L2929l2778R5239O8656o8637K9715Q9043K160O6579
5575H149443P5920N1532J10460Q1531q159k3215Q2946K17119M5391r5107K7375
5564H715236R1517J82960R3503J45794P7253M3643J57733J70523J41192K12825
5554A0032179J96631P3612n9443J40507J37887J10694J71496J26196M0851R8042
$$ y = [8282711, 8271372, 8187555, 7984563, 7888401, 7802387, 7700157, 7629617, 7605372, 7573640, 7567952, 7614004, 7583009, 7520273, 7440566, 7493096, 7450309, 7459641, 7441220, 7434268, 7359132, 7346598, 7421114, 7406373, 7363099, 7368826, 7368359, 7308515, 7409493, 7454972, 7489041, 7635465, 7726326, 7815055, 7893970, 7962856, 8073497, 8156754, 8137230, 8118705, 8165143, 8195906, 8158569, 8177941, 8104485, 8012355, 7910043, 7765882, 7866537, 7899466, 7866688, 7961927, 8030583, 7961946, 7991661, 8080704, 8082864, 8149443, 8225363, 8276895, 8387355, 8468886, 8460727, 8437512, 8520458, 8737577, 8782968, 8687861, 8715236, 8806753, 8989713, 9083216, 9229010, 9306263, 9349906, 9507639, 9678162, 9819354, 10032179, 10228810, 10302422, 10242979, 10383486, 10521373, 10632067, 10803563, 10929759, 10970610, 11068652]
5544A1068652J8564R7296N7918K35103K47989J00480J54143J72368K25431J04021
5534A2481965J42670J06622J51118K03269K60887J14240K01845K21530K72329
5525A4156475K58596J23260J26163J43499J79413K38599R5740J33085J25141K04979
5515A5784950K43311J14884K48939J69622J76967P8990K12596L67227K98042m8683
5505A7646845J14270J13410J88442K02529K12770K28932K46999J98412J68257
5496A9320866K20607K61188L01835K29457K90545K41473K14403J84262J80288
5487B1444924J86448K07621J81708J25239J0512K92611J39499K56428L54928K59934
5477B3459852J78523K51296L30091L44707K98240M41339M29210L92072L52208
$$ y = [11068652, 11087216, 11184512, 11242430, 11477533, 11725522, 11826002, 11980145, 12152513, 12377944, 12481965, 12624635, 12731257, 12882375, 13085644, 13346531, 13460771, 13662616, 13884146, 14156475, 14415071, 14538331, 14664494, 14807993, 14987406, 15226005, 15321745, 15454830, 15579971, 15784950, 16028261, 16143145, 16392084, 16561706, 16738673, 16817663, 17030259, 17397486, 17695528, 17646845, 17761115, 17874525, 18062967, 18265496, 18478266, 18707198, 18954197, 19152609, 19320866, 19541473, 19802661, 20104496, 20333953, 20624498, 20865971, 21080374, 21264636, 21444924, 21631372, 21838993, 22020701, 22145940, 22156452, 22449063, 22588562, 22844990, 23199918, 23459852, 23638375, 23889671, 24219762, 24564469, 24862709, 25304048, 25733258, 26125330, 26477538]
5468B6477538M41540M08673M38861L26829M09426O30215N96069N43636N78317
5459C0851104N51615O92223O95696O64873P60420O64617P48475Q49820Q22197
5450C7301040Q35474R57541Q92589J115114J085088J144411J231607J215945J320098
5441D7098907J316094J398935J453612J771744J894923K218639K345666K432831
5433F1931351K801385L210827L502698L911432M410911M919105N539576O060390
5425I6287675O708950P295485P975776Q610642R032172R136689R164794Q853462
5417A63065645Q224964P367931O546675N773768M838109L357595J013242k156662
5409A98031267n408109p938534r358044j0006527j0021678j0228251j0211318
$$ y = [26477538, 26919078, 27327751, 27766612, 28093441, 28502867, 29133082, 29729151, 30272787, 30851104, 31402719, 32094942, 32790638, 33455511, 34215931, 34880548, 35629023, 36478843, 37301040, 38136514, 39094055, 39986644, 41101758, 42186846, 43331257, 44562864, 45778809, 47098907, 48415001, 49813936, 51267548, 53039292, 54934215, 57152854, 59498520, 61931351, 64732736, 67943563, 71446261, 75357693, 79768604, 84687709, 90227285, 96287675, 102996625, 110292110, 118267886, 126878528, 135910700, 145047389, 154212183, 163065645, 171290609, 178658540, 185205215, 190978983, 195817092, 199174687, 200187929, 198031267, 192623158, 184684624, 175326580, 165320053, 155298375, 145070124, 134858806]
5402A34858806j0137811r836797r348693q397610p645764o719649n718642n016131
5394G2037709m413688l948143l440020l003386k778210k495523k337750k176794
5386D7444195j809434j684513j446755j456740j198526j310973j177860r93494
5378C6365900r21971r58477r17689r16553q91601q27669p96315q34756o16910
5369B8683959n14435o81721m89438n50368o08544m70069l95243l96159m92303
5360B4085679m12994m21272l46781j92253l11138m42546l26641j96458k82966
5351B1152630k76816j79069k49150k57796j50871j67099j79192k36056j41393
5342A9315188j53290j08804j83769j81158k34122j46303k02431j95907k69508
$$ y = [134858806, 124720995, 114884198, 105535505, 97137895, 89492131, 82772482, 77053840, 72037709, 67624021, 63675878, 60235858, 57232472, 54454262, 51958739, 49620989, 47444195, 45634761, 43950248, 42503493, 41046753, 39848227, 38537254, 37359394, 36365900, 35443929, 34485452, 33567763, 32651210, 31759609, 30931940, 30135625, 29300869, 28683959, 28169524, 27487803, 26998365, 26447997, 25839453, 25369384, 24974141, 24577982, 24085679, 23672685, 23251413, 22904632, 22712379, 22401241, 21958695, 21632054, 21435596, 21152630, 20875814, 20696745, 20447595, 20189799, 20038928, 19871829, 19692637, 19456581, 19315188, 19161898, 19053094, 18869325, 18688167, 18454045, 18307742, 18105311, 17909404, 17639896]
5333A7639896j86971k69500j44608k45113j95394j21077k33137j38817j31837
5324A5973442j39885j58472j29793j99170k00680k0938j05306j51545n3709k36718
5314A4577226l1863j31614j63277k189r6440m9497O0064P392l5826k6803L2890
5303A4140063l8971J18302K9586q3260j2427L8832j3709k4345j86726j92215j03163
5292A3671967k14916k73667k16300j64107k76750j36121m1859k09650j61694j31350
5282A1845553o7780n1360p3115k16488k70617j05871j31671k41985k8953r032
5272A0648681j1183j04055j15773j509Q419j59160j03282l7606j52739r5766J5579
5261I891606j35466K6500N9089L9096j91995J3428m247m9295n2744j6085P9882
$$ y = [17639896, 17452925, 17183425, 17038817, 16793704, 16598310, 16477233, 16244096, 16105279, 15973442, 15833557, 15675085, 15545292, 15346122, 15145442, 15124504, 15019198, 14867653, 14813944, 14577226, 14545363, 14413749, 14250472, 14248283, 14151843, 14102346, 14162410, 14169802, 14133976, 14107173, 14140063, 14101092, 14219394, 14248980, 14165720, 14153293, 14192125, 14178416, 14154071, 13967345, 13775130, 13671967, 13457051, 13183384, 12967084, 12802977, 12526227, 12390106, 12348247, 12138597, 11976903, 11845553, 11777773, 11726413, 11653298, 11436810, 11166193, 11060322, 10928651, 10686666, 10657713, 10648681, 10637498, 10533443, 10417670, 10416161, 10424580, 10265420, 10162138, 10124532, 9971793, 9876027, 9891606, 9756140, 9782640, 9841729, 9880825, 9688830, 9702258, 9698011, 9648716, 9595972, 9579887, 9659769]
5250I659769J24724J429j64304M3185Q2960N2355N1523J9590j46658K1566k16806
5239I529333k62964j64172l7015j74408j81921j55231K9775l9998k2485j13550
5229H407364j925p5270q9752P029q7240p8372q6877p7448K3172j1726q2816l8008
5217G808131N812K7552J270j29563j24990L5376j47626j20762q4714m8238o3806
5206G158442n2538o6109J4722l8256k01522p3065j04808k086j11724j3084k2145
5195F487827q2543J029M5121J8655m3586q8209j3221R2148q5608N9467K9743m9585
5183F371238Q0340Q5342m998k0667p9753n6245M570J7674o3541p3910j622J0908
5171F269336J8163j2836J07547o3790p2533m7086k5417n9696p429m8777j9376
$$ y = [9659769, 9784493, 9785922, 9621618, 9664803, 9747763, 9800118, 9851641, 9871231, 9724573, 9746139, 9529333, 9266369, 9102197, 9065182, 8890774, 8708853, 8553622, 8583397, 8543399, 8520914, 8407364, 8405439, 8330169, 8240417, 8247446, 8160206, 8081834, 7994957, 7917509, 7940681, 7928955, 7846139, 7808131, 7813943, 7841495, 7842765, 7713202, 7588212, 7623588, 7475962, 7355200, 7270486, 7222248, 7158442, 7105904, 7039795, 7054517, 7016261, 6814739, 6741674, 6636866, 6634780, 6523056, 6509972, 6487827, 6405284, 6406313, 6451434, 6470089, 6426503, 6338294, 6325073, 6417221, 6331613, 6391080, 6420823, 6371238, 6451578, 6536920, 6531922, 6511255, 6431502, 6375257, 6379827, 6397501, 6333960, 6260050, 6258428, 6269336, 6287499, 6274663, 6382210, 6318420, 6245887, 6198801, 6173384, 6113688, 6106259, 6057482, 6038106]
5160F038106r9902Q5745O4398L3918J392j06895J12215k33N9601Q6509Q972M495
5148F288321R8387O8718L8922J469Q251q2758J33053P1975n1558N586p7572L1988
5136F534782R8626o3003n5014j3096N4369p2480n7128m8890L700o899M0422O9447
5124F484836M3819N2472m7812Q7550J43455O8826J62956M4645P1042Q2410O5231
5113G259430R6729J00255j4756M2137O8540l950K83J5828o4273p4128q569o8514
5101G349012j26065j33564j43111l9538p5829j78172N9135l4282r4367L9491O6646
5090F689356r9613K4134J6267M1082L1404Q2522J7330J06828Q0683p9706Q7983
5079F998270J0049m2799k4746L622M3550R7711O5495o8619q2357J04371M4439
$$ y = [6038106, 5938204, 6023949, 6088347, 6122265, 6123657, 6016762, 6128977, 6128744, 6188345, 6274854, 6283826, 6288321, 6386708, 6455426, 6494348, 6495817, 6504068, 6421310, 6554363, 6626338, 6574780, 6580366, 6502794, 6534782, 6633408, 6570405, 6515391, 6502295, 6556664, 6484184, 6427056, 6378166, 6381866, 6374967, 6415389, 6484836, 6528655, 6581127, 6533315, 6620865, 6764320, 6833146, 6996102, 7040747, 7111789, 7194199, 7259430, 7356159, 7456414, 7441658, 7483795, 7552335, 7548385, 7548668, 7564496, 7500223, 7426095, 7417526, 7349012, 7222947, 7089383, 6946272, 6906734, 6830905, 6652733, 6711868, 6677586, 6583219, 6622710, 6689356, 6589743, 6613877, 6630144, 6671226, 6702630, 6785152, 6802482, 6909310, 6989993, 6910287, 6998270, 7008319, 6965520, 6940774, 6944396, 6987946, 7085657, 7151152, 7082533, 7000176, 7104547, 7148986]
5068G148986j3151M9157R750j17305j4948j9766n3803j48195q1244O5794N8918
5057F884193M3727l5835k027n8751m5337l4212q8196j7630o3335o7841O6131l806
5045F577081j48084j18454r3299n2075o358R924M2680n197q9849p6544l774n5599
5033E980452p4223J1060K1110J3231J33005k3805N9989R9992j1821m0918p1858
5022F096214o7136M5442j06734q7105J11440j5623j05829o3772J6566O622q4075
5011E746010Q0543N9785m3466N4845N2523q9853K7700N4135j0350j46124J14665
5000E900413J01506J970L3964K0770M0185m9327M6680k6429l5588P7292Q7600
4989F199036m256J5543L3557r2942O3063J19405L5955l2006j9992M2856j3326
$$ y = [7148986, 7135835, 7184992, 7194742, 7077437, 7062489, 7042723, 6988920, 6840725, 6759481, 6825275, 6884193, 6927920, 6892085, 6890058, 6831307, 6785970, 6751758, 6663562, 6645932, 6582597, 6514756, 6580887, 6577081, 6428997, 6310543, 6217244, 6165169, 6158811, 6168735, 6211415, 6206218, 6116369, 6039825, 6036051, 5980452, 5906229, 5917289, 5938399, 5951630, 6084635, 6060830, 6120819, 6220811, 6208990, 6168072, 6096214, 6029078, 6074520, 5967786, 5880681, 5992121, 5976498, 5870669, 5806897, 5823463, 5830085, 5746010, 5826553, 5886338, 5842872, 5897717, 5950240, 5860387, 5888087, 5942222, 5931872, 5785748, 5900413, 6001919, 6003889, 6037853, 6058623, 6098808, 6049481, 6096161, 6069732, 6034144, 6111436, 6199036, 6194780, 6210323, 6243880, 6150938, 6214001, 6333406, 6369361, 6337355, 6317363, 6360219, 6346893]
4978F346893o5589n5718J03263J10681M6204j12201K7177J05844J1295O558N9747
4967F584154L4725j03052j66683M2777N5162O2147j5553j4611m6666o1668N174
4956F375906l1152n5501N6278L4119K3972M1400J23851j0632L2737M4094j1677
4945F623395j09862m2032J12590R9830P0557l8722J1290J50865N0809J0316o9972
4934F869064N5417R9162L8976P0430N464J73437P3887J14526J24331J0653n8309
4923G577038M1036p5840l464J09871l2013j6386Q3525M2273j1177J94067J28318
4912H037248J01162J34002J78345J85181J29171J50867p7560q0702q0925j58532
4902H518257o6578l1447o3986J11722M3580j2244L800O599p2635O6261m648m559
$$ y = [6346893, 6281304, 6225586, 6328849, 6439530, 6485734, 6373533, 6400710, 6506554, 6517849, 6524407, 6584154, 6618879, 6515827, 6349144, 6391921, 6447083, 6509230, 6493677, 6479066, 6432400, 6370732, 6375906, 6344754, 6289253, 6345531, 6379650, 6403622, 6445022, 6568873, 6558241, 6590978, 6635072, 6623395, 6513533, 6471501, 6584091, 6683921, 6754478, 6715756, 6727046, 6877911, 6928720, 6939036, 6869064, 6924481, 7023643, 7062619, 7133049, 7138513, 7311950, 7385837, 7500363, 7624694, 7635347, 7577038, 7618074, 7542234, 7538770, 7648641, 7616628, 7600242, 7683767, 7726040, 7714863, 7908930, 8037248, 8138410, 8272412, 8450757, 8635938, 8765109, 8915976, 8838416, 8757714, 8676789, 8518257, 8451679, 8420232, 8356246, 8467968, 8511548, 8499304, 8503104, 8509703, 8437068, 8503329, 8498681, 8494122]
4890H494122M7725N7597J66770L0914J32662J33704J10146K7666m34L7397J52050
4879I390319J71205L0982N0714J37144N8465k0134Q6420J0953p9495M0060O3832
4868I940465Q0136K9152N0784m0784n5337Q6367L8774k259N776Q7520M1521K08611
4856A0470726K24975O8173R7256J32919J18074N6356J88165J61770J16941L0042
4846A1665397N3342J10315J26240Q4613N0198J16749P951Q3373R6166j7613K9789
4835A2406520k4318p7398k9001J11053J42065M8915l966m1477J50392J07393Q6985
4824A2877163Q2554N7929R1395P1567Q5185J21117L24263J13935K0638K44724
4814A4090470J72428J20517K16151K09722K35162J24113J82081K73803J55823
$$ y = [8494122, 8541847, 8599444, 8766214, 8797128, 8929790, 9063494, 9173640, 9201306, 9200872, 9238269, 9390319, 9561524, 9592506, 9643220, 9780364, 9838829, 9818695, 9905115, 9916068, 9836573, 9876633, 9940465, 10020601, 10049753, 10100537, 10059753, 10004416, 10090783, 10129557, 10127298, 10133074, 10220594, 10262115, 10470726, 10695701, 10763874, 10861130, 10994049, 11112123, 11168479, 11356644, 11518414, 11635355, 11665397, 11718739, 11829054, 11955294, 12039907, 12090105, 12206854, 12214805, 12298178, 12394344, 12376731, 12406520, 12382202, 12304804, 12275803, 12386856, 12528921, 12577836, 12573870, 12532393, 12682785, 12790178, 12877163, 12959717, 13017646, 13109041, 13180608, 13265793, 13386910, 13711173, 13825108, 13845746, 14090470, 14262898, 14383415, 14599566, 14809288, 15044450, 15168563, 15350644, 15624447, 15780270]
4805A5780270K47755K70588K17323L91546L23583J73142K10242J95345K82389
4796A8092183K15697K70242K60827K93725K53875K18024K40715K32649K54272
4787B0332209L26616L22021L52151M42302M68242M48000N32901O00488P53185
4778B4578115P19836O03973P65186R63193R16222J029428J207441J302216J425652
4769C3511262J604645J964217K083552K613787L163298L872053M748363N669905
4761E9231082P151412Q727671J0610730J1948154J0326146N127277k475234r448073
4753A01199165j3729403j3682841j0397735p474989n015201l521821k639983k112748
4745D2624444j770640j407202j112847q33140n52788k19831p0224J10837J63311
$$ y = [15780270, 16028025, 16298613, 16515936, 16907482, 17231065, 17404207, 17614449, 17809794, 18092183, 18307880, 18578122, 18838949, 19132674, 19386549, 19604573, 19845288, 20077937, 20332209, 20658825, 20980846, 21332997, 21775299, 22243541, 22691541, 23224442, 23824930, 24578115, 25297951, 25901924, 26667110, 27630303, 28546525, 29575953, 30783394, 32085610, 33511262, 35115907, 37080124, 39163676, 41777463, 44940761, 48812814, 53561177, 59231082, 66382494, 75110165, 85720895, 97669049, 107995195, 113122472, 110647238, 101199165, 87469762, 73786921, 63389186, 55914197, 50898996, 47377175, 44737192, 42624444, 40853804, 39446602, 38333755, 37500615, 36947827, 36727996, 36657772, 36768609, 36931920]
4736C6931920L24794K72212M68076N08270N83749N85855O19711Q18811J027936
4727D2141334J209914J382384J791883K120928K654777L532841M299260N492963
4719F4626284O808244Q136475R783787J1121789Q889941L702096j410829n782178
4711A05875609r908248j2848157j1683218q715293o178238m545770l286126k585869
4703D6124690k245167j941198j515451j228806j005807p83406o13666n26685m29074
4694C5835430m41180m14908k87365l47165k16951j37766n9334j70814r1862j18343
4684C3549742p5785j52626j19620j97715j63012L5018o7845j13418r0915J9550
4674C2623374Q3785J1345R7316J17583J53354K88483L51929K69140L43466L75119
$$ y = [36931920, 37256714, 37528926, 37997002, 38505272, 39089021, 39674876, 40294587, 41113398, 42141334, 43351248, 44733632, 46525515, 48646443, 51301220, 54834061, 59133321, 64626284, 71434528, 79571003, 89354790, 100476579, 109366520, 113068616, 111657787, 105875609, 95967361, 83119204, 71435986, 62720693, 56542455, 51996685, 48710559, 46124690, 43879523, 41938325, 40422874, 39194068, 38188261, 37404855, 36791189, 36264504, 35835430, 35394250, 34979342, 34691977, 34344812, 34127861, 33990095, 33930761, 33759947, 33668085, 33549742, 33473957, 33321331, 33201711, 33003996, 32840984, 32876002, 32808157, 32694739, 32603824, 32623374, 32707159, 32718504, 32815820, 32933403, 33086757, 33375240, 33727169, 33996309, 34339775, 34714894]
4664C4714894M29996O43241O00110N40433N71993O92134P12316O74845O44736
4655D0224698P98660P92183Q29103Q47811Q41431P85575P58596P40480Q53646
4646D7472183P71467P56355Q88185R54512J099585J136208J298108J322551J328345
4637E7027499J556484J632730J664211J699477J517016J500951J578830J422211
4629F9599409J365467J416260J413922J539314J567215J692854J825518J695966
4621H2115925J618352J605718J332953J476404J470522J479559J573345J804981
4613I4477759K004499K027381K224886K226204K246627K346971K793757L140060
4605A13488144L337935L876371M095053M327216M259028L516569K411537O94795
$$ y = [34714894, 35144890, 35788131, 36388241, 36928674, 37500667, 38192801, 38905117, 39579962, 40224698, 41023358, 41815541, 42644644, 43492455, 44333886, 45119461, 45878057, 46618537, 47472183, 48243650, 49000005, 49888190, 50842702, 51942287, 53078495, 54376603, 55699154, 57027499, 58583983, 60216713, 61880924, 63580401, 65097417, 66598368, 68177198, 69599409, 70964876, 72381136, 73795058, 75334372, 76901587, 78594441, 80419959, 82115925, 83734277, 85339995, 86672948, 88149352, 89619874, 91099433, 92672778, 94477759, 96482258, 98509639, 100734525, 102960729, 105207356, 107554327, 110348084, 113488144, 116826079, 120702450, 124797503, 129124719, 133383747, 136900316, 139311853, 140006648]
4597A40006648j302694l315653m426130m849385m295787l447753k431054j468737
4589A14469455o32047J46495J054192J602846K248767K838611L183095L271615
4581A28183029L091164K655618J942763Q23525k80099j212379k452586l638270
4573A29112765m350455m703171m960151m806047m571904m204982l741589l433091
4565I4341375l035469k598882k224626j785851j575719j252088r46207p18048
4557H0204485m38060r0941L7311M02658M86177P19082J120070J346048J555331
4548H5342161K006665K312808K338903K654944K848973K869098K834387K772079
4540A05980018K678746K439946K050786J666854J210518O68345J70699l37083
$$ y = [140006648, 138703954, 135388301, 130962171, 126112786, 121816999, 118369246, 115938192, 114469455, 113837408, 113983903, 115038095, 116640941, 118889708, 121728319, 124911414, 128183029, 131274193, 133929811, 135872574, 136696099, 136416000, 135203621, 132751035, 129112765, 124762310, 120059139, 115098988, 110292941, 105721037, 101516055, 97774466, 94341375, 91305906, 88707024, 86482398, 84696547, 83120828, 81868740, 80922533, 80204485, 79766425, 79675484, 79712795, 80115453, 80601630, 81320712, 82440782, 83786830, 85342161, 87348826, 89661634, 92000537, 94655481, 97504454, 100373552, 103207939, 105980018, 108658764, 111098710, 113149496, 114816350, 116026868, 116695213, 116865912, 116528829]
4532A16528829o98989q26679j011006j171354r86110q50095q92284n64482j45945
4523A09381885p8243K02341K80098L67711M88381N76336P65631P56218O01035
4514A13341393M45179J5292m20401p58998j033146j244901j405369j471165j660880
4505A05807004j782954j883059k084885k057866k114405k131339j899298j660700
4497I0192498j622721j452289j158047j162420j120774r23029p43548o58857n93528
4488H0757285o92427p16838q36437r51045q96655r87552j105256j117257j160802
4479G2293016j156011j143767j207569j149107r56488r19045p86762q48065p30214
4470F3395988m85613m57432k88922p7887o7263J4586J72189L03263L81740N14130
$$ y = [116528829, 115829840, 115003161, 113992155, 112820801, 111834691, 110984596, 110092312, 109527830, 109381885, 109303642, 109505983, 109786081, 110153792, 110642173, 111218509, 111984140, 112740358, 113341393, 113786572, 113801864, 113381463, 112622465, 111589319, 110344418, 108939049, 107467884, 105807004, 104024050, 102140991, 100056106, 97998240, 95883835, 93752496, 91853198, 90192498, 88569777, 87117488, 85959441, 84797021, 83676247, 82753218, 82009670, 81350813, 80757285, 80064858, 79348020, 78511583, 77560538, 76663883, 75676331, 74571075, 73453818, 72293016, 71137005, 69993238, 68785669, 67636562, 66680074, 65761029, 64974267, 64126202, 63395988, 62910375, 62452943, 62164021, 62086134, 62018871, 62033457, 62205646, 62508909, 62890649, 63404779]
4460F3404779P53751P80775R36418R81578R67474R18193P79460O73795N84881
4451G0781104O29711O13427O53317Q36144Q47687R10806J206307J310326J587345
4442G9376174J636118J620196J696586J863060J997162K158000K211420K019860
4434I4578576K072694J842143J802625J997205K377191K855824L339144M012382
4426A14877784M716438N245757N900150O557484P374634Q345111R573122J1343662
4418A73934142J3602668J6292601J9238683K2624812K6278628K9451061L1021870
4411C32444465K9029721K0506363L939440j5956141l0875380l6575386l4467315
4404B68045767k8976429k3129450j8011988j4163052j1127022q762426p066150
$$ y = [63404779, 64158530, 64939305, 65875723, 66857301, 67824775, 68742968, 69522428, 70196223, 70781104, 71410815, 72024242, 72677559, 73513703, 74361390, 75272196, 76478503, 77788829, 79376174, 81012292, 82632488, 84329074, 86192134, 88189296, 90347296, 92558716, 94578576, 96651270, 98493413, 100296038, 102293243, 104670434, 107526258, 110865402, 114877784, 119594222, 124839979, 130740129, 137297613, 144672247, 153017358, 162590480, 173934142, 187536810, 203829411, 223068094, 245692906, 271971534, 301422595, 332444465, 361474186, 381980549, 385919989, 369963848, 339088468, 302513082, 268045767, 239069338, 215939888, 197927900, 183764848, 172637826, 163875400, 156809250]
4397A56809250n459709m275019l073845k089008j031578j536O80956J281023J704697
4388A44545231J790718J222750R5511j839958m195257n917500o783271o675092
4380A22243132o241421n405551m582638l729229l024227k659472k088231j555856
4372I2956507j345283j030817o68980n50125k56450p718J66758M36398N00203
4363I0200493N96272P94865Q82973Q55884Q63633P68919N29464L94024K21846
4354I6108373L07007L83411M76063P77820J066597J523406J677886J891962K307638
4345A06520163K573578L043667L437209M110505M687420N298456O089812P031719
4337A42792529P888383Q505223Q568212P934520O738357N025423L237537J649177
$$ y = [156809250, 151349541, 147074522, 144000677, 141911669, 140880091, 140878555, 141559511, 142840534, 144545231, 146335949, 147558699, 147654210, 145814252, 141618995, 135701495, 128918224, 122243132, 116001711, 110596160, 106013522, 102284293, 99260066, 96600594, 94512363, 92956507, 91611224, 90580407, 89911427, 89361302, 89104852, 89097134, 89263892, 89700290, 90200493, 90796765, 91591630, 92474603, 93330487, 94194120, 94963039, 95492503, 95886527, 96108373, 96415380, 96798791, 97274854, 98052674, 99119271, 100642677, 102320563, 104212525, 106520163, 109093741, 112137408, 115574617, 119685122, 124372542, 129670998, 135760810, 142792529, 150680912, 159186135, 167754347, 175688867, 182427224, 187452647, 190690184, 192339361]
4329A92339361N08488M36978J094159K813754N304655Q313519J1650916J5524220
4321B37986050J9943553K4351210K8194887K9845015K7165315J9704190R019175
4314C96209395l154422j5590042k6280157l3580108l6879810l5500099l0657425
4307B14567332k4956051j9628073j5687858j2728597j0879235r311381p948236
4300A13427901p056778o211127n426151m736022m338271l844950l540752l194871
4292G5078979l051853k647088k545471k291284k047502j964021j744508j613184
4284E7174068j741667j554178j473028j516772j172578j155529j156704j041307
4276D6362305j068636j019508j146524r75455q64140r20504p91981p29947o78504
$$ y = [192339361, 192847849, 193284827, 194378986, 197192740, 202497395, 210810914, 222461830, 237986050, 257929603, 282280813, 310475700, 340320715, 367486030, 387190220, 396209395, 393054973, 377464931, 351184774, 317604666, 280724856, 245224757, 214567332, 189611281, 169983208, 154295350, 141566753, 130687518, 121376137, 113427901, 106371123, 100159996, 94733845, 89997823, 85659552, 81814602, 78273850, 75078979, 72027126, 69380038, 66834567, 64543283, 62495781, 60531760, 58787252, 57174068, 55432401, 53878223, 52405195, 50888423, 49715845, 48560316, 47403612, 46362305, 45293669, 44274161, 43127637, 42152182, 41288042, 40367538, 39575557, 38845610, 38167106]
4267C8167106n70444o30149n73082m06394m01245l51444k36425k60123k81787
4258C4456013k65921l08752m80109p73004p27303o74496o67049o59567m66887
4249B9432925m02529m28887l38052m30565k96266l03440l42262k51642l28961
4240B6310321j99327k16612k19839k31269j14925m8909k38491j82874k03374j53379
4230B4501322j47849j32002n6764j79504q1907r5366l1850O1383o1721j61054
4220B3614688j69894q2594q7971j59574j42032m4803o7224k00083k32348K5981
4210B2454146m6537r2155k23950j35346R465k03194p3120l7176j3632n8974P1231
4199B1650758M7620j24483j7891L1774O9984J59230J09134J58174J46071K11058
$$ y = [38167106, 37596662, 36966513, 36393431, 35987037, 35585792, 35234348, 34997923, 34737800, 34456013, 34190092, 33881340, 33401231, 32628227, 31900924, 31226428, 30559379, 29899812, 29432925, 29030396, 28601509, 28263457, 27832892, 27536626, 27233186, 26890924, 26639282, 26310321, 26110994, 25894382, 25674543, 25443274, 25328349, 25279440, 25040949, 24858075, 24654701, 24501322, 24353473, 24221471, 24164707, 23985203, 23903296, 23807930, 23776080, 23837463, 23775742, 23614688, 23444794, 23362200, 23274229, 23114655, 22972623, 22927820, 22860596, 22660513, 22428165, 22454146, 22407609, 22315454, 22091504, 21956158, 21965623, 21762429, 21689309, 21652133, 21638501, 21579527, 21650758, 21698378, 21573895, 21556004, 21587778, 21657762, 21816992, 21926126, 22084300, 22230371, 22441429]
4189B2441429J63577J78145J4863Q4230K61069L63915L72251N00570M59485M58652
4179B5298186N02358M15537L03935n898o2393k49428l16579k80391k43216j21183
4169B5240928Q0737R4590J40017m435j51384m30377n08186n94128p14019n96266
4159B2557477l17373k38160l35243j51097O6257n7127J43095P1483J00601L17302
4149B2157215L12855L64169M46017L18084K13321J29711K4592O9431L2960N7657
4139B4126012j19995n23902q94776q46915q22760o96333m55147l55260k95647
4130A9115277j86994k44990k12349j59096j45919j90290j20647m7643j07358m8118
4120A7651873n0508r99j98926q0142o6892q1928J3143j5426m2649n9464J62187
$$ y = [22441429, 22605006, 22783151, 22798014, 22882244, 23143313, 23507228, 23879479, 24380049, 24839534, 25298186, 25800544, 26216081, 26520016, 26514118, 26451725, 26202297, 25885718, 25605327, 25362111, 25240928, 25321665, 25416255, 25556272, 25551837, 25400453, 24970076, 24461890, 23867762, 23153743, 22557477, 22240104, 22001944, 21666701, 21515604, 21581861, 21524734, 21667829, 21739312, 21839913, 22157215, 22470070, 22834239, 23280256, 23598340, 23811661, 23941372, 23965964, 24035395, 24068355, 24126012, 24006017, 23482115, 22587339, 21740424, 20917664, 20221331, 19766184, 19410924, 19115277, 18928283, 18683293, 18470944, 18311848, 18165929, 17975639, 17854992, 17807349, 17699991, 17651873, 17601365, 17600366, 17401440, 17321298, 17254406, 17172478, 17185621, 17170195, 17127546, 17068082, 17230269]
4109A7230269J6066O3597l8285J20294R3898m7522j00944k44540J1258j8512n6003
4098A7029576Q8507N7612J41506J87148K14794K32380J70395J97821m8131J20022
4088A8391630q835l9074M0237J4657J37350Q3827J14798J12258J28510J54159
4078A9129517J20556J07521J73484K89938K05928O0726J30750J62204K49468P4525
4068B0704617Q0565J43787K00567J94700J63418K26173J82195J24165J22594J21646
4058B2264427J21311L25928J69783J93340J97173K78524K10434L27397M33349
4049B4521666L95240L91499L18979M04366L94562M02613L38648N29353M41035
4040B8137961N12197N32840O82925O49370O56684O94014Q20770P74438Q73577
$$ y = [17230269, 17246335, 17309932, 17271647, 17391941, 17485839, 17438317, 17337373, 17092833, 17104091, 17085579, 17029576, 17118083, 17175695, 17317201, 17504349, 17719143, 17951523, 18121918, 18319739, 18271608, 18391630, 18382795, 18343721, 18383958, 18398615, 18535965, 18619792, 18734590, 18846848, 18975358, 19129517, 19250073, 19357594, 19531078, 19821016, 20026944, 20087670, 20218420, 20380624, 20630092, 20704617, 20785182, 20928969, 21129536, 21324236, 21487654, 21713827, 21896022, 22020187, 22142781, 22264427, 22385738, 22711666, 22881449, 23074789, 23271962, 23550486, 23760920, 24088317, 24521666, 24916906, 25308405, 25627384, 26031750, 26426312, 26828925, 27167573, 27696926, 28137961, 28650158, 29182998, 29865923, 30515293, 31171977, 31865991, 32686761, 33461199, 34334776]
4031C4334776R30499R39612R82758Q18636Q39147P80154P98068P75600P48281
4022D1947531R46763Q68895J034670J126283J118250J020427J137481J307826
4014E0508126J322348J332866J314311J373116J305555J476611J480363J385952
4006F1499248J425427J554428J343651J509140J513990J422046J383166J353824
3998G3004920J438630J354652J348161J332120J244610J182919J167895J023622
3990H3097529J019706J113433R79601Q50610P90284O89119O87793M68340M38375
3981I0134790L62755L08777K98434J70178K49281o0765N2334j43317r3566q6245
3971I1192656j26216l61910k94351l05050m64155m94801m52619n83908o73001
$$ y = [34334776, 35265275, 36204887, 37187645, 38006281, 38845428, 39625582, 40423650, 41199250, 41947531, 42894294, 43763189, 44797859, 45924142, 47042392, 48062819, 49200300, 50508126, 51830474, 53163340, 54477651, 55850767, 57156322, 58632933, 60113296, 61499248, 62924675, 64479103, 65822754, 67331894, 68845884, 70267930, 71651096, 73004920, 74443550, 75798202, 77146363, 78478483, 79723093, 80906012, 82073907, 83097529, 84117235, 85230668, 86210269, 87060879, 87851163, 88540282, 89228075, 89696415, 90134790, 90497545, 90806322, 91104756, 91274934, 91524215, 91463450, 91515784, 91372467, 91278901, 91192656, 91066440, 90704530, 90410179, 90105129, 89640974, 89146173, 88693554, 88109646, 87436645]
3962H7436645o92114q60507q52903p98061r85191q66391q34210j064671j137183
3953G9345414j001202r94231j020590j103178j318215j071562j148193j006266
3945G0681977j076187j143786j128729j118792j253384j296254j283228j405235
3937F0976382j415810j293956j319474j392202j421127j291048j301182j378655
3929E0162928j199964j322362j406831j176958j291092j208601j303325j266852
3921C9986943j186278j063314j048981r50157r55887j073484r39617q64465q71592
3912C1033168r40413q10285r04353q31486q77966o72108n95192n32562o69920
3903B4198883o45098m81815n61159m02705n09264l86789l96428m60319k81966
$$ y = [87436645, 86744531, 85884024, 85031121, 84233060, 83247869, 82381478, 81547268, 80482597, 79345414, 78344212, 77349981, 76329391, 75226213, 73907998, 72836436, 71688243, 70681977, 69605790, 68462004, 67333275, 66214483, 64961099, 63664845, 62381617, 60976382, 59560572, 58266616, 56947142, 55554940, 54133813, 52842765, 51541583, 50162928, 48962964, 47640602, 46233771, 45056813, 43765721, 42557120, 41253795, 39986943, 38800665, 37737351, 36688370, 35738213, 34782326, 33708842, 32769225, 31904760, 31033168, 30092755, 29282470, 28378117, 27546631, 26668665, 25996557, 25401365, 24868803, 24198883, 23553785, 23071970, 22510811, 22108106, 21598842, 21212053, 20815625, 20355306, 20073340]
3894B0073340k18943k44285l63718j96795k32449j59507j38819j40551m6114j74213
3884A8157946J2884j2240p9181j37859J45498P185K5136j8463p5809K9033K7582
3873A8081712P6893k3595l5300j9376K8629j9559J32340J34684Q2312J50952m3926
3862A8545766k7513P8265j22910p5534l187o5327r1229o1225j13306j42000p7918
3851A7843882l40p2533p0020m2813J2075j98932r4384J05065p4036J05024K2508
3840A7535496k8463l9864M0603O4319N0035k6401j27514n7169l6618j07102j34154
3829A7133168k40879q8889r3093j87278j57781j20924j4066j18120j45075j89133
3819A5777930p0245j47227k69446j95385k70674k89704j34105k87047k10486k09480
$$ y = [20073340, 19854397, 19610112, 19246394, 19049599, 18817150, 18657643, 18518824, 18378273, 18332159, 18157946, 18170830, 18158590, 18079409, 17941550, 18087048, 18094233, 18119369, 18100906, 18025097, 18054130, 18081712, 18158605, 18135010, 18099710, 18080334, 18108963, 18089404, 18221744, 18356428, 18438740, 18589692, 18545766, 18518253, 18596518, 18473608, 18398074, 18394887, 18329560, 18238331, 18177106, 18063800, 17921800, 17843882, 17843542, 17771009, 17700989, 17658176, 17670251, 17471319, 17376935, 17482000, 17407964, 17512988, 17535496, 17507033, 17467169, 17507772, 17572091, 17622126, 17595725, 17468211, 17411042, 17374424, 17267322, 17133168, 16892289, 16803400, 16710307, 16523029, 16365248, 16244324, 16230258, 16112138, 15967063, 15777930, 15707685, 15560458, 15291012, 15095627, 14824953, 14535249, 14401144, 14114097, 13903611, 13694131]
3809A3694131j49366j11527j51057l7823q4997q565p8550k5024q5475j24291j09826
3798A2727630j61527k02036n7016j10009k58314j16710n3251o6542J5830Q8M2777
3787A1760920j7249n6542N8033m8839K6000N3904R7146J22391J10255m8568J04056
3776A2161507P0025M4269J35824J48425R1726J81556J27223O1597J33664j8124
3766A3137692J65409K53822P2634Q3595K11536J69395J87395M16727Q3535K37131
3756A5018871J63406J89681K21157L16932J77043K34672L32709L08549L68881
3747A7331901L62778M01725K92719L83189K27168L96212J98428J55180K13342
3738A9962642K29760K46529K03401K42533K05007K79789K48999K89813J69200
$$ y = [13694131, 13544765, 13433238, 13282181, 13244358, 13159361, 13150796, 13072246, 13047222, 12961747, 12837456, 12727630, 12566103, 12364067, 12307051, 12197042, 11938728, 11822018, 11768767, 11702225, 11718055, 11718143, 11760920, 11743671, 11687129, 11745162, 11696323, 11722323, 11776227, 11873373, 11995764, 12106019, 12057451, 12161507, 12231532, 12275801, 12411625, 12560050, 12651776, 12833332, 12960555, 13022152, 13155816, 13137692, 13303101, 13556923, 13629557, 13713152, 13924688, 14094083, 14281478, 14698205, 14781740, 15018871, 15182277, 15371958, 15593115, 15910047, 16087090, 16321762, 16654471, 16963020, 17331901, 17694679, 18096404, 18389123, 18772312, 18999480, 19395692, 19594120, 19749300, 19962642, 20192402, 20438931, 20642332, 20884865, 21089872, 21369661, 21618660, 21908473, 22077673]
3729B2077673K28481M14783O4309K10611K33104K72308K23820K10087K34017J44450
3719B4313643K17172K71190L79425K82210L02198M34330K26896L49817L91224
3710B7168105L47448K95510M59311M57708L97748M37404N76392M41830M16397
3701C0997853L77133N11996O47825M62582M88217O55072O12804N11895P06641
3692C5972018O83163O81192P18945P69546P57781P50616Q79329Q34954R17099
3683D2964643Q57646Q86367J095633R90111R28794R28909J181361J117158R68675
3674E1919297J187696J117981J319591J240611J312490J321000J193858J358654
3666F1971178J374281J527914J502361J532786J560481J500201J423407J618446
$$ y = [22077673, 22306154, 22720937, 22785246, 22995857, 23228961, 23501269, 23725089, 23935176, 24169193, 24313643, 24530815, 24802005, 25181430, 25463640, 25765838, 26200168, 26427064, 26776881, 27168105, 27515553, 27811063, 28270374, 28728082, 29125830, 29563234, 30139626, 30581456, 30997853, 31374986, 31886982, 32534807, 32997389, 33485606, 34140678, 34753482, 35265377, 35972018, 36655181, 37336373, 38055318, 38824864, 39582645, 40333261, 41212590, 42047544, 42964643, 43822289, 44708656, 45804289, 46794400, 47723194, 48652103, 49833464, 50950622, 51919297, 53106993, 54224974, 55544565, 56785176, 58097666, 59418666, 60612524, 61971178, 63345459, 64873373, 66375734, 67908520, 69469001, 70969202, 72392609, 74011055]
3658G4011055J637623J635348J770761J631138J830958J785431J826485J760582
3650H7889381J675594J860146J708846J757172J652742J766579J541092J617087
3642A01468639J606537J693477J521733J617422J579490J559110J505384J429081
3634A13980873J600045J527790J611701J529823J617657J549174J553978J635631
3626A26606672J637429J757767J806213J834245J909341K017568K177899K226201
3618A41973335K213186K295875K611510K671190K642017K592890K735013K869289
3610A62604305K937536L103219K896371L040565L143892K949629K988788K978710
3602A86643015L125378L111771L157684L084513K997909L000034K967281K911021
$$ y = [74011055, 75648678, 77284026, 79054787, 80685925, 82516883, 84302314, 86128799, 87889381, 89564975, 91425121, 93133967, 94891139, 96543881, 98310460, 99851552, 101468639, 103075176, 104768653, 106290386, 107907808, 109487298, 111046408, 112551792, 113980873, 115580918, 117108708, 118720409, 120250232, 121867889, 123417063, 124971041, 126606672, 128244101, 130001868, 131808081, 133642326, 135551667, 137569235, 139747134, 141973335, 144186521, 146482396, 149093906, 151765096, 154407113, 157000003, 159735016, 162604305, 165541841, 168645060, 171541431, 174581996, 177725888, 180675517, 183664305, 186643015, 189768393, 192880164, 196037848, 199122361, 202120270, 205120304, 208087585, 210998606]
3594B10998606K650151K421509K448654K253940K120920J995187J792876J640871
3586B28322714J342958J359485J216621Q81830P69360O32622K09626j9123k52462
3577B34463631p10670r54509j117428j458271j578478j731568j875782j857982
3569B23178943k113569k102236k042415k149447k176659k226765k165047k172976
3561B06029829k143057k078696k147088k023701j888634j879989j832200j703358
3553A90333106j679956j534044j621097j690895j592162j715131j708182j804368
3545A76987271j798138j909605j815475j922802k035132k103655k087488k077943
3537A61237033k195042k501617k774572k954781l142840l252353l540023l749220
$$ y = [210998606, 213648757, 216070266, 218518920, 220772860, 222893780, 224888967, 226681843, 228322714, 229665672, 231025157, 232241778, 233123608, 233892968, 234525590, 234735216, 234716093, 234463631, 233752961, 232798452, 231681024, 230222753, 228644275, 226912707, 225036925, 223178943, 221065374, 218963138, 216920723, 214771276, 212594617, 210367852, 208202805, 206029829, 203886772, 201808076, 199660988, 197637287, 195748653, 193868664, 192036464, 190333106, 188653150, 187119106, 185498009, 183807114, 182214952, 180499821, 178791639, 176987271, 175189133, 173279528, 171464053, 169541251, 167506119, 165402464, 163314976, 161237033, 159041991, 156540374, 153765802, 150811021, 147668181, 144415828, 140875805, 137126585]
3529A37126585l548290l517769l340692l187302l092208l006501k722653k650720
3521A12060450k797561k646854k637812k698320k642274k634508k552348k383622
3513I1067151k300859k042469j920545j682066j623746j408879j372511j248174
3505G7467902j122257j074805r39542q25343j013933q22256p70483p66790q17395
3496F9315098o78419o62292p51020o94847n52728n44346o42827o05280l74867
3487F3808472n37723m93291l92701l76722n04615m47035l77385k31298l08641
3478F0139061l37360k1872J01763J07089K07815J93425M07044O29114O74531J059325
3468F3159935J139519J143465J223781J587721J737389K036373K105611K159126
$$ y = [137126585, 133578295, 130060526, 126719834, 123532532, 120440324, 117433823, 114711170, 112060450, 109262889, 106616035, 103978223, 101279903, 98637629, 96003121, 93450773, 91067151, 88766292, 86723823, 84803278, 83121212, 81497466, 80088587, 78716076, 77467902, 76345645, 75270840, 74331298, 73505955, 72492022, 71669766, 70899283, 70132493, 69315098, 68636679, 67974387, 67223367, 66528520, 65975792, 65431446, 64788619, 64183339, 63808472, 63270749, 62777458, 62384757, 62008035, 61503420, 61056385, 60679000, 60447702, 60139061, 59801701, 59779829, 59881592, 59988681, 60196496, 60389921, 60796965, 61426079, 62100610, 63159935, 64299454, 65442919, 66666700, 68254421, 69991810, 72028183, 74133794, 76292920]
3460G6292920K254744K314624K310830K282242K082319J960301J475754J350366
3452I2324100J127472O34919M62997K16784n6278l84774o08755o15939q66114
3443I2234412j025484j396186j554979j838426k079988k404624k558899k774579
3435G6601247k965299k949918l195811k951862k979026l061376k772479k514234
3427E3211242k298258k294410k060062j930719j918284j757931j683500j572331
3419C7695747j499050j272003j387360j295351j127488j101654j069932r68018
3411B7974891q37948q01029p38034o53470o42276m97558n27495m77165m07557
3402B2392359l62591l70502l63549l48307l38799k97659m53228k89588j75120
$$ y = [76292920, 78547664, 80862288, 83173118, 85455360, 87537679, 89497980, 90973734, 92324100, 93451572, 94086491, 94549488, 94766272, 94709994, 94325220, 93716465, 93100526, 92234412, 91208928, 89812742, 88257763, 86419337, 84339349, 81934725, 79375826, 76601247, 73635948, 70686030, 67490219, 64538357, 61559331, 58497955, 55725476, 53211242, 50912984, 48618574, 46558512, 44627793, 42709509, 40951578, 39268078, 37695747, 36196697, 34924694, 33537334, 32241983, 31114495, 30012841, 28942909, 27974891, 27136943, 26335914, 25597880, 24944410, 24302134, 23804576, 23277081, 22799916, 22392359, 22029768, 21659266, 21295717, 20947410, 20608611, 20310952, 19857724, 19568136, 19393016]
3393A9393016k21770l29065l31209j78508j84460k17906k49525k19397j99954
3384A7261222k58237j76509l34493j32860j27916k31693k05450j26694k25966
3375A5441404j64805j64189k70310j65858j84086j67014r4630j52737k08472m3008
3365A3826295q485j09381k01631n4330j22811q6012K0525n3689j37484m2890m5860
3354A2984247R333j1735o3884k7274j83715j13157K8012n0736j70649j2600j80110
3343A2207732j56278n494j23305j59592p9848j28560j56962j36993m7679p683
3333A1205338k71524j097j83705m8848k1155r9741o3226j85776p8448q7254j03490
3322A0061074k898J1214o548r4855p0722Q6358k0907K818m9223o0384j5346O11
$$ y = [19393016, 19171246, 18842181, 18510972, 18332464, 18148004, 17930098, 17680573, 17461176, 17261222, 17002985, 16826476, 16491983, 16359123, 16231207, 15999514, 15794064, 15667370, 15441404, 15276599, 15112410, 14842100, 14676242, 14492156, 14325142, 14230512, 14077775, 13869303, 13826295, 13817810, 13708429, 13506798, 13452468, 13329657, 13243645, 13264170, 13210481, 13072997, 13030107, 12984247, 12993580, 12981845, 12917961, 12890687, 12706972, 12593815, 12621827, 12571091, 12400442, 12387842, 12207732, 12051454, 12045960, 11922655, 11763063, 11683215, 11554655, 11397693, 11260700, 11213021, 11205338, 10933814, 10932717, 10749012, 10700164, 10679009, 10579268, 10516042, 10330266, 10251818, 10164564, 10061074, 10058176, 10069390, 10062842, 9967987, 9897265, 9983623, 9962716, 9965534, 9916311, 9855927, 9840581, 9841192]
3310I841192N5106j769K6903J12561J44961l2609p2405J19381J87956q2789M2438
3299A0340926J53052j2700N2521R5321O9323J3474O5990J85649M3327j9508N3803
3288A1041178P6370J05544P9834J16348Q2227J06627Q6172L5101J80663K08719
3278A2118783L60173K10209K09787K54194K92196M26609M98710M41678K86410
3269A5098749L09573K65895K06676j05156l99793o71475o66068o27310n52194
3260A2858897o19913n41080l69065l48368l62466l75529k39518k31525k76186
3251I495247k07092j90732j82398k47749k18061j72253j89315k54627j06550r1013
3241G635457j04347j49070k07592j44102j23662j09940j82129j18794j26479j52555
$$ y = [9841192, 9896298, 9894529, 9921432, 10033993, 10178954, 10146345, 10073940, 10193321, 10381277, 10298488, 10340926, 10493978, 10481278, 10533799, 10629120, 10698443, 10711917, 10777907, 10963556, 11006883, 10987375, 11041178, 11117548, 11223092, 11302926, 11419274, 11501501, 11608128, 11694300, 11729401, 11910064, 12118783, 12478956, 12689165, 12898952, 13153146, 13445342, 13871951, 14370661, 14812339, 15098749, 15408322, 15674217, 15880893, 15775737, 15375944, 14704469, 14038401, 13411091, 12858897, 12238984, 11697904, 11328839, 10980471, 10618005, 10242476, 10002958, 9771433, 9495247, 9288155, 9097423, 8915025, 8667276, 8449215, 8276962, 8087647, 7833020, 7726470, 7635457, 7531110, 7382040, 7174448, 7030346, 6906684, 6796744, 6614615, 6495821, 6369342, 6216787]
3231F216787r0767m6653J08k8649j56061j86054j42883L0198n8223j59010j21195
3220E257598m8999j6228o3818l1541j42691K0650k14057p1737L465O1574J3377
3209D767593o6051q0190r3490K895L999R305j12513j12996q6798R8053n5590p7993
3197D196224n3956k5337J8818k6850r2164j1960k3127r2273K9989M9846q2274
3186C886936j6830l8039O3011L0888m4453q6864p1547K6246p569l0923l763Q941
3174C716034r5752n5626L5158N0818K7432o7793q9736q6403q482M1361P9906l4445
3162C512472m1058o663N512k1780M5475L4198l1900j70819p1312R5566k1142M5215
3150C373764m3167o1166m6153L331r7587n7745o5359N3075n9449k8372j37351
$$ y = [6216787, 6126020, 6079367, 6079475, 6050826, 5894765, 5708711, 5565828, 5596026, 5537803, 5378793, 5257598, 5208599, 5192371, 5128553, 5097012, 4954321, 4974971, 4760914, 4689177, 4692642, 4754216, 4767593, 4701542, 4621352, 4527862, 4530757, 4534756, 4544061, 4431548, 4318552, 4231754, 4329807, 4274217, 4196224, 4142268, 4116931, 4135749, 4108899, 4016735, 4004775, 3981648, 3889375, 3919364, 3969210, 3886936, 3870106, 3832067, 3895078, 3925966, 3881513, 3794649, 3723102, 3749348, 3741779, 3710856, 3707093, 3716034, 3620282, 3564656, 3599814, 3650632, 3678064, 3610271, 3520535, 3434132, 3425650, 3467011, 3546917, 3512472, 3471414, 3464751, 3470263, 3448483, 3493958, 3528156, 3496256, 3325437, 3254125, 3349691, 3328549, 3373764, 3330597, 3269431, 3223278, 3226609, 3129022, 3071277, 3005918, 3058993, 2999544, 2971172, 2833821]
3139B833821m5376O9008o47k4422P995n8873n4579o3869j405m8560R7959L888
3127B714940j40843Q8193L0209r4659j24192l5317K15343J5205k33404M9204n0790
3116B433889p0936q353P1054m2338j5266J10717k1002J38006O423j2867r6591
3105B492736m0719J9968j26858K6208K0902N1400j66431N3137K1259J4572l0246
3094B335928q2752k1865l1044R8212M6171q6172J5990m3828R3065o7039N3089
3083B309755j20364j16778L0041R300k7872o2232N6203J03737m5101k9420l9066
3072B068203O4556J9625p1091m0637l0580k6445L3358Q7806P2524J06767j79384
3061B104702r28o276k7070J80971o5015n5141p5609J2451R248k0036n3048j1006
$$ y = [2833821, 2788445, 2857453, 2856806, 2832384, 2840379, 2781506, 2726927, 2663058, 2661653, 2613093, 2711052, 2714940, 2574097, 2662290, 2692499, 2597840, 2473648, 2438331, 2653674, 2668879, 2435475, 2484679, 2433889, 2362953, 2354600, 2425654, 2383316, 2368050, 2478767, 2457765, 2595771, 2602194, 2589327, 2492736, 2452017, 2471985, 2345127, 2371335, 2392237, 2443637, 2277206, 2330343, 2351602, 2366174, 2335928, 2253176, 2231311, 2200267, 2298479, 2344650, 2258478, 2274468, 2230640, 2323705, 2256666, 2309755, 2189391, 2072613, 2102654, 2111954, 2084082, 2021850, 2078053, 2181790, 2136689, 2107269, 2068203, 2132759, 2152384, 2081293, 2040656, 2010076, 1983631, 2016989, 2104795, 2177319, 2284086, 2104702, 2103774, 2097498, 2070428, 2251399, 2186384, 2131243, 2055634, 2068085, 2077333, 2057297, 2004249, 1993243]
3049A993243J45416l9775K7813m1417M2808M0320l0029m7350J22178Q2412J15994
3038B411613j0399q4196O747k5968L9578N5965P5641P4081J1350j628M0668J0828
3026B604280j15561J1139k5290k0808l6564K2759j4377J560P533N538o2828p4537
3014B302844j6061k2379j6714j9783K5343R9588R3686M4246j8291O8079J9356
3003B559914m5337J7822J54814P2544K0888J53967J25484P8244P3457J39099N8960
2992C409856r0352J7451k9698j51743k35407k6560L0951L6017k400o8926r3684
2981B795505m7685n3101j38813n6244j2886L9017J723p0157M6259o521n4527N4658
2969B497228p6342J17248j4914j2738O5621Q0024N9252J5468P1591J49062N8448
$$ y = [1993243, 2138659, 2098884, 2126697, 2085280, 2128088, 2168408, 2138379, 2091029, 2213207, 2295619, 2411613, 2401214, 2317018, 2323765, 2297797, 2337375, 2393340, 2468981, 2543062, 2554412, 2552784, 2593452, 2604280, 2488719, 2499858, 2474568, 2453760, 2417196, 2439955, 2425578, 2427138, 2434671, 2440209, 2377381, 2302844, 2286783, 2264404, 2247690, 2227907, 2253250, 2352838, 2446524, 2490770, 2472479, 2540558, 2559914, 2514577, 2532399, 2687213, 2759757, 2780645, 2934612, 3060096, 3138340, 3211797, 3350896, 3409856, 3319504, 3336955, 3307257, 3155514, 2920107, 2893547, 2924498, 2960515, 2958115, 2889189, 2795505, 2747820, 2694719, 2555906, 2499662, 2486776, 2525793, 2527516, 2457359, 2503618, 2497097, 2442570, 2497228, 2420886, 2538134, 2523220, 2510482, 2576103, 2656127, 2715379, 2730847, 2802438, 2951500, 3009948]
2958C009948j2105q964L3306K6317M5878p9457q6521n9751n0293K4954n1101m8509
2946B743702N0169p4438l132m3107q3287K5589N3604q6331j11279J5604R713m186
2934B492621J04392J03654J8650N6925J3736K3696J18064Q8013o6727q5025L1840
2923B899839j42527k49039m3777N7439o0334n4611L2775L0840L824k5666n7685
2912B391078r8356J24126P3613k8475l4971M761j2307P9626q7578J27412P0515
2901B609444p1141j53544J09616M9236j10064j9422l8045K7194p335k698j24151
2890B269090K6866N7766J4650j58033L887k953J694P6914q121m5316j7176k8151
2878B191117J1759n9204R7813j12604l915K2637m0393n6224L8649R037J2402L7005
$$ y = [3009948, 2997843, 2988879, 3022185, 3048502, 3094380, 3014923, 2928402, 2868651, 2818358, 2843312, 2792211, 2743702, 2793871, 2719433, 2716301, 2673194, 2589907, 2615496, 2669100, 2582769, 2471490, 2487094, 2496807, 2492621, 2597013, 2700667, 2719317, 2776242, 2789978, 2813674, 2931738, 3019751, 2953024, 2867999, 2899839, 2757312, 2508273, 2464496, 2521935, 2461601, 2406990, 2439765, 2470605, 2474429, 2448763, 2391078, 2292722, 2416848, 2490461, 2461986, 2427015, 2431776, 2419469, 2499095, 2411517, 2538929, 2609444, 2538303, 2384759, 2494375, 2543611, 2433547, 2414125, 2376080, 2403274, 2395939, 2393241, 2269090, 2295956, 2353722, 2368372, 2210339, 2214226, 2211273, 2212967, 2289881, 2281760, 2236444, 2219268, 2191117, 2202876, 2143672, 2241485, 2128881, 2124966, 2147603, 2107210, 2050986, 2089635, 2098672, 2111074, 2148079]
2866B148079r3191q0134r8545P1728p2798l9818k5780j70409j27266J8008l3869
2855A496005n7459L9224j2083n6485j9980j17002k7053q920m1161N6474M4172
2844A295732j4366q2512r9091R635k1315K9162r6855n5031Q4917o965n1190P8025
2832A070146J5399j5146o4796K502q8687j16537O2897P603l008P5939m458m5624
2820H96230K5445q9921j9420J24910j3585N8066p888q8905J4237J5471O9355j9093
2808I64902J7728n1059p98l4181j1722K221k374l6318k968j1185l5380l2641j5879
2795G50346L5863L4664j25362n8874k7857Q7325R6832l7072n1632m3915m175L7393
2783F93536Q3905J3831K7579L2185j05438n9206M2477K9461m6432l1517J2370
$$ y = [2148079, 2054888, 1974754, 1876209, 1947937, 1875139, 1835321, 1809541, 1639132, 1511866, 1529874, 1496005, 1438546, 1477770, 1465687, 1409202, 1389222, 1272220, 1245167, 1236247, 1195086, 1251560, 1295732, 1281366, 1198854, 1099763, 1109398, 1088083, 1117245, 1020390, 965359, 1050276, 1043311, 992121, 1070146, 1085545, 1070399, 1005603, 1008105, 919418, 802881, 865778, 873381, 870373, 946312, 941854, 896230, 921675, 831754, 812334, 937244, 923659, 981725, 973837, 884932, 899169, 914640, 983995, 964902, 982630, 931571, 930773, 896592, 884870, 887091, 884717, 848399, 845431, 834246, 798866, 766225, 750346, 786209, 820873, 695511, 636637, 608780, 696105, 792937, 755865, 704233, 660318, 656143, 693536, 777441, 791272, 818851, 851036, 745598, 686392, 728869, 758330, 711898, 680381, 692751]
2772F92751P062k4913L9577k6753J6724M8567r9351q3689q9165M7190q33k5752
2760E01415J3367O8040Q26n4036k0542R6321J97825p7007j23811J6637K5206N5010
2748F99251r6969j9593n4693J40014q0330O1094K1667R69L096m6030k4525N2457
2736F56408p4740k5301L2752M3182M4796P075k7184p8392L3908O5972o8741m1274
2724E68461L0175k978j0548O848K1590l4169l8356o7332P2283o6628Q8087J5496
2712E82929K3525j0015K2614Q4099j9209n9805R696O811Q7362m1122n2929O458
2700F40414o9900K4470J27178j6596r4627P0338p1796m7899J5919J6459N3506
2689F47466j3094J1272m3821L0327m1529p3429P0545K6153L1732J60933n3004
$$ y = [692751, 699813, 674900, 714477, 687724, 704448, 753015, 653664, 569975, 480810, 528000, 527167, 501415, 514782, 582822, 583648, 529612, 509070, 605391, 803216, 726209, 602398, 619035, 644241, 699251, 602282, 582689, 527996, 668010, 587680, 648774, 670441, 671410, 674506, 628476, 603951, 656408, 581668, 556367, 589119, 632301, 677097, 684172, 656988, 578596, 612504, 678476, 609735, 568461, 598636, 595658, 585110, 591958, 613548, 579379, 541023, 473691, 545974, 479346, 567433, 582929, 606454, 596439, 619053, 703152, 683943, 624138, 633834, 640645, 728007, 686885, 633956, 640414, 570514, 594984, 722162, 705566, 610939, 681277, 609481, 561582, 577501, 593960, 647466, 634372, 645644, 601823, 632150, 590621, 517192, 587737, 613890, 645622, 806555, 753551]
2678G53551j6910j8643l7457k250J7606J8506p8344m2946Q2597k6150J1024J7005
2666F77589k0632J14625Q997N1984J9485l9947j7118k5306j1463J30561M1961
2655I30736k7718M5585j0007j9665p5265P5214k2642o4781O5896o3474j083k71
2643H32525m0637J37420J39338l8762k8734L4154R546n3534o8212M3299r856K8286
2631I84833j12825j7320N074Q8371j3200P136O5430o8267M9694J14209M9240j03426
2619A048949j3859j4029O0099M5566J413O06j923r0716k9928J9747r83j08822
2607I16120m8913R4346q7733r2224J62089J05795m5618r0074o3784P1214L4615
2596I55833k857J6277j7171k5721p2292j7910P1693o9128r4204J45121L8295j09155
$$ y = [753551, 736641, 717998, 680541, 678291, 695897, 714403, 636059, 593113, 675710, 649560, 660584, 677589, 656957, 771582, 780579, 832563, 852048, 812101, 794983, 769677, 758214, 888775, 930736, 903018, 948603, 938596, 918931, 843666, 918880, 896238, 831457, 897353, 833879, 832796, 832525, 791888, 929308, 1068646, 1029884, 1001150, 1035304, 1044850, 991316, 923104, 966403, 956547, 984833, 872008, 854688, 859762, 948133, 934933, 942069, 1007499, 939232, 988926, 1103135, 1152375, 1048949, 1035090, 1021061, 1081160, 1126726, 1128139, 1128745, 1126822, 1036106, 1006178, 1025925, 1024942, 916120, 867207, 961553, 873820, 781596, 943685, 1049480, 1003862, 913788, 850004, 921218, 955833, 952976, 969253, 952082, 926361, 854069, 836159, 907852, 838724, 744520, 889641, 927936, 818781]
2584H18781N1742j3569l8410N3192L806j8816R3824O8768r6682k2410o5545n3278
2572G81403o3032M4122n4436q4322p4851L0522J2341J7752K3800K0230N9464j18772
2560E94221j2130J14059q0474p1638j0564M7904O0428k4817r0938k7831j09615
2549C88605K6860N5967l0124Q8762k4854m0588O4855m0566J1896O0076o2977l1215
2537D66697O2576j3588p0900P6649m0153j02176J4821q9586P7200j00852m8577
2526B32111K11475m559l5878L248j7582q4387j664P3441J3921p2143M4737o4680
2514B98040r2780K8158M9766j2534L1685K507L4775K3088J2308j0811j9868l098
2502C41236j8743m6226m9341N5742R5586n7714m8944J22244J7298j21925o0825
$$ y = [818781, 870523, 856954, 818544, 871736, 875542, 856726, 950550, 1019318, 922636, 900226, 834681, 781403, 718371, 762493, 708057, 623735, 548884, 579406, 591747, 609499, 633299, 653529, 712993, 594221, 582091, 696150, 615676, 544038, 533474, 581378, 641806, 616989, 526051, 498220, 388605, 415465, 471432, 441308, 530070, 505216, 464628, 529483, 488917, 500813, 560889, 497912, 466697, 529273, 515685, 444785, 521434, 481281, 379105, 393926, 304340, 381540, 280688, 232111, 443586, 439027, 403149, 406397, 388815, 304428, 302764, 376205, 390126, 317983, 362720, 298040, 205260, 233418, 283184, 270650, 302335, 304842, 339617, 362705, 375013, 364202, 344334, 341236, 322493, 276267, 226926, 282668, 378254, 320540, 271596, 393840, 411138, 289213, 228388]
2491B28388P241R2704l0283l3195r948j852l8752M0600M8317J25687n087j32586
2479B91234n1666k8783O7508J5532r3795m5776O8158R3714M4530j8206o9053n7016
2467B16381o1029M5264J7873O3904j5831j48035J314N839N4729R3268K8047K8850
2455C30574o6363n4626p084j8021m5501K7863N2529R6520n1575p0354K6169P9342
2443B99473J902l7919L7620o6015k2890r2357l9068J09407R5752q0659R5760J4481
2431C15487r3258j06553L2494m3354M9466J49063J8041p9522j7265j20838O1645
2420A65406J18689l817p3171q8603l6705j2012N1240J64554l2681m588l4126q1152
2408A33034N4817M6282k2212j08842M1619M2595P7002m3750n9705J07172P8499
$$ y = [228388, 235629, 328333, 298050, 264855, 254907, 253055, 214303, 254903, 303220, 428907, 423820, 291234, 239568, 210785, 278293, 293825, 200030, 154254, 222412, 316126, 360656, 342450, 273397, 216381, 155352, 200616, 218489, 282393, 266562, 118527, 119841, 125680, 180409, 273677, 301724, 330574, 264211, 209585, 202501, 184480, 138979, 166842, 219371, 315891, 264316, 193962, 220131, 299473, 301375, 263456, 301076, 235061, 212171, 119814, 80746, 190153, 285905, 205246, 301006, 315487, 222229, 115676, 148170, 104816, 154282, 303345, 321386, 241864, 224599, 103761, 165406, 284095, 280278, 207107, 118504, 81799, 69787, 121027, 285581, 252900, 248312, 214186, 133034, 187851, 234133, 211921, 103079, 144698, 187293, 264295, 220545, 160840, 268012, 346511]
2397C46511j30849n926J02628Q6714n9839k1822q1154M0653M6987k8558p2199
2386B23146o5507j0722Q7781j6957J3722k8060l5812J5002p734k2271P577o894
2374A53271M3322j13616L1249J15594L3751j10271m1446O6824l1568N9279l5804
2363A70585j5163m1495j1364K359O8325n475J10328m8315q3447R4093M3199m8056
2351B35574m4020j1024M9892j02986M5555M5727k7838q1822p0570J33466P2261
2340B44215N9065J564q5877m5602o0468J6229P3762k1684q3326J561M7310Q2425
2328B29174j4511M5020j6402q6424q408Q5213O6413p7211k14k3930L8078j12538
2316A24260M4922K2723m5605O7241L498n7792J9061N0505j13456O4479n3319k6424
$$ y = [346511, 215662, 209736, 312364, 399078, 339239, 317417, 236263, 276916, 323903, 295345, 223146, 157639, 146917, 234698, 217741, 231463, 203403, 167591, 182593, 174859, 152588, 160165, 153271, 196593, 82977, 114226, 229820, 263571, 153300, 111854, 178678, 147110, 206389, 170585, 155422, 113927, 102563, 104922, 173247, 167772, 278100, 229785, 146338, 240431, 283630, 235574, 191554, 180530, 230422, 127436, 172991, 218718, 190880, 109058, 38488, 171954, 244215, 303280, 304844, 218967, 173365, 112897, 129126, 202888, 181204, 97878, 99439, 146749, 229174, 214663, 259683, 243281, 156857, 148449, 233662, 300075, 222864, 222650, 198720, 236798, 124260, 169182, 191905, 146300, 213541, 217039, 159247, 178308, 228813, 115357, 179836, 126517, 100093]
2304A00093L2768J4618P3374O5121n6374K3947K7137m472m6332n0100K0832m3011
2292A57601l7035J9528J2034M2378P3162j739j334o1649K5735P8410p8084m9117
2280A79890K9128J594l2713K9162m9710M6897Q431O1378M3106M4228k2216j40921
2268A98254M1658J3811l0134J8312J32666M3759l5556j53479m5214L5551M9102
2257B68730O4950L1497l2179q5957M4266k4471n3479P6653N0585k378J1495j044
2245C48668O183N7452k8888k7001n2971L3585k6365j6126P4035J08785O187o9845
2233D13699o0080M2039l1249Q8260o08O179j5316q7939K561R2502J995J10476
2221E62519P0092o6874j2128k9953M7559J19917L7918J8717M869M850p7405o3619
$$ y = [100093, 132861, 147479, 220853, 285974, 229600, 253547, 280684, 276212, 229880, 179780, 200612, 157601, 120566, 140094, 152128, 194506, 267668, 265929, 264595, 202946, 228681, 307091, 229007, 179890, 209018, 210612, 177899, 207061, 157351, 204248, 212679, 274057, 317163, 361391, 339175, 198254, 239912, 253723, 223589, 241901, 374567, 418326, 382770, 229291, 184077, 219628, 268730, 333680, 365177, 332998, 247041, 291307, 266836, 213357, 290010, 340595, 338217, 349712, 348668, 354851, 412303, 383415, 356414, 303443, 337028, 310663, 294537, 368572, 477357, 483544, 413699, 353619, 395658, 364409, 452669, 452061, 458240, 442924, 354985, 357546, 450048, 452043, 562519, 632611, 565737, 553609, 523656, 571215, 691132, 729050, 747767, 752636, 757486, 680081, 616462]
2209F16462N9091J24788K2830o8752R8041N1219M3710J13512J5260J71081o739
2198A240503k2515J4661j2309k1525o7036p3156L362K1318l8171q9727j05598
2187H49807K5326J28973K7628p8889J26976p2914J22734J72769l7126l5038j2617
2176A217629J0675J43842N7040L4853J8625J29993J14807P2168J0419k0325P7823
2165A867549N1075Q3733J46048r9980J89985N088K244M1798M5382R9435J10051
2154B542408J35961K22544J38802K34156K09045J97848K13448K57592K89616M85573
2144D926993M26300K09745K01709L06026M24684M97882Q16427J036230J436616
2135A0282612J614150K043179K652321L176922L920346M291700J890752j859282
$$ y = [616462, 675553, 800341, 823171, 754419, 852460, 903679, 947389, 1060901, 1076161, 1247242, 1240503, 1217988, 1232649, 1220340, 1198815, 1131779, 1058623, 1061985, 1083303, 1045132, 955405, 849807, 875133, 1004106, 1031734, 952845, 1079821, 1006907, 1129641, 1302410, 1265284, 1230246, 1217629, 1228304, 1372146, 1429186, 1464039, 1482664, 1612657, 1727464, 1799632, 1810051, 1789726, 1867549, 1918624, 2002357, 2148405, 2048425, 2238410, 2243498, 2245742, 2287540, 2332922, 2432357, 2542408, 2678369, 2900913, 3039715, 3273871, 3482916, 3680764, 3894212, 4151804, 4441420, 4926993, 5353293, 5563038, 5764747, 6070773, 6495457, 6993339, 7809766, 8845996, 10282612, 11896762, 13939941, 16592262, 19769184, 23689530, 27981230, 29871982, 28012700]
2127B8012700n206281n074956l786996k774613j822432j250398q49535r05620
2119F341869o49111o29585k83054k65465j96114k05861j13030l57076l18458j83270
2109C140845j61602j13876k98562k68091n9391r1653r0285j00501j61848q2893
2099A712143q6815n3354o6611o8233N3950j13381j58109J9879k8585j33506j00564
2088I76814M246r30j5170j04211M9283l782q6969N503O9677r3136j0367k5233
2076G65725m3377L055O9302q6634j02585l7350O773j8082O2416j02217l7138J2702
2064D92590l1130k9119m5156o4589K5425M7629l1242j2210J1119O5620q4966n3046
2052B90925J56165J1473m3442L8435n8043O085r063m5o7449L6005o1406L4964
$$ y = [28012700, 22806419, 17731463, 13944467, 11169854, 9347422, 8097024, 7247489, 6341869, 5692758, 5063173, 4780119, 4514654, 4318540, 4112679, 3999649, 3642573, 3324115, 3140845, 2979243, 2865367, 2566805, 2298714, 2239323, 2147670, 2057385, 1956884, 1795036, 1712143, 1625328, 1571974, 1505363, 1437130, 1491080, 1377699, 1219590, 1239469, 1210884, 1077378, 976814, 981060, 980130, 964960, 860749, 910032, 906250, 819281, 824784, 894461, 801325, 790958, 765725, 722348, 725403, 794705, 708071, 605486, 568136, 574909, 556827, 619243, 517026, 479888, 492590, 461460, 432341, 387185, 322596, 348021, 395650, 364408, 352198, 363317, 428937, 343971, 290925, 447090, 458563, 415121, 453556, 395513, 401598, 392535, 392490, 325041, 361046, 299640, 334604]
2040C34604P1703o6126O323L3089n8131r193J40352K2699j18228l1154m2582k5844
2028B57512K6506n4987p2735J04617m4612k877N1400n9377n2468Q9256p5503j8910
2016A47822O288r2094p1172J26063N9356m2410Q3660n693m8868N4271K5262o7533
2004A74952P3865k9022m5621n7583R0432N2988l9794q8036l5927p1596K9138J3489
1992F7285J47726k8028n9356P1359k3171M0297K1960o5923l0836j15882N9264
1981H4695J64607p3638Q9195N5095p3278r7768p5148j8099M2755J50457p5620
1970A73253n5838k6099j6344M8574P86J3833j27535J2114P6211l9987k1834p4742
1958c7608K5547P9112L547L9392m8400J13651J9238m8670l2933L1863J15746m5489
$$ y = [334604, 406307, 340181, 346504, 379593, 321462, 312269, 452621, 475320, 357092, 325938, 283356, 257512, 284018, 229031, 156296, 260913, 216301, 213424, 264824, 205447, 152979, 242235, 166732, 147822, 154110, 62016, -9156, 116907, 176263, 133853, 217513, 211820, 162952, 217223, 242485, 174952, 248817, 219795, 174174, 116591, 207023, 260011, 220217, 132181, 96254, 24658, 53796, 67285, 215011, 186983, 127627, 198986, 175815, 216112, 238072, 172149, 141313, 25431, 84695, 249302, 175664, 264859, 319954, 246676, 148908, 73760, 55661, 98416, 248873, 173253, 117415, 91316, 74972, 123546, 124332, 138165, 10630, 22744, 98955, 58968, 37134, -37608, -12061, 67051, 70598, 109990, 61590, 175241, 194479, 145809, 112876, 144739, 260485, 214996]
1946B14996j85412K920O0596L6927K3669k4597K1374M2349j30017K0690j2874
1935G0621l3248n6025L965l5332K6199J63088k6344j51669L3444n2152p605N1541
1923a3517J57584K35p6264N3128j4376M1096j01327n291q65O0420N81J9445k8374
1910I2475o0312o212o3074O8221k9553J10264L8255n9489M3403p0527l9141q3837
1898e9527p703M9413N3600k0162p7145j00326L7922J8187J02547L0248M2851J4775
1886H4680n4997j2206O7933k0270r868m5085M7521m2412o4744J07329J225J6682
1874G5788j9946J1564k2211M5453K4000j35426M7190j5302j9426N4580L685J2040
1862F1989J64136p986j07290m8661P2823L2179j32484L1922o085j4913Q1750j18287
$$ y = [214996, 29584, 32504, 93100, 130027, 153696, 129099, 150473, 192822, 62805, 83495, 70621, 37373, -18652, -14687, -50019, -23820, 139268, 112924, -38745, -5301, -57453, -65058, -13517, 144067, 144302, 68038, 121166, 106790, 147886, 46559, 41268, 40403, 100823, 101404, 120849, 92475, 32163, 25951, -37123, 31098, 1545, 111809, 150064, 90575, 133978, 63451, 24310, -59527, -67230, -17817, 35783, 15621, -61524, -161850, -123928, -105741, -3194, 27054, 69905, 84680, 29683, 17477, 85410, 65140, 55272, 10187, 57708, 15296, -49448, 57881, 59106, 75788, 55842, 67406, 45195, 90648, 114648, -20778, 26412, 11110, -8316, 46264, 49949, 61989, 226125, 218139, 110849, 62188, 135011, 167190, 34706, 66628, 60543, 45630, 127380, 9093]
1850I093l9325l9774l8526O4473j5835l0650M5980N5805n5069K014L8433o766
1838a0147K6175J869P846Q9087j91K5012M0765o3259l3597L7873J0367p0017o4192
1825b409l6650r845R4287N4024K6117l4669m0075P5333M5474r178J1113o9454
1813A04068m20l8489n306p1460J397m144r2918K8079O3189m7198M799K7190J03240
1800G2027m9500O5484l5951q7474k9459P6456q1729o4104J71855m4309P458r0248
1788h9494o5665K7831r036J44230l911n6673l6159K1880j0364J1658M3940o1193
1776h2956O853J7567J39424j5706J283P3901k8979K8117N2360o6000l4506k3843
1764F7515J9157l6644j10837L2363P3215p1564p4017K7337L4421O753n0969K8944
$$ y = [9093, -30232, -70006, -108532, -44059, -59894, -90544, -44564, 11241, -43828, -41814, -3381, -10147, 16028, 17897, 25743, 114830, 114639, 139651, 180416, 117157, 83560, 121433, 131800, 61783, -2409, -39059, -48904, 45383, 99407, 125524, 90855, 50780, 126113, 171587, 162409, 173522, 104068, 103648, 65159, 59853, -11607, -10210, -14354, -107272, -79193, -16004, -63202, -58403, -31213, 72027, 22527, 88011, 52060, -35414, -64873, 11583, -70146, -134250, 37605, -6704, 754, -89494, -155159, -127328, -136364, 7866, 3955, -52718, -88877, -66997, -77361, -65703, -21763, -82956, -76103, -58536, 80888, 65182, 66465, 140366, 111387, 139504, 191864, 125864, 91358, 67515, 86672, 50028, -60809, -28446, 44769, -26795, -100812, -73475, -39054, -32301, -83270, -54326]
1752e4326l3695m011L6192j1071L1807J1703J11374j39488L1144P7978n2851M9421
1740E4177K0796j29234n5740K8594j527Q1263q6644L125M7324o3486K5263L2724
1728d3365Q5790m8456L2626j2734M1826l1790l0390J6548k7650K647M9203j4718
1716A9537j8572K9045q6384l2553N6487J27792n5460p2153K4426O1455O1161j3463
1704A01318l2398n2553M7217N5350j35693J1824K3555K5073q6318l1450K4458
1693d9617J7010j36983q212J22281m5255Q4349j8150K8419J1101N2001r2327M7357
1681A1974M2187M3637j1015n3955L6761r004n5078K8387q1636j11376P0077J19726
1669C0685l5552n443k1270k5352M136j00658j626o3076P5272J5740N0124l1672
$$ y = [-54326, -88021, -92032, -55840, -66911, -35104, -23401, 87973, -51515, -20371, 57607, 4756, 54177, 74973, -54261, -110001, -81407, -82934, -1671, -88315, -85190, -37866, -101352, -76089, -43365, 42425, -6031, 26595, 13861, 55687, 23897, -6493, 10055, -17595, -14948, 34255, 19537, 965, 30010, -56374, -88927, -32440, 95352, 39892, -32261, -7835, 53620, 114781, 101318, 68920, 16367, 63584, 118934, -16759, -4935, 18620, 43693, -42625, -74075, -49617, -32607, -169590, -177802, -55521, -100776, -16427, -34577, -6158, 4943, 56944, -35383, 11974, 54161, 97798, 86783, 32828, 69589, 60585, 5507, 33894, -47742, -159118, -89041, 30685, -4867, -10310, -31580, -56932, -52796, -153454, -155080, -218156, -142884, -127144, -77020, -108692]
1657a08692J64097k157J1648j3170l5423M6542m339r7727p9672J38223J483J7079
1645C7892O6188n5653M8663n0119q1354J7562J0965m5398J9623m037n5664J2783
1633g8549P1693J5396n636m8456K5941L8632o5779J5618R8275j01489m8997k2537
1621a05888j911J24662n7774K2340J55430o2626n9210l415q7194J1324K8749L86
1609c5127k2101l34m0308l9796K1180K4301r6149m887P0265J14679O7618J00290
1597A59631m1296j45395k1378P5001N5762l5514m4244k7544k4162J0933N9124
1586B0918L7889m5985k5354J4196o8977j09535P2011p189J6765K4065o446O7550
1574a0092p5155m9519k4716J2854J11786J5873L6340k9927J5661l4289O5887p007
$$ y = [-108692, 55405, 53248, 64896, 51726, 16303, 62845, 58506, -39221, -118893, 19330, 20813, 37892, 104080, 48427, 97090, 46971, -34383, -16821, -5856, -51254, -31631, -35668, -91332, -78549, -6856, 8540, 2904, -45552, -19611, 19021, -46758, -31140, 67135, -34354, -83351, -105888, -107799, 16863, -40911, -18571, 136859, 74233, 15023, 11608, -75586, -64262, -35513, -35127, -57228, -57562, -97870, -137666, -116486, -92185, -188334, -193221, -122956, -8277, 59341, 159631, 118335, -27060, -48438, 26563, 82325, 46811, 2567, -24977, -49139, -38206, 20918, 58807, 12822, -12532, 1664, -67313, -176848, -104837, -112026, -95261, -71196, -77642, -10092, -85247, -134766, -159482, -146628, -34842, -18969, 17371, -12556, 3105, -31184, 34703, 27696]
1562B7696l3825M3531k4241k8880k7390k1071n1329O7212N2367o6219J4255K9577
1550a8317J8320q356M0147J00723p0177k7352j03150M2010N9489K5112j5790j1336
1538C1323k3557k4640K1381j15015j06305N0233M2937Q7275R8526n4774m2930
1527c5546q3684Q0818o517j02001l9141J08857O0345K7412m0770k3106Q4349J21361
1515A52377q1838r3120M8156p642M3254O3500p1865j03340n3516p939K9796N7087
1503b5090J01399p6315L4076L7630j2654m7687o4920p1191P4201M1604N3962m0643
1491D372m5320j0373l4043q6425J3465N2401M2534m0573j091J11773o1911K1156
1479c4035M1234K9382l1345L3462k3842j11543l9350K2033J04457l1431m6953
$$ y = [27696, -6129, 37402, 13161, -15719, -43109, -64180, -115509, -48297, 4070, -62149, -47894, -18317, 3, -8353, 31794, 132517, 62340, 34988, -68162, -26152, 33337, 58449, 42659, 31323, 7766, -16874, 4507, -110508, -216813, -166580, -123643, -36368, 62158, 7384, -35546, -119230, -38412, -44929, -146930, -186071, -77214, -16869, 10543, -30227, -53333, 31016, 152377, 70539, -22581, 25575, 17933, 61187, 124687, 52822, -50518, -104034, -111973, -82177, -25090, 76309, -6, 34070, 71700, 59046, 11359, -53561, -124752, -50551, -8947, 45015, 4372, -40948, -51321, -85364, -171789, -158324, -105923, -63389, -103962, -105053, 6720, -55191, -34035, 7199, 36581, 5236, 38698, 14856, -96687, -136037, -114004, -9547, -40978, -87931]
1468h7931j9874K1338J7790K1765j8520K0345K652o7190L1887K3402N8957J09876
1456A14497j22990n9886N4692n0044k0576o6583M1M845J9602n627k0525j4047
1444a66601P2852j7891L9080R3324n8364j4747j8102L0285k09L3983j12699k7917
1432a47006J46882R5895p1530k2107K0490n0381K612L4659q5986L8491k3113m019
1420f5113K4819p3349M3100k06M5019n3181J4904Q5545n4371k5235p5033m0803
1408a73904k802R7359j7013m0283O2045l804J04662r2142O6174l7807l8075J729
1396g3861n113p333L0335J4702K5323L4485o0856j0119M0082M0651m9103P0510
1384D9703M5690j00628J9480J2460L5401k1124k0597p2450J0726J9621j01885
$$ y = [-87931, -107805, -86467, -68677, -46912, -65432, -45087, -42435, -109625, -77738, -54336, 4621, 114497, -8493, -68379, -13687, -63731, -84307, -150890, -150849, -146004, -126402, -132029, -152554, -166601, -93749, -111640, -72560, 20764, -37600, -52347, -70449, -40164, -40373, -6390, -119089, -147006, -124, 95771, 24241, 2134, 22624, -27757, -25145, 9514, -76472, -37981, -61094, -65113, -40294, -113643, -70543, -70749, -25730, -78911, -64007, 21538, -32833, -58068, -133101, -173904, -176706, -79347, -96360, -136643, -74598, -78402, 26260, -65882, 292, -37515, -75590, -73861, -78974, -86307, -55972, -41270, -15947, 18538, -42318, -52437, -12355, 28296, -20807, 49703, 95393, -5235, 14245, 26705, 62106, 40982, 20385, -52065, -41339, -21718, -123603]
1373a23603P0560q4745j7995Q7451J01119R6860m3375l0022j22024M7023L951
1362a4800P2423M1718j77022o7408J03861N4038r0914k5463O0741n0938P4605
1351a9159q9952K2888J58595n8732j40885J26102M8862r6699q4739O1440R7114
1340B4835j03556l4364M33K4002N0043R8822Q191k6286m2057m9042j4137P1007
1328G891M90K093J2417p5762l8615j7252m8728Q5914o085O3340j36703O333N3338
1315i1329J4751n6353J3002j9754R7508P9486l6879n109k8136P8909l0452m4036
$$ y = [-123603, -53043, -137788, -155783, -68332, 32787, 129647, 86272, 56250, -65774, -18751, -14800, 57623, 99341, -77681, -145089, -41228, 12810, -78104, -103567, -42826, -93764, -19159, -109111, -86223, 72372, 13640, -127245, -1143, 47719, -48980, -133719, -72279, 24835, -78721, -113085, -112652, -88650, -38607, 60215, 68406, 42120, 63, -48979, -63116, 7891, 8381, 10474, 22891, -52871, -91486, -108738, -157466, -71552, -77637, -14297, -151000, -144667, -91329, -76578, -132931, -119929, -139683, -42175, 37311, 432, -4677, -32813, 46096, 15644, -28392]
$$ [...]
##END NTUPLES=NMR SPECTRUM
##END=
