##TITLE=1H_CA-9160-1
 CDCl3
 8 sc, 
 7.6.2023
##JCAMPDX= 6.0         $$ Bruker NMR JCAMP-DX V2.0
##DATA TYPE= NMR SPECTRUM
##DATA CLASS= NTUPLES
##ORIGIN= UXNMR, Bruker Analytische Messtechnik GmbH
##OWNER= root
$$ XWIN-NMR		Version 3.5
$$ Wed Jun  7 16:07:56 2023 Russian Standard Time (UT+4h)  she@DPX200
##.OBSERVE FREQUENCY= 200.13135
##.OBSERVE NUCLEUS= ^1H
##.ACQUISITION MODE= SIMULTANEOUS
##.ACQUISITION SCHEME= undefined
##.AVERAGES= 8
##.DIGITISER RES= 18
##SPECTROMETER/DATA SYSTEM= spect
##.PULSE SEQUENCE= zg30
##.SOLVENT NAME= CDCl3
##.SHIFT REFERENCE= (INTERNAL, CDCl3, 0, 15.7711)
##AUDIT TRAIL= $$ (NUMBER, WHEN, WHO, WHERE, WHAT)
$$ ##TITLE= Audit trail, XWIN-NMR		Version 3.5
$$ ##JCAMPDX= 5.01
$$ ##ORIGIN= Bruker BioSpin GmbH
$$ ##OWNER= she
$$ F:/spectra/data/she/nmr/H-F/1/pdata/1/auditp.txt
$$ ##AUDIT TRAIL=  $$ (NUMBER, WHEN, WHO, WHERE, WHAT)
(   1,<2023-06-07 16:05:30.78 +0400>,<she>,<DPX200>,
      <created by zg, POWCHK disabled, PULCHK disabled
       configuration hash MD5:
       00 E9 B6 7A A2 85 ED C7 34 08 36 98 17 FE 4E 26
       data hash MD5: 16K
       56 50 34 19 0A B7 18 54 11 4E 94 7C 27 9D 57 D6>)
(   2,<2023-06-07 16:05:35.98 +0400>,<she>,<DPX200>,
      <Start of raw data processing
       efp BC_mod = 2 LB = 0.24 FT_mod = 6 PKNL = 1 PHC0 = -20064.75 PHC1 = 13.05272 SI = 16K 
       data hash MD5: 16K
       A0 F6 22 61 A6 48 94 A6 10 B8 59 C8 C7 A9 04 2F>)
(   3,<2023-06-07 16:06:02.45 +0400>,<she>,<DPX200>,
      <pk PHC0 = 158.4823 PHC1 = -1 
       data hash MD5: 16K
       A8 48 08 84 54 9F 9E A3 AF 9B 63 0C 5F C9 A5 C9>)
(   4,<2023-06-07 16:06:05.64 +0400>,<she>,<DPX200>,
      <abs ABSG = 5 
       data hash MD5: 16K
       43 DA CF 65 72 01 91 A0 6E 14 6E 8F 86 EC 1E E9>)
(   5,<2023-06-07 16:06:33.25 +0400>,<she>,<DPX200>,
      <pk PHC0 = 4.324723 PHC1 = -5.8 
       data hash MD5: 16K
       A0 E9 9A DA C8 84 C9 93 0B 38 F1 80 72 81 98 E1>)
(   6,<2023-06-07 16:06:36.89 +0400>,<she>,<DPX200>,
      <abs ABSG = 5 
       data hash MD5: 16K
       EA CA 53 B3 1F DE F0 08 63 D1 4C 5C EA 65 E1 41>)
(   7,<2023-06-07 16:06:59.43 +0400>,<she>,<DPX200>,
      <pk PHC0 = 2.191383 PHC1 = -2.8 
       data hash MD5: 16K
       82 B7 6C B2 B4 8F F8 F1 53 66 59 97 C6 C1 D4 BF>)
(   8,<2023-06-07 16:07:02.92 +0400>,<she>,<DPX200>,
      <abs ABSG = 5 
       data hash MD5: 16K
       AF B3 76 10 90 3A 6F A8 50 86 DE 82 99 1C A7 56>)
$$ ##END=
$$ 
$$ hash MD5
$$ 7A DC ED 49 06 2A 69 89 2E 48 57 37 BA 61 07 9E
##$RELAX= 
##$RELAX= 
##$RELAX= 
##$RELAX= 
##$RELAX= 
##$RELAX= 
$$ Bruker specific parameters
$$ --------------------------
##$DU= <F:/spectra>
##$EXPNO= 1
##$NAME= <H-F>
##$PROCNO= 1
##$TYPE= <nmr>
##$USER= <she>
##$AMP= (0..31)
100 100 100 100 100 100 100 100 100 100 100 100 100 100 100 100 100 100 
100 100 100 100 100 100 100 100 100 100 100 100 100 100 
##$AQSEQ= 0
##$AQ_mod= 1
##$AUNM= <au_zg>
##$AUTOPOS= <>
##$BF1= 200.13
##$BF2= 200.13
##$BF3= 200.13
##$BF4= 200.13
##$BF5= 200.13
##$BF6= 200.13
$$ [...]
##$SUBNAM3= <"">
##$SUBNAM4= <"">
##$SUBNAM5= <"">
##$SUBNAM6= <"">
##$SUBNAM7= <"">
##$SUBNAM8= <"">
##$SUBNAM9= <"">
##$SW= 18.05172834244
##$SWIBOX= (0..15)
0 0 2 0 0 0 0 0 0 0 0 0 0 0 0 0 
##$SW_h= 3612.71676300578
##$TD= 16384
##$TD0= 1
##$TE= 0
##$TE2= 300
##$TE3= 300
##$TEG= 300
##$TL= (0..7)
0 120 120 120 120 120 120 120 
##$TP= (0..7)
150 150 150 150 150 150 150 150 
##$TP07= 0
##$TPNAME0= <>
##$TPNAME1= <>
##$TPNAME2= <>
##$TPNAME3= <>
##$TPNAME4= <>
##$TPNAME5= <>
##$TPNAME6= <>
##$TPNAME7= <>
##$TPOAL= (0..7)
0.5 0.5 0.5 0.5 0.5 0.5 0.5 0.5 
##$TPOFFS= (0..7)
0 0 0 0 0 0 0 0 
##$TUNHIN= 0
##$TUNHOUT= 0
##$TUNXOUT= 0
##$USERA1= <user>
##$USERA2= <user>
##$USERA3= <user>
##$USERA4= <user>
##$USERA5= <user>
##$V9= 5
##$VALIST= <valist>
##$VCLIST= <CCCCCCCCCCCCCCC>
##$VD= 0
##$VDLIST= <DDDDDDDDDDDDDDD>
##$VPLIST= <PPPPPPPPPPPPPPP>
##$VTLIST= <TTTTTTTTTTTTTTT>
##$WBST= 1024
##$WBSW= 4
##$XGAIN= (0..3)
0 0 0 0 
##$XL= 0
##$YL= 0
##$YMAX_a= 748651
##$YMIN_a= -831497
##$ZGOPTNS= <>
##$ZL1= 120
##$ZL2= 120
##$ZL3= 120
##$ZL4= 120
##$ABSF1= 15.76341
##$ABSF2= -2.28844
##$ABSG= 5
##$ABSL= 3
##$ALPHA= 0
##$AQORDER= 0
##$ASSFAC= 0
##$ASSFACI= 0
##$ASSFACX= 0
##$ASSWID= 0
##$AUNMP= <proc_1d>
##$AZFE= 0.1
##$AZFW= 0.1
##$BCFW= 0
##$BC_mod= 2
##$BYTORDP= 0
##$COROFFS= 0
##$CY= -3
##$DATMOD= 1
##$DC= 0
##$DFILT= <>
##$DTYPP= 0
##$F1P= 0
##$F2P= 0
##$FCOR= 1
##$FTSIZE= 16384
##$FT_mod= 6
##$GAMMA= 0
##$GB= 0
##$INTBC= 1
##$INTSCL= 3.70164e-10
##$ISEN= 128
##$LB= 0.24
##$LEV0= 0
##$LPBIN= 0
##$MAXI= 10000
##$MC2= 0
##$MEAN= 0
##$ME_mod= 0
##$MI= 1.114404
##$NCOEF= 0
##$NC_proc= -5
##$NLEV= 6
##$NOISF1= 3.799351
##$NOISF2= 2.8
##$NSP= 0
##$NTH_PI= 0
##$NZP= 0
##$OFFSET= 15.77113
##$PC= 1
##$PHC0= -19899.76
##$PHC1= 3.45272
##$PH_mod= 1
##$PKNL= yes
##$PPARMOD= 0
##$PSCAL= 0
##$PSIGN= 0
##$REVERSE= no
##$SF= 200.13000008138
##$SI= 16384
##$SIGF1= 3
##$SIGF2= 2
##$SINO= 5.538805
##$SIOLD= 16384
##$SREGLST= <1H.CDCl3>
##$SSB= 0
##$STSI= 16384
##$STSR= 0
##$SW_p= 3612.71676300578
##$SYMM= 0
##$S_DEV= 0
##$TDeff= 16384
##$TDoff= 0
##$TI= <>
##$TILT= no
##$TM1= 0
##$TM2= 0
##$TOPLEV= 0
##$USERP1= <user>
##$USERP2= <user>
##$USERP3= <user>
##$USERP4= <user>
##$USERP5= <user>
##$WDW= 1
##$XDIM= 16384
##$YMAX_p= 445525923
##$YMIN_p= -232030
$$ End of Bruker specific parameters
$$ ---------------------------------
##NTUPLES= NMR SPECTRUM
##VAR_NAME=  FREQUENCY,     SPECTRUM/REAL,   SPECTRUM/IMAG
##SYMBOL=    X,             R,               I
##VAR_TYPE=  INDEPENDENT,   DEPENDENT,       DEPENDENT
##VAR_FORM=  AFFN,          ASDF,            ASDF
##VAR_DIM=   16384,         16384,           16384
##UNITS=     HZ,            ARBITRARY UNITS, ARBITRARY UNITS
##FACTOR=    0.220516191357247, 1,           1
##FIRST=     3156.27616976337, 0,            0
##LAST=      -456.440593242407, 0,           0
##MIN=       -456.440593242407, -232030,     0
##MAX=       3156.27616976337, 445525923,    0
$$ Real data points
##PAGE= N=1
##DATA TABLE= (X++(R..R)), XYDATA
$$ [...]
7960f187l27M0633J8565L4403J8127q674L83k6584K2952n5215O4174j430k0508
$$ -6187 -6514 34119 52684 87087 105214 96540 96923 70339 93291 38076 102250 100820 80312
7947H0312K2250K9657l0375q052j9810j163m978j0971J4337J5470k5459l3892
$$ 80312 102562 132219 101844 93792 73982 72819 67841 56870 71207 86677 61218 27326
7935B7326J6987K4946k0486j4665J218K8531N4682l8177k5303J5321k6782k0639
$$ 27326 44313 69259 48773 34108 35326 63857 118539 80362 55059 70380 43598 22959
7923B2959J5973K6528j1092j9506o1803J6595J4954l692L2475l8942r159O8065
$$ 22959 38932 65460 54368 34862 -26941 -10346 4608 916 33391 -5551 -14710 53355
7911E3355J3382l2394K9001l7464L515P9862l1336k5281l9359J96J5550l115J4986
$$ 53355 66737 34343 63344 25880 29395 109257 77921 52640 13281 13477 29027 25912 40898
7898D0898l6618O4901L838j04171M6572j1628m5569L4172m1572k52R537L6384
$$ 40898 4280 69181 73019 -31152 15420 3792 -41777 -7605 -49177 -49429 -39892 -3508
7886c508l6008k5699K8439J1146l499l95P47K3777M3997j4869j9931n2518p1087
$$ -3508 -39516 -65215 -36776 -25630 -29129 -29524 -28777 -5000 38997 24128 4197 -48321 -119408
7873a19408N1641k8227L8662K403L1416r507P332J543l6179k3667l5195N8603
$$ -119408 -67767 -95994 -57332 -54929 -23513 -33020 -25688 -24145 -60324 -83991 -119186 -60583
7861f0583k385k5828J4527K4092j1206j2310M833O659k555M8694r705k0917k0002
$$ -60583 -62968 -88796 -74269 -50177 -61383 -73693 -68860 -62201 -64756 -16062 -25767 -46684 -66686
7848f6686K4844J4742L9412J9435p1304m1437l6704N53J2923j003j1845K0441
$$ -66686 -41842 -27100 12312 31747 -39557 -80994 -117698 -117145 -104222 -105225 -117070 -96629
7836i6629k3597O4616M9997m5433M2600j7744p5286j7550J8758K3221L9387J5360
$$ -96629 -120226 -55610 -5613 -51046 -8446 -26190 -101476 -119026 -100268 -77047 -37660 -22300
7824b2300L0671o5346n4105L4958L1046m7059k9835K9653l2066j6945N9996N5394
$$ -22300 8371 -56975 -111080 -76122 -45076 -92135 -121970 -92317 -124383 -141328 -81332 -25938
7812b5938l8456l0463M9374N7963j3189j0800j13138K2559j4772J3302O4710k0343
$$ -25938 -64394 -94857 -45483 12480 -709 -11509 -124647 -102088 -116860 -103558 -38848 -59191
7800e9191M548j8773j6120n3243k4732L532J5830N9642l1021M7980J0385k559
$$ -59191 -54643 -73416 -89536 -142779 -167511 -163979 -148149 -88507 -119528 -71548 -61163 -63722
7788f3722L1026m3557L7797k6069l4796n241N256K7527l0609q149K7757N2433
$$ -63722 -32696 -76253 -38456 -64525 -99321 -104562 -99306 -71779 -102388 -110537 -82780 -30347
7776c0347p6505o7707N1828N7114K1738k631j7270m8356J6577n2236K7894O4596
$$ -30347 -106852 -174559 -122731 -65617 -43879 -46510 -63780 -112136 -95559 -147795 -119901 -55305
7764e5305j7548k0470q989l3089j9380N5367K7205m3802O648Q421k838N0204K9889
$$ -55305 -72853 -93323 -102312 -135401 -154781 -99414 -72209 -116011 -109363 -100942 -103780 -53576 -23687
7751b3687j01272k0041J3262k3408J9195M5418M8480L984p9309NO2569K6422M906
$$ -23687 -124959 -145000 -131738 -155146 -135951 -90533 -42053 -38069 -117378 -117373 -54804 -28382 -23476
7738b3476Q522J0508p6983k5231K6093k7707J1092L9072j2239m8948L1125j5242
$$ -23476 -14954 -4446 -81429 -106660 -80567 -108274 -97182 -58110 -70349 -119297 -88172 -103414
7726a03414k0267K938o942N1710l1290j2127K8937m7659m4413R270P4389L3410
$$ -103414 -123681 -120743 -127685 -75975 -107265 -119392 -90455 -138114 -182527 -173257 -98868 -65458
7714f5458l4539n3869m8691k9473N1577M6918K3848N268M773l4574Q950J2868
$$ -65458 -99997 -153866 -202557 -232030 -180453 -133535 -109687 -104419 -99646 -134220 -125270 -112402
7702a12402k0890K4588L6909k9905j7203K4512J2180n4640q689j8017K0665k5270
$$ -112402 -133292 -108704 -71795 -101700 -118903 -94391 -82211 -136851 -145540 -163557 -142892 -168162
7690a68162Q437P5520K771K669r142j1771j8051m1204l7149j6038M5748M7886
$$ -168162 -159725 -84205 -81434 -78765 -87907 -99678 -117729 -158933 -196082 -212120 -166372 -118486
7678a18486K0282L6856k6067J4561m519k4442q447J848n6406Q59K0106O2294J3165
$$ -118486 -98204 -61348 -87415 -72854 -77373 -101815 -110262 -108414 -164820 -163961 -143855 -81561 -68396
7665f8396j0651J2232l8242J1679P474j9471p7588Q3029K3534n8549P791J320
$$ -68396 -79047 -66815 -105057 -93378 -85904 -105375 -182963 -99934 -76400 -134949 -127158 -125838
7653a25838r792K3652O7928o5255l8080N9175Q803k9519j7657J4929P0336N778
$$ -125838 -135630 -111978 -44050 -109305 -147385 -88210 -79407 -108926 -126583 -111654 -41318 -35540
7641c5540k7913q2114k145M0313J87p998j1919L4149L2455n1005j7726K9194j0874
$$ -35540 -63453 -145567 -147712 -107399 -107212 -115210 -127129 -92980 -60525 -111530 -129256 -100062 -110936
7628a10936K4367N2796r1606j806J7132L4649m1259J1670j547j4438k4432M5424
$$ -110936 -86569 -33773 -125379 -127185 -110053 -75404 -116663 -104993 -106540 -120978 -145410 -99986
7616i9986J1210J6062O304o9740J1643K603L6592K891j5930L4087k1917m292N131
$$ -99986 -88776 -72714 -66410 -136150 -124507 -121904 -85312 -82421 -98351 -64264 -86181 -90473 -85342
7603h5342m7539O3316p990K375r998n3771l6165L6366M5516m761l5311l1272M6913
$$ -85342 -132881 -69565 -77555 -75180 -85178 -138949 -175114 -138748 -93232 -97993 -133304 -164576 -117663
7590a17663j6885j8691N6368L6123Q466R152q404j2728o2350l0862J8883J3098
$$ -117663 -134548 -153239 -96871 -60748 -52282 -43130 -51534 -64262 -126612 -157474 -138591 -125493
7578a25493Q131m1921M7319J7961q337n672L725j5858L0707O713l7985J5541k2098
$$ -125493 -117362 -159283 -111964 -94003 -102340 -108012 -104287 -120145 -89438 -82725 -120710 -105169 -127267
7565a27267L2984Q679k806p9406q759M8167K8464m5622l0308J0805N3352P653
$$ -127267 -94283 -85604 -88410 -167816 -176575 -128408 -99944 -145566 -175874 -165069 -111717 -104064
7553a04064M2080K9226l1035J8252k4245R46l7631M8203k902Q672j8169j6378
$$ -104064 -61984 -32758 -63793 -45541 -69786 -68840 -106471 -58268 -61170 -52498 -70667 -87045
7541h7045K1264K3091l8336k3108o0527m1632M8194Q1429m2611j1957N932K0801
$$ -87045 -65781 -42690 -81026 -104134 -164661 -206293 -158099 -76670 -119281 -131238 -125306 -104505
7529a04505O561K0875P169m8043L1572k4434j4237N4838k3919l7094K4173P76
$$ -104505 -97944 -77069 -69900 -117943 -86371 -110805 -125042 -70204 -94123 -131217 -107044 -106268
7517a06268j2750O322R692k2400m5552M1553j1825L4801J8726l2466l1086p689
$$ -106268 -119018 -112696 -103004 -125404 -170956 -129403 -141228 -106427 -87701 -120167 -151253 -158942
7505a58942N7161K8556J8685l2688k6894n92j7468O6783M8634p1884k7560k5261
$$ -158942 -101781 -73225 -54540 -87228 -114122 -114714 -132182 -65399 -16765 -88649 -116209 -141470
7493a41470K0742O1038J173m1309j3821k6153Q052o53K4477j8352l9759K9943
$$ -141470 -120728 -59690 -58517 -99826 -113647 -139800 -131748 -132401 -107924 -126276 -166035 -136092
7481a36092L6058K1616j4238N3134k0786k4336K1620j2493R13J608o596L694j9499
$$ -136092 -100034 -78418 -92656 -39522 -60308 -84644 -63024 -75517 -74604 -72996 -79592 -75898 -95397
7468i5397L8880M4238n3487o8995k0239M7630N0838j0724l4204k886K5109j0598
$$ -95397 -56517 -12279 -65766 -134761 -155000 -107370 -56532 -67256 -101460 -104346 -79237 -89835
7456h9835n4228L8583m493K9922K9765j2608k7983m9906J2109K832L517K809L6320
$$ -89835 -144063 -105480 -109973 -80051 -50286 -62894 -90877 -140783 -128674 -125842 -122325 -119516 -83196
7443h3196J5096K2542l5526k3592j6097k3166m258P126P5925J6939m5081J1754
$$ -83196 -68100 -45558 -81084 -104676 -120773 -143939 -148197 -141071 -65146 -48207 -93288 -81534
7431h1534j3947m5060M1399M0531j4440l5294j3403m4332N6000J9372L5919j300
$$ -81534 -95481 -140541 -99142 -58611 -73051 -108345 -121748 -166080 -110080 -90708 -54789 -56089
7419e6089Q09R752j3301o2594k4497J9605N2255j2382l55o262O91o10J0392L0295
$$ -56089 -55280 -45528 -58829 -121423 -145920 -126315 -74060 -86442 -86797 -93059 -92368 -92978 -82586 -52291
7405e2291L3934O663p2886k3714J8401P395k7666L0882j9981J2842J7837J9113
$$ -52291 -18357 -11694 -84580 -108294 -89893 -82498 -110164 -79282 -99263 -86421 -68584 -49471
7393d9471J3594l522L8827m7751j9418K8921l2119O313J6206K9308p550m0399
$$ -49471 -35877 -39399 -572 -48323 -67741 -38820 -70939 -64626 -48420 -19112 -26662 -67061
7381f7061l7704K2943j5012l1337O4843J6202k0220o746j0918j8229K5151J5547
$$ -67061 -104765 -81822 -96834 -128171 -63328 -47126 -67346 -74092 -85010 -103239 -78088 -62541
7369f2541K485K383l0361L208j4163m083K8446j1417J8168l2979J7063l301j4534
$$ -62541 -60056 -57673 -88034 -84826 -98989 -103072 -74626 -86043 -67875 -100854 -83791 -87092 -101626
7356a01626N9517M8813m8699j80n6979m0408M4042N7737m954k2432j542o6118
$$ -101626 -42109 6704 -41995 -42175 -99154 -139562 -95520 -37783 -42737 -65169 -66711 -132829
7344a32829J1171k7556j2328R1139M2645l3483p0032J8335M9491R352J6263n4017
$$ -132829 -121658 -149214 -161542 -70403 -27758 -61241 -131273 -112938 -63447 -54095 -37832 -91849
7332i1849j5654K217l344J7059K3727q874j0213o292J4686l672q37j2274J9571
$$ -91849 -107503 -105286 -108630 -91571 -67844 -76718 -86931 -93223 -78537 -82209 -83046 -95320 -75749
7319g5749k0704L0945J3305k5478k5804j2962O0445M8697o6846k442J0014j9004
$$ -75749 -96453 -65508 -52203 -77681 -103485 -116447 -56002 -7305 -74151 -76593 -66579 -85583
7307h5583l6300L4741K204j3206K0701J693R745K5664l8542l693L6906j9051K3549
$$ -85583 -121883 -87142 -84938 -98144 -77443 -75750 -66005 -40341 -78883 -82576 -45670 -64721 -41172
7294d1172O370j9365M489L798J7183j6504k2109K1409M2581j5530P942j3731r726
$$ -41172 -34802 -54167 -49678 -45880 -28697 -45201 -67310 -45901 -3320 -18850 -10908 -24639 -34365
7281c4365l930l184r206J5951k9227J7322L1032j1051J7527j6623k7825l4847
$$ -34365 -38295 -41479 -50685 -34734 -63961 -46639 -15607 -26658 -9131 -25754 -53579 -88426
7269h8426J8182L529L116n4147J4335M3911K6128J3985Q955k1769j0209n4054
$$ -88426 -70244 -66715 -63599 -117746 -103411 -59500 -33372 -19387 -10432 -32201 -42410 -96464
7257i6464N1155M3261j6677l8345j5702J8808m3312j2108K7261K7269L1320K8465
$$ -96464 -45309 -2048 -18725 -57070 -72772 -53964 -97276 -109384 -82123 -54854 -23534 4931
7245D931J7182n7039J7574M9010j7017k8056N7127p1235P908K2733n5012l1045
$$ 4931 22113 -34926 -17352 31658 14641 -13415 43712 -27523 -19615 3118 -51894 -82939
7233h2939p5517J23736J1096l9563Q12R245j416O1901m3348k6098K3868q726j8097
$$ -82939 -158456 -34720 -23624 -63187 -62375 -53130 -54546 7355 -35993 -62091 -38223 -46949 -65046
7220f5046k7732j1401L3150N3129m2717l5590M9346O7473R819k0283n5001P19
$$ -65046 -92778 -104179 -71029 -17900 -60617 -96207 -46861 20612 30431 10148 -44853 -44134
7208d4134Q444M259p332j6132O2614k3222j5282J1077l7841L0928j671L9623p042
$$ -44134 -35690 -31431 -38763 -54895 7719 -15503 -30785 -19708 -57549 -26621 -28292 11331 4289
7195D289J3300n0889J841l6638K9912k095M0742J7081l0760K6610j0241l134k1564
$$ 4289 17589 -33300 -31459 -68097 -38185 -40280 462 17543 -13217 13393 3152 18 -21546
7182b1546M7853l0398J1603J1770J9774L6027m2383j9381J422k6196j7903j5563
$$ -21546 26307 -4091 7512 19282 39056 75083 32700 13319 14741 -11455 -29358 -44921
7170d4921N4035j687j1025J2829n3080L7093N286j1980l0391K0805k6019k0330
$$ -44921 9114 7427 -3598 9231 -43849 -6756 -1470 -13450 -43841 -23036 -49055 -69385
7158f9385M0356l2995m4340j1123P6230J3767l8416M555J0834L0369l6348l4997
$$ -69385 -29029 -62024 -106364 -117487 -41257 -27490 -65906 -61351 -50517 -20148 -56496 -91493
7146i1493m0545J06856K7091o0306M5004J7308o3429l8471Q691j3267L8453k6930
$$ -91493 -132038 -25182 1909 -58397 -13393 3915 -59514 -97985 -89294 -102561 -64108 -91038
7134i1038M057K2068J7141l4442L1029j8820L1199J6627L8161m9856m1018K6050
$$ -91038 -86981 -64913 -47772 -82214 -51185 -70005 -38806 -22179 15982 -33874 -74892 -48842
7122d8842J3995K8719o8174J7841J140O9841j3210l1020j9304j1079L5126k2786
$$ -48842 -34847 -6128 -74302 -56461 -55321 14520 1310 -29710 -49014 -60093 -24967 -47753
7110d7753j0400L4976K0747K483j100k8164K0432n3673K3498L6276K9050K3960
$$ -47753 -58153 -23177 -2430 53 -1047 -29211 -8779 -62452 -38954 -2678 26372 50332
7098E0332l0027p7578N3683q55l2965j0532L6775P056K4985r265O746O420O4415
$$ 50332 20305 -57273 -3590 -4445 -37410 -47942 -11167 -4111 20874 11609 18355 24775 89190
7085H9190l1597q9087M993M983K9864K3855M00p760l8836j69N0979q7652m5528
$$ 89190 57593 -31494 -26501 -21518 8346 32201 32601 24841 -13995 -14164 36815 -50837 -96365
7072i6365K1747j1966M1348J8974l962J6019j2623J1830j3778L5300J8309j8066
$$ -96365 -74618 -86584 -45236 -26262 -30224 -14205 -26828 -14998 -28776 6524 24833 6767
7060F767l3408J8745j9295n083l6803M0767k1375M432k6945j4286M8419q989J2034
$$ 6767 -26641 -7896 -27191 -32274 -69077 -28310 -49685 -45253 -72198 -86484 -38065 -47054 -35020
7047c5020J1695M2894N11k645j018j8046L685r111M367P299k2274l1104Q3085
$$ -35020 -23325 19569 20080 17435 16417 -1629 2056 -7055 -2688 4611 -17663 -48767 34318
7034C4318j4421l7867o042p053Q1730j5753o1211L10M1389j7811M8421m3584j2088
$$ 34318 19897 -17970 -24012 -31065 50665 34912 -26299 -25989 15400 -2411 46010 2426 -9662
7021i662r952m4491p091L5072K9550r694J1554N945o753j4317K8465k064j3743
$$ -9662 -19614 -64105 -71196 -36124 -6574 -16268 -4714 1231 -5522 -19839 8626 6562 -7181
7008g181l1363J8398j3007j6639j5735O0361k0671J3387R284n2413J5843J2082
$$ -7181 -38544 -20146 -33153 -49792 -65527 -5166 -25837 -12450 -3166 -55579 -39736 -27654
6996b7654o0179k5084L75Q1242M4148k3678R174K1519l2001m7057p907K6423J2210
$$ -27654 -87833 -112917 -112542 -31300 12848 -10830 -1656 19863 -12138 -59195 -67102 -40679 -28469
6983b8469l307j48n218K2707K7580L1677j5249k6178l4726k2135K2792j2398J8622
$$ -28469 -31776 -31924 -37142 -14435 13145 44822 29573 3395 -31331 -53466 -30674 -43072 -24450
6970b4450m246J871M0707o7778K1653j2967L6315k1652M8068R013k1202K1665
$$ -24450 -28696 -26825 13882 -53896 -32243 -45210 -8895 -30547 17521 26534 5332 26997
6958B6997L3903l7507n6920P614K7548J6771m5880K7557j0203L1657J0886J7696
$$ 26997 60900 23393 -33527 -25913 1635 18406 -27474 83 -10120 21537 32423 50119
6946E0119K9257K428j0646n1963N852j413k7879P5209l913k134Q5702l2625L609
$$ 50119 79376 81804 71158 19195 25047 23634 -4245 70964 67051 64917 150619 117994 121603
6933A21603J2508R637n5063K9324K319l1984P932k3442K2756M361L9924r427l7311
$$ 121603 134111 143748 88685 118009 120328 88344 96276 72834 95590 99951 139875 130448 93137
6920I3137k8473N2520N0137k3773l2763l7677K7252K7528l0119M2639R0181k1700
$$ 93137 64664 117184 167321 143548 110785 73108 100360 127888 97769 140408 230589 208889
6908B08889l1296m039N2723P7748J8388m1713l9555L1046J8886Q657K9957N4785
$$ 208889 177593 173554 226277 304025 322413 280700 241145 272191 291077 299734 329691 384476
6896C84476o776q73K908Q3433M6686J3876O8581J9852k9266l9512j7704l7358
$$ 384476 377700 376827 379735 463168 509854 523730 592311 612163 582897 543385 525681 488323
6884D88323l043M7682j9763k2673k4401l7736k3559o1628l7643k8673L9407m7681
$$ 488323 485280 532962 513199 490526 466125 428389 404830 343202 305559 276886 316293 268612
6872B68612J5333q05j9646r469K1004j847j1100k2648q3689N639N2803N9617p764
$$ 268612 283945 283140 263494 254025 275029 273182 262082 239434 155745 161384 214187 273804 266040
6859B66040j4902K5241J1463k232j3597K6200P0634K8813k5122k1599N9932n4973
$$ 266040 251138 276379 287842 285610 272013 298213 368847 397660 372538 350939 410871 355898
6847C55898l6011K9690m6802m3371L9573J1302o4625K8105L1660o1290l3101M1185
$$ 355898 319887 349577 302775 259404 298977 310279 245654 273759 305419 244129 211028 252213
6835B52213j8970j0679m7967q4134O9049q325r593L3878O914j7156K848k9770
$$ 252213 233243 222564 174597 90463 159512 151187 141594 175472 182386 165230 168078 138308
6823A38308J3645K0930O885L132l016j8900P117l8783j9427K8703l9080j2697
$$ 138308 151953 172883 179768 182900 179884 160984 168101 129318 109891 138594 99514 86817
6811H6817k0802J7521N0427k118n9326m0006M880J9552J7452k2523n57J046r938
$$ 86817 66015 83536 133963 131845 72519 32513 37393 56945 74397 51874 51317 52363 42425
6798D2425L8321l8818k3198M2420j3087M591N3406L7233N444m628j4603M2006
$$ 42425 80746 41928 18730 61150 48063 52654 106060 143293 148737 144109 129506 171512
6786A71512K3222J8100m0418m6872L0003r8656m0961K9309j6818j242N9981J4144
$$ 171512 194734 212834 172416 125544 155547 56891 15930 45239 28421 27179 87160 101304
6774A01304K8218o4041J177M0507j2294L855o103p1426K6929L0833j8501J2811
$$ 101304 129522 65481 66658 107165 94871 98726 92623 21197 48126 78959 60458 73269
6762G3269M913L4523J4167N585k5846R210o7003K6421L4189K817K8692l2874m249
$$ 73269 78182 112705 126872 132457 106611 115821 48818 75239 109428 112245 140937 108063 103814
6749A03814M5003k6044o980L6169P198J1691J0817M957q156k3502k4612J4901
$$ 103814 148817 122773 115793 151962 159160 170851 181668 186625 178469 154967 130355 145256
6737A45256p110j6285m783j5223k7582k9179O60N2486o249m1988K3800j7148J9910
$$ 145256 138146 121861 117078 101855 74273 45094 45754 98240 91991 50003 73803 56655 76565
6724G6565K9574l5847q455M2676m7403j2306l277K7123M6259l9675l2466k80J1179
$$ 76565 106139 70292 61837 104513 57110 44804 41527 68650 114909 75234 42768 42488 53667
6711E3667j3509n779M9997n6871l3561M6020K4604J3076n3252l997L6600M2778
$$ 53667 40158 34379 84376 27505 -6056 39964 64568 77644 24392 20395 56995 99773
6699I9773m9389M5333M124l085K999j4889j9223Q670J7514k4808n2382o736M6350
$$ 99773 50384 95717 99841 96756 99755 84866 65643 74313 91827 67019 14637 7901 54251
6686E4251J307L00L0769o08j6567Q801j5038l2200L6942n6737K6649N2547k0784
$$ 54251 55558 55858 86627 86019 69452 78253 63215 31015 67957 11220 37869 90416 69632
6673F9632l8742O0075M3215n6368k4660K1250o834l4845L0588K040M0775J5764
$$ 69632 30890 90965 134180 77812 53152 74402 67568 32723 63311 65351 106126 121890
6661A21890L079m3663O785J2418r523n8801J8089J742o198N013L5297k234j1939
$$ 121890 124969 81306 88091 100509 90986 32185 50274 52016 45818 50831 86128 83894 71955
6648G1955M6186l3903l1766j2932m826k374P9470L223r224l873l5040K5127r36
$$ 71955 118141 84238 52472 39540 34714 32340 111810 115033 105809 101936 66896 92023 91087
6635I1087J4249K0178l190K1281k931p6149L1897K6846j3923j0074m2508N09L370
$$ 91087 105336 125514 122324 143605 140674 64525 96422 123268 109345 99271 56763 57272 60642
6622F0642n6713L6355K565k0757R596L2896l6542n439N5775l3521k928P1380n404
$$ 60642 3929 40284 42849 22092 31688 64584 28042 22603 78378 44857 41929 113309 107905
6609A07905k0034l9136J6039L6483K3988j1468n9759l1677K2020K0984k1293l9314
$$ 107905 87871 48735 64774 101257 125245 113777 54018 22341 44361 65345 44052 4738
6597D738L0890k1764K6255L4579o4390M2309J6388j3673L998M7171L6233k5902
$$ 4738 35628 13864 40119 74698 10308 52617 69005 55332 59330 106501 142734 116832
6585A16832j8139l4966J7447M4568n2834j3848K5617K2032j5304N860P746j1077
$$ 116832 98693 63727 81174 125742 72908 59060 84677 106709 91405 97265 105011 93934
6573I3934l4438M2268k7880k7990o243K7826l6739N7498L5475j1258k6613k9092
$$ 93934 59496 101764 73884 45894 39651 67477 30738 88236 123711 112453 85840 56748
6561E6748M4484j4486K6359j8982J5954K0705j8800r869J8654K3532q995m429
$$ 56748 101232 86746 113105 94123 110077 130782 111982 102113 120767 144299 135304 130875
6549A30875n3559K148J2366L8670L6549j9684n5951J8732L3533k5787j8759k950
$$ 130875 77316 79464 91830 130500 167049 147365 91414 110146 143679 117892 99133 96183
6537I6183M0222m9005n2863N9609J0632o796L309L9431M1838p1000O740R003k3691
$$ 96183 136405 87400 34537 94146 104778 97982 101291 140722 182560 111560 118300 127303 103612
6524A03612p54N1863r100J0960n409N724l7277k1402L3476L986l1559R13N7699
$$ 103612 102858 154721 145621 156581 151172 156896 119619 98217 131693 135679 104120 105033 162732
6511A62732k4688K8827m697j6887m7904J0443J5062K5877P4807J0465p8196m2648
$$ 162732 138044 166871 162174 145287 97383 107826 122888 148765 223572 234037 155841 113193
6499A13193M0832L5614p2047K6924P2614P608l9166L164p708J0703J6124n0651
$$ 113193 154025 189639 117592 144516 217130 224738 185572 188736 181028 191731 207855 157204
6487A57204L8766N292R455j1789j3953j700k8689k2685m3381N4989J7669n890
$$ 157204 195970 201262 210717 198928 184975 183275 154586 131901 88520 143509 161178 155288
6475A55288N7751J3757k7383J6119M2183k9277k2379j1044R32M1926k2249m4589
$$ 155288 213039 226796 199413 215532 257715 228438 206059 195015 195947 237873 215624 171035
6463A71035o371Q282l5488m099R0490n3011K7166m978l1399o042N037Q5779m4958
$$ 171035 164664 172946 137458 133359 223849 170838 198004 193026 161627 155585 160622 246401 201443
6450B01443n6849L886k8931K8939l4094L3827j8120j406L8353K2515J1205L4068
$$ 201443 144594 148480 119549 148488 114394 148221 130101 128695 167048 189563 200768 234836
6438B34836k5490j21282o408K5846J4613O1804K4796n3320k1673p817j112J9486
$$ 234836 209346 88064 81656 107502 122115 183919 208715 155395 133722 125905 124793 144279
6426A44279n404N2430J6447K4949n4102m9142M7491k548m2313k72j8389L0550
$$ 144279 138875 191305 207752 232701 178599 129457 176948 174400 132087 131815 113426 143976
6414A43976P215o502K0590P271K853p158k8180J6395M1222j7775J1691L606l0961
$$ 143976 151191 144689 165279 172550 175403 168245 140065 156460 197682 179907 191598 195204 164243
6401A64243o150j143k2682N7763K0134J8304r347l0787j3755J9153j7478l4645
$$ 164243 158093 156950 134268 192031 212165 230469 221122 190335 176580 195733 178255 143610
6389A43610J4239k5058J4512L9969n135R069r246n6075M5275J8152o5047M9746
$$ 143610 157849 132791 147303 187272 182137 191206 181960 125885 171160 189312 124265 174011
6377A74011j423K0544M702J1573o829q125O6021O1152l4231o7385n2852N816Q069
$$ 174011 172588 193132 197834 209407 202578 194453 260474 321626 287395 220010 167158 172974 181043
6364A81043J5545K4424l5242J0964N2460n3125N5751P1510j6125n8836N7657J4574
$$ 181043 196588 221012 185770 196734 249194 196069 251820 323330 307205 248369 306026 320600
6352C20600N242j9268N0913L8427l0513q205k7763J9512q2140R574l581q456N8819
$$ 320600 325842 306574 357487 395914 365401 357196 329433 348945 266805 276379 272798 264342 323161
6339C23161j1721k7356J6474J4513k4032M5450L018l2262m2198j832L5082k2816
$$ 323161 311440 284084 300558 315071 291039 336489 339507 307245 265047 263215 298297 275481
6327B75481J0260l793j2161L3441J6002k1041K5389L00L3613K3062o457l9447
$$ 275481 285741 281948 269787 303228 319230 298189 323578 323878 357491 380553 374096 334649
6315C34649L7958j6193l8603K8386j1085J4938n525l0707O709J5372M1685Q205
$$ 334649 372607 356414 317811 346197 335112 350050 344525 313818 320527 335899 377584 385789
6303C85789k2046m1388O542p780J2922J8628n0471O4211M6948m2054l3988M7170
$$ 385789 363743 322355 328897 321117 334039 352667 302196 366407 413355 371301 337313 384483
6291C84483k9636o947M7186k6254n924L880O805j8927k7432k3700r124L475L5844
$$ 384483 354847 347900 395086 368832 362908 366788 373593 354666 327234 303534 294410 297885 333729
6278C33729p298N7579L8217p8610J6321J0202m0576K5499l2124j8504J7227K7970
$$ 333729 326431 384010 422227 343617 359938 370140 329564 355063 322939 304435 321662 349632
6266C49632L2799p491J3005l6927l5655J03938m9913m1433k8242q503J3768J2951
$$ 349632 382431 374940 387945 351018 315363 419301 369388 327955 299713 291210 304978 317929
6254C17929J4036L4376O5267k646k5261m4266j0859N064J9917P7367m14m400O242
$$ 317929 331965 366341 431608 428962 403701 359435 348576 353640 373557 450924 450510 446110 452352
6241D52352m2810L0100O2400N7023n4396m0316r234k7820l5412j2681K0041J1054
$$ 452352 409542 439642 502042 559065 504669 464353 455119 427299 391887 379206 399247 410301
6229D10301j8421n266m651K6320K4274l5633o2623l1075N3508K9372J1616l3627
$$ 410301 391880 386614 381963 408283 432557 396924 334301 303226 356734 386106 397722 364095
6217C64095k3640J4884q968J9849m2059j9171j9815j1351L0830K3939M5573M5100
$$ 364095 340455 355339 346371 366220 324161 304990 285175 273824 304654 328593 374166 419266
6205D19266r6783p72j5596N261J1313j4056l2816j9609R481P2673K7517l7372
$$ 419266 322483 321711 306115 311376 322689 308633 275817 256208 265689 338362 365879 328507
6193C28507L2732O543L68o5624j8975j5678J3796k1674J5841K8759j6679k1743
$$ 328507 361239 367782 368150 302526 283551 267873 281669 259995 275836 304595 287916 266173
6181B66173K0278l378n1785P919O6545p081J8754j3393p443K7574o7470j8590
$$ 266173 286451 283073 231288 239207 305752 298671 317425 304032 296589 324163 256693 238103
6169B38103L7500L8380J3557l4887K9234J4125L6149k4681n9347J5694k1798k745
$$ 238103 275603 313983 327540 292653 321887 336012 372161 347480 288133 303827 282029 279284
6157B79284K1422M8450M556k9140n4333L5217L4189O129K3530P736j7203M2741
$$ 279284 300706 349156 353712 324572 270239 305456 339645 345774 369304 377040 359837 402578
6145D02578l2266j8318j4561O074r67j0835L8560Q778l712j7121m6990j6259k6433
$$ 402578 370312 351994 337433 343507 342540 331705 370265 379043 375331 358210 311220 294961 268528
6132B68528R84M9684P816J081k5716K9320J7133J6383p500n6676m9804P9933l228
$$ 268528 269512 319196 327012 328093 302377 331697 348830 365213 357713 301037 251233 331166 327938
6119C27938j2209P5363m1678n9392K7311J0606L7787o214K1755l0574r140K2915
$$ 327938 315729 391092 349414 290022 317333 327939 365726 359512 381267 350693 341553 364468
6107C64468K2048J0569j0211m8973K637j6302m0652O566j3788Q2518j5295l1181
$$ 364468 386516 397085 386874 337901 340538 324236 283584 290150 276362 358880 343585 312404
6095C12404Q428K8715j7650J1131o7864j98J2876o41O5575j5344p933q756L146
$$ 312404 320832 349547 331897 343028 275164 274966 287842 287201 352776 337432 329499 320743 323889
6082C23889j03j4062N5469j4337J8622m0616k1474J1292j9330O6422l7221K6512
$$ 323889 323786 309724 365193 350856 369478 328862 307388 318680 299350 365772 328551 355063
6070C55063N6396o0237K5674N0671l5272m0106J3926L2792k3757p92o581L283
$$ 355063 411459 351222 376896 427567 392295 352189 366115 398907 375150 374358 367777 371060
6058C71060N636O068L7745M7891j818J3650l5528M717k493m9700p6231K8791O4901
$$ 371060 376696 382764 420509 468400 466582 480232 444704 449421 446928 397228 320997 349788 414689
6045D14689Q150M9979J3359l4817k236L0089K936j9339j4189K036J3312K9765
$$ 414689 422839 472818 486177 451360 449124 479213 482149 462810 448621 450657 463969 493734
6033D93734P924K2375L5869j703o3212M6195J13823j994l8976k1217M1893k882
$$ 493734 501658 524033 559902 558199 494987 541182 655005 653011 614035 592818 634711 631829
6021F31829l4268m1816j7574N22K4318J9204n8553J6478N2105j8202m4335N224
$$ 631829 597561 555745 538171 538693 563011 582215 523662 540140 592245 574043 529708 534932
6009E34932M6477J5792K8333m0869p1343P2993O2035O3616M9048N9495K5202m1710
$$ 534932 581409 597201 625534 584665 513322 586315 648350 711966 761014 820509 845711 804001
5997H04001n4903L0388l8201J5423n8580j568j5982l5692l2132k2594Q607N6394
$$ 804001 749098 779486 741285 756708 698128 696560 680578 644886 612754 590160 598767 655161
5985F55161j2415l9053k0096j4756K6307l1118O0153L553k3634K6058J00227J955
$$ 655161 642746 603693 583597 568841 595148 564030 624183 627736 604102 630160 730387 732342
5973G32342m1183K8595J6419J6351K2629k1944k1929n4673o4946R111j5650l2066
$$ 732342 691159 719754 736173 752524 775153 753209 731280 676607 611661 620772 605122 573056
5961E73056l68q942K882m557k462K1054j8144k0456J5689M701J4192j4811j7571
$$ 573056 572688 563746 566628 562071 559609 580663 562519 542063 557752 562453 576645 561834 544263
5948E44263m2369O1572K1479o3721k7691K7456N4608J9176l2717l2835j0098K7952
$$ 544263 501894 563466 584945 521224 493533 520989 575597 594773 562056 529221 519123 547075
5936E47075o9618K7031N300o772j2344L826R39K009K1428J5709M5341k7011l5047
$$ 547075 477457 504488 509788 503016 490672 494498 495437 497446 518874 534583 579924 552913 517866
5923E17866K8587n123l7544K7731K961J5808J8162O74J1222j3902q628l4007j0398
$$ 517866 546453 541330 503786 531517 534478 550286 568448 569122 580344 566442 557814 523807 513409
5910E13409K32m987k5007M9377m289K7859k9974K2039K8691m9215L5702o848K9218
$$ 513409 513641 508654 483647 533024 528735 556594 526620 548659 577350 528135 563837 556989 586207
5897E86207M7267j3664m376o957j3598l487K1790L8193j1413M6317J606k010l0745
$$ 586207 633474 619810 615434 608477 594879 591392 613182 651375 639962 686279 687885 685875 655130
5884F55130k1815K8588M988l1453K4351j1423K1795P750J235O5067m0351j4432
$$ 655130 633315 661903 666891 635438 659789 648366 670161 677911 679146 744213 703862 689430
5872F89430L5893l6161l93j9804K0094J297K9353L7656J0098n7377L1037N398
$$ 689430 725323 689162 688769 668965 689059 690356 719709 757365 767463 710086 741123 746521
5860G46521j3957k5424r849J1581O1220N7823J6563L360m030k5027r545j3510
$$ 746521 732564 707140 697291 708872 770092 827915 844478 847838 843808 818781 809236 795726
5848G95726o0911J5848K5691o2722J1604M2970p034K7319K0439j1654J628J2974
$$ 795726 734815 750663 776354 713632 725236 768206 761172 788491 808930 797276 798904 811878
5836H11878P620j0289K2605k2971L1332l741P848N3649j1600k3115j409l2351
$$ 811878 819498 809209 831814 808843 840175 836434 844282 897931 886331 863216 861807 829456
5824H29456P263K7601O0765L4223j4015J716L0155J172k0616O731n4234N8866
$$ 829456 836719 864320 925085 959308 945293 947009 977164 978336 957720 964451 910217 969083
5812I69083K5391K4282K962K2216j4012K6391J2181k1076r070k3671J7057L1280
$$ 969083 994474 1018756 1021718 1043934 1029922 1056313 1068494 1047418 1038348 1014677 1031734 1063014
5800A063014j3182K5302J69m8723k1077k8762R834r21N608M1594L540j650K9544
$$ 1063014 1049832 1075134 1075303 1026580 1005503 976741 986575 985654 991262 1032856 1036396 1034746 1064290
5787A064290j600j1043N3188J1949j9426j819J2410L556m3255j1664K8753l5458
$$ 1064290 1062690 1051647 1104835 1116784 1097358 1095539 1107949 1111505 1068250 1056586 1085339 1049881
5775A049881O7455p526j274M7900L0742r720p942n2226n57L3361M1744O6412L604
$$ 1049881 1117336 1109810 1108536 1156436 1187178 1177458 1169516 1117290 1116733 1150094 1191838 1258250 1261854
5762A261854p631L6621n8725k2969M6829L3844O9517j6166L5859O2829M5651k9676
$$ 1261854 1254223 1290844 1232119 1209150 1255979 1289823 1359340 1343174 1379033 1441862 1487513 1457837
5750A457837l69N9842N089j0229K6427R2089K6468N6280M514J8356j832L347m4601
$$ 1457837 1457468 1517310 1522399 1512170 1538597 1630686 1657154 1713434 1717948 1736304 1734472 1737819 1693218
5737A693218N378K6381l4652j7619R908M3809K8687n6448J8539J17398P3314o718
$$ 1693218 1698596 1724977 1690325 1672706 1682614 1726423 1755110 1698662 1717201 1834599 1907913 1901195
5725A901195O1702K6313J4960P6143R7628J15921N6994Q9406O124N9397R6488
$$ 1901195 1962897 1989210 2004170 2080313 2177941 2293862 2350856 2440262 2446386 2505783 2602271
5714B602271J03903l6250O4977o250l0660j8603n2566l3142K2597k1337P4911
$$ 2602271 2706174 2669924 2734901 2728651 2697991 2679388 2626822 2593680 2616277 2594940 2669851
5703B669851M3867L2678N6115K6912J6308R8012L0779Q3393K6332N5395R5862
$$ 2669851 2713718 2746396 2802511 2829423 2845731 2943743 2974522 3057915 3084247 3139642 3235504
5692C235504Q6716J44247N3916J51919J44136J28483J93047J39733J64244K37034
$$ 3235504 3322220 3466467 3520383 3672302 3816438 3944921 4137968 4277701 4441945 4678979
5682D678979K35431K93394L13557L63082K85467L63087M40599M25861L01098L00159
$$ 4678979 4914410 5207804 5521361 5884443 6169910 6532997 6973596 7399457 7700555 8000714
5672H000714K05195J40061O1660n939m9375j09125j18305k23450k51098j90518
$$ 8000714 8205909 8345970 8407630 8401691 8352316 8243191 8124886 7901436 7650338 7459820
5662G459820j60650j21421j04111k5220j4132M952R5939J21873K01080K04733
$$ 7459820 7299170 7177749 7073638 7048418 7034286 7039238 7135177 7257050 7458130 7662863
5652G662863K54658L07177L31888K45216J71928R5354M7276N123r607n8356p2177
$$ 7662863 7917521 8224698 8556586 8801802 8973730 9069084 9116360 9121483 9111876 9053520 8981343
5641H981343j71230k02485k64024l56752l92841m85733m14045m77087m07366l23387
$$ 8981343 8810113 8607628 8343604 7986852 7594011 7108278 6694233 6217146 5809780 5486393
5631E486393k83660k49355l02617l01054j73882j86322j14127j16186j12999r3949
$$ 5486393 5202733 4953378 4650761 4349707 4175825 3989503 3875376 3759190 3646191 3552242
5621C552242j19204j09994p3239m7604p5355p3224m6180k1997n8987k0804n3640
$$ 3552242 3433038 3323044 3249805 3202201 3126846 3053622 3007442 2985445 2926458 2905654 2852014
5610B852014j5473o0243n3015m6308k7597J3051M1034L4872l0883m3280M5352
$$ 2852014 2836541 2776298 2723283 2676975 2649378 2662429 2703463 2738335 2707452 2664172 2709524
5599B709524k3421j1793p370k1024k6589L4776P1283j7448N993l1395M1176L0930
$$ 2709524 2686103 2674310 2666940 2645916 2619327 2654103 2725386 2707938 2713931 2682536 2723712 2754642
5587B754642k3228N4635k2684J5864L9303N598K0262k5844O9015R4928R4103L4140
$$ 2754642 2731414 2786049 2763365 2779229 2818532 2824130 2844392 2818548 2887563 2982491 3076594 3110734
5575C110734R1528N6423k3606l4533M809J6045m8689k2995m655J6014O1535K5768
$$ 3110734 3202262 3258685 3235079 3200546 3205355 3221400 3172711 3149716 3145061 3161075 3222610 3248378
5563C248378K5227J09033P2416j5509N304J7900L8313k0778L8882K7351j4044
$$ 3248378 3273605 3382638 3455054 3439545 3444849 3462749 3501062 3480284 3519166 3546517 3532473
5552C532473J5224M301l1680n755j5435J1932J08023N1511p275o735N2755K1584
$$ 3532473 3547697 3551998 3520318 3514563 3499128 3511060 3619083 3670594 3663319 3656584 3709339 3730923
5540C730923j3293R5883N4344m1618K0241L7538L7498J12568R5429J1891L9063
$$ 3730923 3717630 3813513 3867857 3826239 3846480 3884018 3921516 4034084 4129513 4141404 4180467
5529D180467K1152N2976m700N7582N2310j682M4169N8985M6921L1774J3924j9829
$$ 4180467 4201619 4254595 4249895 4307477 4359787 4358105 4402274 4461259 4508180 4539954 4553878 4534049
5517D534049K8203M787k105L6888m0944l3579j7585p837J4608Q730K4638K1826
$$ 4534049 4562252 4567039 4564934 4601822 4560878 4527299 4509714 4501877 4516485 4525215 4549853 4571679
5505D571679k7661k4395j5246k271M6014o153N2077O0616K5477K8352K1220m2223
$$ 4571679 4544018 4519623 4504377 4502106 4548120 4541967 4594044 4654660 4680137 4708489 4729709 4687486
5493D687486j3420l4957p4951j08163o5839n4513Q0628k6555l8757K6745j0485
$$ 4687486 4674066 4639109 4564158 4455995 4390156 4335643 4416271 4389716 4350959 4377704 4367219
5482D367219K6096k512l904k2406j3472j1909R099l8853j9977O325o2132m8503
$$ 4367219 4393315 4390803 4386899 4364493 4351021 4339112 4348211 4309358 4289381 4295706 4233574 4185071
5470D185071n3092J4725l7043k3939J0020j1343n1803j9870r36l2239k8156l4271
$$ 4185071 4131979 4146704 4109661 4085722 4095742 4084399 4032596 4012726 4011790 3979551 3951395 3917124
5458C917124R2491L2237k2992n1574R6724N7063K1042J5054M0375K3200M066j3904
$$ 3917124 4009615 4041852 4018860 3967286 4064010 4121073 4142115 4157169 4197544 4220744 4224810 4210906
5446D210906K1509K9643K3309Q1990Q5907M7584L1999M352J33492O6771J5731
$$ 4210906 4232415 4262058 4285367 4367357 4453264 4500848 4532847 4537199 4670691 4737462 4753193
5435D753193N8721O7173R3790Q3040P8655P9231J02745J38930N6819P4854J64811
$$ 4753193 4811914 4879087 4972877 5055917 5134572 5213803 5316548 5455478 5512297 5587151 5751962
5424E751962Q8474R3072J23694J21461J68544J57300Q6021J36736J53637J64667
$$ 5751962 5840436 5933508 6057202 6178663 6347207 6504507 6590528 6727264 6880901 7045568
5414G045568J76395J71713J89039J10132J53747J91639K07081K30330J49221K07881
$$ 7045568 7221963 7393676 7582715 7692847 7846594 8038233 8245314 8475644 8624865 8832746
5404H832746K05177K30053L25348L29782K65504K84044L19008L30754L39060L90012
$$ 8832746 9037923 9267976 9593324 9923106 10188610 10472654 10791662 11122416 11461476 11851488
5394A1851488L93048L86988L93805M27970M57257M35695M36330L81343M51825
$$ 11851488 12244536 12631524 13025329 13453299 13910556 14346251 14782581 15163924 15615749
5385A5615749M68453M91637N32043O31319O58340O56064Q86395R63803J061907
$$ 15615749 16084202 16575839 17107882 17739201 18397541 19053605 19940000 20903803 21965710
5376B1965710J186672J414650J591184J822081K089981K415171K762242L024517
$$ 21965710 23152382 24567032 26158216 27980297 30070278 32485449 35247691 38272208
5368C8272208L257677L409405L512020L500489L474526L438480L219626K752610
$$ 38272208 41529885 44939290 48451310 51951799 55426325 58864805 62084431 64837041
5360F4837041J923287O60287p23924j956580k840287l453744l688214l864772
$$ 64837041 66760328 67420615 66696691 64740111 61899824 58446080 54757866 50893094
5352E0893094l809453l671680l567193l320049l050801k658919k401897k042723
$$ 50893094 47083641 43411961 39844768 36524719 33473918 30814999 28413102 26370379
5344B6370379j850760j576852j369105j233492j034380r92960q85103p41228o94101
$$ 26370379 24519619 22942767 21573662 20340170 19305790 18312830 17427727 16686499 15992398
5335A5992398o16616o11768n63535m57564m73024m25207m16124l86119k81923
$$ 15992398 15375782 14764014 14200479 13742915 13269891 12844684 12428560 12042441 11760518
5326A1760518k57250k47699k99775k42561j98456k90143l19080k33430k09989
$$ 11760518 11503268 11255569 10955794 10713233 10514777 10224634 9905554 9672124 9462135
5317I462135k14569j44943k20913j86114j26536j97005j23566j50936q6350j54937
$$ 9462135 9247566 9102623 8881710 8695596 8569060 8372055 8248489 8097553 8011203 7856266
5307G856266q5159r4589j40316j10718p6299o6552p3000m8600j01189p9621j20385
$$ 7856266 7771107 7676518 7536202 7425484 7349185 7282633 7209633 7161033 7059844 6980223 6859838
5296F859838l7603j38855j07622j18476q4360r2984p0666p7365m8573n9560j0276
$$ 6859838 6822235 6683380 6575758 6457282 6372922 6279938 6209272 6131907 6083334 6023774 6013498
5285F013498j01330p6649p3919o6364l3663m3589o8144q5146p019r7080n2396
$$ 6013498 5912168 5835519 5761600 5695236 5661573 5617984 5549840 5464694 5457675 5360595 5308199
5274E308199p6263m3595j5571o7727l9302j7610p5229l0458J4787o0496l4298
$$ 5308199 5231936 5188341 5172770 5105043 5065741 5048131 4972902 4942444 4957231 4896735 4862437
5263D862437j3233q6625k8329n1806p9737l9444k7490L1251r956k8483k1832L895
$$ 4862437 4849204 4762579 4734250 4682444 4602707 4563263 4535773 4567024 4557068 4528585 4506753 4510648
5251D510648O034l1900m322m7505o7372J5284k3460o2601j3712L3572m2539r4389
$$ 4510648 4516682 4484782 4480460 4432955 4365583 4380867 4357407 4294806 4281094 4314666 4272127 4177738
5239D177738l0840k3994l9110J021O927j22060N5250k7090n1619m9255q1226p4814
$$ 4177738 4146898 4122904 4083794 4084815 4091742 3969682 4024932 3997842 3946223 3896968 3815742 3740928
5227C740928j9994N7012j1983j7354o5063m0055l859m6173m114R982K3402M4750
$$ 3740928 3720934 3777946 3765963 3748609 3683546 3643491 3639632 3593459 3589345 3599327 3622729 3667479
5215C667479k0537R916R444p7321r648J0900L5346m3410J3337k7716q6083m2161
$$ 3667479 3646942 3656858 3666302 3588981 3579333 3590233 3625579 3582169 3595506 3567790 3481707 3439546
5203C439546p6853n8794j04479o1882r7601j5756j5939m9253m3352K3432m9618
$$ 3439546 3362693 3303899 3199420 3137538 3039937 3024181 3008242 2958989 2915637 2939069 2889451
5192B889451m1284J2416m4963L879j4813p4183l6259Q409m7238j00460p674L8449
$$ 2889451 2848167 2860583 2815620 2819499 2804686 2730503 2694244 2702653 2655415 2554955 2547281 2585730
5180B585730k4045o2200p7036l3947q295L8522K2904J1918P734m1218P191l2744
$$ 2585730 2561685 2499485 2422449 2388502 2380207 2418729 2441633 2453551 2461285 2420067 2427258 2394514
5168B394514m5434o0045l1915M685R772n0642l3599l6837K6525j3251k6818L155
$$ 2394514 2349080 2289035 2257120 2261805 2271577 2220935 2187336 2150499 2177024 2163773 2136955 2140110
5156B140110O0324O575j0074m3718J2539K4863k2389k0770l1405n749K1253K8622
$$ 2140110 2200434 2207009 2196935 2153217 2165756 2190619 2168230 2147460 2116055 2110306 2131559 2160181
5144B160181J3810L9759l7945K0624k0583m1604j0156K5503K9706l6380k1908
$$ 2160181 2173991 2213750 2175805 2196429 2175846 2134242 2124086 2149589 2179295 2142915 2121007
5133B121007N0941J7415J7278k3833q603K8249M1741M0852l5116o377J8174M3466
$$ 2121007 2171948 2189363 2206641 2182808 2174205 2202454 2244195 2285047 2249931 2243554 2261728 2305194
5121B305194l1998M7666N3264J0171N0794K6030J6481J01297O0712J6768M6710
$$ 2305194 2273196 2320862 2374126 2384297 2435091 2461121 2477602 2578899 2639611 2656379 2703089
5110B703089m3714M554L3327K5529m5755p756P242L7247O92o4725o0172q417L46
$$ 2703089 2659375 2663929 2697256 2722785 2677030 2669274 2676516 2713763 2714455 2649730 2589558 2581141 2581487
5097B581487j050M7158P591K2107O6641O036J5858Q099K8233M0364M9639L8644
$$ 2581487 2580437 2627595 2635186 2657293 2723934 2729970 2745828 2753927 2782160 2822524 2872163 2910807
5085B910807M4433O3236P4705K5241L4571p602L1825O8170l1410m4782J6666K9741
$$ 2910807 2955240 3018476 3093181 3118422 3152993 3145391 3177216 3245386 3213976 3169194 3185860 3215601
5073C215601j5840r6618o2936j9665m5014n6154j727R685m3045j13127L3081J25345
$$ 3215601 3199761 3103143 3040207 3020542 2975528 2919374 2917647 2927332 2884287 2771160 2804241 2929586
5061B929586J0843m0268P9478O1813P3445M251M506K4604M7249M7513K3517M5551
$$ 2929586 2940429 2900161 2979639 3041452 3114897 3119148 3123654 3148258 3195507 3243020 3266537 3312088
5049C312088O966Q99K3619M3381J16935J13390N0748J78465J86043L27713K67600
$$ 3312088 3319054 3319953 3343572 3386953 3503888 3617278 3668026 3846491 4032534 4360247 4627847
5038D627847K05924r7583k68542l64031l28252k59451j75755j42691j13551r9936
$$ 4627847 4833771 4736188 4467646 4103615 3775363 3515912 3340157 3197466 3083915 2983979
5028B983979p7343o5777o139M7500r0149o1139m580R66O794L6174k0105M4447
$$ 2983979 2906636 2840859 2834720 2882220 2792071 2730932 2726352 2727318 2734112 2770286 2750181 2794628
5016B794628l0697j2682m7920m7607N2144J5194k2247q624k4188M5680J0841l1533
$$ 2794628 2763931 2751249 2703329 2655722 2707866 2723060 2700813 2692189 2668001 2713681 2724522 2692989
5004B692989r598j1369K3417K9709J2690r2779L1032M3962m980J3070N2431N2774
$$ 2692989 2683391 2672022 2695439 2725148 2737838 2645059 2676091 2720053 2715073 2728143 2780574 2833348
4992B833348P3933L9226L3389J19781J41491J36556J75497J59270L60178L25750
$$ 2833348 2907281 2946507 2979896 3099677 3241168 3377724 3553221 3712491 4072669 4398419
4982D398419J98252L3524o0407j10281l12222l29904k24909j07583j22444p4537
$$ 4398419 4596671 4630195 4569788 4459507 4147285 3817381 3592472 3484889 3362445 3287908
4972C287908r1121n7753K0497n0346p1285p145J6633j2653p0430K6291J3381K0806
$$ 3287908 3196787 3139034 3159531 3109185 3037900 3030755 3047388 3034735 2964305 2990596 3003977 3024783
4960C024783K4720K712Q378m2375o273m7293K4063j0545J1243L6721J3202N1429
$$ 3024783 3049503 3052215 3060593 3018218 3011945 2964652 2988715 2978170 2989413 3026134 3039336 3090765
4948C090765k3910o5846m7755j6639K8591N4984j0389L3526O7063K2882K4108
$$ 3090765 3066855 3001009 2953254 2936615 2965206 3020190 3009801 3043327 3110390 3133272 3157380
4937C157380L55L4313r621L8307J08377n450J6118K8760M1454N3981M5093J5188
$$ 3157380 3157735 3192048 3182427 3220734 3329111 3323661 3339779 3368539 3409993 3463974 3509067 3524255
4925C524255M363J3509M4711K8623M3902K9889R9485M9449R3486O7395k2247l503
$$ 3524255 3528618 3542127 3586838 3615461 3659363 3689252 3788737 3838186 3931672 3999067 3976820 3973317
4913C973317q3859m9747r7122k8769l5410j3343L5138l768J7819L2027K8444L8119
$$ 3973317 3889458 3839711 3742589 3713820 3678410 3665067 3700205 3696437 3714256 3746283 3774727 3812846
4901C812846J7282K5655N2641O6044O3604N5773O370k3236P3368O7420J28543
$$ 3812846 3830128 3855783 3908424 3974468 4038072 4093845 4100215 4076979 4150347 4217767 4346310
4890D346310O1917R3344Q7678O3030Q0522R7842N3051R7401J15082L5979O5244
$$ 4346310 4408227 4501571 4589249 4652279 4732801 4830643 4883694 4981095 5096177 5132156 5197400
4879E197400Q7175Q8731J31839J42144J21114J52294L6069Q5591N0342j4017N3013
$$ 5197400 5284575 5373306 5505145 5647289 5768403 5920697 5956766 6042357 6092699 6078682 6131695
4868F131695L9767M4524J26450N3617J35237R3360M4349P7634M4822J16812J17239
$$ 6131695 6171462 6215986 6342436 6396053 6531290 6624650 6668999 6746633 6791455 6908267 7025506
4857G025506K6895K9786L9936Q8344N8615J0559K4840N0614J20109R0089J23054
$$ 7025506 7052401 7082187 7122123 7210467 7269082 7279641 7304481 7355095 7475204 7565293 7688347
4846G688347K8108Q8121Q9430M1233L8102J08011J35853J36968P2192J15614J15027
$$ 7688347 7716455 7804576 7894006 7935239 7973341 8081352 8217205 8354173 8426365 8541979 8657006
4835H657006P3065N1428J1061O6902L9701L7273J34104P3332J6917N4925J3830
$$ 8657006 8730071 8781499 8792560 8859462 8899163 8936436 9070540 9143872 9160789 9215714 9229544
4824I229544R7368J58171J51058J79035L18898K73417K36777K49101J49624K28381
$$ 9229544 9326912 9485083 9636141 9815176 10134074 10407491 10644268 10893369 11042993 11271374
4814A1271374J98651J61964K55951J78388K39957K79621K19408K26527K35412
$$ 11271374 11470025 11631989 11887940 12066328 12306285 12585906 12805314 13031841 13267253
4805A3267253L23402L61597K97926K42099K36852K19811K50349K35385K94356
$$ 13267253 13590655 13952252 14250178 14492277 14729129 14948940 15199289 15434674 15729030
4796A5729030L98920K96416K72761K68257L57278M04501M12464M53741N19828
$$ 15729030 16127950 16424366 16697127 16965384 17322662 17727163 18139627 18593368 19113196
4787A9113196M69917M69098M89979N34812N68510N75875N30244N55691N34029
$$ 19113196 19583113 20052211 20542190 21077002 21645512 22221387 22751631 23307322 23841351
4778B3841351N64389O00157N45730O45324N33221N19996O33365P40519P56519
$$ 23841351 24405740 25005897 25551627 26196951 26730172 27250168 27883533 28624052 29380571
4769B9380571Q71554R84562J040905J249379J391474J509240J599729J708303
$$ 29380571 30252125 31236687 32277592 33526971 34918445 36427685 38027414 39735717
4761C9735717J825682J672561J577480J355159J190071J161122J126128J266841
$$ 39735717 41561399 43233960 44811440 46166599 47356670 48517792 49643920 50910761
4753E0910761J417130J516450J679782J879606K122810K401299K767544L194253
$$ 50910761 52327891 53844341 55524123 57403729 59526539 61927838 64695382 67889635
4745F7889635L749009M447489N019613N728680O351080P203548Q188075R353496
$$ 67889635 71638644 76086133 81105746 86834426 93185506 100389054 108577129 117930625
4737A17930625J1118916J3571569J7201571K2066928K8308828L6766526M7428879
$$ 117930625 129049541 142621110 159822681 181889609 210198437 246964963 294393842
4730B94393842N7820647N7854296L5457138j384273l6576627o1774147o5509749
$$ 294393842 352214489 410068785 445525923 444141650 407565023 345790876 280281127
4723B80281127n0988208l5497957k5327760j9191665j5190758j2510186j0544317
$$ 280281127 229292919 193794962 168467202 149275537 134084779 121574593 111030276
4716A11030276q829973p467776o169206n069777l940577l000236k257996j774645
$$ 111030276 102200303 94732527 88563321 83493544 79552967 76552731 74294735 72520090
4708G2520090j396258j027560q94934o72127m42874l25729k87332l00566l57543
$$ 72520090 71123832 70096272 69201338 68529211 68086337 67760608 67473276 67172710 66815167
4699F6815167m40181m73223k97251l5150K68782O52625Q61352J114831J310443
$$ 66815167 66374986 65901763 65604512 65569362 65838144 66490769 67352121 68466952 69777395
4690F9777395J637863J996439K365348K836311L339310L829359M443365N127390
$$ 69777395 71415258 73411697 75777045 78613356 81952666 85782025 90225390 95352780
4682I5352780N868371O743863P932053R700071J2263796J5665724J9907680K5508630
$$ 95352780 101221151 107965014 115897067 125597138 137860934 153526658 173434338 198942968
4674A98942968L3232597M3288460N2854454N2658767L1546640L048462j5110061
$$ 198942968 232175565 275464025 328318479 380977246 412523886 415572348 400462287
4667D00462287l5386910n7312776n8564417m4097559l1040596k3001978j7996913
$$ 400462287 365075377 307762601 249198184 205100625 174060029 151058051 133061138
4660A33061138j4484405j2215543j0338020q528975p122681n924190m827367m043473
$$ 133061138 118576733 106361190 96023170 87494195 80371514 74447324 69619957 65576484
4652F5576484l440925k771224k398335k262757k024292j869837j831874j719299
$$ 65576484 62135559 59364335 56966000 54703243 52678951 50809114 48977240 47257941
4644D7257941j593013j541566j556602j569870j424871j292476j075946r07530
$$ 47257941 45664928 44123362 42566760 40996890 39572019 38279543 37203597 36296067
4636C6296067o49667m64966m13321l24546l73201l03023k56598l59880l63266
$$ 36296067 35646400 35181434 34768113 34443567 34070366 33767343 33510745 33150865 32787599
4627C2787599m40379l78554l15683l85530l31893l79310l92427k57111k43950
$$ 32787599 32347220 31968666 31652983 31267453 30935560 30556250 30163823 29906712 29662762
4618B9662762j38340l5800J870n8021Q3451N2386Q9882J69226R7979J80550J57383
$$ 29662762 29524422 29488622 29490492 29432471 29515922 29568308 29658190 29827416 29925395 30105945 30263328
4607C0263328K00436K10225J38806K31643K39179K94154L02293L71082M44187
$$ 30263328 30463764 30673989 30812795 31044438 31283617 31577771 31880064 32251146 32695333
4598C2695333M58468N05936N20080N15793N05379M35461M54142M44313N05732
$$ 32695333 33153801 33659737 34179817 34695610 35200989 35636450 36090592 36534905 37040637
4589C7040637O04508O60314Q23005R75279J086441J241902J464898J670995J949030
$$ 37040637 37645145 38305459 39128464 40103743 41190184 42432086 43896984 45567979 47517009
4580D7517009K292310K619470L044753L586840M168910M766853N289806N721369
$$ 47517009 49809319 52428789 55473542 59060382 63229292 67996145 73285951 79007320
4572G9007320N656411N355386M815846M087123L389109K533223J359600m9977
$$ 79007320 84663731 90019117 94834963 98922086 102311195 104844418 106204018 106154041
4564A06154041j778567l278714m452569n056508n290494n351295n226766m925900
$$ 106154041 104375474 101096760 96644191 91587683 86297189 80945894 75719128 70793228
4556G0793228m602179m276398l827866l307344k923307k673908k399603k165467
$$ 70793228 66191049 61914651 58086785 54779441 51856134 49182226 46782623 44617156
4548D4617156k015044j893514j699712j612259j474167j363216j241752j143731
$$ 44617156 42602112 40708598 39008886 37396627 35922460 34559244 33317492 32173761
4540C2173761j062198r11364q18605o55481n68334n68342n53739m79335n29623
$$ 32173761 31111563 30200199 29381594 28726113 28157779 27589437 27035698 26556363 26026740
4531B6026740n35957n11726n21310m63377m78909n28104m56707m48842m50190
$$ 26026740 25490783 24979057 24457747 23994370 23515461 22987357 22530650 22081808 21631618
4522B1631618l52099m04708l93361l83928l74543l10121k63951j99354j32222
$$ 21631618 21279519 20874811 20481450 20097522 19722979 19412858 19148907 18949553 18817331
4513A8817331k03751j22685r1723j78329j26067j27787j43936j13704j14695j48848
$$ 18817331 18613580 18490895 18399172 18220843 18094776 17966989 17823053 17709349 17594654 17445806
4503A7445806j83096k26967k12200j99708j92303j27928j98727k39033j92080
$$ 17445806 17262710 17035743 16823543 16623835 16431532 16303604 16104877 15865844 15673764
4494A5673764j02784j19886m2500j01509m6600m4172l8999r3958j70118r9482
$$ 15673764 15570980 15451094 15408594 15307085 15260485 15216313 15177314 15083356 14913238 14813756
4484A4813756j95108j84676o6751K2689M8931L2723M5802J37622J78295J36047
$$ 14813756 14618648 14433972 14367221 14389910 14438841 14471564 14517366 14654988 14833283 14969330
4474A4969330J68436J50400J26065J60003L5647j03622r7424j66053k29583j31360
$$ 14969330 15137766 15288166 15414231 15574234 15609881 15506259 15408835 15242782 15013199 14881839
4464A4881839j46831j64237p4709l0786o6729j3399P952Q2268J80164J29009R7880
$$ 14881839 14735008 14570771 14496062 14465276 14398547 14385148 14393100 14475368 14655532 14784541 14882421
4453A4882421J35466O6110M2744m9629o0126N4777K1403L021P4915P1760J23016
$$ 14882421 15017887 15083997 15126741 15077112 15016986 15071763 15093166 15096187 15171102 15242862 15365878
4442A5365878J72651J47549J37687J84131K12304J89731K63074J35128Q0540J6762
$$ 15365878 15538529 15686078 15823765 16007896 16220200 16409931 16673005 16808133 16888673 16905435
4432A6905435l9153J3658j432L8229N9426R2489K17176K14659K30854K09144K80320
$$ 16905435 16866282 16879940 16878508 16916737 16976163 17068652 17285828 17500487 17731341 17940485 18220805
4421A8220805K88411L00108K59256K74608K74098K64685K80254J97301J1121j87420
$$ 18220805 18509216 18809324 19068580 19343188 19617286 19881971 20162225 20359526 20370647 20183227
4411B0183227l25540l86543k15177j29729P468L8197M2754J01492K54804K77241
$$ 20183227 19857687 19471144 19255967 19126238 19133706 19171903 19214657 19316149 19570953 19848194
4401A9848194L38659L68932L81415M54829M26693M58273N10651M41324M02214
$$ 19848194 20186853 20555785 20937200 21392029 21818722 22276995 22787646 23228970 23631184
4392B3631184M71914M40666N34890N93890O44343Q16428Q29516R04977J056231
$$ 23631184 24103098 24543764 25078654 25672544 26316887 27133315 27962831 28867808 29924039
4383B9924039J115773J176546J260701J286741J418399J647460J786172J968200
$$ 29924039 31039812 32216358 33477059 34763800 36182199 37829659 39615831 41584031
4375D1584031K228674K555631L023822L673772M495125N619219O884222Q173456
$$ 41584031 43812705 46368336 49392158 53065930 57561055 63180274 70064496 78237952
4367G8237952R640739J0879463J1037784Q424791K034909o269522j1678854j2546561
$$ 78237952 87878691 98758154 109795938 118220729 120255638 113986116 102307262 89760701
4359H9760701j0804841q592347o638763n139695m091614l445318k892073k495922
$$ 89760701 78955860 70363513 63724750 58585055 54493441 51048123 48156050 45660128
4351D5660128k150589j933598j481934j147399r19745o48929m47623k24755j26511
$$ 45660128 43509539 41575941 40094007 38946608 38026863 37377934 36930311 36705556 36579045
4342C6579045J17357L64779O67601R39296J215777J527836J754161K019153J914960
$$ 36579045 36696402 37061181 37728782 38668078 39883855 41411691 43165852 45185005 47099965
4333D7099965J300126L23584q90498j829563k572434k686432k454541k149311
$$ 47099965 48400091 48723675 47833177 46003614 43431180 40744748 38290207 36140896
4325C6140896j823534j529561j271819j005222q99341p48207n21302m63419m43930
$$ 36140896 34317362 32787801 31515982 30510760 29611419 28863212 28341910 27878491 27434561
4316B7434561l17570k25818j68167k10434j48840j01930p8430l6257k1283r9868
$$ 27434561 27116991 26891173 26723006 26512572 26363732 26261802 26183372 26147115 26125832 26025964
4306B6025964r3074j17137K6144m905L7652J80346K85191L69022L56089M75346
$$ 26025964 25932890 25815753 25841897 25836992 25874644 26054990 26340181 26709203 27065292 27540638
4296B7540638N75188N53352M59323M93622M66196N24411N65226N92196O59546
$$ 27540638 28115826 28669178 29128501 29622123 30088319 30612730 31177956 31770152 32429698
4287C2429698P11300Q59233R71835J105950J300059J462515J780275K005345K415575
$$ 32429698 33140998 34000231 34972066 36078016 37378075 38840590 40620865 42626210 45041785
4278D5041785K782785L209941L668037L933803M050606L648769K745491J637803
$$ 45041785 47824570 51034511 54702548 58636351 62686957 66335726 69081217 70719020
4270G0719020J012128Q20255J097764J849874L100721M837720O799695Q349218
$$ 70719020 71731148 72551403 73649167 75499041 78599762 83437482 90237177 98586395
4262I8586395Q645360P231128M479444J009886k900068o650557r424670j1008079
$$ 98586395 107231755 114462883 118942327 119952213 117052145 110401588 100976918 89968839
4254H9968839j1173309j0119415q280046o445475n250995m344581l592908l052622
$$ 89968839 78795530 68676115 60396069 53950594 48699599 44355018 40762110 37709488
4246C7709488k595904k368987k067381j838815j608801j304273j174542j093856
$$ 37709488 35113584 32744597 30677216 28838401 27229600 25925327 24750785 23656929
4238B3656929r63614q51110p41868p58947p20749o48280o39320n96538n78621
$$ 23656929 22693315 21842205 21100337 20341390 19620641 18972361 18333041 17736503 17157882
4229A7157882n27415n11177m37853m02857m18718l11872k13431k08625k29751
$$ 17157882 16630467 16119290 15681437 15278580 14859862 14547990 14334559 14125934 13896183
4220A3896183k31627j63181j53293j34576j58673j90536k00698k01102k24021
$$ 13896183 13664556 13501375 13348082 13213506 13054833 12864297 12663599 12462497 12238476
4211A2238476k74535k96617j94733j45108j87308k19355j43104p7164j02382r8178
$$ 12238476 11963941 11667324 11472591 11327483 11140175 10920820 10777716 10700552 10598170 10499992
4201A0499992j33113j44481j19199j77522j48363j77477j50477j32463k09496
$$ 10499992 10366879 10222398 10103199 9925677 9777314 9599837 9449360 9316897 9107401
4192I107401j75676j39700j44264p6633j67315j11790j03200k8379j18775j20026
$$ 9107401 8931725 8792025 8647761 8571128 8403813 8292023 8188823 8160444 8041669 7921643
4182G921643n6710o3053q5108q6541n7279n8438j16458j33683o3394n4573n804
$$ 7921643 7864933 7801880 7716772 7630231 7572952 7514514 7398056 7264373 7200979 7146406 7140602
4171G140602k5638r0511k8543o7747j4254K0876j4218j297l5196o6901L9730l6675
$$ 7140602 7114964 7024453 6995910 6928163 6913909 6934785 6920567 6919270 6884074 6817173 6856903 6820228
4159F820228n5993m651j23287q5986l3202m2321m4304n7746n1834l9150m9327
$$ 6820228 6764235 6759584 6636297 6550311 6517109 6474788 6430484 6372738 6320904 6281754 6232427
4148F232427J4219n7953j4119o3243o57R778p45Q8207Q6263J7403J1128L1936
$$ 6232427 6246646 6188693 6174574 6111331 6110674 6120452 6119707 6207914 6294177 6311580 6322708 6354644
4136F354644k6606P8804O8561O1651Q0249O056R1336N6772M0314q852m3359k4847
$$ 6354644 6328038 6406842 6475403 6537054 6617303 6623359 6714695 6771467 6811781 6802929 6759570 6734723
4124F734723K617Q0449Q4672L5700O8291j2778r6262j51743p1456o5996j1555
$$ 6734723 6737340 6817789 6902461 6938161 7006452 6993674 6897412 6745669 6674213 6608217 6596662
4113F596662N2602O675N5025O411K2718L9232M7720J6508n6359r5262j34962j26507
$$ 6596662 6649264 6655939 6710964 6717375 6740093 6779325 6827045 6843553 6787194 6691932 6556970 6430463
4101F430463q1018m6152O7574K3082M0921R3513J59264J09328L1774k1268o1222
$$ 6430463 6349445 6303293 6370867 6393949 6434870 6528383 6687647 6796975 6828749 6807481 6746259
4090F746259j62934j99572j41536j93583r4898j22687j03301j26832m9861O314
$$ 6746259 6583325 6383753 6242217 6048634 5953736 5831049 5727748 5600916 5551055 5557369
4080E557369n5872l3370j1194o100m6829n5765j3291m5024l6791L790L7666N640
$$ 5557369 5501497 5468127 5456933 5450833 5404004 5348239 5334948 5289924 5253133 5256923 5294589 5300229
4068E300229L7522l053N0103J7581L2056L4783K5124O3437l171k8813k2185J6185
$$ 5300229 5337751 5334698 5384801 5402382 5434438 5469221 5494345 5557782 5554611 5525798 5503613 5519798
4056E519798l0241n0388K126N100J7513K7345L1090J3549O197Q1947J51348P3982
$$ 5519798 5489557 5439169 5441295 5446395 5463908 5491253 5522343 5535892 5542089 5624036 5775384 5849366
4044E849366L5640R1996L2508O6288J02636O3759K6943j975O503j5458q364l5727
$$ 5849366 5885006 5977002 6009510 6075798 6178434 6242193 6269136 6267161 6273664 6258206 6249842 6214115
4032F214115k1375O4451O5943J1197n258M6813R455Q0576l3368k590K7311K5088
$$ 6214115 6192740 6257191 6323134 6334331 6329073 6375886 6385341 6465917 6432549 6429959 6457270 6482358
4020F482358K1773j0102P5410M6215R6469O0168O9042m15M0572N4158L5114M586
$$ 6482358 6504131 6494029 6569439 6615654 6712123 6772291 6841333 6840918 6881490 6935648 6970762 6975348
4008F975348L8472J21365J05189Q1812P8570L4061R3769J33594O2914J01079J07518
$$ 6975348 7013820 7135185 7240374 7322186 7400756 7434817 7528586 7662180 7725094 7826173 7933691
3997G933691J18010J51774J75106J27520J19615J61483J49183J04491K61965K13498
$$ 7933691 8051701 8203475 8378581 8506101 8625716 8787199 8936382 9040873 9302838 9516336
3987I516336K14639J46577K33412K84033K68791K79440K27385L88039L20389L22887
$$ 9516336 9730975 9877552 10110964 10394997 10663788 10943228 11170613 11558652 11879041 12201928
3977A2201928M41746M68578M58215L51451L49178L42043L98946L02056K94225
$$ 12201928 12643674 13112252 13570467 13921918 14271096 14613139 15012085 15314141 15608366
3968A5608366L55380M27967L72700L75582M56083M82851M62768N40489N56317
$$ 15608366 15963746 16391713 16764413 17139995 17596078 18078929 18541697 19082186 19638503
3959A9638503N62916N60875N98718N63930O19499N70893N76890O21497N62277
$$ 19638503 20201419 20762294 21361012 21924942 22544441 23115334 23692224 24313721 24875998
3950B4875998O16441N50295M77700N77421N69550N07326N45181N00135N71038
$$ 24875998 25492439 26042734 26520434 27097855 27667405 28174731 28719912 29220047 29791085
3941B9791085M32147N12742M83673M51951L53643L70213L36875L55798K56198
$$ 29791085 30223232 30735974 31219647 31671598 32025241 32395454 32732329 33088127 33344325
3932C3344325K67736K18035K12168J14264J15442J33232R8500J12785L0592m5538
$$ 33344325 33612061 33830096 34042264 34156528 34271970 34405202 34503702 34616487 34647079 34601541
3922C4601541o5750q1024r2648j37728j66598j25342k14216j26227k86456k74851
$$ 34601541 34535791 34454767 34362119 34224391 34057793 33932451 33718235 33592008 33305552 33030701
3912C3030701k34846l03261l64422l27536l76871l74320l67364l72031m19502
$$ 33030701 32795855 32492594 32128172 31800636 31423765 31049445 30682081 30310050 29890548
3903B9890548m32791l90489m48960m33590m13890m40949m54972m34110n13792
$$ 29890548 29457757 29067268 28618308 28184718 27770828 27329879 26874907 26440797 25927005
3894B5927005n23981n13371n84216m81001n77161n35069m81868m99644m84072
$$ 25927005 25403024 24889653 24305437 23824436 23247275 22712206 22230338 21730694 21246622
3885B1246622n28544n65715n19733n56359n67158m90549n90333n44583n35988
$$ 21246622 20718078 20152363 19632630 19076271 18509113 18018564 17428231 16883648 16347660
3876A6347660n20807m43639m94512m79476l84352m38005m62029m79742l98649
$$ 16347660 15826853 15383214 14888702 14409226 14024874 13586869 13124840 12645098 12246449
3867A2246449l37360m15999l72733k94081l11771l47430l13139k91600k90777
$$ 12246449 11909089 11493090 11120357 10826276 10514505 10167075 9853936 9562336 9271559
3858I271559j96223k14387k05827k09979j41454j36786j30606k19974j51501n4078
$$ 9271559 9075336 8860949 8655122 8445143 8303689 8166903 8036297 7816323 7664822 7610744
3848G610744q3024p3965p2289k3017r2357j52301J3159l3155j05550p3565L762
$$ 7610744 7527720 7453755 7381466 7358449 7266092 7113791 7126950 7093795 6988245 6914680 6918442
3837F918442M88l1244K7063l5925j5043J0150j6960o9585m1336m4625o0558m5654
$$ 6918442 6918930 6887686 6914749 6878824 6863781 6873931 6856971 6787386 6746050 6701425 6640867 6595213
3825F595213j5962o1426m9954k7152r6467Q029j4995m0508m89K7582k464p0979
$$ 6595213 6579251 6517825 6467871 6440719 6344252 6352281 6337286 6296778 6296289 6323871 6321407 6250428
3813F250428j3740Q053K0096K7994k7449k0100J4243k1500m8185l8099J9167n2993
$$ 6250428 6236688 6244741 6264837 6292831 6265382 6245282 6259525 6238025 6189840 6151741 6170908 6117915
3801F117915l6874r4154o4941j0796q2973p0618m1580o7355r998k8087l9097r8227
$$ 6117915 6081041 5986887 5921946 5911150 5828177 5757559 5715979 5648624 5638626 5610539 5571442 5473215
3789E473215o9254n6244r8820q3603j05435j25775j03063o2470p9820l6504l5422
$$ 5473215 5403961 5347717 5248897 5165294 5059859 4934084 4831021 4768551 4688731 4652227 4616805
3778D616805p3034n6527k8339r7583n6300o8795k4298j4356o5694m9897q398n5541
$$ 4616805 4543771 4487244 4458905 4361322 4305022 4236227 4211929 4197573 4131879 4081982 4073584 4018043
3766D018043l6510K1188l6713J2142j8167m5770L004M04j0262M5754n5238k7207
$$ 4018043 3981533 4002721 3966008 3978150 3959983 3914213 3917217 3917621 3907359 3953113 3897875 3870668
3754C870668n698l8845J6857l4159j8559j3737K2337L3832n0174n1243L6995J0069
$$ 3870668 3864970 3826125 3842982 3808823 3790264 3776527 3798864 3832696 3782522 3731279 3768274 3778343
3742C778343L0918L1331J2714L1875q662Q09O0602J5932M1112L7050L9816k4473
$$ 3778343 3809261 3840592 3853306 3885181 3876519 3877328 3937930 3953862 3994974 4032024 4071840 4047367
3730D047367Q206N2716O9272K2276J9500N5473L8845Q5974K0045J9628R0421J15513
$$ 4047367 4055573 4108289 4177561 4199837 4219337 4274810 4313655 4399629 4419674 4439302 4529723 4645236
3718D645236J2012Q0142P1720K128M8289J02565J4425P1871N6721O6093N3749
$$ 4645236 4657248 4737390 4809110 4811238 4859527 4962092 4976517 5048388 5105109 5171202 5224951
3707E224951M0334L8864Q3242J04347J05625M1615N7612P3597L250L1872O6723
$$ 5224951 5265285 5304149 5387391 5491738 5597363 5638978 5696590 5770187 5773437 5805309 5872032
3696E872032P4983M6109J14660Q5864M8771O9348M9738R0937Q9488Q6724M1069
$$ 5872032 5947015 5993124 6107784 6193648 6242419 6311767 6361505 6452442 6541930 6628654 6669723
3685F669723J74217O6355Q2284Q7034N8606J11577Q5704J53060P8710M0885Q7040
$$ 6669723 6843940 6910295 6992579 7079613 7138219 7249796 7335500 7488560 7567270 7608155 7695195
3674G695195J11149M9846J35688J04960J21293J14791O0221O2349J04588J17672
$$ 7695195 7806344 7856190 7991878 8096838 8218131 8332922 8393143 8455492 8560080 8677752
3664H677752J72503J60033J01398J15317J38601J01422J50338J60821J25087J41924
$$ 8677752 8850255 9010288 9111686 9227003 9365604 9467026 9617364 9778185 9903272 10045196
3654A0045196J55123J72935K12448J43380J35839K04782K11017J77839K00537
$$ 10045196 10200319 10373254 10585702 10729082 10864921 11069703 11280720 11458559 11659096
3645A1659096K19541J91054K75837K43453J62732L31273K61035L02361K88027
$$ 11659096 11878637 12069691 12345528 12588981 12751713 13082986 13344021 13646382 13934409
3636A3934409K96727L11911L41267K81082K74034L40294L97981L64433L26367
$$ 13934409 14231136 14543047 14884314 15165396 15439430 15779724 16177705 16542138 16868505
3627A6868505L83114L86481M12275M56364L78115L89840M93803M44680M38294
$$ 16868505 17251619 17638100 18050375 18506739 18884854 19274694 19768497 20213177 20651471
3618B0651471M69212M95924N40994N41379M98835N84584N32428N04781N74506
$$ 20651471 21120683 21616607 22157601 22698980 23197815 23782399 24314827 24819608 25394114
3609B5394114N56216N78432N12926N60409N88278N64091O46290O10576O74321
$$ 25394114 25950330 26528762 27041688 27602097 28190375 28754466 29400756 30011332 30685653
3600C0685653O19277N67342N64523O20503O06502N60633N42623N55979N55986
$$ 30685653 31304930 31872272 32436795 33057298 33663800 34224433 34767056 35323035 35879021
3591C5879021N25652N61404N70047N30591N36845N27209M93614N70764N93704
$$ 35879021 36404673 36966077 37536124 38066715 38603560 39130769 39624383 40195147 40788851
3582D0788851N88559O33467N88717O53993O21223O52086P03519P68118Q09945
$$ 40788851 41377410 42010877 42599594 43253587 43874810 44526896 45230415 45998533 46808478
3573D6808478Q08100Q43792Q72577Q53821R18143R24130R45824Q63523Q90676
$$ 46808478 47616578 48460370 49332947 50186768 51104911 52029041 52974865 53838388 54729064
3564E4729064R26619R34656R76159R54894R70258J024285J095895J074986J078066
$$ 54729064 55655683 56590339 57566498 58521392 59491650 60515935 61611830 62686816 63764882
3555F3764882J085744J055076J103400J088037J048686J065673J102666J056419
$$ 63764882 64850626 65905702 67009102 68097139 69145825 70211498 71314164 72370583
3547G2370583J070722J092295R70154J046067R95755R85944R98741R87034R04708
$$ 72370583 73441305 74533600 75503754 76549821 77545576 78531520 79530261 80517295 81422003
3538H1422003Q97342Q79793Q11754Q51431Q08517O47366N44364N35824M51700
$$ 81422003 82319345 83199138 84010892 84862323 85670840 86318206 86862570 87398394 87850094
3529H7850094K98103K02764K9674M803l8104p7260j43146j87966k20211l00493
$$ 87850094 88148197 88350961 88380635 88385438 88347334 88270074 88126928 87938962 87718751 87418258
3519H7418258k39508l17158l23563m07211m78912n62068o62530p55757r39125
$$ 87418258 87178750 86861592 86538029 86130818 85651906 85089838 84427308 83671551 82732426
3510H2732426r22810r76912j206539j168925j187515j191921j213681j286198
$$ 82732426 81809616 80832704 79626165 78457240 77269725 76077804 74864123 73577925
3502G3577925j182744j205039j244240j244167j275780j265287j280511j341243
$$ 73577925 72395181 71190142 69945902 68701735 67425955 66160668 64880157 63538914
3494F3538914j351900j330803j351992j295292j217713j199734j178264j231960
$$ 63538914 62187014 60856211 59504219 58208927 56991214 55791480 54613216 53381256
3486E3381256j243695j239321j220757j227668j152310j213767j069291j037717
$$ 53381256 52137561 50898240 49677483 48449815 47297505 46083738 45014447 43976730
3478D3976730j012934r12893r14136q38813q63152q46970q41480q94673r39108
$$ 43976730 42963796 42050903 41136767 40297954 39434802 38587832 37746352 36851679 35912571
3469C5912571r07448q97516r09772p82363p64257o31985n77829n82131m79403
$$ 35912571 35005123 34107607 33197835 32415472 31651215 31019230 30441401 29859270 29379867
3460B9379867m68668l72691k88414k63021k85501k53852k17201j68296k01232
$$ 29379867 28911199 28538508 28250094 27987073 27701572 27447720 27230519 27062223 26860991
3451B6860991j58451j33913j47290o8828l7911k5151p6748l7283M5759N2778J30558
$$ 26860991 26702540 26568627 26421337 26352509 26314598 26289447 26212699 26175416 26221175 26273953 26404511
3440B6404511J18893Q5240J58403K23209J98497K92276L28162L86550M46831N79223
$$ 26404511 26523404 26608644 26767047 26990256 27188753 27481029 27809191 28195741 28642572 29221795
3430B9221795N85358O15914P25785Q00839Q44212R10907Q90960R30310R38155
$$ 29221795 29807153 30423067 31148852 31949691 32793903 33704810 34595770 35526080 36464235
3421C6464235Q78208P98237P25411O05846N29141L10819J74303M7801q8385j67400
$$ 36464235 37342443 38140680 38866091 39471937 40001078 40311897 40486200 40534001 40445616 40278216
3411D0278216l32929l46530n31544o34307p75683q44504r68440j007181j104876
$$ 40278216 39945287 39598757 39067213 38432906 37657223 36812719 35844279 34837098 33732222
3402C3732222j171263j271341j320702j348661j351906j403523j379441j384972
$$ 33732222 32560959 31289618 29968916 28620255 27268349 25864826 24485385 23100413
3394B3100413j392732j258111j184497j074860j026705r53436q66096p59434p11246
$$ 23100413 21707681 20449570 19265073 18190213 17163508 16210072 15343976 14584542 13873296
3385A3873296o42726o04064n77822m94857m03234m13817l61185l59300k94473
$$ 13873296 13230570 12626506 12048684 11553827 11150593 10736776 10375591 10016291 9721818
3376I721818k50255k34287k21526k21082k16277j96547j75191j84758j20862j34465
$$ 9721818 9471563 9237276 9015750 8794668 8578391 8381844 8206653 8021895 7901033 7766568
3366G766568r8389j07067j11675j08951j16417p4301j18061j00825j32449j22021
$$ 7766568 7668179 7561112 7449437 7340486 7224069 7149768 7031707 6930882 6798433 6676412
3356F676412o9840p7513r1638q1853o3831j58556r1479r1122n5160j08939j03566
$$ 6676412 6606572 6529059 6437421 6355568 6291737 6133181 6041702 5950580 5895420 5786481 5682915
3345E682915n2505j11946j20524j21801q1666j23726p4882q5018j04203j19800
$$ 5682915 5630410 5518464 5397940 5276139 5194473 5070747 4995865 4910847 4806644 4686844
3335D686844j34552l2691q9835q0476j11757r7342q1380j7283n2011r5807L5220
$$ 4686844 4552292 4519601 4429766 4349290 4237533 4140191 4058811 4041528 3989517 3893710 3928930
3324C928930m2204m5404o194L9029j9727n2193k9292n9549J3715n7626k6508n1678
$$ 3928930 3886726 3841322 3835128 3874157 3854430 3802237 3772945 3713396 3727111 3669485 3642977 3591299
3312C591299r838Q050J4643l6792q588l8794j9625r401k6527k0403p0929N3351
$$ 3591299 3581461 3589511 3604154 3567362 3558774 3519980 3500355 3490954 3464427 3444024 3373095 3426446
3300C426446R774j00982n0363l4010n6992j3085q0045n0546j9195N149J6649m9816
$$ 3426446 3436220 3335238 3284875 3250865 3193873 3180788 3100743 3050197 3031002 3036151 3052800 3002984
3288C002984o6105n9538l1815k985k1867j7559n4055j3715m4165n746k0747l5210
$$ 3002984 2936879 2877341 2845526 2842541 2820674 2803115 2749060 2735345 2691180 2685434 2664687 2629477
3276B629477l4597J1064L8559J739k6761P568j1151l4956l6153M4273K9125L1544
$$ 2629477 2594880 2605944 2644503 2646242 2619481 2627049 2615898 2580942 2544789 2589062 2618187 2649731
3264B649731K0426l7086k6996J5409j4355O6908O391O1731M8066m9549l4044L783
$$ 2649731 2670157 2633071 2606075 2621484 2607129 2674037 2680428 2742159 2790225 2740676 2706632 2710415
3252B710415J9755L6369K3355K334j0464R798m0742k4609l1155k2361N5167L1508
$$ 2710415 2730170 2766539 2789894 2792228 2781764 2791562 2750820 2726211 2695056 2672695 2727862 2759370
3240B759370p123r199L5631l9696o0092J6807O3401K5166p3975L6257K1448l0135
$$ 2759370 2752247 2743048 2778679 2738983 2678891 2695698 2759099 2784265 2710290 2746547 2767995 2737860
3228B737860N2481j1318j580K4782P4496J9892L9764N2184P4256j4997O6439J19633
$$ 2737860 2790341 2779023 2777443 2802225 2876721 2896613 2936377 2988561 3062817 3047820 3114259 3233892
3216C233892J18801J09699J19208J17460J33999Q5061N6888m3163j13222q3290
$$ 3233892 3352693 3462392 3581600 3699060 3833059 3918120 3975008 3931845 3818623 3735333
3206C735333j56395k33401j48360j33934j08961o0673j34263j31103r0420j30114
$$ 3735333 3578938 3345537 3197177 3063243 2954282 2893609 2759346 2628243 2537823 2407709
3196B407709p4636j21307K20m8610q4481p6925k4929l8106p8804n8797k8349N450
$$ 2407709 2333073 2211766 2211986 2163376 2078895 2001970 1977041 1938935 1860131 1801334 1772985 1778435
3184A778435m2768o2652J5688Q560K8884K006L6268l6107p5580o4967r3526p8370
$$ 1778435 1735667 1673015 1688703 1697263 1726147 1728153 1764421 1728314 1652734 1587767 1494241 1415871
3172A415871r4522N0795p3629n3962k4752j275j4902L3657m0435O785k3982K947
$$ 1415871 1321349 1372144 1298515 1244553 1219801 1218526 1203624 1237281 1196846 1203631 1179649 1182596
3160A182596p084K4339R203o330m1672l8874j81j849N1139j7185O6404R1627N9509
$$ 1182596 1175512 1199851 1209054 1202724 1161052 1122178 1121997 1120148 1171287 1154102 1220506 1312133 1371642
3147A371642P5392K2644q267j04946r6483k6286o0559o2637p4732k7100r650p318
$$ 1371642 1447034 1469678 1461411 1356465 1259982 1233696 1173137 1110500 1035768 1008668 999018 991700
3135I91700K3448n9551J5070j87m3962K1564J0491l3906r809M3978j2344M021
$$ 991700 1015148 955597 970667 970480 926518 948082 958573 924667 914858 958836 946492 950513
3123I50513j4798q199K5112M837J2645K1655l1437J8061O0659l411n6175p2071
$$ 950513 935715 927516 952628 957465 970110 991765 960328 978389 1039048 1035637 979462 907391
3111I07391K1935l3866j07016o3197K115p833J4735k6966k5583n5029l4227J1349
$$ 907391 929326 895460 788444 725247 727362 719529 734264 707298 681715 626686 592459 603808
3099F03808o750M916J3001K6775p8265m141K300K6789P0031n5912J053m8933j1155
$$ 603808 597058 601974 614975 641750 563485 559344 561644 588433 658464 602552 603605 554672 543517
3086E43517o10n5868K6630M314l4563L6318N600n1276M0189k7744j2653j4915
$$ 543517 542907 487039 513669 517983 483420 519738 525338 474062 514251 486507 473854 458939
3074D58939J4254J4798n4111K8274M48j5737J4054m2489K1508l3357J8633M7547
$$ 458939 473193 487991 433880 462154 462602 446865 460919 418430 439938 406581 425214 472761
3062D72761L0351r465l6356l4081K4230l1098j666l95l1428n99K2853O613r314
$$ 472761 503112 493647 457291 423210 447440 416342 414676 414281 382853 382254 405107 411720 402406
3049D02406r0000J5909Q3694K2046j7726L10j8141M7327L7856m1996k2767k9899
$$ 402406 312406 328315 412009 434055 416329 416639 398498 445825 483681 441685 418918 389019
3037C89019j067p24l7305N262k1351j0162O5753l773M1258j4574l4255P0294j3676
$$ 389019 387952 387228 349923 355185 333834 323672 389425 385652 426910 412336 378081 448375 434699
3024D34699j14774J8200k5523K5075J8440M849o7345o20K0921K5613o699K018
$$ 434699 319925 338125 312602 337677 356117 360966 293621 293001 313922 339535 332836 334854
3012C34854q4111N401M318M2409L6254k7770j6266k9035M0443J0672J2561o7743
$$ 334854 250743 256144 260462 302871 339125 311355 295089 266054 306497 317169 329730 261987
3000B61987L687L5429J911j1851j6850M013q342O5602j234n2180K7223O577r427
$$ 261987 265674 301103 303014 291163 274313 278326 269984 335586 334352 282172 309395 315972 306545
2987C06545r851j7397l1074J3328K5288k0489o9J7159j7641K8081M286M0130K1143
$$ 306545 296694 279297 248223 261551 286839 266350 266281 283440 265799 293880 298166 338296 359439
2974C59439n5984m2501M2682j0109j7707O8160J2120j5154l2000j6430M70k4512
$$ 359439 303455 260954 303636 293527 275820 343980 356100 340946 308946 292516 292986 268474
2962B68474L759L7326k7141J0952J8840L8582k9377o0783l5453N0817J7583n9626
$$ 268474 272233 309559 282418 293370 312210 350792 321415 260632 225179 275996 293579 233953
2950B33953K1697K1059N942m211L0724k7074R1991M8105k7585l4011Q291l624
$$ 233953 255650 276709 282651 278440 309164 282090 374081 422186 394601 360590 368881 365257
2938C65257J2628m483N6544k7957o0051Q3661J5961j6326k9796j0778K3019p2853
$$ 365257 377885 373402 429946 401989 341938 425599 441560 425234 395438 384660 407679 334826
2926C34826K3494K0108k8771M4979k984k6732m0127K9929l3872l3704J7564k6572
$$ 334826 358320 378428 349657 394636 391652 364920 324793 354722 320850 287146 304710 278138
2914B78138J3710M7369k5833L4150P622K5759j5442o1732K3379L5114m4388N5857
$$ 278138 291848 339217 313384 347534 355156 380915 365473 303741 327120 362234 317846 373703
2902C73703L9005j6975K0622l0457M2763n5295l0826j765O6434K8001l8742K9764
$$ 373703 412708 395733 416355 385898 428661 373366 342540 340775 407209 435210 396468 426232
2890D26232p450J846L234N381l2237j9989k430R72M3633j1578k2514K9250J4658
$$ 426232 418782 420628 423862 429243 397006 377017 374587 375559 419192 407614 385100 414350 429008
2877D29008J0849j7504N2257k2280L3006J4633J2400m848n6137J4305j9446R492
$$ 429008 439857 422353 474610 452330 485336 499969 512369 507521 451384 465689 446243 455735
2865D55735k486K4511k9249m0840O0391j6182n0177n2591j5911P0049m4076j6592
$$ 455735 453249 477760 448511 407671 468062 451880 401703 349112 333201 403250 359174 342582
2853C42582O6249P442p8196K4398r54l6951l5417O7935K0839m056L2850L9992
$$ 342582 408831 416273 338077 362475 361521 324570 289153 357088 377927 373871 406721 446713
2841D46713n549L5102k1758O488k4563P354k7734k3370L4728l2855K0480J1843
$$ 446713 441164 476266 454508 460996 436433 443787 416053 392683 427411 394556 415036 426879
2829D26879k8919k4792M1977M1281M120m709J610j8026J2240k8646O5326J8052
$$ 426879 397960 373168 415145 456426 460546 455837 457447 439421 451661 423015 488341 506393
2817E06393j7498k2333J1875n0109l2313m1206o855K0022O591q5882m0929k7319
$$ 506393 488895 466562 478437 428328 396015 354809 347954 367976 374567 288685 247756 220437
2805B20437P813O819K4001Q226r3320k039K9921j6967l0034K0638r3660M5829
$$ 220437 228250 235069 259070 267296 173976 171937 201858 184891 154857 175495 81835 127664
2793A27664R4930m8804J5645j1300l1873l9260K5461r65j7013m3702k4030p892
$$ 127664 222594 173790 189435 178135 146262 107002 132463 131498 114485 70783 46753 38861
2781C8861N7891Q609r361k8808o4357R3355m346j1277K9041o133k5579k9425J9379
$$ 38861 96752 105361 96000 67192 2835 96190 91844 80567 109608 103475 77896 48471 67850
2768F7850K1436j3782l3351j7820L468Q048J3539J9188l4214M172J8283j8350
$$ 67850 89286 75504 42153 24333 27801 35849 49388 68576 34362 38534 56817 38467
2756C8467J6270j5888n1290j236K0302q033P321L4899K3443j3072m4673l652N1828
$$ 38467 54737 38849 -12441 -13677 6625 -1408 5913 40812 64255 51183 6510 2858 54686
2743E4686p756n620r997J0396L326m8315M3503j0948n3465l866k5681J7511K3978
$$ 54686 46930 41310 31313 41709 45035 -3280 40223 29275 -24190 -28056 -53737 -36226 -12248
2730a2248P517L5585l1993J6934L3996k2764j2663n2344K2264M9446K7634q8635
$$ -12248 -4731 30854 -1139 15795 49791 27027 14364 -37980 -15716 33730 61364 -27271
2718b7271Q9026m1923m8089m325L4149O013m4205p454P190N0795M2331l5465L6549
$$ -27271 61755 19832 -28257 -32582 1567 7580 -36625 -44079 -36889 13906 56237 20772 57321
2705E7321K3586m6088k7479m4303N8932p411J1445m4010L2197l4910l5205J7075
$$ 57321 80907 34819 7340 -36963 21969 14558 26003 -18007 14190 -20720 -55925 -38850
2693c8850J3987L8364n5586J473J1768l5957K1322N5426P669p223J2212j3727
$$ -38850 -24863 13501 -42085 -40612 -28844 -64801 -43479 11947 19616 12393 24605 10878
2681A0878O917k528o9553J1095K1801l6553K5963k5370K7967P556l8457L1242
$$ 10878 17795 15267 -54286 -43191 -21390 -57943 -31980 -57350 -29383 -21827 -60284 -29042
2669b9042k0527p6976J3701j1909O7397M2635j3260K6382J0472o4890p284j944
$$ -29042 -49569 -126545 -112844 -124753 -57356 -14721 -27981 -1599 8873 -56017 -63301 -65245
2657f5245K9685J2318K1931K2674j2950k2934k6088N6336L1153L2545n9311n6018
$$ -65245 -35560 -23242 -1311 21363 8413 -14521 -40609 15727 46880 79425 20114 -35904
2645c5904o0140J6273R4429j4210k9887L9321l646j804k087O3246m7862j2721
$$ -35904 -96044 -79771 14658 448 -29439 9882 6236 4432 2345 65591 17729 5008
2633E008l5483J0433O011j1279L649p194J3724J4013j3368L3022o2841K5772L9831
$$ 5008 -30475 -20042 -14031 -25310 -21661 -28855 -15131 -1118 -14486 18536 -44305 -18533 21298
2620B1298q3719K3349K1681M124K8071R2868L226n2336j3595j7751K697m6203
$$ 21298 -62421 -39072 -17391 -13267 14804 107672 110898 58562 44967 27216 29913 -16290
2608a6290p3233q967R6973O4442m6833j4268M912k8599q621N9514k7015K0691
$$ -16290 -89523 -98490 -1517 62925 16092 1824 6736 -21863 -30484 29030 2015 22706
2596B2706j7612o418n439P95K7890K7341m8190m2630l5082K159K8035L4476j5123
$$ 22706 5094 -1324 -6763 -5968 21922 49263 1073 -41557 -76639 -74480 -46445 -11969 -27092
2583b7092l5638K8885L9525K7755q557K6806m636J595m3933k8076N1760P430k5441
$$ -27092 -62730 -33845 5680 33435 24878 51684 47048 48643 4710 -23366 28394 35824 10383
2570A0383k4655N2676k2716j0919L8919o786J2245J1745J2060j2332J1754n5424
$$ 10383 -14272 38404 15688 4769 43688 36902 49147 60892 72952 60620 72374 16950
2558A6950l4569L1713J054o211n8467Q349R50q45P569l5132K2055Q082P7L6676
$$ 16950 -17619 14094 15148 8937 -49530 -41181 -40231 -41076 -33507 -68639 -46584 -38502 -38425 -1749
2544a749N969J8079K421L8913L683P783o1773J6670m0089l0313K1294N053J9352
$$ -1749 4220 22299 24720 63633 67316 75099 13326 29996 -10093 -40406 -19112 -14059 5293
2531E293J4368p2763l695O9567N2117m7505j4701M4044j6494n8714J6356M0048
$$ 5293 19661 -53102 -56797 12770 64887 17382 2681 46725 30231 -28483 -12127 27921
2519B7921k0687O667l7581n728l3589o861K4553l0658n176K8558L28L0360p849
$$ 27921 7234 13901 -23680 -29408 -62997 -69858 -45305 -75963 -81139 -52581 -52253 -21893 -29742
2506b9742M3373l4553J1770m5210M9976n72k45l4832j3849j5757J7365L0772K2138
$$ -29742 13631 -20922 -9152 -54362 -4386 -4958 -5203 -40035 -53884 -69641 -52276 -21504 634
2493F34j2854k5339J0284j0335J377k4624l2505L8662m6530l5698N1934J7867
$$ 634 -12220 -37559 -27275 -37610 -36233 -60857 -93362 -54700 -101230 -136928 -84994 -67127
2481f7127K0884N1091j7171o0K6141n740N202l7194n3694J6233k535L1408l6412
$$ -67127 -46243 4848 -12323 -12383 13758 8018 13220 -23974 -77668 -61435 -63970 -32562 -68974
2468f8974n635L3050J044q764k6511J5739k9106J9532j7n4794J3865K7133o6704
$$ -68974 -74609 -41559 -40515 -49279 -75790 -60051 -89157 -69625 -69642 -124436 -110571 -83438 -150142
2455a50142O1468R890J0505o91K1520p489r860M1274J0696k0046n578K684j2913
$$ -150142 -88674 -78784 -68279 -68970 -47450 -54939 -64799 -23525 -12829 -32875 -38453 -35769 -48682
2442d8682J7665k9721o8014N4814j3958p489L7934L98L3529j547m629J2174R337
$$ -48682 -31017 -60738 -128752 -73938 -87896 -95385 -57451 -57053 -23524 -25071 -29700 -17526 -8189
2429h189J0285o6149k1054r893k2898M004j709K7066J2015K7403k390L1526j1660
$$ -8189 2096 -64053 -85107 -95000 -117898 -113894 -115603 -88537 -76522 -49119 -51509 -19983 -31643
2416c1643J1176j1500p8394l2010Q710K6137M5346j4186J0052J9744n872J1471
$$ -31643 -20467 -31967 -110361 -142371 -133661 -107524 -62178 -76364 -66312 -46568 -52440 -40969
2404d0969m280k3148l7451M7225M82k5447k181n61P594J178J1182m6536N8680
$$ -40969 -45249 -68397 -105848 -58623 -58141 -83588 -85769 -86330 -78736 -77558 -66376 -112912 -54232
2391e4232N5359o1777o632K4132J4543k9131m9390q116J2650J6605M2535n2568
$$ -54232 1127 -60650 -67282 -43150 -28607 -57738 -107128 -115244 -102594 -85989 -43454 -96022
2379i6022O571K2192n121N5704p12l0457J6392l6489l4k3537j1659j950N0498
$$ -96022 -89451 -67259 -72380 -16676 -17388 -47845 -31453 -67942 -67976 -91513 -103172 -105122 -54624
2366e4624K6601L4798j0370m3763K0956K2101j8295n780n4382Q0567M7711p0557
$$ -54624 -28023 6775 -3595 -47358 -26402 -4301 -22596 -28376 -82758 -2191 45520 -25037
2354b5037o629k336M724O6879K3441m0094k3648k0971J3736j2981k7666L3272
$$ -25037 -31666 -34002 -29278 37601 61042 20948 -2700 -23671 -9935 -22916 -50582 -17310
2342a7310L6430L041P5816L079M069p2653j6284K3931q60n2029K7986l608l1054
$$ -17310 19120 22161 97977 101056 105125 32472 16188 40119 39259 -12770 15216 11608 -19446
2329a9446K8758m6099m2653m909M6134L2729K9454m8986n0345L9123m5007K0685
$$ -19446 9312 -36787 -79440 -84349 -38215 -5486 23968 -25018 -75363 -36240 -81247 -60562
2317f0562J3503j2596O7768k6909O376R010j1741N157l4245O0802m961l9155q7
$$ -60562 -47059 -59655 8113 -18796 -12420 -3410 -15151 -9994 -44239 16563 11602 -27553 -27640
2304b7640j0384k8516M5184r662L0752m3539m6276Q2945N8081j6365m8707m0020
$$ -27640 -38024 -66540 -21356 -31018 -266 -43805 -90081 -7136 50945 34580 -14127 -54147
2292e4147n45N9425k7868k7330L11N26l080k9700k3097j9142K4186N5229m929
$$ -54147 -54692 4733 -23135 -50465 -50154 -49628 -52708 -82408 -105505 -124647 -100461 -45232 -50161
2279e0161j9943p196m2158R018Q3345L5469o402j5649Q21M312O994m6550k0941
$$ -50161 -70104 -77300 -119458 -110440 -27095 8374 1972 -13677 -12856 -8544 -1550 -48100 -69041
2266f9041J1087j53L2477K164k2343J8410L3525j1105o3215J7086J9030j940J3385
$$ -69041 -57954 -58107 -25630 -23466 -45809 -27399 6126 -4979 -68194 -51108 -32078 -34018 -20633
2253b0633l1716j0158Q262J1731k6832J4214k1355K1781K2207j7904N0896M380
$$ -20633 -52349 -62507 -54245 -42514 -69346 -55132 -76487 -54706 -32499 -50403 493 4873
2241D873k9599j2231k6001P718M9790j3930r803k328K7418N9574l5862o0822L0043
$$ 4873 -24726 -36957 -62958 -55240 -5450 -19380 -29183 -31511 -4093 55481 19619 -41203 -11160
2228a1160m097k8256J6293K2133N2993q452p6830M5346j5189M7423n506J1479
$$ -11160 -15257 -43513 -27220 -5087 47906 39454 -37376 7970 -7219 40204 34698 46177
2216D6177M5584n6831M49J35m8454P5027P224l2486K9975k6208K1386k160O376
$$ 46177 91761 34930 35379 35514 -12940 62087 69311 36825 66800 40592 61978 59818 66194
2203F6194n7986J262K8473P568K9603K28K6202l7050j9389O6884l2127j7530N300
$$ 66194 8208 9470 37943 45511 75114 75342 101544 64494 45105 111989 79862 62332 67632
2190F7632r133L4194Q985r0047J2364K9765n571L3030K0211m286R673l0394R729
$$ 67632 58499 92693 101678 11631 23995 53760 48189 81219 101430 97144 106817 76423 86152
2177H6152m880K8629M6314Q406M7770m4114m9587O832M5677k5205M632m8145N0725
$$ 86152 81272 109901 156215 164621 212391 168277 118690 125522 171199 145994 150626 102481 153206
2164A53206O093k1632J5029K9350N4042k9797j2740J6197M7613K673j9311L2573
$$ 153206 159299 137667 152696 182046 236088 206291 193551 209748 257361 260034 240723 273296
2152B73296j6665m9451N0567Q4030K0487m5011j2091M2880L0776q137k6683J4106
$$ 273296 256631 207180 257747 341777 362264 317253 305162 348042 378818 370681 343998 358104
2140C58104M7758k7545n285J5243M7658J8956l0517M2873L0457L3951J4781p036
$$ 358104 405862 378317 373032 388275 435933 454889 424372 467245 497702 531653 546434 539398
2128E39398J710Q9752O539J4156R777O277N015L0920P9753j2442l8556K8134J9061
$$ 539398 541108 630860 637399 651555 661332 667609 672624 703544 783297 770855 732299 760433 779494
2115G79494M9539M9751N458J7167L5410M7595K9535N9834O6477N5769P8693O6327
$$ 779494 829033 878784 884242 901409 936819 984414 1013949 1073783 1140260 1196029 1274722 1341049
2103A341049Q862J02487M6917K7960M4886K9126Q0391R8304L4010N7123L2582
$$ 1341049 1349911 1452398 1499315 1527275 1572161 1601287 1681678 1779982 1813992 1871115 1903697
2092A903697R6415P8248J36927J54211K03131K12763K78946K53802J53622J26839
$$ 1903697 2000112 2078360 2215287 2369498 2572629 2785392 3064338 3318140 3471762 3598601
2082C598601K36852L15695L74891M34933O37733Q65155J142476J439021J803624
$$ 3598601 3835453 4151148 4526039 4960972 5598705 6463860 7606336 9045357 10848981
2073A0848981K413172L078578K893690J13458l335933l964455k684943j734725
$$ 10848981 13262153 16340731 19234421 19347879 16011946 12047491 9362548 7627823
2065G627823j188077r32735p05040n92439n00493m12748k49505k26438j71238
$$ 7627823 6439746 5507011 4801971 4209532 3709039 3296291 3046786 2820348 2649110
2056B649110j36174j46403j97620k05628j81662j43941j30079j18483r4747j09168
$$ 2649110 2512936 2366533 2168913 1963285 1781623 1637682 1507603 1389120 1294373 1185205
2046A185205o6749n1717k2307q5818q2536n4345m8646r4583K0022J7658p0770
$$ 1185205 1118456 1066739 1044432 958614 876078 821733 773087 678504 698526 716184 645414
2035F45414j5357m0470N972J924k1454o0758k488J1844j891q2939k1114L2433
$$ 645414 630057 589587 595559 597483 576029 515271 512783 524627 522736 439797 418683 451116
2023D51116l4718K4220l9219k8203j9690l2606K5229K893L0601l1156m7438K9325
$$ 451116 416398 440618 401399 373196 353506 320900 346129 349022 379623 348467 301029 330354
2011C30354j1647l9850M3796j3331o0310L0782k1550o0416n8583J411J360l4502
$$ 330354 318707 278857 322653 309322 249012 279794 258244 197828 139245 140656 142016 107514
1999A07514K3385j3259j1345o257L3586O239M5056j2771k7079M4407l2950p460
$$ 107514 130899 117640 106295 100038 133624 139863 184919 172148 145069 189476 156526 149066
1987A49066M0224j465p9870j3286N3758K2516l4838k8097k6038K0921K433j7806
$$ 149066 189290 187825 107955 94669 148427 170943 136105 108008 81970 102891 105324 87518
1975H7518j2207J5581k1456P333O376J1268K9576n0900k4472l9473n102R646J1012
$$ 87518 75311 90892 69436 76769 83145 94413 123989 73089 48617 9144 4042 13688 24700
1962B4700j975O445k1821k0586k5598M6443L5534o161M6313m9836k2680k6949
$$ 24700 22725 29170 7349 -13237 -38835 7608 43142 36981 83294 33458 10778 -16171
1950a6171k2608k6570J2104O014o600J09032L0690n1270j02130O0423J1435K3345
$$ -16171 -38779 -65349 -53245 -47231 -53831 55201 85891 34621 -67509 -7086 4349 27694
1938B7694O240j3850K7020l7955K0712j4864j455k177k6783j1183Q0863j6120
$$ 27694 33934 20084 47104 9149 29861 14997 13542 11365 -15418 -26601 54262 38142
1926C8142q659j1559J8034j9466k208j4814K1041l3430N492k0277j1178J0979
$$ 38142 29483 17924 35958 16492 14284 -530 20511 -12919 -7427 -27704 -38882 -27903
1914b7903j0602k7965M5249j7349l071J3552Q551k894M143J9499l8879L3919J7230
$$ -27903 -38505 -66470 -21221 -38570 -41641 -28089 -19538 -22432 -18289 1210 -37669 -3750 13480
1901A3480m7748K3932L8002L595M7360o0850L8046Q215k8072k4155J0996J4956
$$ 13480 -34268 -10336 27666 31261 78621 17771 55817 64032 35960 11805 22801 37757
1889C7757k59r427j427m9995K1051M553q0978Q280M0771j6814j6670Q25N0813
$$ 37757 37498 28071 26644 -23351 -2300 2253 -78725 -70445 -29674 -46488 -63158 -62333 -11520
1876a1520J306K9367j711k5411n8347j3676J5195P3575J1629p0574j0270L3372
$$ -11520 -10214 19153 17442 -7969 -66316 -79992 -64797 8778 20407 -50167 -60437 -27065
1864b7065K0224j5175j7948K9658J1436J4428j18k350Q832n9357j6196J1926J8616
$$ -27065 -6841 -22016 -39964 -10306 1130 15558 15440 13090 21922 -37435 -53631 -41705 -23089
1851b3089m9933j452M024l3363M7718m3220K7148Q9039j9951L7219o1583p704
$$ -23089 -73022 -74474 -70450 -103813 -56095 -99315 -72167 16872 -3079 34140 -27443 -35147
1839c5147K6595l4662L4098L6812j8490j8001l1564M71L4606K6576J330m4054
$$ -35147 -8552 -43214 -9116 27696 9206 -8795 -40359 -39888 -5282 21294 22624 -21430
1827b1430k2051l240j9603J0018J2034j61k0912j559Q2503j5046P397j9835j5922
$$ -21430 -43481 -46721 -66324 -56306 -44272 -44433 -65345 -66904 15599 553 7950 -11885 -27807
1814b7807N8857l3947J4775J9555l0059M525k4349M9328K4319o3753k4708L130
$$ -27807 31050 -2897 11878 31433 1374 5899 -18450 30878 55197 -8556 -33264 -30134
1802c0134o366M4994O6423K5990p8459n7008K6863M2188J1499k9604o1621j3211
$$ -30134 -36500 8494 74917 100907 22448 -34560 -7697 34491 45990 16386 -45235 -58446
1790e8446M6946l2722J6806K6J879K0463m5155l9394L2865j8856m174K9019J0980
$$ -58446 -11500 -44222 -27416 -27390 -25511 -5048 -50203 -89597 -56732 -75588 -79762 -50743 -39763
1777c9763j6477M4840k0002l2259j6949J8205L5701P3010l6118k2699L777p0544
$$ -39763 -56240 -11400 -31402 -63661 -80610 -62405 -26704 46306 10188 -12511 -8734 -79278
1765g9278J4857L0553j6525J1225p976K3941L2884P134j5554m2406l4471J4320
$$ -79278 -64421 -33868 -50393 -39168 -47144 -23203 9681 16815 1261 -41145 -75616 -61296
1753f1296N9099J3133j618n7867n87k8142m3750N5010M3505L0082l8206j095L6845
$$ -61296 -2197 10936 9318 -48549 -49136 -77278 -121028 -66018 -22513 7569 -30637 -31732 5113
1740E113k9776j8837l016O5514K3165k1250q3198J1334M2809o496j0179l1828
$$ 5113 -24663 -43500 -46516 18998 42163 20913 -62285 -50951 -8142 -14638 -24817 -56645
1728e6645r06L7213k9177L5033p6416K0754j9776j291P2202k3253Q423j7593J3263
$$ -56645 -57551 -20338 -49515 -14482 -90898 -70144 -89920 -91211 -19009 -42262 -33839 -51432 -38169
1715c8169L7001L7610l2618l6368m7562K5954M0152K3099n3156j3354n4606K9889
$$ -38169 -1168 36442 3824 -32544 -80106 -54152 -14000 9099 -44057 -57411 -112017 -82128
1703h2128R3236J4270o8592R360J6853j6022J22M887K7894n0818j9399J9356l4279
$$ -82128 11108 25378 -43214 -33854 -17001 -33023 -32901 -28014 -120 -50938 -70337 -50981 -85260
1690h5260K3279K6755l0388J8618m322j8876k9047M5202N3641M1282m0917Q436
$$ -85260 -61981 -35226 -65614 -46996 -51318 -70194 -99241 -54039 -398 40884 -33 8403
1678H403m1649J4882j9775l3260K2816j3584o101j6524L3180L0330r061l651o010
$$ 8403 -33246 -18364 -38139 -71399 -48583 -62167 -68268 -84792 -51612 -21282 -30343 -33994 -40004
1665d0004M4721j8314p1419P2604k0320l9711O5600O448l2884n57L007K0637O370
$$ -40004 4717 -13597 -85016 -12412 -32732 -72443 -6843 -395 -33279 -33836 -30829 -10192 -3822
1652c822l4603J3154L959l2960J2302j5438k110J0780M244J8689L499k2545L4669
$$ -3822 -38425 -25271 -21312 -54272 -41970 -57408 -59518 -48738 -44494 -25805 -22306 -44851 -10182
1639a0182k8936K4515K1121q0597j0840j5050M8233O2293l1933L6572m0614k41
$$ -10182 -39118 -14603 6518 -74079 -84919 -99969 -51736 10557 -21376 15196 -25418 -25659
1627b5659J6052O76K1638k7235l4478o2730M3611M4771l7436j9291K1272J5276
$$ -25659 -9607 -8931 12707 -14528 -49006 -111736 -68125 -23354 -60790 -80081 -58809 -43533
1615d3533l028J2501n609j2266r17l8598l9797m716M9909J7115K9727R377k7181
$$ -43533 -46561 -34060 -39669 -51935 -52852 -91450 -131247 -135963 -86054 -68939 -39212 -29835 -57016
1602e7016M5069l2528j1695K0154r410m724K3084P36n7744J6717P2602J3156k4651
$$ -57016 -11947 -44475 -56170 -36016 -45426 -50150 -27066 -26330 -84074 -67357 5245 18401 -6250
1589f250P05P491J550o234K7360p3286O509l1903K6258O4996n5403j7343K358
$$ -6250 -5545 1946 3496 -2738 24622 -48664 -42155 -74058 -47800 17196 -38207 -55550 -53192
1576e3192L7228K2600K8932j7017k5796n7169L145O3287k7141o481j3168J649
$$ -53192 -15964 6636 35568 18551 -7245 -64414 -61269 2018 -25123 -31604 -44772 -43123
$$ [...]
##END NTUPLES=NMR SPECTRUM
##END=
