##TITLE=1H_CA-9148-2
 CDCl3+DMSO
 8 sc, 
 18.5.2023
##JCAMPDX= 6.0         $$ Bruker NMR JCAMP-DX V2.0
##DATA TYPE= NMR SPECTRUM
##DATA CLASS= NTUPLES
##ORIGIN= UXNMR, Bruker Analytische Messtechnik GmbH
##OWNER= root
$$ XWIN-NMR		Version 3.5
$$ Thu May 18 14:16:38 2023 Russian Standard Time (UT+4h)  she@DPX200
##.OBSERVE FREQUENCY= 200.13135
##.OBSERVE NUCLEUS= ^1H
##.ACQUISITION MODE= SIMULTANEOUS
##.ACQUISITION SCHEME= undefined
##.AVERAGES= 8
##.DIGITISER RES= 18
##SPECTROMETER/DATA SYSTEM= spect
##.PULSE SEQUENCE= zg30
##.SOLVENT NAME= CDCl3
##.SHIFT REFERENCE= (INTERNAL, CDCl3, 0, 15.9518)
##AUDIT TRAIL= $$ (NUMBER, WHEN, WHO, WHERE, WHAT)
$$ ##TITLE= Audit trail, XWIN-NMR		Version 3.5
$$ ##JCAMPDX= 5.01
$$ ##ORIGIN= Bruker BioSpin GmbH
$$ ##OWNER= she
$$ F:/spectra/data/she/nmr/H-F/1/pdata/1/auditp.txt
$$ ##AUDIT TRAIL=  $$ (NUMBER, WHEN, WHO, WHERE, WHAT)
(   1,<2023-05-18 14:15:21.79 +0400>,<she>,<DPX200>,
      <created by zg, POWCHK disabled, PULCHK disabled
       configuration hash MD5:
       00 E9 B6 7A A2 85 ED C7 34 08 36 98 17 FE 4E 26
       data hash MD5: 16K
       63 49 6C 22 11 A5 B3 7E 3E 29 C2 E8 DF 2F 29 1A>)
(   2,<2023-05-18 14:15:24.18 +0400>,<she>,<DPX200>,
      <Start of raw data processing
       efp BC_mod = 2 LB = 0.24 FT_mod = 6 PKNL = 1 PHC0 = -19896.22 PHC1 = 9.852721 SI = 16K 
       data hash MD5: 16K
       7B 54 F0 23 1E 8D C6 0A 33 6C F0 2E 6B B6 9B CA>)
(   3,<2023-05-18 14:15:41.82 +0400>,<she>,<DPX200>,
      <pk PHC0 = -5.850935 PHC1 = 2.4 
       data hash MD5: 16K
       7F 12 3B 62 BC 08 48 23 6E 17 38 21 E4 3E 70 CB>)
(   4,<2023-05-18 14:15:45.26 +0400>,<she>,<DPX200>,
      <abs ABSG = 5 
       data hash MD5: 16K
       C8 8A 81 7A C5 FA AF 19 50 F7 11 A9 8C DA 1C 7A>)
$$ ##END=
$$ 
$$ hash MD5
$$ D0 3D 48 78 A3 AD 53 61 12 36 14 68 95 5B 02 6A
##$RELAX= 
##$RELAX= 
##$RELAX= 
##$RELAX= 
##$RELAX= 
##$RELAX= 
$$ Bruker specific parameters
$$ --------------------------
##$DU= <F:/spectra>
##$EXPNO= 1
##$NAME= <H-F>
##$PROCNO= 1
##$TYPE= <nmr>
##$USER= <she>
##$AMP= (0..31)
100 100 100 100 100 100 100 100 100 100 100 100 100 100 100 100 100 100 
100 100 100 100 100 100 100 100 100 100 100 100 100 100 
##$AQSEQ= 0
##$AQ_mod= 1
##$AUNM= <au_zg>
##$AUTOPOS= <>
##$BF1= 200.13
##$BF2= 200.13
##$BF3= 200.13
##$BF4= 200.13
##$BF5= 200.13
##$BF6= 200.13
##$BF7= 200.13
##$BF8= 200.13
##$BYTORDA= 1
##$CFDGTYP= 0
##$CFRGTYP= 5
##$CHEMSTR= <none>
##$CNST= (0..31)
1 1 145 1 1 1 1 1 1 1 1 1 1 1 1 1 1 1 1 1 1 1 1 1 1 1 1 1 1 1 1 1 
##$CPDPRG= <>
##$CPDPRG1= <>
##$CPDPRG2= <>
##$CPDPRG3= <>
##$CPDPRG4= <mlev>
##$CPDPRG5= <mlev>
##$CPDPRG6= <mlev>
##$CPDPRG7= <mlev>
##$CPDPRG8= <mlev>
##$CPDPRGB= <>
##$CPDPRGT= <>
##$D= (0..31)
0 1.2 0 0 0 0 0 0 0 0.06 0 0.03 0 0 0 0 0.0002 0 0 0 0 0 0 0 0 0 0 0 0 
0 0 0 
##$DATE= 1684404921
##$DBL= (0..7)
120 120 120 120 120 120 120 120 
##$DBP= (0..7)
150 150 150 150 150 150 150 150 
##$DBP07= 0
##$DBPNAM0= <>
##$DBPNAM1= <>
##$DBPNAM2= <>
##$DBPNAM3= <>
##$DBPNAM4= <>
$$ [...]
##$SUBNAM3= <"">
##$SUBNAM4= <"">
##$SUBNAM5= <"">
##$SUBNAM6= <"">
##$SUBNAM7= <"">
##$SUBNAM8= <"">
##$SUBNAM9= <"">
##$SW= 18.05172834244
##$SWIBOX= (0..15)
0 0 2 0 0 0 0 0 0 0 0 0 0 0 0 0 
##$SW_h= 3612.71676300578
##$TD= 16384
##$TD0= 1
##$TE= 0
##$TE2= 300
##$TE3= 300
##$TEG= 300
##$TL= (0..7)
0 120 120 120 120 120 120 120 
##$TP= (0..7)
150 150 150 150 150 150 150 150 
##$TP07= 0
##$TPNAME0= <>
##$TPNAME1= <>
##$TPNAME2= <>
##$TPNAME3= <>
##$TPNAME4= <>
##$TPNAME5= <>
##$TPNAME6= <>
##$TPNAME7= <>
##$TPOAL= (0..7)
0.5 0.5 0.5 0.5 0.5 0.5 0.5 0.5 
##$TPOFFS= (0..7)
0 0 0 0 0 0 0 0 
##$TUNHIN= 0
##$TUNHOUT= 0
##$TUNXOUT= 0
##$USERA1= <user>
##$USERA2= <user>
##$USERA3= <user>
##$USERA4= <user>
##$USERA5= <user>
##$V9= 5
##$VALIST= <valist>
##$VCLIST= <CCCCCCCCCCCCCCC>
##$VD= 0
##$VDLIST= <DDDDDDDDDDDDDDD>
##$VPLIST= <PPPPPPPPPPPPPPP>
##$VTLIST= <TTTTTTTTTTTTTTT>
##$WBST= 1024
##$WBSW= 4
##$XGAIN= (0..3)
0 0 0 0 
##$XL= 0
##$YL= 0
##$YMAX_a= 124760
##$YMIN_a= -142399
##$ZGOPTNS= <>
##$ZL1= 120
##$ZL2= 120
##$ZL3= 120
##$ZL4= 120
##$ABSF1= 15.73366
##$ABSF2= -2.31819
##$ABSG= 5
##$ABSL= 3
##$ALPHA= 0
##$AQORDER= 0
##$ASSFAC= 0
##$ASSFACI= 0
##$ASSFACX= 0
##$ASSWID= 0
##$AUNMP= <proc_1d>
##$AZFE= 0.1
##$AZFW= 0.1
##$BCFW= 0
##$BC_mod= 2
##$BYTORDP= 0
##$COROFFS= 0
##$CY= -3
##$DATMOD= 1
##$DC= 0
##$DFILT= <>
##$DTYPP= 0
##$F1P= 0
##$F2P= 0
##$FCOR= 1
##$FTSIZE= 16384
##$FT_mod= 6
##$GAMMA= 0
##$GB= 0
##$INTBC= 1
##$INTSCL= 3.70164e-10
##$ISEN= 128
##$LB= 0.24
##$LEV0= 0
##$LPBIN= 0
##$MAXI= 10000
##$MC2= 0
##$MEAN= 0
##$ME_mod= 0
##$MI= 1.114404
##$NCOEF= 0
##$NC_proc= -8
##$NLEV= 6
##$NOISF1= 3.799351
##$NOISF2= 2.8
##$NSP= 0
##$NTH_PI= 0
##$NZP= 0
##$OFFSET= 15.95183
##$PC= 1
##$PHC0= -19902.07
##$PHC1= 12.25272
##$PH_mod= 1
##$PKNL= yes
##$PPARMOD= 0
##$PSCAL= 0
##$PSIGN= 0
##$REVERSE= no
##$SF= 200.129963918928
##$SI= 16384
##$SIGF1= 3
##$SIGF2= 2
##$SINO= 5.538805
##$SIOLD= 16384
##$SREGLST= <1H.CDCl3>
##$SSB= 0
##$STSI= 16384
##$STSR= 0
##$SW_p= 3612.71676300578
##$SYMM= 0
##$S_DEV= 0
##$TDeff= 16384
##$TDoff= 0
##$TI= <>
##$TILT= no
##$TM1= 0
##$TM2= 0
##$TOPLEV= 0
##$USERP1= <user>
##$USERP2= <user>
##$USERP3= <user>
##$USERP4= <user>
##$USERP5= <user>
##$WDW= 1
##$XDIM= 16384
##$YMAX_p= 433535106
##$YMIN_p= -3022252
$$ End of Bruker specific parameters
$$ ---------------------------------
##NTUPLES= NMR SPECTRUM
##VAR_NAME=  FREQUENCY,     SPECTRUM/REAL,   SPECTRUM/IMAG
##SYMBOL=    X,             R,               I
##VAR_TYPE=  INDEPENDENT,   DEPENDENT,       DEPENDENT
##VAR_FORM=  AFFN,          ASDF,            ASDF
##VAR_DIM=   16384,         16384,           16384
##UNITS=     HZ,            ARBITRARY UNITS, ARBITRARY UNITS
##FACTOR=    0.220516191357247, 1,           1
##FIRST=     3192.43914438488, 0,            0
##LAST=      -420.277618620903, 0,           0
##MIN=       -420.277618620903, -3022252,    0
##MAX=       3192.43914438488, 433535106,    0
$$ Real data points
##PAGE= N=1
##DATA TABLE= (X++(R..R)), XYDATA
$$ [...]
8771 88068601 96876098 106086996 115398948 123420602 129267389 133076467 135347581 137410615
8763 137410615 139946613 141171026 140597245 136586037 129317935 121780228 113588405 106936927
8755 106936927 101600430 96182363 90270511 84002420 76762913 70388557 65701650 61889844
8747 61889844 59306195 56984559 55190374 54069433 53181922 52444317 53059093 53653256 54332848
8738 54332848 55557227 58034441 61220736 64680419 69522259 74912431 81139629 87271100
8730 87271100 92479734 96164006 97249432 96600325 95282262 94248725 92771579 90157807
8722 90157807 85332379 78733152 71825070 65664317 60424716 56061150 52714586 50958282
8714 50958282 49903431 48980793 48717275 48995335 50249449 52450115 55286407 59033848 64282942
8705 64282942 71312859 81000015 92584525 102933032 109300192 107676118 96729667 81767753
8697 81767753 67938054 56995226 49094579 43277152 39182426 35897966 32665616 30542792
8689 30542792 28454806 26903852 25805079 24699127 23457111 22734950 21776492 21145246 20532283
8680 20532283 20131450 19825837 19169575 18832730 18500534 17993189 17813908 17888049 17546690 17608776
8670 17608776 17890429 17359169 17032906 17292220 17337045 17266588 16526099 16291999 16724393 16999262
8660 16999262 17070891 17581863 17799972 17996304 17698697 17982093 17814767 17964339 18437551 18705122
8650 18705122 18988344 19434572 19874412 19862248 20489230 21168400 21571043 22297593 22749053 23197646
8640 23197646 23780985 24564779 25404959 25753802 26320327 27341766 28634898 30008150 31779002
8631 31779002 33214281 34791895 36599992 38441408 40924311 43646982 46478892 49852408
8623 49852408 53897748 59085021 65311743 72800086 80550210 88474607 95865298 101271984
8615 101271984 104536911 105375243 105522708 105470320 104329869 101610292 96301382 88947626 80793064
8606 80793064 73733810 68209156 63451148 60558349 58140999 56154594 55136362 55043580
8598 55043580 55102272 55787169 56751386 58260389 60176406 62474335 65779700 70136542 74788313
8589 74788313 80308519 87071228 94735646 101964425 108477742 114101482 118759637 123385312
8581 123385312 128390719 133624329 136951633 137314644 133974212 129051032 123459212 117656877
8573 117656877 111465650 105459876 97648050 88507184 79419985 71456906 64881876 59464980
8565 59464980 54902826 51475104 48951274 46674159 45194546 44095915 43136787 42726619
8557 42726619 42707175 43209708 44236354 45668007 47502107 49862925 53015458 57322756 61958460
8548 61958460 65950252 68380408 69274570 68667687 67662266 66104807 64247979 61194334
8540 61194334 56906015 51237033 45235077 39392405 34549109 30621703 27836096 24996910
8532 24996910 22763786 21360402 19628587 18480335 17280294 15983644 15202199 14504753
8524 14504753 13420905 12850907 12566998 12041697 11133771 10359763 9947983 10030556 9689682
8515 9689682 9232562 8592254 8698194 8159384 7724177 7354801 7488424 7336815 6948919 6920583
8505 6920583 6540493 5983488 6036349 5661323 5547016 5161428 4966702 4532732 4483845 4723953
8495 4723953 4639080 4461002 4426204 3987572 3928012 3885279 3645356 3382887 3863651 3687348
8485 3687348 3459560 3913321 3551927 3354236 3022320 2890668 2828243 2825289 2645809 2463526
8475 2463526 2156173 2344214 2767282 2753113 2787105 2653182 2550113 2490823 2233696 2310036
8465 2310036 2176140 2308710 2283008 2165564 1995502 1976994 1470710 2022208 2289262 2311554
8455 2311554 2194292 1816854 1885752 2145786 2157252 2341492 1991956 1773904 1824031 1808549
8445 1808549 2080481 1843450 1702165 1657636 1439575 1056066 1125247 1118187 956357 1263133
8435 1263133 1242534 966283 959825 1386871 1317638 1341594 1871492 1494097 1702066 1815981
8425 1815981 1919390 1711694 1210780 1397556 1205366 1159704 1081365 1245643 1338675 933432
8415 933432 891777 1089176 1182209 1184024 1211549 1208223 1304685 1132046 1233947 1327431 1353966
8404 1353966 1193923 1116399 1065750 686167 514853 729235 1117805 1197788 1139583 730386
8394 730386 609731 1165743 1351032 1043760 505310 606810 874680 770138 717697 1090653
8384 1090653 1085002 1011962 837639 1220956 772832 127820 840724 973705 545364 331456
8374 331456 557621 842018 773639 575394 376580 603359 575221 663434 998396 620952
8364 620952 773005 480074 164852 34540 230659 581200 931631 434297 48672 422793
8354 422793 350528 128390 217964 203158 365417 454245 725101 1021570 946174 622101 210649
8343 210649 357176 397063 464649 418110 200215 490696 570274 285976 -166216 199276
8333 199276 262739 600591 732966 514129 344575 470597 521325 448616 509901 -15467
8323 -15467 -177811 -220742 -226946 -269546 -28344 288338 357089 173052 185779 291031 494127
8312 494127 95781 300316 369224 4083 -373649 -75297 -73373 -34740 166664 -98403
8302 -98403 -239738 -22239 25277 -20391 -158456 -120815 -109375 111501 471973 179586 -68318
8291 -68318 -107762 190134 316912 -187141 -419899 -123924 54275 -156865 -44540 -90851
8281 -90851 -360752 -79921 137009 312088 122288 -30930 9208 336540 79267 178112
8271 178112 496184 586990 353991 24574 34710 -156043 -174331 -91028 75749 163616 39250
8260 39250 292290 543423 784105 1023509 602277 604889 421376 309693 109911 353791
8250 353791 932338 578784 560782 779069 992597 608662 488712 458075 515166 618657
8240 618657 307184 443585 527911 408546 57629 189705 329038 484566 609373 504810
8230 504810 346063 277950 395306 549467 830191 43478 469798 557593 372377 676804
8220 676804 1158914 862277 902766 1143988 1306619 1097928 561902 794130 1007902 816105
8210 816105 610580 475347 510971 650260 709132 448838 504181 402260 -202536 -66230
8200 -66230 214229 356888 455728 195950 -43117 162354 176447 -1430118 -3022252 -143440
8190 -143440 542086 705285 436301 3288 42547 283292 154622 -226068 77893 94055
8180 94055 101250 152995 201636 88891 459005 256885 71627 21880 -155979 -318483 -54042
8169 -54042 499214 309057 184214 195625 -92008 66941 188729 690066 68284 -90690
8159 -90690 230802 125880 -36845 -351579 -596717 -429011 -576984 -579752 -53241 240461
8149 240461 85400 238869 184674 243029 48190 158919 314437 204049 101143 244693
8139 244693 339206 547213 293374 -216084 248510 -74345 -331623 -180262 229362 223874
8129 223874 87164 160175 142336 -216867 -564340 -199847 41517 -182692 -226101 -106895
8119 -106895 233068 301909 379117 65617 -193746 -119261 -2691 -283130 -97954 39501
8109 39501 -271753 -451731 -426527 134166 325560 16764 510620 583646 -26995 -107991
8099 -107991 -205169 -447804 -424244 -577124 -495791 -223413 -172459 -66162 484992 361046
8089 361046 425156 626762 298963 514741 145058 -329061 -147759 -92566 -6527 47003
8079 47003 -210625 -404330 -88754 159293 509246 315076 216501 576517 536806 520380
8069 520380 487050 510407 458340 -117310 150501 379579 -261486 94409 -182873 -624768
8059 -624768 -561862 98530 -46085 324469 259125 371644 147423 -62632 -455563 -414840
8049 -414840 78333 -16084 -185675 -897 286487 216663 112364 199845 396610 -32843
8039 -32843 30085 -34356 -10130 435116 -18531 62865 303041 -38804 -268010 -148146 286673
8028 286673 225237 70054 430138 542029 384442 360420 126197 43047 112716 -8009
8018 -8009 265650 152444 -166104 133866 37392 100852 509326 384399 238915 133057
8008 133057 39369 101027 -17589 -46566 -69358 293418 -24136 -11895 196114 357239 87980
7997 87980 -350426 -111087 -129687 -78663 183678 372951 187230 191659 730488 792766 700364
7986 700364 730507 318594 338606 374086 499676 439337 131456 361820 516925 525251 356853
7975 356853 375954 144702 132269 87556 78542 -6266 -174586 7666 134181 356182 240955
7964 240955 367714 721633 548860 731196 440167 341978 196484 318455 316345 157328
7954 157328 73936 334310 263266 177311 509589 328656 144813 635499 617865 600695 679101
7943 679101 304392 153476 257716 653834 511623 377053 -151937 119197 481697 420802
7933 420802 341642 101489 196235 181885 199948 -44875 134617 26058 -194931 -192060 -390396
7922 -390396 -20003 278443 490577 411083 255497 458331 241427 470085 449507 294597
7912 294597 38536 215012 541076 492021 -108784 -56691 344190 524070 649849 574979
7902 574979 63261 102023 771019 742251 756558 773031 699236 387035 372631 431496 401360
7891 401360 374057 235028 294077 384356 594330 269956 65374 362834 34489 475450
7881 475450 782738 927914 829542 633086 521102 379436 320200 812379 1090153 754750
7871 754750 326329 520252 604172 575890 409320 743109 936272 924852 753638 734721
7861 734721 178488 -71595 161235 318950 711777 1088314 659466 711621 635703 598646
7851 598646 577975 623786 907962 817941 671857 582958 278607 542455 832147 1095685
7841 1095685 849404 569439 449958 526974 984697 548222 382073 247315 595715 873466
7831 873466 589008 696657 977020 828864 889854 769118 918315 840306 782726 678539
7821 678539 839535 852062 1113393 905411 811245 1026653 729470 784080 736606 540193
7811 540193 568780 1086055 1370454 1399669 1342550 1252115 1074012 1312689 1349143 903066 723477
7800 723477 622404 1082424 961269 683858 616575 851091 1178021 770383 866589 1269237
7790 1269237 1330390 1314195 1380512 1622415 1309913 1175513 1227667 1516906 1129652 943043
7780 943043 1283613 1331256 1616704 1574076 1353934 1425999 1160558 1025668 1351656 1443224
7770 1443224 1257921 1366059 1077323 974487 1125923 1542211 1287681 1203559 1344544 1218773
7760 1218773 1424331 1389914 1542389 1098714 1222150 1426944 1419593 1145283 859122 1122555
7750 1122555 1154906 1292293 1148759 1185917 1440549 1503943 909057 1071968 1293800 1541831
7740 1541831 1445948 1363769 1299583 1282644 1841437 1742222 1451543 1228820 1335051 1807916
7730 1807916 1421868 1193245 1532938 1497738 1052169 840123 1442933 1852476 1879079 1409703
7720 1409703 1481384 1387100 1655899 1962893 2064551 1625367 1310089 1641784 1924084 2287453
7710 2287453 1920209 1746942 1994395 1861434 1951674 1712018 1754317 1688709 1895304 1848419
7700 1848419 1566902 1972377 1971203 2098660 2040762 1778072 1727338 1840345 1931236 1702828
7690 1702828 1694731 1779602 1835079 2384425 2556072 2745560 2517193 2057452 2333596 2476797
7680 2476797 2450608 1866005 1917229 2134177 2701860 2703723 2587577 2308322 2148234 2603616
7670 2603616 2647351 2639178 2158395 2172136 2435338 2400195 2698798 2555118 2555194 2808296 2628710
7659 2628710 2786548 2586466 2456270 2796521 2690249 2585272 2582989 2514971 2464856 2770406
7649 2770406 2992283 2944021 2904565 2771273 2226789 2273050 2900614 3122755 3078991 3078787 3066659
7638 3066659 2463942 2914000 2877567 2818111 3172507 3209453 2940899 3076682 2750608 2664732
7628 2664732 3579367 3659508 3484113 3318011 3171501 3510904 3517258 3163178 3530017 3736095
7618 3736095 3273625 3172112 3237812 3129631 3379874 3446893 3342424 3197237 3013953 3360624
7608 3360624 3927499 3447438 3622523 3966743 3867773 4040083 4228055 3866481 4070467 3979612
7598 3979612 3890993 3857134 3918137 4069422 3655074 3749597 3842024 4068743 4131945 4293993 4847941
7587 4847941 4732223 4604274 4673040 4594887 4777021 4910507 4709446 4649213 4685211 4674627
7577 4674627 4641267 4545220 4894017 5019534 4936275 5310836 5399779 5130800 5450593 5411159
7567 5411159 5833797 5750634 5567927 5793692 5685200 5414889 5820218 6091274 6021431 5922880
7557 5922880 5683637 5385657 5799588 5919106 6074880 5992853 6387386 6944173 6599310 6795366
7547 6795366 6878603 6642437 7341086 7380987 7390207 7691882 7906102 7545364 7084491 7546598
7537 7546598 7605569 7540848 7517182 7796725 8255745 8503737 7854207 8257528 8286284 8524562
7527 8524562 8641220 8883723 9032921 8658309 9060687 9629779 9338404 9459861 9581385 9558315
7517 9558315 9822755 9998930 9666833 9668433 9988308 9768385 9915173 10323401 10555575 10602823
7507 10602823 10801407 10953843 11003956 11213639 11152033 11739224 11646885 11660600 11912182 11707348
7497 11707348 12022493 12300238 12440849 12369420 12586602 12902961 12942503 13214957 13415590 13762901
7487 13762901 14025284 14368738 14550754 14355453 14483717 14697926 14951272 14970016 15226869 15752107
7477 15752107 15891796 15712651 16350079 16128416 16469717 16576994 16691350 17094212 17382728
7468 17382728 17587262 17931189 18355753 18849368 19131858 19562048 19909028 20098423 20441230
7459 20441230 20736433 21042299 21514509 21796651 22188294 22491960 22688640 23098191 23624342
7450 23624342 24084482 24616336 24547870 25200820 25734475 26107476 26383822 26616100 27683143
7441 27683143 28598957 28968767 29172017 29249758 29375131 29873606 30253558 30832174 31969169
7432 31969169 32907707 33201127 33556914 34052146 34755230 35382940 35966577 36586317 37411440
7423 37411440 38515080 39418321 39880878 40312577 40915731 42227929 43129817 43730752 44433118
7414 44433118 45531639 46211445 47048707 48233739 49332748 50205311 51771879 52664135 53611747
7405 53611747 54711182 55627430 56676396 57829594 58569823 60048891 61509070 62190308 63693222
7396 63693222 65270252 66674439 67949541 69208266 70671595 72323580 74006997 75067152
7388 75067152 77039931 78400686 79820305 81317177 82683386 84547691 86735441 88272204
7380 88272204 90119609 91992537 94138051 96050567 97864509 99855311 101983630 103860195
7372 103860195 106158552 108719309 110690979 112956416 115115492 117588126 119884323 122640262
7364 122640262 124990654 127521179 129885519 132638168 135482189 138705227 141673699 144551048
7356 144551048 147262314 150443557 153602711 156930514 160480431 163965856 168004754 171682539
7348 171682539 175411592 179088603 182834867 186833484 190532246 195149750 199256136 202978951
7340 202978951 207365767 211930465 216732694 221017218 225620966 229916965 233923909 238011088
7332 238011088 241603658 245541550 249228986 252441563 255129500 257503289 258922143 259985927
7324 259985927 261323475 261579374 260542391 259497518 257640055 254966174 252137070 248418588
7316 248418588 244194603 239489875 233783269 227733640 222090698 216210142 209895123 203487329
7308 203487329 196436572 189717329 183301907 177037283 170830589 165021437 159063829 153297448
7300 153297448 147533161 141908738 136429312 131465165 126469345 121814298 117677722 112965572
7292 112965572 108887530 105454055 101606313 97670923 94286025 91095919 87763785 84766021
7284 84766021 82008270 79577629 76932989 74461835 72000224 69323490 66735851 64484361
7276 64484361 62842313 61307142 59452131 57122709 55727363 53925741 52338557 51104596
7268 51104596 49598783 48449823 47065178 45094111 44065429 42925299 41405154 40433591
7260 40433591 39736967 38543872 37826188 36697980 36002242 35132680 33655844 33225845 32268492
7251 32268492 31134189 30495602 29832117 29043033 28488060 27896302 26962800 26833290 26548850
7242 26548850 25805433 25323366 24743616 23729198 23236191 22859692 22285794 21821753 21558667
7233 21558667 21053427 20459980 20138006 19607633 18992453 18907306 18647041 18253277 17965386 17457953
7223 17457953 16889472 16609303 16295406 15633394 15698987 15475565 15257615 15006875 14775716 14450123
7213 14450123 14112669 13936246 13842609 13156272 12935991 12726372 12508216 12197462 11679288 11620379
7203 11620379 11549804 11326727 11194081 11118791 10924252 11131191 11131421 10647975 10313767 10032541
7193 10032541 9822838 9766352 9938584 10048839 9505360 8896779 8597530 8623480 8676778 9025749
7183 9025749 8972362 8880144 8761431 8845795 8474107 8427695 8297560 7971759 8181686 7919552
7173 7919552 7908715 7622221 7571129 7898709 7543492 7064938 7004804 7155652 6834876 6928676
7163 6928676 7022333 6660925 6563908 6236151 6621921 6385012 6272441 6552019 6158077 6402932
7153 6402932 6047205 5726629 6219755 5681513 5037391 5224946 5408775 5931581 5777684 5235812
7143 5235812 5248558 5247903 5044437 4469171 4760374 4892605 4865477 4786077 4685281 4915529 4823304
7132 4823304 4577289 4390291 4452226 4347987 4236688 4235090 4254617 4409128 4216766 4219099 4356994
7121 4356994 4297393 4081421 3930105 3732116 3449009 3612259 3611374 3853761 4083928 3935890
7111 3935890 3550998 3470738 3473915 3766101 3558745 3213078 3175853 3047589 3002445 3166333
7101 3166333 3215638 3418203 3317016 2988154 2867960 2972475 3361323 3293769 3046747 2973164
7091 2973164 2924474 2812108 2828047 2739680 2798330 2852782 2790590 2314718 2021964 2648549 2808352
7080 2808352 2926066 2671122 2369946 2565196 2670754 2369910 2206272 2266089 2192764 2202888
7070 2202888 2088589 2121543 2285616 2313771 1883006 1933066 2103240 2058193 1703427 2088253
7060 2088253 2192061 2240801 2037350 2046177 2335919 2277142 2101744 2085615 1901060 1706468
7050 1706468 1797550 1626267 1478299 1550979 1458212 1388764 1484519 1604477 1349830 1236452
7040 1236452 1504481 1442829 1571742 1738405 1577752 1798240 1576091 1297309 1389663 1696519
7030 1696519 1538585 1159676 1424817 1787121 1635954 1255862 1698841 1999627 1938623 1543540
7020 1543540 1793279 1620547 613126 308251 277882 827533 1651119 1478746 1614194 1180000
7010 1180000 1107283 1463393 1350284 1060446 1317830 1011545 996275 996853 932909 1268611 1059152
6999 1059152 1012069 910538 983026 491000 713403 543292 601473 819424 1153668 1264106
6989 1264106 845719 868413 1217800 1299201 883402 792344 619980 706950 554025 636525
6979 636525 1015712 897464 720338 813706 731351 468076 433624 76824 434814 847935
6969 847935 669142 857360 705938 543978 662402 743988 719725 753203 552977 576891
6959 576891 553858 567041 276887 -126311 127733 301971 710432 820077 1094425 932243
6949 932243 1117664 925690 487234 161816 249656 541773 818325 650475 554275 441078
6939 441078 272917 804102 667796 536575 673809 313479 169759 743797 628693 364502
6929 364502 107388 441707 444620 612571 401261 604549 495956 780025 681486 686546 913903
6918 913903 593932 284725 352454 520800 231664 249777 231798 83928 -84193 81127
6908 81127 396411 461738 556017 547586 584320 540408 715546 481764 124387 422224 777984
6897 777984 665580 631371 476508 208524 735955 354626 381830 745051 630766 182235
6887 182235 128295 449474 283707 217092 32692 161175 163725 406742 328595 422212 403875
6876 403875 151595 153303 283569 393695 365693 494606 -305747 -193378 367018 597675
6866 597675 800305 409837 80891 -99530 -232831 -390887 -758657 -281531 112396 -71774
6856 -71774 149575 522608 528040 505921 485849 307756 291763 375237 183338 191953 83103
6845 83103 1933 -129686 -272557 -101862 235924 286190 145213 172425 8836 -168866
6835 -168866 127548 233423 388477 -152756 -366102 -248290 -124402 139672 406965 614679
6825 614679 768210 413509 223329 -70205 -182519 147502 409270 -43450 60100 18056
6815 18056 10951 146826 252832 -144396 80533 320829 43393 105274 267813 5563
6805 5563 -46561 -128977 78561 -343671 -487100 205669 239735 337271 47786 215454 -12160
6794 -12160 1139 341403 186992 53158 202785 -308620 -516682 -472945 166266 110625
6784 110625 -99902 -479488 -258609 -264539 105579 157156 -139447 34156 -14022 182013
6774 182013 286242 258114 243848 53846 42759 171836 135295 281664 393089 309925 319120
6763 319120 368315 460311 -19369 29054 -113611 -354224 -87747 -21836 4104 -16807 42072
6752 42072 55622 174029 -1867 152417 -139231 -137009 -114106 -203588 -48754 -74136 -103855
6741 -103855 -47489 47839 151485 183076 159567 386148 118181 -69163 -332663 -175220
6731 -175220 -153061 15400 -59935 -48516 -127977 -12156 -188774 -38779 -220483 -412606
6721 -412606 -246728 -770334 -860136 -656407 -258303 -258074 -177530 178639 94703 -11083 -229364
6710 -229364 -199682 -296716 14605 40587 221002 189600 50760 -142251 -15341 105345
6700 105345 58618 413694 332052 263928 -95470 -462740 -433275 -176176 -34598 -13866 -230122
6689 -230122 -92989 -198906 12297 -301794 126588 219833 -103839 -282846 156644 -44249
6679 -44249 115285 -90316 -54567 334772 7726 -224671 -115045 -344852 -226939 -51974
6669 -51974 -108951 -86876 29338 106698 -107917 389905 3641 -365197 96902 169329 -173245
6658 -173245 -198651 -437287 -123841 66252 -431378 -365601 54820 553666 156611 -19484
6648 -19484 181903 15002 -133991 -479456 -294202 -54676 -247730 45499 43573 141237
6638 141237 185673 69213 -89000 236651 408064 101161 123979 106314 264952 247092
6628 247092 -74695 -311384 -246558 -331550 -147379 -595978 -624089 -306989 -429538 -218083
6618 -218083 42918 238304 63467 -317131 -203455 -212291 -4276 29665 99253 183208 10098
6607 10098 -240507 -2856 183706 -412852 -244606 34513 129821 302853 176042 -294322
6597 -294322 -400773 -373505 -460407 -14435 42469 -127576 -146729 -43632 -134710 -111524 251265
6586 251265 -68897 -319310 -210835 -250321 62458 -43967 -382277 -119573 -212379 -59908
6576 -59908 -467170 -653933 -737699 -881473 -643809 -665928 -386534 -504731 -604816 -384317
6566 -384317 -507290 -476848 -491969 -262449 114926 -220461 -42002 -748065 -685924 -175846
6556 -175846 -152433 -97400 -152826 -125576 -237553 -182037 -22467 54359 -165149 -212245 -82928
6545 -82928 -561898 -617573 -621116 -347648 -306062 -434428 -228952 -267330 -359144 -488148 -15506
6534 -15506 199486 -175684 -341513 -551007 -369306 -325251 -388339 -358605 -551342 -93123
6524 -93123 136466 87687 8906 290742 80426 62922 195676 -215873 -455533 -345019
6514 -345019 -105940 -161878 -178877 -114192 -156599 -149299 -346008 -512118 -383384 -156304 210017
6503 210017 37863 160976 13699 -409374 -707046 -500864 -266037 -331018 -254394 -474764
6493 -474764 -551117 -822242 -540316 -363503 -332187 -177347 -217044 -11674 247670 -113547
6483 -113547 -140070 -134389 -170943 -251266 -201166 -133957 66542 -47412 43385 -217101 -39770
6472 -39770 -46522 -235929 167751 22720 -393213 -428768 -266055 -250237 -21219 141626 -177704
6461 -177704 -212369 -108341 -218411 -289236 -606364 -360880 42921 -79098 183141 174358
6451 174358 -234946 -210659 -329715 -151140 -100219 -164051 -254603 84654 282299 188590 203910
6440 203910 -6408 16867 -219065 -172993 -154759 -522845 -198905 -494883 -326262 235233
6430 235233 304632 332982 -2889 -188855 47553 -52717 -125425 123172 271400 6076
6420 6076 102527 102069 -31052 -279678 -158996 -422291 -52819 201927 -94779 -142900 -68110
6409 -68110 -29072 -71288 -397400 -441720 -145719 -167522 -389606 -497984 -629889 -498395 -194842
6398 -194842 51472 -61788 -263444 -306335 -267712 -401041 -406133 95160 298641 476883
6388 476883 136955 -88925 214239 62570 -224019 -168488 -165472 -367866 -388819 -274362
6378 -274362 -519419 -394896 -120009 -188645 -345871 -98814 -278957 -546072 -456563 -315448
6368 -315448 -921333 -420220 64560 191563 -226958 -376191 -191236 -32287 -21548 -304359
6358 -304359 -26601 6262 -282055 114300 -136569 -94731 104040 -316075 12142 -88522
6348 -88522 -86721 75827 -229574 -169234 140928 -82590 -183346 42913 -178341 -452694
6338 -452694 -109918 76347 199120 213597 -137128 -552706 -653393 -879579 -709702 -674834
6328 -674834 -161071 -643181 -551954 -102608 -270651 208287 57657 -140808 -246434 -54399
6318 -54399 -395448 -308610 49476 230352 326996 -38663 -55481 -238494 -729412 -484646
6308 -484646 -357531 -1120812 -797589 -318026 -730099 -409622 -374324 -459538 -491577 -474205
6298 -474205 -117453 -282848 -510264 -62344 -70697 28711 -135065 4345 -63902 -136504 -165663
6287 -165663 -365221 -256524 208404 15338 -113432 -190628 -516089 -584459 11922 91467
6277 91467 -668449 -725879 -559994 -56857 -80486 -94253 377398 -29217 -382997 -543716
6267 -543716 -399967 -94672 -324820 -165255 -949971 -870781 -473704 -304752 -303286 -248625
6257 -248625 -565836 -318347 -273571 -314073 -271972 -379821 -476210 -220607 -30145 -165549
6247 -165549 140619 -66162 -258842 -336250 -654603 -278261 -153880 -145724 -59342 -374775
6237 -374775 -169143 -149044 -79395 -171173 -350706 -130164 -49915 -176242 -127872 -320574 -403570
6226 -403570 167031 73297 112335 -142729 -395366 -383662 -533916 -403996 -377322 -359098 -336781
6215 -336781 -165582 -396332 -195960 31867 398734 614983 1728 -172442 -172843 110930
6205 110930 -46362 -338333 -456779 -345529 -356130 -262780 -53190 -24190 -164986 107411
6195 107411 -234490 -397703 -201046 -298017 -678248 -753234 -299397 -172017 -285196 -264902
6185 -264902 173967 336820 103784 -602110 -303505 -127295 -144870 -177957 -405160 -240750
6175 -240750 -22904 -428628 -477099 -177665 -330641 -205875 128328 51896 31636 -64116
6165 -64116 113581 30633 -342932 -425699 -384736 -276586 -104136 -127364 -128607 -423336 -416918
6154 -416918 -90706 149074 -71012 -196954 -270612 -293044 -317293 -278831 -541610 -539403 7298
6143 7298 -93154 -140077 22797 -185849 -188934 -240523 -113237 -60170 211519 -35041 -796059
6132 -796059 -666399 -589540 -451282 -538005 -168864 -237435 -296501 -200951 -215915 135962 -124423
6121 -124423 -278065 -240873 -159637 -46595 -152932 -40184 -183780 -482834 -185337 -1646
6111 -1646 -351869 236250 146287 -10537 -366390 -689887 -360755 -195263 -106465 242368
6101 242368 110482 -146140 -312216 -414690 -162557 -33830 216625 -353363 -93573 -266387
6091 -266387 -308283 -161944 -214486 -437972 -427502 -239484 169914 161806 -591617 -541247 -196430
6080 -196430 -341029 -329489 -635220 -728444 -354847 -19217 -124306 -32156 -293470 -353383
6070 -353383 -266358 -64277 -4936 176925 -92530 -310678 -521227 -377726 1545 -109659
6060 -109659 106879 169736 210309 129898 377154 -189489 -212059 -451844 -453167 -494410 -76354
6049 -76354 -134353 -344966 -190177 -411456 -824314 -592138 -331353 -406705 -253625 -301824
6039 -301824 -406218 -493189 -510956 -353530 -310306 -258021 -499852 -307391 -382420 -259435 -122833
6028 -122833 -340401 -254866 -96883 -108020 204161 119789 -371248 -553737 -442701 -432229
6018 -432229 -267673 116136 118297 -27949 -24177 72558 -216582 -289431 -215488 -207239 -481452
6007 -481452 -531178 -473827 -378961 56238 -9916 116659 245532 169439 -272536 -413273 -262244
5996 -262244 -2137 249084 494439 277704 -323358 -704062 -641455 -172525 -314610 -262990
5986 -262990 -417814 -334720 -264398 -401507 -178503 -114779 -281366 144615 -178221 -389868
5976 -389868 -549041 -550837 -672090 -611999 -539913 -631113 -498312 -340034 -307482 -200595 102753
5965 102753 -372215 83309 -69476 -129764 147766 67258 96111 -266158 -396863 31125
5955 31125 -10529 -116861 -38238 -37373 212785 388652 465046 -22778 -159616 -21037 -478597
5944 -478597 -55965 -241442 -626424 -52121 210940 94187 315395 269394 -67239 -281609
5934 -281609 -493655 120895 295240 376874 213240 -108208 -456159 -406168 -526412 -436109
5924 -436109 -268677 -230966 93261 328421 643850 74470 20883 67405 12324 -248106
5914 -248106 -611135 -206764 -180213 -304141 -668154 -198027 83469 217229 -67498 -89472
5904 -89472 27216 372322 17037 -332655 -566510 -507883 -293314 -247912 -173618 103052
5894 103052 -402040 -379880 12561 212652 276921 72966 311312 -491170 -419284 -348371
5884 -348371 -109423 -463404 -398088 -181690 -115562 11611 -170158 -326161 -359348 -66450
5874 -66450 194483 301774 -48635 -92961 149443 119022 -193049 -499451 -337544 -215415
5864 -215415 -303515 -640586 -286287 -239310 -94868 -114743 -269066 -162614 51389 -197725
5854 -197725 -282055 -135881 -215841 -168519 -130585 152569 403999 294845 -471986 -346828
5844 -346828 -408186 96243 44310 247322 -240387 -13748 10244 -435807 -334811 -172164
5834 -172164 117973 -196028 92382 1163 230023 132844 93684 -180940 -230064 -260390 -121489
5823 -121489 -92844 -427789 -542389 -388648 67928 -180992 -445709 -130781 17490 194869
5813 194869 273984 -206448 -373029 164999 158750 212348 169326 92916 -246237 -17021 235794
5802 235794 236277 29783 -396032 -237480 -53197 -133219 -407815 -282802 -108559 -222039
5792 -222039 -381966 -470232 -194082 141480 -194317 -460679 -289579 -6275 519492 383189
5782 383189 17739 -362863 -348466 -3763 -247648 -219605 150290 37132 95555 325726
5772 325726 440785 125949 -221298 -133405 124655 16308 76867 -24735 -301307 44535
5762 44535 146650 -348190 -143886 47394 245722 345758 204810 189505 -155958 32081
5752 32081 297346 -145189 -126268 139398 251070 170767 169649 78500 -40269 -157484 -200339
5741 -200339 248499 492068 540257 300152 237629 36839 266551 243576 90587 -73361
5731 -73361 -125016 -94689 -66054 -48050 -365498 -368093 -398881 -398464 -498870 -210694 141310 27182
5719 27182 -162537 -173411 -306019 -314925 177003 -344614 -461356 250247 6796 -417846
5709 -417846 -279115 -302321 -369889 -427033 -228115 167273 239060 -249668 -120617 -169779 -213247
5698 -213247 -329479 116555 209141 -58137 7316 -419431 -166379 353814 -25587 -331872
5688 -331872 -462421 -499452 -479649 -314067 -320027 -407135 -304684 -165858 -339235 -255392 23262
5677 23262 -9596 -210688 -420047 -473281 -405518 -42813 45738 106644 237693 -134625 -543399
5666 -543399 -445504 -313790 -319750 -290189 -476857 -376233 -156684 118274 -132615 -55459 47683
5655 47683 -170328 -202262 -178599 -215134 -120113 118705 80114 96708 -173212 188316 338478
5644 338478 -33541 -114967 35364 71250 -57982 -63655 18718 -113888 -49028 145304 -252184
5633 -252184 -380028 -152114 227029 288574 736197 701480 -151906 -1305 395929 252116
5623 252116 293964 249313 68452 242555 -46514 -50714 -70975 -94542 371043 388133 87062
5612 87062 284660 -6597 201025 39150 125582 235276 165059 69014 42792 -54150 -75765
5601 -75765 -272753 -38376 139444 -190250 4952 82601 289179 102451 -112353 -143443
5591 -143443 -1917 199945 -97576 -228522 -164639 -40090 43191 71558 283955 115967
5581 115967 -179562 -240195 -495271 -100017 -53674 -297387 -377391 -286226 -512777 -400623
5571 -400623 -161232 197984 432766 36772 -187833 -428348 -381158 -26035 -422044 -800200
5561 -800200 -267684 -183715 -180199 -320031 -192016 -179734 -307667 -209948 -18333 -243729 -113684
5550 -113684 -57167 99347 113914 33457 417562 61568 252505 164860 -331676 -232338 -1330
5539 -1330 127494 3435 143776 370493 57776 284345 352537 285766 490391 40563
5529 40563 75461 134105 -210764 -562727 -438607 230850 534407 279394 -77869 -106361
5519 -106361 59404 -13378 275079 280915 133323 -294793 -228224 -20595 -150814 -170158 -123658
5508 -123658 -222052 66336 -3792 -18003 532066 436827 237052 87270 90776 -84845 133240
5497 133240 80445 -208744 70884 480145 -42450 -285561 -192742 -303440 -145443 199351
5487 199351 131593 66836 55761 -96086 -233501 -273332 44544 -49592 -30710 297878 38769
5476 38769 -271221 -34752 -12833 174509 395451 312679 -165612 -66450 156856 -14676
5466 -14676 -28657 107617 182051 306118 -65416 -16601 197862 268088 -121671 -211503 -170743
5455 -170743 -173218 62007 138410 308887 164505 62037 90877 125932 -363675 -298538 -15805
5444 -15805 25772 195509 -26093 7448 110032 -110431 218517 169075 -131744 69022
5434 69022 -280484 -282459 44795 91644 309919 -152891 -330479 -30545 181840 -54219
5424 -54219 -270444 -346241 -362336 125389 15069 -33973 343434 669000 182083 150094 50355
5413 50355 1027 -142353 -352311 217017 753301 475022 417805 -187393 -182480 153193 108011
5402 108011 220423 -141815 788 379260 532646 240846 -40909 -251581 -419020 -257277
5392 -257277 -51516 80737 442894 546717 64423 -132478 22736 332926 200918 250062
5382 250062 444104 348794 578941 147639 93819 398097 756019 406580 -115346 -80083
5372 -80083 42307 -241114 -217093 118128 -141595 443533 348868 132887 794549 134088
5362 134088 197502 45895 150627 -183637 -86754 -245669 -123474 -73923 848 139807
5352 139807 439891 458288 53310 119677 111680 112933 332769 480452 286243 204110 125042
5341 125042 14746 151424 -45710 -40025 88480 205687 185278 -37889 92760 -79036
5331 -79036 -165633 189912 238783 43265 250390 106099 194114 312797 -192234 -234918 -49264
5320 -49264 -105850 -38243 148841 171083 282912 220149 524564 203007 -54187 414916 435738
5309 435738 853279 560559 341377 356741 337476 621816 978609 850890 769672 777043 333479
5298 333479 521859 727394 472641 364267 8507 73395 34430 152622 54904 644419
5288 644419 721948 434011 -213769 -51428 39190 415240 957522 973530 605700 341028
5278 341028 157988 487988 379517 543423 904955 1159795 798693 721940 590539 647898
5268 647898 689367 488850 375797 69889 514620 241323 446434 284923 66124 331340
5258 331340 319291 478039 528487 643011 634893 783332 852042 781799 1181974 1068386 1036216
5247 1036216 949151 1113421 1105812 662664 430141 283943 153059 419772 474961 657494
5237 657494 636399 752828 739449 708463 617328 84343 163317 739888 612770 740738 676241
5226 676241 503517 696195 1077000 1018166 1232556 863267 550827 939968 1298091 1529695
5216 1529695 1277728 1201462 1010315 1013087 791849 609249 826102 912475 962384 621572
5206 621572 729250 638671 869081 807344 469462 274957 30956 -75606 259035 31234
5196 31234 252663 479488 472956 73307 244813 634729 522887 883384 486501 830463
5186 830463 894885 748432 862180 495386 489504 429226 -61486 474857 243613 428745
5176 428745 546952 731947 499180 -38118 467507 610957 470686 487507 814695 355999
5166 355999 417653 725032 504678 587326 615109 515202 300771 586788 435065 104473
5156 104473 249547 382641 666332 754061 732989 794290 326599 766103 470520 432599
5146 432599 372872 410853 932612 712597 536468 410091 69240 274724 591489 457403
5136 457403 536713 487117 162477 139924 9888 -216748 367409 284477 331557 705251 649469
5125 649469 962154 762731 896936 846273 617342 715136 417105 368619 598115 590133 451106
5114 451106 39982 221639 553249 421249 749140 937406 981738 727103 772322 916911
5104 916911 536616 738688 781876 664680 926259 526995 619564 494323 529578 459688
5094 459688 514995 676645 890216 869636 378132 255290 585064 750542 707982 768437
5084 768437 521968 512653 1005143 737608 775731 364373 463842 591745 982135 832040
5074 832040 623489 642760 686162 635091 798856 726863 540453 743538 366808 646733
5064 646733 438816 515675 655004 460046 519000 1043070 902927 325239 740313 1166310
5054 1166310 956091 404624 622062 945179 390612 226218 265077 509818 653677 638768
5044 638768 208415 553630 588296 679486 719597 599800 347474 528182 943389 657876
5034 657876 361945 604495 980918 992015 1076657 866027 1149603 1191764 810243 701220
5024 701220 563566 562965 766403 993854 1080207 1020473 866331 901701 1025369 995644 1163765
5013 1163765 1087354 1056106 735101 659040 1026980 1308538 993710 776437 768825 1216120
5003 1216120 1052555 1019706 1136762 1187597 1166939 995149 1022585 1130764 908511 824813
4993 824813 730333 784795 999280 997121 1196430 710792 817793 781208 1268078 1400919 1491355
4982 1491355 1115639 1124302 1071523 1308408 1370737 1248575 1312104 1477823 1559897 1323134 1236978
4971 1236978 1442346 1451051 1730016 1700026 1372135 1290691 1075597 1274650 1273042 1436241 1511775
4960 1511775 2051303 2332628 2199737 2174664 1430602 1782944 1918728 2044943 2463658 2860043
4950 2860043 2608980 2113536 2248029 2037349 1573809 1635347 1661583 1455077 2523457 2451701
4940 2451701 1969727 2146370 2334492 2320042 2430190 2537290 2508220 2290554 2364663 2894432
4930 2894432 3005184 2423112 2359601 2416200 2658762 2669919 2406054 2573200 2507933 2804531
4920 2804531 2535278 2623265 2240216 2241841 2589193 2165741 1932569 2266617 2410148 2597284
4910 2597284 2506072 2519132 2491570 2371973 2677794 2311724 2587702 2380028 2604395 2258811
4900 2258811 2159747 1864441 1681978 2077295 2315116 2105390 2156869 2357879 2393838 2422232
4890 2422232 2236991 2374962 2509543 2293326 2271528 2357526 2454726 2306595 2045222 1773266
4880 1773266 2047915 1898571 1792241 1649486 2037321 2278845 2383302 2394456 2386730 2675463
4870 2675463 2721561 2419906 2108090 2394996 2641176 2694737 2299884 2121434 2363321 2208251
4860 2208251 2252337 2623743 2381797 2408092 2381798 2526786 2448344 2688662 2488658 2434701
4850 2434701 2617582 2598994 2517803 2592326 2591751 2939525 2911708 2721195 2437060 2361100 2326659
4839 2326659 2862295 3103577 3027953 3148154 3103604 3307762 3231570 3177074 3337114 3579395
4829 3579395 3224274 3275498 3150784 3156768 3351536 3252154 3475420 3426674 3552658 3687957
4819 3687957 3679602 3599545 3559641 3816411 3896113 3804804 3945627 3759071 3555805 3984123 4250798
4808 4250798 4228761 3963478 4085591 4022190 3871574 3711771 4318071 4826978 4628679 4298018
4798 4298018 4635979 4558905 4376783 4650525 4717193 4763895 4597758 4516062 4902999 4953003
4788 4953003 5027418 5399179 5487705 5362909 5850515 6022229 5682261 5841569 5581227 5888892
4778 5888892 6287027 6626854 6673186 6585526 7046370 6666641 6288046 6972159 7184441 7420714
4768 7420714 7669921 7682600 7716545 7665179 7660978 7451825 7628533 8056499 8185411 8315311
4758 8315311 8710781 9002726 9134413 9814746 9906636 9574460 9817131 10073094 10012232 10053584
4748 10053584 10258726 10823627 11082791 11189643 11075625 11732629 11991092 12252804 12620676
4739 12620676 12850719 12805966 13025243 13226587 13974487 14096717 14322686 14856486 15275530 15869981
4729 15869981 15874115 16426467 17125372 17624854 18269556 18386685 18700387 19365084 19869367 20150750
4719 20150750 20727958 21587926 22219925 22688673 22903588 23981057 24767909 25499089 26304164
4710 26304164 27318817 28230276 28448591 28774302 29763269 30386951 31082943 32032209 33185695
4701 33185695 34690213 36087857 36741243 38061563 39596580 41119560 42794470 44899667
4693 44899667 46369765 48331087 50562573 52111142 54786581 57005616 59538934 62286245
4685 62286245 65249860 68264485 71432208 74686365 78582850 82758631 87006427 91970156
4677 91970156 97369530 102663890 108992531 115463782 122177753 128913961 134261203 138924117
4669 138924117 143684250 147513158 150554018 152612440 154084683 155480059 156314197 157525865
4661 157525865 158124977 159786859 161573081 163908523 166292388 169427993 172773030 176943795
4653 176943795 181687180 187079166 192765951 198751137 205095102 212120316 219023920 226173519
4645 226173519 233896389 240986029 246863157 251980481 255177699 256099851 254879696 251581121
4637 251581121 246228909 239508181 232630502 225702709 217781272 210784610 204229374 197928071
4629 197928071 192260361 187659340 183800324 179716969 175848169 172625165 170055157 167567531
4621 167567531 165585275 163522339 161475635 159475258 156451974 152639349 148295065 143301463
4613 143301463 138174960 131955577 125141685 118339241 112135406 105295505 98515894 91765987
4605 91765987 85496768 79924637 75072954 70478143 66288181 62726847 59770796 56498809
4597 56498809 53659110 51077172 48873420 46294050 44627053 43109563 41151565 39027722
4589 39027722 37577249 36635082 35270493 34022538 32519089 31241837 30551265 29633056 28896454
4580 28896454 28350458 27316999 26036009 25427308 24449158 23791308 22960564 22255406 21907900
4571 21907900 21346789 20554050 19907304 19383083 18770684 18608307 17788498 16875648 16278964
4562 16278964 16097189 15691343 15327024 15172405 15160243 14582436 14157190 13526838 13223607 12752352
4552 12752352 12236110 12002691 12054419 11786950 11873344 11709350 11433544 11196034 10927335 10504904
4542 10504904 10109689 10290578 10150200 10115562 9805780 9337574 9279959 9475230 8893443 8759301
4532 8759301 8716416 8338646 8145013 8301873 8122892 7907888 7662490 7356512 7299260 7060951
4522 7060951 6921145 6995071 6893573 7230297 7349145 7107259 6976172 7046852 6812334 6566916
4512 6566916 6095739 6070793 6479075 6210357 6092169 5905628 5663748 5734816 5637606 5540939
4502 5540939 5304548 5479373 6082143 5928667 5344174 5444815 5767652 5874542 5802578 5539014
4492 5539014 4991126 4876602 5217623 5519498 5095799 4697202 4521740 4742645 4920350 4166655
4482 4166655 4650743 4735484 4983350 4955917 4808142 5018681 5069140 5296919 5062448 4751809
4472 4751809 4859903 5201280 4978981 4881671 4884653 4805049 4917627 4798080 4386682 4469820
4462 4469820 4338497 4299126 4483063 4266299 4302078 4661107 4838621 4843299 4567745 4299224
4452 4299224 4539109 4543975 4619198 4679203 4703486 5061502 5290775 5489005 5171306 4757933
4442 4757933 4711664 4675465 5116409 5213121 5059003 5143886 5163997 5105103 4962824 4886432 5000443
4431 5000443 5287347 5402157 5577450 5407277 5590305 5755822 5196116 5496130 5581786 5670347
4421 5670347 5332586 5826131 6141623 6387241 6409164 6087459 5900601 5886112 5749527 6071298
4411 6071298 6189059 6446790 6378995 6409545 6199470 6444496 6639059 6693691 6552495 6738879
4401 6738879 6881857 7112820 7090532 7019473 7247846 7685100 7952905 7961695 7967923 7729240 8116275
4390 8116275 8266733 8185106 8287132 8750127 8891638 9011328 9268587 9297784 9084316 9587949
4380 9587949 9649982 9886450 10172483 10224628 10392483 10411405 10653701 11146249 11430780 11332091
4370 11332091 11551507 11815191 12000492 12054141 12013987 12512988 13008281 13571764 13394110 13995242
4360 13995242 13908667 14098343 14615909 15222723 15554400 15720177 15768076 16403646 16713895 17029972
4350 17029972 17360310 18067778 18307283 18521564 18957062 19632736 19963811 20570022 20800950
4341 20800950 21335315 22091448 22743060 22961641 22804671 23705971 24551839 25421914 26186763
4332 26186763 26805695 27393610 27927869 28564457 29594399 30261146 31309737 32205089 33069977
4323 33069977 34084004 35105946 35960057 36886320 37854184 39085748 40160587 41257094 42500139
4314 42500139 43718264 45394552 47163024 48882457 50943026 52663753 54418918 57010539
4306 57010539 59352879 61721594 64160217 66730237 69494538 72622138 75835091 79397712
4298 79397712 83846014 88294883 92663147 97804634 103255028 108949856 114925388 121076777
4290 121076777 127180335 132578774 138219477 142975166 146953499 150425655 153516460 156343513
4282 156343513 159350796 161870677 164462775 166801135 169058303 171948905 175111851 178362444
4274 178362444 182224308 186496726 191556999 196843373 202864772 208737306 214919650 221902757
4266 221902757 228729036 235745793 242701545 249480147 255710448 260993317 263602003 264149372
4258 264149372 261867797 256676148 249464186 241385116 233067764 224555763 216176906 208350531
4250 208350531 200841436 194104156 187431556 181374517 176564150 172561739 169200299 165553677
4242 165553677 162993988 161249476 158853584 157054947 156001434 155095577 154747011 153941355
4234 153941355 152923089 151174615 149101605 145397681 140381967 134179134 127399767 120094777
4226 120094777 112413285 105425110 98114281 91171240 84832064 79794297 75445792 70560585
4218 70560585 66446479 62941009 59789125 56781537 53932648 51275635 48736544 46309047
4210 46309047 43598691 41571709 40090655 38425859 36640273 34666845 33032000 31651797
4202 31651797 30559108 29201620 27997077 27079375 26221815 25373777 23995429 23235292 22873152
4193 22873152 22191829 21658442 20983555 20162825 19289537 18891467 18607149 18153246 17760089
4184 17760089 17248057 16506575 15950391 15487753 15137136 14888044 14418113 13643315 13391894
4175 13391894 13118187 12997785 12776710 12263809 11743330 11253116 11156355 10738591 10559572 10253747
4165 10253747 10310658 9992692 9369918 9062909 9137670 9095850 8773373 8404318 8133811 7896083
4155 7896083 7691433 7540370 7426407 7493187 7434701 6635623 6514060 6523433 6331595 5892778
4145 5892778 5963542 6121430 6085734 6086107 5893561 5543455 5643206 5459579 5457225 5385772 5466954
4134 5466954 5455268 4883622 4914714 4929002 4833073 5054366 4746013 4610690 4475704 4467931 4564518
4123 4564518 4407549 4214670 4214596 4396602 4303568 4331346 4224656 4327195 4610287 4401570 4044532
4112 4044532 4282452 4078992 3761672 3871321 4002018 3571234 3675692 3337504 3739312 3879655
4102 3879655 3804141 3660946 3302449 3128782 3099494 3336452 3324970 3366802 3230468 3275789
4092 3275789 3446347 3349504 2946849 2887729 2974840 2540625 2523160 2681512 2597792 2434964
4082 2434964 2418841 2758455 2958155 3085048 3111344 3194145 2802213 2740272 2881745 2660481
4072 2660481 2623290 2519828 2587776 2748073 2337561 2281277 2722661 2568999 2307688 2566844
4062 2566844 2635115 2250050 2304179 2843925 2832797 2379081 2401290 2276862 2233289 2762079
4052 2762079 2480851 2145745 2216069 2531543 2163692 2235988 2322775 2130915 2379068 2149394
4042 2149394 1779162 2015777 2140411 2348271 2146967 2225774 2230895 2714795 2784577 2899707
4032 2899707 2688432 2545796 2639230 2215592 2364981 2455220 2366630 2293992 2223666 2121830
4022 2121830 2395528 2512789 2789256 2543338 2504749 2555486 2655940 2533431 2429557 2149783
4012 2149783 2125062 2557783 2886097 3058920 3243655 3179101 3207607 3403531 3569215 3371150
4002 3371150 3815550 3468801 2925618 3129029 3116327 3089946 3371658 3490057 3344613 3458562
3992 3458562 3381899 3368301 3481831 3427571 3595129 3550844 3763446 4045639 4113800 3923558
3982 3923558 3793429 4008816 4474283 3917367 4159071 4328003 4032559 3537978 3739837 4149058
3972 4149058 4211980 4518027 4526982 4371830 4366681 4408016 3986857 4140056 4152640 4138328 4353463
3961 4353463 4467826 4433879 4272034 4480720 4738216 4585405 4689530 4646488 4966206 5183705
3951 5183705 4955112 5020296 4824629 5080351 5817223 5412327 5360533 5387919 5178855 5343835
3941 5343835 5158248 4954745 4861998 5217518 5277122 5220233 5371424 5437582 5173355 4786745
3931 4786745 5009754 4757352 4833590 4974485 5290329 5284444 4997877 5372538 5217440 5200576
3921 5200576 5260275 4992948 5539225 5288248 5451974 5329864 5861136 6144988 5898051 6097966
3911 6097966 6035080 5786291 5382079 5593238 5754653 5404190 5148732 5047225 5566251 5200962
3901 5200962 4788704 4576732 4686703 5192027 4877473 4569186 4432196 4462578 4669520 5024410
3891 5024410 5028378 4953917 4863839 4707666 4899398 4698001 4578704 4951317 4897044 4936996 4828181
3880 4828181 4762557 5180282 5499642 5003402 4994311 5137134 4625123 4578146 4678273 4721323
3870 4721323 4865478 4582485 4616048 4527549 4664862 4719629 5133339 5251531 5070089 4936762
3860 4936762 4983885 4939888 4733567 5079387 5206051 5195464 5307626 5218914 4995240 5425472
3850 5425472 5403359 5220341 5414184 5290543 5191819 5169420 5267755 5429606 5404498 5441128 5612981
3839 5612981 5416607 5515526 5950915 5702761 5740603 5723312 5804039 5921220 6165288 6254740
3829 6254740 6209159 6208011 6312426 6517682 6393897 6763397 6911409 7238470 7207691 7227156
3819 7227156 6891413 6613014 7170940 7159545 6648865 7114467 7412155 7373429 7374419 7413310 7299608
3808 7299608 7333185 7504282 7643636 7999900 7819848 7847793 8427102 8720199 8686224 8546971
3798 8546971 8575495 8523415 8497531 8649836 8578224 9185612 8887931 9066254 9666632 9825779
3788 9825779 9715023 10139961 10168459 10480380 10784478 10706306 11392408 11512779 11592840 11453595
3778 11453595 11568759 11575870 11866409 12356613 12251355 12361421 12943034 13005777 12853655 12760133
3768 12760133 12983722 13515461 13705401 14289444 14892665 15205923 15447634 15750342 15875213
3759 15875213 16310733 16832145 17259436 17638465 18024890 18342297 18408980 19122761 18684500 19136870
3749 19136870 19470446 19758000 20298949 20493161 21249097 21740426 22012673 22786445 23502149
3740 23502149 23831609 24685211 25424187 25689484 26103386 26866633 27471822 28276492 28910956
3731 28910956 29513326 30159588 30928106 31525493 32579422 33550534 34860769 36326992 37298174
3722 37298174 38808133 40314225 41376401 42512637 44306895 45738234 47571493 49587749
3714 49587749 51309463 52922879 54751462 56491093 58133957 60309027 62220953 64424640
3706 64424640 66544998 68295389 70053124 71759524 73492536 75383756 77405668 79853374
3698 79853374 82445385 85214315 87145082 89223329 91620422 93752149 95667902 97308077
3690 97308077 99475578 101635659 103890488 106599278 109845196 113301020 116381320 120012263
3682 120012263 123706426 127500331 132438214 137230815 141886751 147679704 153512485 159122980
3674 159122980 165427435 172486652 179968847 187493180 195166584 202840240 210116230 217436577
3666 217436577 224317467 230765680 236953979 242380912 248192875 253880424 259575709 265429339
3658 265429339 271631662 278905441 286613786 295385157 304905310 315649702 327666963 340777287
3650 340777287 353918186 365581801 374702673 380943744 384084524 384729862 385122002 385954976
3642 385954976 388701996 393366796 400151357 407403990 414423689 421318308 427026348 430858677
3634 430858677 432941144 433535106 432282619 429442210 424907037 418260796 411123648 402812289
3626 402812289 393872931 384099640 375208634 367766637 361779858 357667538 353671532 349703356
3618 349703356 344482801 336619858 325671172 313148364 299842351 286927082 275326176
3611 275326176 265221759 256622666 249172093 242657656 236432582 230070400 224278646 218441820
3603 218441820 212285451 206331739 200405391 193958903 187225460 179833479 171860687 163992288
3595 163992288 156124145 148263657 141428994 134976205 129482783 123935403 118767405 113579444
3587 113579444 108921177 104294982 99652971 95557107 91644342 87888966 84529220 81934894
3579 81934894 79713238 77789384 75834193 73906771 72117583 70789284 69410093 67718044
3571 67718044 66104995 63914007 62404288 60519245 58487942 56667194 54455066 53357860
3563 53357860 51888345 49790051 48137112 46525131 44539732 42602759 40842948 39513431
3555 39513431 37990733 37244171 35807127 34498259 33287066 31970760 30413490 29138440
3547 29138440 27895610 27343222 26396119 24845829 23925991 22748692 22042806 21289172 20752454
3538 20752454 20029507 19224354 18938969 18142120 17616613 17106060 16259750 16020791 15803019
3529 15803019 15535954 15351721 14851227 14270594 13979748 13631177 13399367 13149569 12855916
3520 12855916 12863459 12623317 12243270 11847048 11509300 11013071 10940730 10970863 10641143 10228081
3510 10228081 9895359 9820540 9842305 9480772 9211681 9057676 8817755 8701866 8988256 8531722
3500 8531722 8537188 8882922 8737259 8638610 8413427 8371111 7832651 7688845 7806486 7636661
3490 7636661 7490408 7527526 7355789 7134734 7006305 6698486 6453817 6389146 6209562 6216924
3480 6216924 6100842 6018257 5779392 5705363 5954363 6231860 6496908 6098857 5902561 6168714
3470 6168714 5915416 5748487 5577300 5697617 5446045 5212230 5113082 4612695 4273913 4631053
3460 4631053 4748993 5069564 4927928 4538927 4551473 4833037 4601794 4096650 4521698 4707780
3450 4707780 4197577 3732761 3922563 4350084 3515658 3375351 3689532 3345585 3793324 3658870
3440 3658870 3514613 3480036 3878273 3702556 3541654 3395640 3585564 3429687 3319370 3480402
3430 3480402 3696966 3471263 3492104 3977359 3891731 3625089 3032986 3010148 2985450 3065892
3420 3065892 3612029 3776541 3413637 3465190 3357170 3489207 3653573 3706467 3701591 3199784
3410 3199784 3109678 3592744 3501156 3539883 3749084 3942916 3549179 3283643 3538481 3967343
3400 3967343 4453338 4189861 3805285 3910658 4050440 4130981 3871676 3441050 3512336 3387702
3390 3387702 3391660 3758783 3694709 3657408 3695534 3873858 4379448 4156555 3901519 3828099 3865753
3379 3865753 4240992 4238354 4213867 4153289 3994079 4012038 3959420 4205281 4276366 4122201 3816726
3368 3816726 3647776 3383667 3870506 3772652 3523281 3710133 3605336 3668606 3393162 3147738
3358 3147738 3620195 4389636 3788659 3468292 3427473 3413958 3503196 3489143 3393095 3196253
3348 3196253 3156468 3491458 3554155 3569135 3547837 3270509 2984350 3017495 2724956 2829446
3338 2829446 2942848 3078176 3355922 3275547 3049741 3292496 3038077 2861581 3240272 3364240
3328 3364240 3192279 3114646 2882236 2628099 2946311 2959238 3156849 2803175 3050360 3050208
3318 3050208 2457277 2425015 2481143 2133923 2260416 1878793 1951043 2157756 2492933 2430777
3308 2430777 2149101 1936851 1932454 2371206 2529259 2326375 2034489 1507164 1892686 1997507
3298 1997507 1821248 1396220 1295548 1632874 2079077 2223618 1771245 1968200 1818264 1898497
3288 1898497 1730835 1803620 1426998 1750391 1589801 1503621 1576137 1306062 981601 1118672
3278 1118672 1146979 1057645 1323166 1069983 903714 1067517 1041904 1085932 1153480 952729
3268 952729 609700 806479 1130846 996451 1277349 1077313 1017296 1044471 1051970 1044040 846126
3257 846126 770705 730784 638992 971040 925535 540684 702805 893690 1040982 1084563 932074
3246 932074 684577 753383 799144 930087 813528 574301 718221 545857 402764 923493
3236 923493 999081 876943 1057969 610096 792711 468855 444315 706303 725424 689260
3226 689260 668531 513268 595998 707619 777783 686729 524394 577720 927403 873897 612897
3215 612897 550131 597621 582063 117751 702925 1001738 786240 74331 32842 173829
3205 173829 460511 827027 747571 589568 614389 872171 1147024 1238326 1004177 808477
3195 808477 719647 1234028 1395024 1008080 367286 508870 769168 958081 1063909 849811
3185 849811 757558 709235 386516 487594 656894 537333 716139 792689 795011 509643 578456
3174 578456 516538 334474 47003 16844 95205 434726 636042 736233 180157 255693
3164 255693 367987 484845 47389 133367 464659 540678 534668 465933 367489 150538 -148591
3153 -148591 -16645 346738 284942 269851 218812 524447 325019 543792 273565 345361
3143 345361 201719 173560 363858 625493 191929 -304314 112953 41956 105696 85512
3133 85512 327518 458900 289968 354139 297542 654346 805643 503897 267973 114646
3123 114646 413550 761340 592071 525499 868313 564515 563867 447249 508008 723970 588759
3112 588759 531677 706976 375308 340138 536786 751549 676025 306264 328654 441049
3102 441049 878756 446124 244180 516241 858318 1030226 1214285 1320959 1259794 1124219
3092 1124219 1467333 1215318 868893 768587 739717 708476 747272 782496 983198 1148165
3082 1148165 1251309 1116261 1167646 1284878 1041652 1025877 887276 712496 880213 986959
3072 986959 1183954 1470507 1491202 1404377 1488528 1484134 1300951 1400139 1484433 1683518 1873864
3061 1873864 1962250 1793677 2072334 1908895 1955672 2262608 2041552 2525524 2429180 2379437
3051 2379437 2323566 2309456 2492309 2599839 2787884 2639589 2719390 2618716 2490886 2554721
3041 2554721 2426784 2380163 2484056 2364400 2186602 2442056 2211877 2099049 2233413 2109745
3031 2109745 2064358 1701694 1623339 1703967 1616484 1418839 1433025 1503714 1660684 1415798 1297805
3020 1297805 1411152 1348414 1384318 1265444 1357939 1204007 1487979 1219063 1074747 1210022
3010 1210022 1056913 916528 1466134 2384954 2379962 2420215 2265736 1763721 1988559 2235719
3000 2235719 2101563 2044281 1594312 1458062 1431497 1035103 928675 618893 321535 596278
2990 596278 517170 465168 290510 233704 282738 438941 144638 408453 194143 79709
2980 79709 174304 696423 707003 485641 430570 703559 780042 814735 1251000 1506080 1344421
2969 1344421 1226403 1097355 1123111 989471 798803 497347 482260 987947 565876 405434
2959 405434 256471 332428 291778 701005 893551 424122 331622 509226 236916 161357
2949 161357 100989 -48901 -77959 -82330 -40657 -295637 -379502 -174001 180164 546034 459325
2938 459325 271845 129505 447136 320582 434105 21902 -353671 67784 41061 65009
2928 65009 -219667 -278457 -242873 106753 177974 48523 401084 402898 498097 586901 555347
2917 555347 476110 134475 -222794 205433 254919 125375 267630 231654 385810 455469
2907 455469 125993 -200237 -376449 -117137 -132028 -143596 -238205 32852 318120 470441
2897 470441 40530 65575 58188 -60724 -45749 -44102 -6419 206646 382103 9849 -28399
2886 -28399 -148366 -60126 -229283 -429574 -284800 -441501 -305899 227667 54933 213244
2876 213244 247826 -194005 -527993 -421982 -157234 -155871 -389954 -342411 -639160 -220424
2866 -220424 13722 268084 131487 -121347 -294165 -19548 292188 206897 235927 415770
2856 415770 50934 -605323 -206382 -84137 238366 217078 290363 199258 -71294 331682
2846 331682 108683 -44484 -489524 -620947 -84410 -79205 36595 3885 324941 485889
2836 485889 -61236 -247107 -394253 -244904 9231 342427 273899 98336 325362 374832
2826 374832 260385 -245571 -290560 -320735 -236893 345591 247464 63625 244054 362967
2816 362967 137266 -282094 -275977 -113319 -47511 -130503 -184153 -384932 -207951 -60670 -317231
2805 -317231 81319 311427 -54088 8605 105723 -478826 -241788 365922 -173096 -425176
2795 -425176 -201698 -155097 -45979 413253 364949 6778 -247019 -162818 -86606 286379
2785 286379 199879 -134548 -72737 -93866 81304 109482 -279004 -457124 -183430 58179
2775 58179 536035 41693 5894 183306 -444742 137704 656234 474178 258985 950
2765 950 198806 692215 506309 403427 474020 -37323 -128413 -278914 -157418 127540 -170148
2754 -170148 -125771 184074 325341 255104 -59227 232684 810838 575243 440376 296126
2744 296126 90200 230597 280535 218545 168621 11650 126665 -139926 222416 503423
2734 503423 656201 943744 481507 515307 575393 787305 581889 331302 690532 468856
2724 468856 134642 196265 290489 448329 288189 -110641 5244 150441 318958 422559
2714 422559 390255 723903 550538 306578 334166 296851 634336 612564 852591 1045986
2704 1045986 793550 813731 717892 601956 519466 634962 574233 477171 888962 1052049
2694 1052049 738832 405793 145584 358318 134062 84988 163157 346020 574028 737418
2684 737418 840452 623073 499516 132255 99909 20105 358002 856200 762289 615324
2674 615324 567375 585026 336545 456764 656739 198102 11475 424227 93579 106493
2664 106493 343630 765637 682655 443793 602664 640127 418779 171158 594014 243272
2654 243272 521592 442816 146755 484446 514003 450695 432450 -37701 -29594 -236744 78670
2643 78670 183204 -238919 17469 -126892 -90154 239533 607796 420137 407300 84000
2633 84000 -56316 197157 216768 -542433 -488963 -405490 -510008 -118163 535926 591878 208640
2622 208640 -72245 -202145 -47973 168614 -60345 -5606 6767 -25687 -377129 -128263
2612 -128263 86927 46801 -166963 -915150 -403425 -501922 -599727 -462046 -326812 -74877
2602 -74877 -322556 -125505 284898 67194 -59288 -173714 -215486 -186149 -162691 -274929
2592 -274929 -465027 -454304 -138216 -273675 -175301 -158737 -296008 -152259 209311 -42700
2582 -42700 -357329 218053 121887 173313 115306 -264176 -58621 -132174 -232920 -532786 -126378
2571 -126378 65183 -56599 166339 94272 -107354 67060 471944 350195 109902 75151
2561 75151 108238 -108693 -110706 -23411 -261005 -9317 46197 46062 -17112 -77278 -152413 -260096
2549 -260096 -198470 -339009 -610968 -657473 -231932 -484176 55855 81906 -361416 7657
2539 7657 -124460 7190 -347763 -51027 -65461 -298541 -402189 -196954 -535000 -388179
2529 -388179 55462 213708 -8669 123419 -403153 -262722 -164710 -627078 -116400 -4684
2519 -4684 162816 263164 -210643 -191776 -286710 -636689 -504274 -567055 -506826 -622865 -198475
2508 -198475 -477567 -245504 -512391 -533475 -168270 -275257 -620806 -167990 55474 -200516
2498 -200516 -432412 -460254 -303980 -175934 -310175 -117560 164005 456711 168274 145253
2488 145253 22716 158397 -265316 -211319 -453250 -65840 405139 350139 382801 -211398
2478 -211398 -198544 6245 19545 172856 604097 301521 -387257 -585852 -169629 -10460
2468 -10460 75457 -371833 -69922 163286 322528 -82235 -535944 -576474 -122664 38133
2458 38133 98221 82334 117778 484247 460841 211338 -180903 -246198 -223910 -366889 -90870
2447 -90870 -137522 50288 293320 183105 179835 -238629 -385718 -258975 -518139 -172711
2437 -172711 -235267 -78556 -354044 -612577 -302087 -305218 -5599 89279 -259746 -301435 -143077
2426 -143077 -86027 -10960 -378966 -358336 -297278 -281268 -326952 -37518 -58964 23957 58809
2415 58809 -226436 -236745 138682 271480 -147102 -452919 -727771 -684429 -821447 -156215
2405 -156215 84258 -90431 150835 -177083 -68605 -34101 -33501 -304696 -388765 183096 492181
2394 492181 -644230 -608918 -607636 -560443 -373152 -327842 -320482 -282685 -66324 109575 -504230
2383 -504230 -932852 -697515 -598984 -84870 -10756 -235634 -383034 -302147 -13474 19942
2373 19942 -168610 123073 287679 36151 360878 330529 35679 -159812 34558 21912
2363 21912 -624167 -720667 -369700 -129832 -459862 -35029 286703 399527 37856 -27077
2353 -27077 -147799 -11133 -202630 -292579 -278582 269453 29408 156173 231496 49403
2343 49403 368855 276228 269459 132315 -82367 -335435 -297938 -227374 -295280 -374223 -489415
2332 -489415 -382783 -68627 56205 -6652 -3646 -38291 -130788 -395886 -389227 -248299 -160709
2321 -160709 -384476 -170547 151218 73011 -149542 -119212 -83704 -347668 -228005 -550538
2311 -550538 -573821 -690677 -399742 -204104 -180349 -166109 25394 278843 175053 -179363
2301 -179363 46840 -32670 55650 361108 59612 57783 59700 -78626 -64686 -62119 -182954
2290 -182954 23223 -34052 -24247 -181961 9724 -199871 -413039 -401514 -227445 -177193 -462592
2279 -462592 -750959 -463905 -77033 186747 -47592 -142798 20168 -229748 99300 -124394
2269 -124394 -106141 -251904 -283012 -155634 -358228 -776669 -195886 79393 -303775 56895
2259 56895 71759 -43075 -313586 -164901 114597 -368696 -523824 -680780 -173241 222780
2249 222780 -454387 -692915 -447676 -316821 -328454 -536882 -554334 318312 633808 116975
2239 116975 125486 157958 -2192 -269876 -240893 70299 71838 -149872 156558 208394 139690
2228 139690 4191 122861 227695 -49624 -248056 -225453 -305734 -70566 -65042 181462
2218 181462 40611 -69543 438048 178456 347662 126269 -181372 -235970 -264177 34490
2208 34490 20478 -288075 -429310 -316921 -299992 -34970 331129 465450 56603 89793
2198 89793 -184676 -99686 -133768 -137699 -85261 -63725 156273 13017 -74956 -333058 -473568
2187 -473568 -172860 -155298 -99355 220471 371451 620208 734560 451926 337274 -2610
2177 -2610 266047 906097 528045 562662 785693 619128 455924 437469 221763 523227
2167 523227 173831 237685 628769 793968 501754 363386 236784 -8712 -73415 -63386
2157 -63386 222949 136504 -49276 -16603 -25179 453310 303203 387702 381469 317099 259260
2146 259260 646541 226664 87435 17677 -16405 -24029 292726 397945 72127 185656
2136 185656 316594 468833 277178 264919 234560 16071 -97024 -181154 -283446 -41139
2126 -41139 -420032 -285016 -179520 69059 241552 162543 149547 543766 277536 -256852
2116 -256852 -162586 -321062 -817882 -676775 211833 327162 365602 76778 -1420 42522
2106 42522 -127451 -163387 -46849 69300 523538 666573 492248 684120 402169 435310
2096 435310 418919 246299 -40811 289125 41110 -141708 288798 700179 424074 488176
2086 488176 281564 676335 868904 380677 351626 339994 756644 644782 328611 736167
2076 736167 701849 563438 666863 616083 910313 592171 326523 124864 469763 718515
2066 718515 37091 40162 321009 277880 585025 670574 540988 673067 581818 705850 327303
2055 327303 64233 478483 260046 460999 495685 391286 388578 498459 458405 502377 712585
2044 712585 885410 1035424 776737 1097107 700364 900173 890489 514289 819476 732361
2034 732361 828984 1004660 918414 858974 987190 1035384 1150717 877188 1059317 1096280 1176614
2023 1176614 1290164 1057526 950426 1025064 1641808 1797649 1528555 1317743 1122847 1140309
2013 1140309 1279983 1430057 1268782 1224543 1157057 1320846 1097453 1055348 993145 1188589
2003 1188589 1368337 1669527 1731743 1782685 1647936 1701882 1884663 1756424 1478222 1259123
1993 1259123 1242583 1858436 2107679 1888447 1810128 1747260 1899609 2111104 2400049 2075236
1983 2075236 2062484 2393501 2883151 2799503 2546957 2881483 3251046 3527811 3800591 3516482
1973 3516482 3296927 3039209 3175523 3199222 3638123 3583097 3556329 3752692 3870140 4129587
1963 4129587 5087287 5270203 4930035 4911392 5079293 5216711 5645419 6120117 6600085 6321016
1953 6321016 6163792 6472404 7146977 7204441 7406850 7851670 8292292 8381259 8361455 8868005
1943 8868005 9199583 9185699 9313466 9577769 9946875 10175623 10419815 11078727 11889548 12802665
1933 12802665 12737171 13175235 13751183 14688584 15728664 17010277 18155301 18861152 20091090
1924 20091090 21875795 23441771 25148020 26868401 28079027 29677289 31737027 34198524
1916 34198524 37852273 41786082 47097285 53649542 61491371 71726016 85144111 101375355
1908 101375355 118803439 132802399 137918699 128542192 109479250 89436091 72556544
1901 72556544 59859180 50290159 43164494 37761053 33630520 30631965 28104553 25789064
1893 25789064 23793035 22336262 20860326 19136540 17727910 16485724 15395844 14602505
1885 14602505 13524732 12503636 11799790 11681072 11019436 10352346 9778104 9225401 8897784
1876 8897784 8313930 7746432 7380989 6860464 6900879 6566378 6126749 6014534 5715836 4963651
1866 4963651 4924469 5111245 5133331 4819119 4304443 4374807 3961288 4373055 3757831 3697554
1856 3697554 3633739 3660795 3875500 3292578 3260936 2936399 2560453 2602760 2684620 2841587
1846 2841587 2759474 2730906 2630422 2395642 2122306 2160857 2212252 2313061 1899153 2177465
1836 2177465 2323338 2319667 2066508 1944354 1790905 1945282 2335775 2283712 1961081 1712540
1826 1712540 1398433 1483514 1519728 1499317 1814743 1397866 1120800 1122798 1443376 1057650
1816 1057650 849046 1371789 1072420 1078968 580764 645732 838789 635928 502473 247179
1806 247179 205823 411919 310385 346623 515905 565532 292123 630449 433713 653061
1796 653061 1019737 1158132 577609 349199 949501 818353 773333 288357 484179 458975
1786 458975 327206 -148682 52337 65219 220731 531588 392908 -45259 111061 -73667
1776 -73667 121556 354612 189676 -634 -114518 -438894 157788 476625 151074 191747
1766 191747 250813 94118 598720 490263 339504 545863 728393 490429 424550 51412
1756 51412 -241190 -12504 402296 742440 1040896 817424 240525 179873 242621 284265
1746 284265 -65061 199749 352009 449627 349636 93873 -11682 154278 67755 -2391
1736 -2391 121443 277767 134871 416676 168775 -107712 -169041 98797 -65172 -89850
1726 -89850 481343 307484 -44043 -229575 -434565 -122642 -27373 -200247 -285383 -248198
1716 -248198 -35271 170198 252810 2318 -254092 446834 411238 347542 306229 465477
1706 465477 522992 131153 515227 415628 -355839 -209007 226826 -74790 199162 493276
1696 493276 453993 288011 12240 -59853 85538 207929 278327 293414 232292 169627 67487
1685 67487 178865 -190199 -59354 331724 197915 66722 213430 -83300 195643 83806
1675 83806 -106733 526294 430681 62021 -131402 400722 439368 82265 126800 416726
1665 416726 67085 54136 119703 141817 276573 280363 -148839 -139694 -29355 68105 250604
1654 250604 208993 328624 361284 131906 118515 121575 291839 545982 169242 186170 538382
1643 538382 676199 177516 -11775 410074 766935 831049 623814 816848 768661 543539
1633 543539 183933 291182 349575 185837 117872 198434 285215 141602 439460 152941
1623 152941 -167969 -260145 -146230 40405 71877 62449 11005 -105388 -150294 85045 182241
1612 182241 174748 73918 274325 -165854 -288067 -399053 -622465 -275225 8861 191559
1602 191559 373644 -84605 -201535 37488 -72271 -156040 -164204 -22840 -190355 23154
1592 23154 404049 169573 -17765 -142641 276376 81514 -349184 -132702 -148384 -90999
1582 -90999 52426 97755 240301 125558 300235 277017 459108 357376 -9241 141413
1572 141413 -122886 -154847 357187 -38590 -157728 198125 -292643 121869 27588 317446
1562 317446 395742 254999 250345 321851 399815 515943 290882 -54065 -351608 -116263 91741
1551 91741 -315270 -375482 -102472 76470 -96503 -171890 -110851 -261800 99474 36724 -59984
1540 -59984 -271327 -296580 -87253 170095 430157 -314637 -197895 -91959 -8105 -367967
1530 -367967 -458103 -30422 121681 261936 70552 132202 98965 -152228 -484655 -192396
1520 -192396 225996 169978 19679 -158265 170072 58908 -28364 299864 347829 111011
1510 111011 -417546 -521554 -696945 -463764 -44176 -23555 9904 -276917 254575 259723
1500 259723 12365 -314633 -67441 163501 346524 284754 -20377 15836 -149559 66845
1490 66845 -182842 -328044 -198698 -398698 -533623 -206351 33503 -32777 64675 259617
1480 259617 -121827 51742 -143932 51841 47007 54765 338540 475209 58277 -391300
1470 -391300 -404662 -236700 -33434 179205 244184 65186 -523359 -477159 -92351 294525
1460 294525 -19358 -94693 500585 473046 -171557 -921389 -901907 -554943 -625336 -253699
1450 -253699 39665 92348 407216 254840 315231 244305 -95131 -572085 -521434 -406047
1440 -406047 -140452 178711 341772 -156524 -500077 -117246 -148423 -386914 94413 -20485
1430 -20485 -280343 37593 322953 149627 -165985 -134893 -220229 -431866 -81877 -117630
1420 -117630 98604 249349 110942 -126805 -146269 -221161 -272950 -195585 205578 -58890
1410 -58890 -210926 -101777 248569 304338 329913 407665 -27166 -204228 140053 144142 229727
1399 229727 124721 -106706 48371 -244114 -428102 -499065 -284231 -495138 -435166 154534
1389 154534 249905 -47570 49362 236495 270912 -63411 -168784 -131129 -109280 -101800 -450433
1378 -450433 -362147 -93014 -232556 -185325 -171491 294333 352294 393799 329189 131450 92892
1367 92892 203580 70143 -291561 156995 49120 226635 -6730 -336033 51571 92249
1357 92249 44424 -10722 -161938 -31067 -164758 32323 -75302 166646 529675 250061
1347 250061 246940 -5857 -249312 -95351 -62307 -156805 -556825 -642865 -254182 -359416 -24646
1336 -24646 44105 103619 -158879 -276588 -349830 -253156 141404 132340 320395 200429 -141001
1325 -141001 7135 53007 269318 102763 72086 149733 215891 109648 -176359 336229
1315 336229 344786 57858 98706 -399344 -399809 -472716 -342965 -371458 -239815 -427471 -614014
1304 -614014 -185675 -327247 -164104 -270054 -73380 29549 -115271 -385872 -490101 -440010
1294 -440010 -498227 -694488 -551940 -411565 -648032 -499871 -350211 -253825 -32266 228048
1284 228048 -157317 -351479 -340489 -203691 -29336 39870 -244337 -177451 -82185 -33490 188667
1273 188667 327735 182098 435 -122720 21061 295067 -131014 73712 12768 76804
1263 76804 -188658 -451088 -473998 -234199 -257350 -577787 -480245 146950 -129884 -308705
1253 -308705 165928 -20720 235506 366645 313940 262754 512340 270190 -199287 -336266
1243 -336266 -192199 -182201 42931 259447 346145 128043 211014 196383 -15821 -331576 -285040
1232 -285040 -291223 24345 -50482 -124146 58137 -7424 302707 155247 177156 -27936 -164139
1221 -164139 -208394 -114511 260416 267008 220138 12366 -94813 -152615 -196435 -454032 -274917
1210 -274917 -265982 -317190 -246075 -220396 -159665 60534 159427 -1120 -19603 127851 552439
1199 552439 -117248 -441608 95544 161816 -114657 -128328 -137673 -60326 -89561 90297 197270
1188 197270 301227 103256 191693 187546 86218 311829 94691 8959 -121539 215136
1178 215136 336773 255360 380481 -10259 229804 -12891 -52353 -70011 -142350 -90708 -14842
1167 -14842 205656 -76537 -237986 32256 -147629 104633 38182 -25360 438469 475542
1157 475542 279243 357929 43607 104590 11269 -7776 -20708 46998 -103772 -591361 17412
1146 17412 338689 15139 -60782 99044 388870 2400 -270558 -752767 -208852 -303925
1136 -303925 -282655 -521144 -538691 -157794 -474567 -517370 -454199 -222680 -163781 -150289 -54595
1125 -54595 -40507 -555727 -282289 9813 15012 -5247 -352039 -76517 138225 -121969 -23318
1114 -23318 717050 156976 -170798 -139364 -110572 73712 -35605 203956 -220258 -192933
1104 -192933 -399919 -653210 -223620 204212 124478 352623 -33845 -208703 -140415 -23050
1094 -23050 196537 -20388 -372587 2414 -270082 -378995 -63046 254068 312831 577330
1084 577330 -124802 -350461 -513047 -306253 -596159 -204408 66412 -129018 118851 125068
1074 125068 -32791 -149382 -383866 -231634 -48793 -155949 -60121 -7353 -37972 -144748
1064 -144748 -106227 127377 -71461 -241400 -355856 -214326 -216758 -222676 -375405 -118672 -35553
1053 -35553 58175 -115203 -234553 -233737 -79364 -309580 -301924 -328525 -375286 -240429 404286
1042 404286 88964 -63300 -212161 -201086 154303 -257733 -162183 -98063 121035 282308
1032 282308 317953 136603 379680 258335 476003 161403 -213417 -146431 -237551 -330915
1022 -330915 -505328 -422215 -130168 -531076 -107615 -149651 178681 8970 418626 338133
1012 338133 169333 -211561 219507 171950 -192033 -179482 -322407 -299286 -5589 -172108
1002 -172108 149903 73119 147903 99911 -47561 -100945 -563877 -601659 -395405 102205 489943
991 489943 380869 167862 -172 -301131 -7771 255273 565821 786133 257477 3836
981 3836 -69542 175995 379361 -178061 -148135 -294067 -326441 -87537 291509 521179 379109
970 379109 819262 859704 26536 200418 104021 155341 53838 42796 53124 -314094 -242454
959 -242454 -266958 -146260 -367294 -260577 96152 224050 -83251 -285006 -233203 -122394
949 -122394 -279643 171054 149321 -382923 -180990 111688 -254374 -237150 -516159 -65370
939 -65370 171341 255536 399253 202643 99038 -239993 -295084 -284397 -238600 78196 129181
928 129181 32377 119355 -7059 -244958 -140333 19312 -40603 451563 -71932 -194941
918 -194941 -320427 -20676 -236566 -177310 68877 -41616 -164242 -77594 -303616 -450358
908 -450358 -162022 -118340 178116 144458 -105181 -140343 -72037 244803 197850 -105379 -215527
897 -215527 -226525 -42426 297712 -207 59912 443113 189771 64234 -27032 93467
887 93467 237327 88083 464288 168765 121659 179305 60329 226307 605664 425590
877 425590 336747 97397 -15102 -401363 -406393 -271225 6508 -38663 -510050 -420330 -357260
866 -357260 222171 103819 -196295 -647267 -193512 -35800 140460 316283 184432 -291296
856 -291296 -172253 -460692 -466412 149341 52449 -348045 -358506 -523969 -567797 81098 -42158
845 -42158 -148183 -388422 141912 -147526 -226133 -105455 80841 35633 -111787 -360033
835 -360033 -201986 210089 -82543 -113931 -238836 -45094 -65211 -200143 13864 456946
825 456946 235069 11828 251833 137495 -103772 87008 -37248 -386075 -275895 -145396
815 -145396 57554 -153793 -188960 -235409 -278365 -545525 -98763 -39360 -32020 186322 310321
804 310321 1579 -122586 -230124 162771 440876 338830 520837 23297 -604927 -860035
794 -860035 -319711 -280858 -167758 -421884 -532511 -20364 40576 -198498 -233810 271339
784 271339 389800 14710 -136468 -279546 81490 83035 -15652 -115863 -122550 -357063 -141649
773 -141649 -69718 23959 236801 -14493 211622 360094 58496 135629 -145696 -123197 -1394
762 -1394 40134 -273656 -411405 -535495 -286665 -104989 73465 -153420 325373 273264 371549
751 371549 193831 340119 242073 -95523 339054 486737 -81859 -111960 -476439 -436664
741 -436664 -268185 16493 213351 17378 -144429 -209563 177376 141041 -58000 8407
731 8407 105940 -2219 -138193 -304588 -221069 -112145 285777 176037 143727 -77031 -30620
720 -30620 2360 204892 268782 129270 -232565 82644 -95233 -206057 98432 414823
710 414823 90959 496289 389326 92421 142760 230256 468992 448588 405880 327539 328831
699 328831 -206157 -660701 -221227 -20090 -271825 -541655 -307145 -419181 -258283 -11572
689 -11572 -222565 299084 269219 51838 209520 367120 227632 -48467 -170362 42245
679 42245 -153769 -268356 -220647 -301501 64104 133474 16653 -133350 -150466 -551311 -570307
668 -570307 -313409 -19723 278192 -191172 -362102 159613 45938 125497 19932 -268299
658 -268299 -48949 302851 35940 -92564 216536 347341 899082 324914 58002 -136128
648 -136128 -466641 -455191 38890 112259 42562 -147992 -181173 -59067 -369497 -54912 -125426
637 -125426 -304158 34836 365685 396349 323528 130651 169219 -193402 191903 310097
627 310097 168829 232636 105522 118731 275362 63603 78354 -172616 -462161 -310782
617 -310782 -415730 168336 249913 -149724 65312 -39682 -39311 52627 71201 134726 341182
606 341182 104587 -143892 -757442 -732786 -681330 -248801 107545 -162494 -306012 -400140
596 -400140 -329718 -220562 106218 354611 -56239 -277006 264741 215829 -100931 70768
586 70768 268294 440466 298762 -132294 71998 -291584 -610289 -421231 -249154 12283
576 12283 175634 6491 -165191 -195727 -6451 19609 -45296 -208425 -99226 -294697 -254820
565 -254820 64415 9404 -157698 -19736 -226539 -69435 -164112 -208448 -290137 -296800 -81122
554 -81122 430772 610158 258710 -108915 -83858 81160 225479 -249280 -534563 -222630
544 -222630 139768 196877 334201 71518 38302 -5850 62221 477270 216277 37518 90877
533 90877 -234295 192473 633076 732070 258308 242013 157134 246824 34301 -503331 -4610
522 -4610 245435 506054 267826 128059 70286 191250 163734 63147 158893 -139501 -178066
511 -178066 -153776 -126773 -471849 -266916 -218464 -439593 -175658 41508 252234 381944
501 381944 398600 -78452 -94269 1623 33643 52914 -44276 75629 92796 193069 45293
490 45293 -15153 154270 61153 30778 -135776 -96342 -143964 -232544 -174210 122856 -311543
479 -311543 86925 411033 277299 298712 132723 -283211 56604 -6013 66915 555582
469 555582 421159 294202 44278 -233014 -161820 26536 400869 200346 27484 160700
459 160700 97035 158482 366491 169199 199707 -69436 118213 -5709 -53968 -208778 -30417
448 -30417 154901 32355 95590 2465 -251832 -554036 -75602 -30669 106125 -40550 -146886
437 -146886 -258323 71509 259418 232564 182775 -190477 -16803 -220258 -64179 -78106
427 -78106 -337318 -342649 -6268 -99180 -390372 -419501 -308609 -237597 -150357 178446 105062
416 105062 47462 -129357 -234069 65798 496922 100350 -95576 167116 -34524 155884
406 155884 284001 -52478 -42395 271521 157469 -28855 -381309 -159956 -182016 -382707
396 -382707 54887 -167367 -139124 -399506 115904 170896 -73936 -121584 -339985 -145275
386 -145275 -220571 -332977 -178114 -93728 -1283 -29312 25086 -141953 -272982 -355406 -19629
375 -19629 470411 221361 -313591 -238278 -302474 -405439 -348870 5801 -279677 -253443 120418
364 120418 559207 315680 187044 -85113 29960 194873 140666 266087 499633 -108617
354 -108617 -276113 -74741 -476899 -241174 -563426 -477504 -165632 -81418 -181184 -55957
344 -55957 -522086 -716570 -86770 165694 160801 477534 178084 233280 244591 112140 -278154
333 -278154 51686 125047 177632 271836 -145729 -647901 -410114 -179015 -349686 -86459
323 -86459 -226428 -20354 83539 76917 214085 245397 505275 447161 224473 58141 65071
312 65071 76323 -92100 -175057 -116276 -171048 69918 -187423 -304653 -181139 -132487 -262684
301 -262684 -70814 4840 -652941 -723730 -531817 6276 210769 -69093 -121090 202711
291 202711 213143 67307 119421 26175 102387 257414 18071 -354494 -326542 -20233 188762
280 188762 228042 230949 -180878 -295753 -69499 -548002 -288787 -84426 -222066 -194113 -338545
269 -338545 -389524 -132241 46211 -294947 -528347 -361214 45201 112155 65111 170482
259 170482 -47447 -234080 -373618 -218502 -325874 127101 403651 402500 205262 246094
249 246094 124656 146833 274471 249144 469306 282548 -139482 12713 659254 160927
239 160927 -216649 -230853 -88872 162116 457193 541835 140203 -20017 100709 -22928
229 -22928 -14883 -192945 -377189 -74480 107687 16117 -131296 -82342 -289256 -494390 -425553
218 -425553 -89400 -394705 -521939 -188341 -296635 -403187 59283 55356 -370136 -266999
208 -266999 -11917 -134303 -172984 9038 36335 -48093 -443761 -336955 -259373 -211775 -233125
197 -233125 44574 98112 206132 518517 614186 -76339 -395663 -40137 -243837 -7631
187 -7631 196503 237179 401049 570746 170212 -154853 90693 24308 113858 -174101 -54880
176 -54880 14082 -177437 -120578 594 219959 44311 -55184 239304 171135 -28292 -382036
165 -382036 -339814 197037 679741 752069 292012 -9860 70259 -51791 -12435 69973 -154876
154 -154876 -337068 1543 -115419 -288929 -420744 -592872 -519056 -281975 307059 -278268
144 -278268 -253123 -7329 256392 350959 109236 -255447 -302732 -116545 46234 171783
134 171783 -50844 -22862 -265908 -203546 -167728 -329180 -206863 -20098 -26246 -19810 -77251
123 -77251 -58557 238334 70525 -231791 -36582 -89096 -201543 -117842 -39513 -97012 -44323
112 -44323 -32867 -155647 -103953 -23628 -11306 -145391 -60878 205142 85466 92162 87425 -98168
100 -98168 -325221 -9081 -50174 -366301 299387 416653 171655 109078 126085 -87811 -254512
89 -254512 -461153 -230236 -71633 90035 95625 3895 -132248 -122676 2804 -219455 -10583
78 -10583 190739 53707 -112074 22456 121878 -117893 -340970 -207244 2525 90957 174655
67 174655 186010 97258 34123 -24814 -149607 -1752 65110 113986 -17880 44575 246607
56 246607 94001 14654 122510 317588 109563 -218897 -184112 -103593 -301769 -188837 -7216
45 -7216 -28749 182737 -265122 -181502 165271 79739 -28744 -168467 85313 268161 -144152
34 -144152 -343504 -237300 -202256 -32699 242435 317130 12280 96071 131176 260377 66939
23 66939 9663 -97950 -141672 -25572 43525 7178 314168 113599 -280445 -206446 -297094
12 -297094 -82290 138108 -127266 -319014 -106585 -29636 -95834 -169155 60823 -175333 -27025
1 -27025 228268
0 228268
$$ Imaginary data points
##PAGE= N=2
##DATA TABLE= (X++(I..I)), XYDATA
16383 -2201023 -2273743 -1947019 -1665224 -1592331 -1456267 -1709217 -1631519 -1577519 -1877410 -1905547
16373 -1905547 -1815676 -1758900 -1487024 -1678379 -1748206 -1636674 -1784592 -1789563 -1350329 -1427320
16363 -1427320 -1035330 -1163859 -1445191 -1028102 -923397 -951213 -1040839 -601794 -718375 -961385
16353 -961385 -932166 -834319 -909053 -809588 -809295 -830346 -765309 -493949 -317623 -191165 -162170
16342 -162170 -191902 -222974 -290245 -259650 -182516 -229331 -247923 -125986 -60007 -208802 3790
16331 3790 254263 570994 515635 610458 615015 170207 102235 301301 467552 597270 684664
16320 684664 591240 683120 593160 459525 667329 739921 985987 695182 577114 413178
16310 413178 433589 937239 1155127 849781 932631 865536 799451 921959 917266 1174348 1100754
16299 1100754 1268207 1560129 1196397 1096301 1520173 1647395 1695877 1448420 1738678 1988722
16289 1988722 1951997 1786148 2000182 1715273 1730371 1836911 1759482 1963716 1924214 1929884
16279 1929884 1837309 2047594 2153622 2050916 2106583 2377954 2247479 2088815 2206836 2371386
16269 2371386 2451745 2616144 2050803 1978610 2650233 2666428 2633612 2728939 2571862 2212343
16259 2212343 2092914 2274339 2446937 2635317 2721687 2962266 2389447 1994895 2537102 2817851
16249 2817851 3091430 2742360 2965007 3152530 2908374 2866293 2840014 3094229 2850845 2828347
16239 2828347 3016456 2795434 2814679 2997254 3132058 2899612 3002965 2867061 3127806 2848922
16229 2848922 3231271 3327478 3057789 2906397 2941558 2987960 3514035 3658114 3493989 3098987
16219 3098987 3305834 3057391 3143821 3305011 3159325 3386687 3554415 3679853 3341966 3551223
16209 3551223 3662811 3274936 3265300 3232617 3360758 3685101 3543020 3551613 3412099 3757356
16199 3757356 3979138 4205786 4255464 3965423 3803764 3639009 3653249 3852438 3954065 4069797
16189 4069797 3953314 3522614 3449271 3940120 4125537 4108375 4078023 4258930 4035158 3677648
16179 3677648 3785591 4200833 4107355 3879818 3913868 3978120 3823058 3836851 3849348 3588948
16169 3588948 3995913 4199274 4071218 4014748 3727302 3888787 4176864 4350878 4267715 4241254
16159 4241254 4154889 3942434 4018563 4219332 4164205 4101198 4453076 4713732 4382370 4498514
16149 4498514 4547749 4910692 4385923 4252694 4084051 4678722 4691855 4576079 4199005 4208300
16139 4208300 4471031 4435536 4388852 4090141 4474720 4595863 4344377 4561327 4722063 4637029
16129 4637029 4429333 4338046 4572917 4648353 4562080 4770950 4671418 4404529 4083855 4328872
16119 4328872 4333683 4384468 4389424 4725645 4950639 4572079 4455173 4288594 4654657 4739559
16109 4739559 4710506 4900199 4822241 4167118 4189448 4385885 4616354 4324523 4655427 4544552
16099 4544552 4807029 4649422 4572101 4375088 4331210 4542828 4577266 4484838 4735726 4852227
16089 4852227 4935365 4815145 4811113 4914052 4930314 5093435 4753165 4651470 5060642 4861418
16079 4861418 4722733 4589424 4405045 4703696 4894738 4195201 4012215 4763321 4429283
16070 4429283 4490846 4479897 4430722 4715587 4953166 5017962 4971183 4753768 4277664 4486181
16060 4486181 5040796 5058157 4724700 4979191 4681183 4578867 4229721 4278465 4595888 4785930
16050 4785930 4559811 4294663 4562672 4541095 4741593 4883897 4819071 4687721 4999058 4897935
16040 4897935 4675837 4575287 4381958 4534750 4928593 4529280 4429035 4413416 4747415 4871213
16030 4871213 4929818 4740877 4646534 4505499 4534601 4275890 4843691 5005452 4911325 4922619
16020 4922619 5012621 5048449 4945710 4948600 4666725 5170687 4391943 4914235 5065148 4533126
16010 4533126 4555191 4853079 4424070 4446463 4788868 4724869 5032208 4942473 4781218 4891308
16000 4891308 5142474 4756482 4734077 4808423 4850464 4538326 4442224 4757252 4664735 4548990
15990 4548990 4820184 5140496 4890995 4911863 4707996 4197962 4533915 4866800 4576436 4792569
15980 4792569 4716606 4584327 4834175 4998600 4815363 4934221 4659928 4716786 4808545 4672778
15970 4672778 4746195 4649633 4672252 4760225 4909474 4942595 4620030 4816331 5277907 5120643
15960 5120643 5043032 5014344 5094957 5278459 5192231 4906918 4860520 5060309 4820431 4698894
15950 4698894 4301854 4214878 4382031 4666568 4775616 4870279 4969302 5309051 5008111 4761457
15940 4761457 5207522 4777296 4766979 4754186 4628619 4694752 4599944 4569591 4675590 4405134
15930 4405134 4061659 4256691 4408674 4526570 4685325 4415225 4946118 4937758 4622446 4303556
15920 4303556 4167427 4481531 5060505 4855076 4501943 4383232 4281863 4481778 4673174
15911 4673174 4903456 4938220 4456157 4441942 4547273 4564622 4506422 4707927 4616376 4342763
15901 4342763 4512146 4742880 4868489 4928245 4977916 5264412 4925740 5018333 4697095 4698479
15891 4698479 4770061 4917912 5001435 4850176 4685917 4761648 4743466 4799399 4645943 5046821
15881 5046821 4748410 4665669 4786847 4461560 4591769 4719910 4975694 4720863 5002795 5213932
15871 5213932 5187005 4771183 4821743 5112096 4810324 4566711 4799639 5192496 5142528 4608734
15861 4608734 4645839 4897122 5145925 4947560 4332803 4428379 4844986 4737197 4586695 4572478
15851 4572478 4967432 4927137 4821010 4586293 4625539 4802903 4676816 4633385 4856226 4791221
15841 4791221 4769189 4848961 4822216 5008224 4899123 4788903 4875107 5108172 5151060 4539213
15831 4539213 4788786 4656983 4624588 4786352 4996988 5271674 5124137 4839858 5061889 5165178
15821 5165178 4816693 4661221 4728964 5050879 5065870 5095414 5032642 5051531 4893097 5134599
15811 5134599 5025645 4711435 5177023 5160977 5165035 5001205 4757538 4716497 4902235 4824945
15801 4824945 5103801 4807832 5032514 5081015 4902742 5028382 5024887 4763522 4863814 4873327
15791 4873327 4702869 4815568 4956667 4893288 5084263 4951489 4645718 4609643 4765561 4698474
15781 4698474 4546421 4675812 4624828 4598702 4523128 4358206 4353473 4062345 4571319 4682939
15771 4682939 4782139 4840778 4719067 4417574 4412115 4493324 4240663 4883387 4962848 5084763
15761 5084763 5253292 5129910 5024797 5003813 5031582 5077987 4929586 4943180 4962781 5038844
15751 5038844 5038208 4818554 4875168 5152099 5021318 5058287 5019899 5192071 5233135 5005877 4727727
15740 4727727 4842810 4704617 4679078 4826915 5206318 5239808 4848374 4725435 5002601 4908013
15730 4908013 5169617 5041251 5018811 4721212 4905284 4775978 4774926 4549375 4265215 4427135
15720 4427135 4693924 5325804 4913725 4683781 5066252 5102046 4966225 4734292 4737139 4744310
15710 4744310 4792206 4798252 5365121 5015294 4512027 4962976 5280417 5414318 5239155 4957045
15700 4957045 4841246 5119237 4985777 4482026 4213228 5121677 5199990 4904666 4667780 4568035
15690 4568035 5073704 5000843 5241759 5005462 5022423 4992727 4808470 4758427 4618335 4569509
15680 4569509 4211892 4852447 4893329 4778888 4738017 4825819 4960970 4748694 5311772 5162530
15670 5162530 4980610 4846163 4795184 4605063 4890412 5081214 5151870 5138970 5149827 4859455
15660 4859455 4690450 4629838 4526076 4639021 5102893 5032865 5167484 5266630 5099558 5134504
15650 5134504 4972386 5102793 4576800 4807875 4939279 5169912 4749176 4937314 5173421
15641 5173421 5094272 5131000 5180760 5383154 5248560 5011991 5182355 5176779 5172189 5179287 5144988
15630 5144988 5302312 5216097 5412031 5223827 4682388 4619823 4932368 5005605 4888546 4706252
15620 4706252 4844170 5201269 4896471 4755567 4636753 4832038 5036452 4659551 4789455
15611 4789455 4701069 4948383 5206929 4724169 5110684 5250407 5225809 5229967 5240433 5271273
15601 5271273 5139860 5089515 5056555 5026153 5031748 4986313 4996320 4808443 5136999 5180255 4984630
15590 4984630 4874700 4846449 5014437 5015728 4967271 4946662 4639051 5055453 4949720 4781102
15580 4781102 4849123 4926790 4489792 4686427 4921006 5035001 4850810 5217338 5254988 4833446
15570 4833446 5012294 5051756 4849146 5118558 5385036 5363098 4937117 5056910 5419896 5163741
15560 5163741 5438102 5317321 4836291 4782870 5086195 5095827 5095575 5325386 5403138 4578695 4628326
15549 4628326 4813969 4335240 4600227 5287555 5203545 5018075 4786689 5423000 5245889 5130347
15539 5130347 5355927 5262109 5333711 5167885 4817717 4926419 4902352 4846714 4991124 4633742
15529 4633742 4431840 4463800 4466778 4591298 4240035 4506545 4527081 4613072 5122416 5264712
15519 5264712 5075934 4841783 5390511 5379651 4997086 4748321 4504097 4758685 4913315 5036188
15509 5036188 5012080 4965591 4844157 5114248 5274856 5171801 5031152 4790109 4866851 4942509
15499 4942509 4954451 5363580 4756306 4806388 5067913 4581029 4151440 4691872 5124082 5116657
15489 5116657 5012139 5190876 5063773 4732033 4892434 5614195 5399348 5054476 5003981 4955890
15479 4955890 4982477 4861389 4587990 4251636 4511416 4787524 5005763 4859353 5223414 5064090
15469 5064090 5185366 5111433 4936852 4904208 4886909 5024552 5126301 5198611 5235349 5459278
15459 5459278 5488722 5451762 5168212 5121629 4745706 5207336 5320578 5426014 5591863 5235409
15449 5235409 4953148 4245689 4555787 5076828 5281945 5206714 4724569 4579486 5088066 5168550
15439 5168550 5015538 5470353 5581597 5403227 5449392 5045443 5424870 5413424 5507598 5098927
15429 5098927 5099195 4993937 4896239 5199164 5252703 5264338 4867137 4889283 5237902 4951199 4839306
15418 4839306 4784110 4973976 4935255 4943332 5132205 5037439 4916866 4763383 4790853 5139315
15408 5139315 5395429 4787315 4542560 4718955 4832706 4853897 4442940 4835495 4754405 4706645
15398 4706645 4855285 4797090 5145186 5138691 5166958 5369661 5268494 5137333 5426434 5230300
15388 5230300 5056589 4847118 4678729 4415450 4498696 4587325 4964320 5156561 4764135 5059498
15378 5059498 5121982 4880273 5086299 5155972 4893994 4685223 4417102 4928960 5376433 5484574
15368 5484574 5372072 5094159 5284348 5185706 5005682 5340738 5223908 5129170 5044010 5155475
15358 5155475 5196111 4753654 4875182 4867773 4729267 4892934 5040110 5013029 5199567 5326856
15348 5326856 4958587 5068019 5199109 4780296 4925803 5229575 5069994 5177730 5113463 4794265
15338 4794265 4931152 4918214 4933462 4932328 5126166 4955681 5237713 5419455 5018718 5025792
15328 5025792 4982080 5482708 5393230 5111331 5020546 5203699 5413480 5256365 4901049 4660837
15318 4660837 4838738 4606172 4635793 4608580 4689353 5203640 5493525 5244001 4934403 4604986
15308 4604986 5016770 5028410 5330427 5254860 5056224 5228675 4934452 4805232 5004824 5173136
15298 5173136 5210964 5221000 4926156 4640278 4620590 5140820 5250459 5442289 5501348 5469829
15288 5469829 5465935 5587006 5566845 5410312 5225868 5433218 5411232 5191255 5131829 5129562 5569475
15277 5569475 5582466 5381786 5336730 5545796 5074120 5232851 5257567 4716525 4980590 5337314
15267 5337314 4985276 4880535 5236957 5277348 5303002 5421030 5308651 5400513 5143096 4749501
15257 4749501 4952182 5061397 5477558 5296970 4997133 5088182 5014802 5061822 4960195 4620786
15247 4620786 4361644 4594884 4597461 4575941 5017566 5075188 4974983 5004169 4737818 5105659
15237 5105659 5383498 5228826 5126867 5114582 5284950 5268199 4861572 5092048 5352760 5305005
15227 5305005 5329889 5346081 5277550 5302242 5306723 5219251 5098897 5093011 5240074 5254297 5640824
15216 5640824 5622174 5636528 5580884 5466539 5157946 4960124 5155735 5367965 5219509 5265033
15206 5265033 5338851 5071032 4930347 5160772 5311779 5442803 5734656 5539288 5673888 5352769
15196 5352769 4923034 5063763 4963625 5071706 5053453 5106707 5436341 5736721 5671713 5430675
15186 5430675 5452161 5330398 5639952 5922738 5625795 5487330 5374679 5246832 5092545 5447019
15176 5447019 5457219 5480469 5450224 5019229 5051774 5335963 5401146 5438299 5456483 5135148 5058289
15165 5058289 5200823 5354108 5636689 5413837 5482920 5157222 4970881 5168404 5101146 4978930
15155 4978930 4921455 4958083 4837777 4300943 4611581 4841491 4839594 5010165 4862033 5372831
15145 5372831 5432826 4664600 4818694 5252001 5116356 5630262 5382799 5493851 5267063 5183822
15135 5183822 5169581 5248977 5287704 5247806 5694104 5349963 5320281 5207551 5493261 5723502
15125 5723502 5795222 5476782 5362247 5579484 5556178 5283799 5152004 5056295 5041097 4951411
15115 4951411 5011832 5179445 5198881 5123590 5173142 5228124 5003154 5232501 5410749 5374568
15105 5374568 5143462 5231424 5355747 5536186 5548297 5302762 4890640 4882148 4909432 5298635
15095 5298635 5555008 5341741 5237734 5500931 5689617 5717854 5372403 5481268 5458384 5264783
15085 5264783 5210287 5077145 5460048 5241968 5296351 5646713 5387094 5458714 5633588 5094674
15075 5094674 4610240 4649049 5130726 5625212 5623863 5220351 5326505 5522993 5474898 5267274
15065 5267274 5495429 5713195 5205443 5135471 5088374 5108128 5387285 5535083 5849259 5650561
15055 5650561 5420402 5367019 5402567 5573392 5376539 5349542 5412106 5597895 5629475 5679910
15045 5679910 5806620 5682582 5404065 5016421 4914625 5297701 5038985 5199833 5534161
15036 5534161 5274700 5433321 5232306 5062649 5063191 5270123 5607133 5681424 5438989 5123287
15026 5123287 5198358 5438610 5063821 4906711 5145855 5567162 5895479 5293849 5405833 5316344
15016 5316344 5253652 5393631 4987361 5540661 5468193 5205987 5468174 5449210 5299275 5336784
15006 5336784 5404364 5373423 5094578 4971121 5281799 5438336 5593444 5493065 5293169 4987955
14996 4987955 5053930 5304432 5306174 5532047 5474905 5392400 5794725 5681529 5335114 5554605
14986 5554605 5388889 5117104 5167540 5138758 5035431 5168288 5354866 5380332 5268544 4874744
14976 4874744 4686938 4452310 4833039 5056652 5408079 5575371 5490737 5344972 4896842 5012605
14966 5012605 4692068 4793868 5114812 5102822 5295310 5206288 5108604 5214119 5482684 5660122
14956 5660122 5576176 5256148 5465102 5427464 5553567 5523336 5365181 5581878 5521860 5363962
14946 5363962 5368138 5202512 5007835 5465735 5432581 5418598 4889621 4604031 4738913 5035636
14936 5035636 5232393 4828608 4979348 5220727 5472975 5791513 5786923 5539588 5150381 5316674
14926 5316674 5422191 5356402 5473659 5391463 5294816 5586624 5402153 5524262 5815961 5422124
14916 5422124 5154465 5165614 5259054 5236486 5112062 5465657 5610325 5632890 5550010 5429071
14906 5429071 5289095 5417114 5775220 5290021 5156061 5224617 5037130 5025113 5221695 5336730
14896 5336730 5624333 5332139 4915444 5007034 4965991 5608373 5836720 5736229 5544866 5350703
14886 5350703 5434407 5630107 5176044 5181071 5343854 5358167 5213547 4911624 5171791 5351269
14876 5351269 5751878 5627066 5126487 5364529 5309867 5156929 5292863 5180161 5145895 5268074
14866 5268074 5332456 5186307 5201925 5427298 5484995 5904415 5918889 6057672 6137304 5665153
14856 5665153 5683262 5449059 5462133 5492833 5369344 5262379 5338926 5431158 5889631 5394069
14846 5394069 5295243 5191094 5191284 5447120 5374841 5318110 5600703 5849445 5778823 5868509 5596766
14835 5596766 5439882 5520731 5519008 5418732 5484066 5395855 5344083 5185861 5564970 5473180 5389250
14824 5389250 5470377 5248887 5304936 5364982 5701080 5801749 5599182 5512427 5640970 5788951
14814 5788951 5636387 5409618 5589471 5586368 5482390 5589688 5701653 5636791 5745000 5528164
14804 5528164 5496209 5279366 5129590 5054190 5015814 4788480 4982426 5105498 5390770 5472207
14794 5472207 5483135 5266139 5400914 5466568 5804246 5808255 4865534 5319222 5571325 5595344
14784 5595344 5368841 5389006 5526651 5634029 5512863 5435131 5526455 5679446 5704598 5721348
14774 5721348 5645605 5770880 5451250 5233481 5299907 5536395 5341552 5309358 5377084 5083137
14764 5083137 5094965 5516428 5121725 5404138 5780337 5390220 5445620 5552365 5434958 5487918
14754 5487918 5964735 5909519 5514584 5345760 5249713 5167108 5722137 5833410 5761595 5593299
$$ [...]
##END NTUPLES=NMR SPECTRUM
##END=
