##TITLE=1H_CA-9141-3
 CDCl3
 8 sc, 
 21.4.2023
##JCAMPDX= 6.0         $$ Bruker NMR JCAMP-DX V2.0
##DATA TYPE= NMR SPECTRUM
##DATA CLASS= NTUPLES
##ORIGIN= UXNMR, Bruker Analytische Messtechnik GmbH
##OWNER= root
$$ XWIN-NMR		Version 3.5
$$ Fri Apr 21 16:29:44 2023 Russian Standard Time (UT+4h)  she@DPX200
##.OBSERVE FREQUENCY= 200.13135
##.OBSERVE NUCLEUS= ^1H
##.ACQUISITION MODE= SIMULTANEOUS
##.ACQUISITION SCHEME= undefined
##.AVERAGES= 8
##.DIGITISER RES= 18
##SPECTROMETER/DATA SYSTEM= spect
##.PULSE SEQUENCE= zg30
##.SOLVENT NAME= D2O
##.SHIFT REFERENCE= (INTERNAL, D2O, 0, 15.7304)
##AUDIT TRAIL= $$ (NUMBER, WHEN, WHO, WHERE, WHAT)
$$ ##TITLE= Audit trail, XWIN-NMR		Version 3.5
$$ ##JCAMPDX= 5.01
$$ ##ORIGIN= Bruker BioSpin GmbH
$$ ##OWNER= she
$$ F:/spectra/data/she/nmr/H-F/1/pdata/1/auditp.txt
$$ ##AUDIT TRAIL=  $$ (NUMBER, WHEN, WHO, WHERE, WHAT)
(   1,<2023-04-21 16:28:35.50 +0400>,<she>,<DPX200>,
      <created by zg, POWCHK disabled, PULCHK disabled
       configuration hash MD5:
       00 E9 B6 7A A2 85 ED C7 34 08 36 98 17 FE 4E 26
       data hash MD5: 16K
       42 C4 6C 33 90 94 98 98 BB 87 DB FA 77 A4 25 1B>)
(   2,<2023-04-21 16:28:37.73 +0400>,<she>,<DPX200>,
      <Start of raw data processing
       efp BC_mod = 2 LB = 0.24 FT_mod = 6 PKNL = 1 PHC0 = -19743.29 PHC1 = 12.6008 SI = 16K 
       data hash MD5: 16K
       A1 E1 83 4F B1 BB 8A 14 01 8E 1B C4 88 6E 57 6B>)
(   3,<2023-04-21 16:29:00.79 +0400>,<she>,<DPX200>,
      <pk PHC0 = -97.17741 PHC1 = 13.6 
       data hash MD5: 16K
       02 67 63 03 0D 99 21 E0 9A 0A B4 7A 26 F1 EE 5A>)
(   4,<2023-04-21 16:29:03.98 +0400>,<she>,<DPX200>,
      <abs ABSG = 5 
       data hash MD5: 16K
       33 4D AE 81 45 42 EA FE 11 07 DA 73 3F EB C0 E3>)
$$ ##END=
$$ 
$$ hash MD5
$$ 8A EE F9 AC 6B FA DB C5 5B E7 70 4C ED 06 54 4A
##$RELAX= 
##$RELAX= 
##$RELAX= 
##$RELAX= 
##$RELAX= 
##$RELAX= 
$$ Bruker specific parameters
$$ --------------------------
##$DU= <F:/spectra>
##$EXPNO= 1
##$NAME= <H-F>
##$PROCNO= 1
##$TYPE= <nmr>
##$USER= <she>
##$AMP= (0..31)
100 100 100 100 100 100 100 100 100 100 100 100 100 100 100 100 100 100 
100 100 100 100 100 100 100 100 100 100 100 100 100 100 
##$AQSEQ= 0
##$AQ_mod= 1
##$AUNM= <au_zg>
##$AUTOPOS= <>
##$BF1= 200.13
##$BF2= 200.13
##$BF3= 200.13
##$BF4= 200.13
##$BF5= 200.13
##$BF6= 200.13
##$BF7= 200.13
##$BF8= 200.13
##$BYTORDA= 1
##$CFDGTYP= 0
##$CFRGTYP= 5
##$CHEMSTR= <none>
##$CNST= (0..31)
1 1 145 1 1 1 1 1 1 1 1 1 1 1 1 1 1 1 1 1 1 1 1 1 1 1 1 1 1 1 1 1 
##$CPDPRG= <>
##$CPDPRG1= <>
##$CPDPRG2= <>
##$CPDPRG3= <>
##$CPDPRG4= <mlev>
##$CPDPRG5= <mlev>
##$CPDPRG6= <mlev>
##$CPDPRG7= <mlev>
##$CPDPRG8= <mlev>
##$CPDPRGB= <>
##$CPDPRGT= <>
##$D= (0..31)
0 1.2 0 0 0 0 0 0 0 0.06 0 0.03 0 0 0 0 0.0002 0 0 0 0 0 0 0 0 0 0 0 0 
0 0 0 
##$DATE= 1682080114
##$DBL= (0..7)
120 120 120 120 120 120 120 120 
##$DBP= (0..7)
150 150 150 150 150 150 150 150 
##$DBP07= 0
##$DBPNAM0= <>
##$DBPNAM1= <>
##$DBPNAM2= <>
##$DBPNAM3= <>
##$DBPNAM4= <>
##$DBPNAM5= <>
$$ [...]
##$SUBNAM3= <"">
##$SUBNAM4= <"">
##$SUBNAM5= <"">
##$SUBNAM6= <"">
##$SUBNAM7= <"">
##$SUBNAM8= <"">
##$SUBNAM9= <"">
##$SW= 18.05172834244
##$SWIBOX= (0..15)
0 0 2 0 0 0 0 0 0 0 0 0 0 0 0 0 
##$SW_h= 3612.71676300578
##$TD= 16384
##$TD0= 1
##$TE= 0
##$TE2= 300
##$TE3= 300
##$TEG= 300
##$TL= (0..7)
0 120 120 120 120 120 120 120 
##$TP= (0..7)
150 150 150 150 150 150 150 150 
##$TP07= 0
##$TPNAME0= <>
##$TPNAME1= <>
##$TPNAME2= <>
##$TPNAME3= <>
##$TPNAME4= <>
##$TPNAME5= <>
##$TPNAME6= <>
##$TPNAME7= <>
##$TPOAL= (0..7)
0.5 0.5 0.5 0.5 0.5 0.5 0.5 0.5 
##$TPOFFS= (0..7)
0 0 0 0 0 0 0 0 
##$TUNHIN= 0
##$TUNHOUT= 0
##$TUNXOUT= 0
##$USERA1= <user>
##$USERA2= <user>
##$USERA3= <user>
##$USERA4= <user>
##$USERA5= <user>
##$V9= 5
##$VALIST= <valist>
##$VCLIST= <CCCCCCCCCCCCCCC>
##$VD= 0
##$VDLIST= <DDDDDDDDDDDDDDD>
##$VPLIST= <PPPPPPPPPPPPPPP>
##$VTLIST= <TTTTTTTTTTTTTTT>
##$WBST= 1024
##$WBSW= 4
##$XGAIN= (0..3)
0 0 0 0 
##$XL= 0
##$YL= 0
##$YMAX_a= 224687
##$YMIN_a= -228485
##$ZGOPTNS= <>
##$ZL1= 120
##$ZL2= 120
##$ZL3= 120
##$ZL4= 120
##$ABSF1= 15.74579
##$ABSF2= -2.30606
##$ABSG= 5
##$ABSL= 3
##$ALPHA= 0
##$AQORDER= 0
##$ASSFAC= 0
##$ASSFACI= 0
##$ASSFACX= 0
##$ASSWID= 0
##$AUNMP= <proc_1d>
##$AZFE= 0.1
##$AZFW= 0.1
##$BCFW= 0
##$BC_mod= 2
##$BYTORDP= 0
##$COROFFS= 0
##$CY= -3
##$DATMOD= 1
##$DC= 0
##$DFILT= <>
##$DTYPP= 0
##$F1P= 0
##$F2P= 0
##$FCOR= 1
##$FTSIZE= 16384
##$FT_mod= 6
##$GAMMA= 0
##$GB= 0
##$INTBC= 1
##$INTSCL= 3.70164e-10
##$ISEN= 128
##$LB= 0.24
##$LEV0= 0
##$LPBIN= 0
##$MAXI= 10000
##$MC2= 0
##$MEAN= 0
##$ME_mod= 0
##$MI= 1.114404
##$NCOEF= 0
##$NC_proc= -8
##$NLEV= 6
##$NOISF1= 3.799351
##$NOISF2= 2.8
##$NSP= 0
##$NTH_PI= 0
##$NZP= 0
##$OFFSET= 15.73036
##$PC= 1
##$PHC0= -19840.47
##$PHC1= 26.2008
##$PH_mod= 1
##$PKNL= yes
##$PPARMOD= 0
##$PSCAL= 0
##$PSIGN= 0
##$REVERSE= no
##$SF= 200.130008240609
##$SI= 16384
##$SIGF1= 3
##$SIGF2= 2
##$SINO= 5.538805
##$SIOLD= 16384
##$SREGLST= <1H.CDCl3>
##$SSB= 0
##$STSI= 16384
##$STSR= 0
##$SW_p= 3612.71676300578
##$SYMM= 0
##$S_DEV= 0
##$TDeff= 16384
##$TDoff= 0
##$TI= <>
##$TILT= no
##$TM1= 0
##$TM2= 0
##$TOPLEV= 0
##$USERP1= <user>
##$USERP2= <user>
##$USERP3= <user>
##$USERP4= <user>
##$USERP5= <user>
##$WDW= 1
##$XDIM= 16384
##$YMAX_p= 363434548
##$YMIN_p= -1357186
$$ End of Bruker specific parameters
$$ ---------------------------------
##NTUPLES= NMR SPECTRUM
##VAR_NAME=  FREQUENCY,     SPECTRUM/REAL,   SPECTRUM/IMAG
##SYMBOL=    X,             R,               I
##VAR_TYPE=  INDEPENDENT,   DEPENDENT,       DEPENDENT
##VAR_FORM=  AFFN,          ASDF,            ASDF
##VAR_DIM=   16384,         16384,           16384
##UNITS=     HZ,            ARBITRARY UNITS, ARBITRARY UNITS
##FACTOR=    0.220516191357247, 1,           1
##FIRST=     3148.11708265738, 0,            0
##LAST=      -464.599680348401, 0,           0
##MIN=       -464.599680348401, -1357186,    0
##MAX=       3148.11708265738, 363434548,    0
$$ Real data points
##PAGE= N=1
##DATA TABLE= (X++(R..R)), XYDATA
$$ [...]
8640 48408567 47497474 46749072 46425335 46021497 45830917 45247347 44898228 45294280 45579018
8631 45579018 46068280 46467699 46965188 47486940 48262111 49369844 51110011 52843543 53551628
8622 53551628 54752724 56106905 56485771 56703197 56347482 55405496 54854994 54073683 52667688
8613 52667688 50962835 49402813 47940988 46441648 45114582 43876905 43134465 42680354
8605 42680354 42174180 41430439 41356024 40932141 40360496 40155802 40521223 40843110 40822936 41112731
8595 41112731 42225947 42653475 43468098 44526182 45421607 45938189 47191789 48200816 49132821
8586 49132821 49825893 50473343 51290873 51337246 51540050 52399178 52770040 53060787 53173321 53187800
8576 53187800 52897950 52808341 53208388 52168376 51763480 51293583 50669420 49624960 49232695
8567 49232695 48235583 46856626 46193160 45290143 44643401 43710734 43341833 43668601 43576312
8558 43576312 43763525 43637879 44252916 44066304 43613236 43649149 43952062 44746729 44733015 45141716
8548 45141716 46104841 46850581 48349819 49297639 49765390 49965167 50009165 50505033 50324385
8539 50324385 49780412 47879236 46439837 46034431 44190509 42411819 40734146 39187401
8531 39187401 37587028 36246439 34865720 33692163 32558661 31208488 30349152 29737459
8523 29737459 29084569 29161707 28555657 28146518 27636321 27266133 26655297 26622261 26446946 25964279
8513 25964279 26072634 26138562 25814239 25891699 25873883 25748964 25629307 25327921 24411492 24038923
8503 24038923 23221099 22208531 21443748 20278280 19442555 18670893 18457115 17464570 16640351
8494 16640351 15719250 15601408 14537430 14293183 14001430 13497329 12634716 12491804 12615305
8485 12615305 11989398 12239680 12079791 11519373 11486148 10875168 10909230 10662394 10468830 10450183
8475 10450183 10549943 9844557 9558483 9187038 9185644 9398171 9135548 9669004 9209757 8856924
8465 8856924 8596198 8712639 8862445 8343753 8307579 8823224 8498442 8017293 7781188 8066045
8455 8066045 7556358 7662635 8050643 8394707 8131354 8304319 7961942 7522231 7845454 7931603
8445 7931603 7704093 7597088 7687395 7375594 7820932 8339759 7701624 7258313 7265379 7224999
8435 7224999 7195551 7812062 7583497 6848566 7135470 7002822 7019269 7003003 7402303 7437363
8425 7437363 7232520 7348728 7487997 7472661 7491808 7243697 7071316 7424391 7190601 7199787
8415 7199787 7261305 7655966 7721727 7050950 6675588 7344159 7703492 8040522 7875572 7075676
8405 7075676 7206547 7247256 7314879 7735673 7649211 6772697 6850182 7200553 7958735 7601235
8395 7601235 7448040 7013052 7253450 7252000 7262133 6798690 6524163 6759505 7134490 7318769
8385 7318769 7251944 6927627 6636970 6576741 6698408 6860604 7075234 7691557 7099948 7227058
8375 7227058 7145084 7115195 6936918 7415018 7165839 6804205 7009708 7299849 7593113 7274185
8365 7274185 6950126 6847598 6806657 6755534 6657363 7039213 7207886 7023800 6747395 6677614
8355 6677614 6805681 6880388 6679165 6291653 6340913 6853822 6795908 6349579 6506770 6744380
8345 6744380 6946491 6658816 7042829 6882455 6385970 6374986 6832901 7373585 6936568 7099103
8335 7099103 6838016 6808473 6960689 6783446 6738034 6458785 6364732 6332136 6246984 6627799
8325 6627799 6611570 6834714 7349574 7490696 7379504 6679263 6646840 6900777 6809451 6802047
8315 6802047 6779935 6749974 6559060 6794169 6836251 7064676 6886212 6723490 6384860 6101887
8305 6101887 6270644 6206857 6166264 6137408 6561507 6957538 6963722 6804675 6566204 6593206 6941624
8294 6941624 6831297 6764087 6674052 6996998 7251202 7262355 6797596 6205333 6719955 7082115
8284 7082115 7012682 7166411 6948965 6573479 6696755 6704424 6442075 6825184 6673513 7078201
8274 7078201 6972547 6870763 7041548 7405961 7333712 6977621 6736089 6840008 6883100 7183140
8264 7183140 7242896 6987754 6555315 6448276 6347239 6498391 6469435 7127163 7630370 7302083
8254 7302083 7244265 6844900 6926534 6693750 7136874 7402806 7007986 6990662 7099884 6696536
8244 6696536 7174138 6987994 6836436 7014032 7586480 7188353 6628583 7267788 7386959 6813234
8234 6813234 7345984 7537664 7005803 7333567 7067886 7170992 7202324 7070826 7385176 7291090
8224 7291090 7448436 7327319 7405788 7169957 7284109 7263586 7133089 6776804 6956901 6705360
8214 6705360 6787752 6879073 6794882 6473126 6848522 6619823 6665941 7010685 7027203 6656806
8204 6656806 7036803 6711392 7133461 6758741 6227162 6364549 6746352 6697359 6701803 6479702
8194 6479702 6421080 3631135 560000 6362260 6705161 7160964 6819357 6536595 6496137
8185 6496137 6675800 6629247 6879371 7001829 7427940 7115486 7006051 7751047 7858450 8163998
8175 8163998 7650109 7631263 6976990 6809815 6564175 6024258 5809216 6330196 6294890 6722701
8165 6722701 6810924 6368555 6451922 6825316 6949965 6887784 6636731 6665992 6459879 7086957
8155 7086957 7016432 7185697 7275139 6636034 6268393 6910906 7168598 7346564 6937352 6830135
8145 6830135 6251081 6426652 6197727 6585389 6485521 6119475 6081124 6595135 7237756 6367654
8135 6367654 6933009 6755543 6635883 6710715 7186091 6993694 6910429 6970647 6678837 6362494
8125 6362494 6405330 6527871 6719416 6724530 6295244 5988469 5980823 6137642 6069597 6371753 6390757
8114 6390757 6421800 6361169 6240613 5783438 5962280 6341890 6482019 6696503 6645254 6375643
8104 6375643 6590853 6384662 6238078 6464346 6241346 6298146 6443881 6628965 6401431 6356285
8094 6356285 6401303 6113743 6068921 6669283 6727546 6270962 5782397 5983582 5991537 6161727
8084 6161727 5955885 6344822 6477610 6115761 5684231 5843678 5867745 6614579 7057745 7104111
8074 7104111 6776525 6757761 6545561 6109698 6184297 6090019 6039204 6288528 6796060 6481575
8064 6481575 6197877 6524477 6614522 6464901 6666884 6482454 6111528 5485651 5683747 5873062
8054 5873062 6167150 6292391 5835082 5573287 6108451 5964769 5640335 6014341 6081702 5692468
8044 5692468 5973123 5972811 6224216 6294349 6423354 6347459 6340178 6139191 5949554 6099014 6027497
8033 6027497 5942459 5562850 5612641 5696467 6015262 5910211 5671526 5454057 5331015 5940971
8023 5940971 6046888 5778613 5659783 5660208 6116014 6106179 5915256 5642086 5618725 5624465 5589022
8012 5589022 5654441 5639379 5853958 5576617 5183356 5209346 5654394 5726023 5678628 5674540 5904511
8001 5904511 5774174 5383442 5642515 5544761 5400687 5870612 6076029 6213063 6007659 5467277
7991 5467277 5037955 5199567 5282633 5681026 5274664 5177549 5489732 5832611 5730497 5208942
7981 5208942 5317441 5249517 5575479 5408872 5355453 6202780 5650655 5394542 5282736 5417446
7971 5417446 5071439 4504392 5218567 5326082 5511889 5508253 5572803 5892863 5835280 5687717
7961 5687717 5793533 5302275 5139939 5131880 4891799 5270720 5268425 5314727 5290358 5324242 4822871
7950 4822871 4735416 4974692 4399852 4924788 4934478 4916051 5082346 5173796 5478759 5300181
7940 5300181 5087579 5354606 5635841 5317708 5059741 5180879 5048977 5137881 4549491 4899934
7930 4899934 5284574 5538343 5319439 5286964 5172646 4870882 5111103 4923665 4763540 4969723
7920 4969723 4919413 4935460 4809618 4303651 3956665 4220063 4488490 4513403 4904765 4726965
7910 4726965 4664700 5182036 5346897 4830119 4292111 4555896 4455286 4490253 4637717 4422922
7900 4422922 4380946 4728866 5001254 5035550 4904538 4431880 4572918 4703584 5131021 5316229
7890 5316229 5077894 4912836 5030127 4789113 4637749 4711515 4736743 4264091 4382705 4119837
7880 4119837 4193308 4379261 4496810 4867409 3858622 4237800 3999883 4161814 3968673 4129799
7870 4129799 4344470 4283194 4337820 3970502 4044016 3978253 3706821 3465737 3963802 4473479
7860 4473479 4430535 4451769 4188902 4558023 4581082 3781226 3475057 3896129 4470827 4176703
7850 4176703 4017349 3594038 3566330 3791697 3695466 3511427 3646732 3480205 3267664 3215949
7840 3215949 3476257 3555139 3813703 3532196 3760567 4163967 4213693 4341505 3926351 3591605
7830 3591605 3866348 4015801 3986222 4124590 3313636 3469576 3688110 3461313 3555739 3380869
7820 3380869 3639704 3240842 3369154 3486823 4163648 4132770 3494659 3321212 3419569 3424187
7810 3424187 3305311 3068419 3252069 3204903 2830937 3287323 3343632 3415279 3133963 3323060
7800 3323060 3425850 3811569 3695644 3510842 3614500 3870897 3611840 3397403 3453039 3486499
7790 3486499 3630515 3607897 3281114 3052185 3261673 3285565 3272846 2845364 3056109 3206180
7780 3206180 3195646 3341258 3707649 3732574 3614807 3543581 3031867 2758282 3413183 3367041
7770 3367041 3512049 3743462 3496978 3141097 3312155 3569105 3192867 2884880 3054420 3112745
7760 3112745 2666111 2752231 3174719 3038420 3482782 2748563 2464055 2674334 3110497 3147506
7750 3147506 3072698 3057794 2970637 2963628 2717554 2638270 2822408 2460799 2046293 2146295 2401417
7739 2401417 3047730 3043607 3329005 3236215 2632885 3111845 2919791 2389358 3121196 3629321
7729 3629321 3311324 2743193 2721208 2613766 2675152 2652217 2779757 2859160 2650332 2489461
7719 2489461 2505559 2331098 2538933 2393842 2697135 2638397 2741393 2700867 3231998 2632683
7709 2632683 2185506 2436079 2771933 2155683 2297518 2796741 2637319 2571959 2659015 2766719
7699 2766719 2982209 3087989 2675571 2954349 2898053 2955367 2893958 2539013 2630616 2591208
7689 2591208 2502752 2397394 2660222 2625388 2712723 2623965 2386420 2311123 2516426 2907826
7679 2907826 2728095 2607055 2103603 1735350 2357401 2670309 2610067 2482671 2179154 2664415
7669 2664415 2720990 2333661 2291082 2469749 2423472 2375157 2480142 2495493 2601954 2428958
7659 2428958 1980104 2369687 3001256 3287864 2999631 2709504 2320756 2284392 2191210 2341737
7649 2341737 2498024 2698787 2549645 2269638 2671849 2570959 3007166 2776253 2479491 2107424
7639 2107424 2420193 2814970 2757517 1993111 1802030 2018374 2381985 2296779 1884647 1875343
7629 1875343 2049885 2143282 1774953 1927920 1962921 1998275 1548237 1254563 1265542 1951871
7619 1951871 2087995 1788639 1794965 2016119 2016567 1930762 2125698 2165339 2260528 2268902 2196463
7608 2196463 1879811 2001959 2150029 2109878 2385305 2248433 2592259 2702908 2764893 2636970
7598 2636970 2497789 1898348 1816179 1528098 1989836 2387803 2040487 2177270 2182980 2156504
7588 2156504 2270505 2001419 2140311 2272043 1630570 872701 1667152 1933716 1888815 1528147
7578 1528147 1686920 1486895 1583570 1667696 1788246 1649842 1375571 1715292 1801584 1722209
7568 1722209 1254264 1273550 1131141 1661400 1844553 1759808 1786788 1613089 1519685 1587157
7558 1587157 2088928 2167890 2159072 1841180 2204233 1894392 2049386 1987247 1437316 1316302
7548 1316302 1668390 1485328 1177218 1492791 1275405 1324540 1048509 1133288 1713790 1662018
7538 1662018 1543048 1333957 1518224 1336896 1110414 1404102 1563333 1811591 1595970 1575307
7528 1575307 1553412 1679319 1559979 1721739 1423435 1530564 1114115 815596 1276206 1853959
7518 1853959 1602503 1617851 1323380 1541412 1409740 1174489 1259845 2039543 1595748 1666492
7508 1666492 921602 853279 1060212 1328329 1461495 1185776 1475104 1834239 1902068 1739530
7498 1739530 1466155 1389198 1401904 1300492 1532744 1692691 1662653 1582759 1338361 1354513
7488 1354513 1233931 1562253 1483593 1114747 1265055 1497634 1461187 1015066 1127858 975076
7478 975076 1021759 802409 890097 954807 1205840 1208090 1310134 1826655 1535741 1573770 1438857
7467 1438857 1321902 714584 612308 1374283 1618974 1274556 1157731 1148765 1155699 1164667 967538
7456 967538 1117132 1666938 1818823 1078331 1198151 1495192 1371334 993325 1789554 1571308
7446 1571308 1252405 1392838 1362864 1054223 938395 657032 602906 564668 737954 1061194
7436 1061194 796683 323098 467418 774160 1012980 1063525 841602 210045 566375 945907
7426 945907 1094345 1036411 1041602 1195330 928610 1027458 1299599 1013537 906063 1655559
7416 1655559 1798896 918810 597284 536503 811506 624672 283273 591369 1458915 1255912
7406 1255912 991763 1020443 1155856 1186078 1026204 828650 340780 404828 529738 1056261
7396 1056261 868424 952469 575386 464288 604762 980248 684961 1182656 1131336 808872
7386 808872 670901 228485 482098 520214 443012 504296 404171 503966 1059498 1056274 386865
7375 386865 -81521 927588 970506 528271 610379 732951 650752 583535 226441 413126
7365 413126 967196 1175287 1056995 1353965 1081273 947162 1204514 1251124 892876 617764
7355 617764 523437 324569 -352578 55863 638554 700671 1255183 992676 1124643 1100085
7345 1100085 821677 835819 1074460 1082439 1280533 1033363 913661 858752 519623 190840
7335 190840 258096 814061 835325 680346 180671 395659 518645 604276 614966 768573
7325 768573 734039 581164 599394 654427 1024279 1170301 1394321 1257915 600406 194787
7315 194787 -99903 -55749 -567906 -646007 -56222 -308042 -113440 174595 146431 275016
7305 275016 528460 -102819 -29970 319553 610939 353095 613819 588833 460161 10698
7295 10698 -344912 -269831 434095 960732 337126 461116 656728 1040271 558744 117364
7285 117364 195228 -142835 -130890 57798 407548 -104475 346772 492633 588090 303801
7275 303801 169891 509700 451433 486446 198614 39608 59730 -419560 90943 635751
7265 635751 260327 -472576 37313 156567 88579 362385 497467 354846 477632 651377
7255 651377 524868 507325 501907 599457 616354 363787 349381 784473 700806 -50890 -150185
7244 -150185 256135 346399 286920 270828 553906 391255 849255 228124 161429 64628 -403364
7233 -403364 273366 388063 -264626 -375923 -288617 471058 331568 592590 424797 395661
7223 395661 293354 -148094 41393 379223 703424 509933 549834 438540 333741 96565
7213 96565 34844 144516 227296 -147440 -394878 92315 64474 518135 406782 668452
7203 668452 546105 -13835 62125 775715 857184 791868 956353 351218 146298 -75377
7193 -75377 -177645 -347985 532526 145223 -271420 221639 452055 204159 4443 547416
7183 547416 667629 401906 508539 691398 56199 391109 405974 75518 193027 225581
7173 225581 187438 -104334 -556325 220055 296480 157615 -369047 -276420 -407980 -802008
7163 -802008 -408144 -128258 381675 123577 138962 751800 456400 80168 -162202 -453713
7153 -453713 -656204 22275 -395335 -478779 -299662 -273138 -57527 -324487 -51631 -3347
7143 -3347 -279311 -43088 24574 17628 278638 119477 196033 -438952 -532582 -181500 -101353
7132 -101353 -353914 -521689 -405070 175216 235773 -31710 41085 613411 648063 499820
7122 499820 -175377 265106 -20001 56970 50152 300615 -205066 -273285 8350 70811 -117067
7111 -117067 -113663 240821 -213071 -396525 -163605 -96264 -437935 -359488 -252894 250031
7101 250031 444310 40515 -71405 215418 356390 272053 -233573 -116149 -1473 4309
7091 4309 237518 138617 -368215 -342803 -97467 -9467 114837 177848 215178 215816 -439757
7080 -439757 -164766 624097 575559 188075 68724 256305 95054 -86972 13627 -164707
7070 -164707 -425002 -93969 76720 183073 -63619 -361212 -236880 -100242 322181 299151
7060 299151 -247942 -487341 -382964 -524108 -170068 228296 -341625 -213784 -37132 219533
7050 219533 544505 182985 147185 269776 6241 408683 260930 -169275 -378118 -231841
7040 -231841 -291259 -129334 132456 -177246 -78612 -226607 97647 -507006 -317039 -197650
7030 -197650 -287924 -86102 41493 38598 -6047 3982 143470 487615 391806 200384 -118647
7019 -118647 -485861 -250796 -93872 -73418 -645648 -499234 -357940 258884 275371 194526
7009 194526 -35417 -552325 -149172 -198379 -322213 -139297 -249532 -561944 -179471 98350
6999 98350 385073 173697 -469747 -270348 347192 135437 272500 79730 126172 -13355
6989 -13355 -76320 -46498 -556691 -271916 32938 -85571 174974 147397 358092 403834 266008
6978 266008 -416726 -658064 -738310 -150058 -85760 -330761 -232533 169106 182460 696912
6968 696912 768939 280124 72163 -139147 -190594 -603531 -310769 -224777 -566036 -273082
6958 -273082 -114704 -306376 48654 140472 -131573 -26579 -135901 -205679 -9476 -247493
6948 -247493 186918 123695 -28999 218988 -9731 -426410 30120 -166598 -54865 -125775
6938 -125775 -380005 -478349 51105 259508 141851 64382 -414542 -255093 353761 73526
6928 73526 -392170 -702153 -1225198 -1203633 -647211 -521263 -502270 -553687 -482471 -196451 -275427
6917 -275427 -293427 -423944 -614909 -677630 -721513 -138649 147189 -192390 -456118 -911179
6907 -911179 -518975 61904 519903 491116 416776 -109401 -26790 192587 -212363 -683113
6897 -683113 -634507 -255836 8867 -352929 -1082614 -438311 -101529 -50869 -280894 77721
6887 77721 34292 147364 -310279 -751494 -664026 -393919 -205745 -1273 49685 -368521
6877 -368521 222320 62882 -342853 -574335 -430350 -181492 195263 157207 -319577 -290016
6867 -290016 -29064 -688236 -486017 -288950 -620682 43985 -52825 -291739 -445108 -20532
6857 -20532 -199045 -153537 -133711 -222512 -1930 -140425 -380945 -536411 -289431 -68323
6847 -68323 -238351 -564010 -110988 -257082 267472 -299152 -241991 101681 137210 227405
6837 227405 -626765 -851328 -451708 -263334 -168217 -454298 -240305 -225182 -54842 -137981
6827 -137981 -114341 96251 -587277 -140293 -246553 -390609 -337209 -698873 -519016 13507
6817 13507 -70624 303031 485476 -151610 -447401 -659269 -473803 16337 -115283 -162124
6807 -162124 178654 181640 547596 106898 164792 186540 -152839 -167152 -252227 -155326 -155261 -27653
6795 -27653 -337196 -139060 554309 60833 70133 229852 135390 278236 40581 -59630
6785 -59630 -370770 -627344 124566 -172947 -526871 -139266 -189483 -454454 -478022 -522438
6775 -522438 -468502 -316019 -253435 -666314 -672821 -510795 -709937 -905099 -633035 -107970
6765 -107970 -353269 -286235 -42755 -178903 -667056 -201477 26435 -429272 -401519 -194507
6755 -194507 8798 208754 137466 43419 -638448 -364461 -722099 -537286 -470426 -303060
6745 -303060 -236545 -480888 -326020 -185519 47266 -72570 -71973 127531 106187 93652 -184457
6734 -184457 -360951 -482113 -383587 58911 -291795 -430276 -247544 -192748 245277 -147972
6724 -147972 -636355 -568235 -786468 -879960 -464737 -222927 -82043 -269749 145900 70532
6714 70532 -304523 -355655 -355934 -369842 -466174 -413588 -677349 -382362 -91511 -46059 -2684
6703 -2684 -279883 9311 -52441 -560212 -366190 -324918 -394230 -189112 66487 301474 76731
6692 76731 -209920 -232094 -686521 -102366 -142831 147008 226764 -368989 -251977 -283570 -250829
6681 -250829 -250381 -127400 106373 -198565 -310683 -172773 -199454 -609490 -158645 -78417 -171995
6670 -171995 -565249 -305238 -194694 -33419 6544 -32396 -187853 -781024 -520049 -23610
6660 -23610 -99564 -320469 -71963 -536036 -541039 -487761 -29995 -396035 -432540 -110000 -661944
6649 -661944 -1222240 -1203814 -797621 -513028 -419073 -48201 -221514 -571188 -610376 -372541
6639 -372541 -137881 -745220 -353094 -185723 -349680 -521705 -269856 -125108 -59775 -15429
6629 -15429 -600274 -353759 -46018 -385310 -262341 -98830 -282155 -691290 -586068 -880356
6619 -880356 -601899 -421308 -6794 -324173 -785416 -895801 -619485 -680497 -1053376 -923060
6609 -923060 -842822 -424940 -205628 -406320 -700735 -659240 -926714 -495956 -503367 112842
6599 112842 264546 -52181 511592 345426 -304737 -87227 -280397 -739646 -660330 -947010
6589 -947010 -1178463 -851874 -745890 -860932 -748054 -149327 -145233 -671635 -526906 -812023
6579 -812023 -972185 -330549 -490675 -416917 -509449 -546870 -1037767 -277607 -327581 -827737
6569 -827737 -952679 -619164 -795014 -758641 -791379 -1125130 -815043 -1071820 -896612 -187672
6559 -187672 -32297 -59392 146390 22196 242417 597 -405691 -1225068 -502545 -183196
6549 -183196 -365855 -511886 -518185 -86530 -314903 -611453 -528813 113906 -471777 -709737
6539 -709737 -394348 -708475 -227503 -247129 -178600 -386603 -1007611 -649932 -635239 -876227
6529 -876227 -833279 -987718 -567423 -188440 -334093 -825477 -727674 -795517 -373528 -554262
6519 -554262 -713858 -159890 -148026 -506466 -595025 -405524 -342078 -610273 -428809 -180624
6509 -180624 -325203 -370058 -145071 -659117 -645060 -637928 -976759 -713876 -750857 -422306 -208891
6498 -208891 -159431 -240357 -290836 66007 -281059 -345862 -461063 -446916 -318597 -298129 -157834
6487 -157834 -439787 -249849 -274182 -20746 -132151 48447 -115061 -388187 -367417 -288971
6477 -288971 -503765 -271421 -660412 -1000091 -792098 -311081 -418512 -590059 -150154 -97466
6467 -97466 -385834 -397861 -173421 -474984 -776445 -774095 -436388 -649313 -503800 -151604
6457 -151604 17435 -193116 -184233 -361268 -665287 -381191 -98913 112462 -281718 -261730
6447 -261730 -622160 -576170 -600153 -297031 -261717 -755782 -489594 -151952 347298 451193
6437 451193 192353 -71542 -279846 -399681 -127693 -47809 -501793 -643017 -556427 -511821
6427 -511821 -325477 -583863 -330580 -159670 -339740 -355778 -58297 -583586 -448965 -80084
6417 -80084 -517467 -931769 -749327 -257212 -68156 -36545 -136937 -62405 -315091 -262034
6407 -262034 -420329 -561464 -1032685 -662886 -271815 -404676 -605272 -667378 -570382 -699100
6397 -699100 -74738 6110 -153554 -333017 -500845 -45546 -14055 69959 -520025 -564737
6387 -564737 -497641 -569947 -384044 -92496 -262041 -360575 -186012 -192684 -735506 -981300 -657438
6376 -657438 -296917 -454790 -662573 -419592 -434595 -480570 -445597 -193900 -262074 -250539 -641354
6365 -641354 -341553 -384033 -365783 -762170 -728684 -375398 -318809 -913716 -818979 -916936 -609093
6354 -609093 -413011 -741884 -491765 -559196 -115627 -266787 -815741 -453182 -568591 -779458
6344 -779458 -957845 -901566 -840924 -854918 -490388 -361404 -476122 -702247 -808392 -832866
6334 -832866 -805501 -759860 -616771 -542615 -594669 -245221 -684708 -748187 -292662 101838 -546089
6323 -546089 -912455 -821262 -604421 -250217 -772956 -799072 -393157 -808634 -947176 -296531
6313 -296531 -542634 -334810 -446419 -557053 38187 172671 -423978 -307441 -206447 -48726
6303 -48726 -104266 -48286 -191771 -569090 -1002100 -1113444 -1357186 -844574 -217743 -102710
6293 -102710 -160481 -797565 -881056 -419880 -620208 -99029 -58483 -491777 -602563 -468632
6283 -468632 -481350 -607691 -33308 238099 167686 -214351 -544584 -755240 -719216 -823195
6273 -823195 -935408 -538719 -219394 -418184 -813479 -424133 -392081 -1090276 -658201 42068
6263 42068 -398521 -658220 -566683 -1024462 -791798 -565510 -366146 -268865 -193733 -320377
6253 -320377 -69972 -416497 -720304 -411115 134595 392734 232158 -341743 -625689 -393144
6243 -393144 165574 -262683 -220373 -175487 123087 237952 -344417 60768 -32899 38794
6233 38794 -344514 -2062 -25339 -153909 -356832 12978 260566 -220266 -305183 180943
6223 180943 -233508 -113316 147707 466487 -18969 7921 -39345 242888 -194157 -413157
6213 -413157 -161261 -396103 57477 225375 211726 2715 317659 -196710 -5629 681001
6203 681001 205220 306184 454281 -225576 -61740 -119116 282479 312047 166791 -66521
6193 -66521 -158985 25166 352887 198550 115270 22648 -401816 132727 297900 397994
6183 397994 600841 590186 842477 540452 284888 773671 364421 233127 575838 71821
6173 71821 -202693 -350821 14358 111085 -288101 297391 823932 -207770 -338309 62521
6163 62521 526628 534630 70225 -471309 -156570 376507 397566 476773 356975 -64376 564170
6152 564170 574822 -49960 -185162 -132945 262652 -74767 32997 -251600 480002 764258
6142 764258 1108606 1429960 627499 1032530 456274 42648 361382 221274 82820 486158
6132 486158 367100 571308 112885 76456 254482 707017 350935 381766 263824 -135626
6122 -135626 101179 -106819 312329 561845 -837 -252010 2904 -234211 -210910 -268449
6112 -268449 -355843 -538591 -117780 281923 -46528 -267884 -621790 -596553 -161098 -327195
6102 -327195 -631637 -577288 -540479 -771246 -241127 -237809 -446678 -634496 -662125 -734119 -538205
6091 -538205 -686060 -577403 -456919 -661497 -744827 -110746 -194692 -365437 -908205 -592861
6081 -592861 -594190 -632616 -676317 -226300 -73378 244705 603861 219476 -169793 94378
6071 94378 -130839 -146901 -110267 -7373 -60677 63461 277818 -231699 -111533 -219322
6061 -219322 -3278 -124470 -528900 -312200 406374 -125911 -67962 -17092 -648922 -697477
6051 -697477 -176895 -129272 -174794 -230885 -592809 -1054493 -529872 -236057 -322361 -286113 -139185
6040 -139185 -434088 -81047 485 -13527 71731 -68638 -107816 -310738 -865921 -542113
6030 -542113 -738300 -15218 -143891 -595466 -429275 -81728 -195480 -151956 -158192 258940
6020 258940 427716 99815 -111937 -174688 -24333 -319465 -52006 -108606 -46049 -54054 -497446
6009 -497446 -515300 -564630 -473098 -10896 -222022 -202906 -1036549 -804820 -679987 -333603
5999 -333603 14928 353057 82138 -397234 -143056 -307410 -706653 -368499 437350 598805
5989 598805 354358 174128 -331184 -229227 -103363 109884 -171241 -41957 -272842 -112741
5979 -112741 202979 55804 -447829 -392898 -385417 -267652 -48532 -24511 -61195 303272 145541
5968 145541 4442 263497 -387247 -133029 -61635 -85315 -562567 -664491 -852331 -971525
5958 -971525 -692148 -607492 -354775 -351942 -417565 -455296 -313303 -26 -101331 -318708 -321425
5947 -321425 115414 -344918 -234686 -170962 -563632 -512373 -204866 -206953 -169004 112736 -207970
5936 -207970 225404 472310 174599 189185 8956 -333590 45574 170888 25265 185310
5926 185310 29196 -201134 24212 319868 -158431 -323014 -93900 -435153 -867263 -285618
5916 -285618 -36907 222876 123911 72015 -296604 259224 210331 117783 409563 127238
5906 127238 139328 208760 -52900 -352178 -233526 -43074 28817 -57872 -212160 -38089
5896 -38089 250372 -461171 -609095 -386345 -203704 -418387 -337967 -549309 -670850 -446092
5886 -446092 -410212 -146292 -363124 -178658 -14117 -372372 -231372 -201436 -10905 -69816
5876 -69816 -567616 -188407 -243406 21058 -4839 151821 407676 374861 530873 306275
5866 306275 151837 247264 -54191 -71971 65697 143587 284307 634058 829746 437368
5856 437368 223536 413400 222151 -139296 -116585 -25085 -293072 -775013 -337983 -89877
5846 -89877 272974 418327 66881 412773 533524 458874 571265 362083 156757 614631
5836 614631 519430 431751 336881 -197858 292234 -299305 -284763 -633477 -440352 -221834
5826 -221834 25836 -60551 162602 1063 -240225 -184138 -186259 -299851 -114689 -167739 -372181
5815 -372181 -101403 -339842 236804 577380 644014 376496 251369 252166 -199645 -643923
5805 -643923 -211221 -178215 -279848 -59151 -267603 -493658 -569573 -204766 24416 -26389
5795 -26389 -393670 -230026 193914 100818 -185129 -28345 54963 175142 76682 250909
5785 250909 -10053 -109662 42232 -98402 -260431 -399614 -198888 -211128 400623 525111
5775 525111 54738 221626 316710 -56338 386600 563397 143146 -196554 -100223 -59504
5765 -59504 95419 231116 159746 25614 34473 336374 254337 -48654 -192879 -525598 -265850
5754 -265850 56213 291692 -163069 -66595 -336171 -556819 -214656 339954 534968 -141872
5744 -141872 -364362 -393721 -608024 -28773 27348 130417 160786 353159 445271 505003 153723
5733 153723 -215610 -215358 -186312 195515 -187108 -380004 -126235 115584 -8565 478460
5723 478460 205392 -168751 -32216 -62795 145031 282998 -46551 -262713 -456653 -195856
5713 -195856 -549891 -528245 -292123 -761051 -568310 -469636 -287828 -162898 -208790 33744
5703 33744 256776 43302 -350635 -59007 58721 24520 -89619 149943 69688 -743554
5693 -743554 -360449 -450377 -66076 51256 -62949 -78885 -205871 -344581 -73102 42716
5683 42716 -158447 -64603 437699 655912 418950 173172 43170 216200 -641934 -248447
5673 -248447 -586486 -875874 -84338 67844 399964 245725 128003 320904 289001 714714
5663 714714 290117 -7376 55927 -203202 255666 470949 284535 19145 185348 522086
5653 522086 6432 260913 411223 171898 -430603 -155909 93228 -373888 -785040 -496979
5643 -496979 -81572 20156 -352343 -517530 -635505 -344631 -35450 -244059 -13660 -164758
5633 -164758 -667961 -246310 294555 213859 21029 -64989 -319784 -163779 -2893 251237
5623 251237 313614 135174 484106 31996 282236 -51833 525343 398484 -118695 -76195
5613 -76195 -63181 -524206 -666325 -3284 -130029 -123951 100122 -23293 -139195 -352544
5603 -352544 -314889 -121534 147426 449812 363567 -96732 14482 371176 477694 90493
5593 90493 408700 415718 -350530 136627 435782 243433 511110 291679 237796 122073
5583 122073 -305627 -199382 40868 157374 291407 -73209 -234284 21646 7267 -226352
5573 -226352 121187 129356 368814 152339 37137 5575 -313098 -172198 -129045 430920
5563 430920 368058 186491 -160719 -261688 279631 755974 282021 202057 483827 318134
5553 318134 346859 431484 207269 210391 -114537 -131943 441620 511112 542464 1186749 281630
5542 281630 377895 122635 42659 270005 298862 -206100 -93036 783123 836881 934869 704977
5531 704977 596244 139085 580807 1356691 976347 391487 702929 1044088 928752 713134
5521 713134 560489 340681 341881 601348 821876 975219 751584 613094 689708 983366
5511 983366 538425 457204 640460 594332 561998 763773 1010111 804939 442113 541326
5501 541326 870125 902931 862110 594025 205579 48108 533079 653564 542784 776863
5491 776863 1053737 975633 456943 300018 715069 634537 540752 367781 6423 -295757
5481 -295757 -252127 -171312 742143 607727 851251 823022 229244 446147 179797 -144619
5471 -144619 275437 556716 793903 335404 167326 -97036 642814 753891 224388 215761
5461 215761 859324 1025728 640649 891791 1131010 1031404 999791 476420 773489 607000
5451 607000 520293 814957 421020 652895 895464 622523 -93193 -37285 -95759 53671
5441 53671 -13147 -13621 294172 646473 724521 642322 186757 659321 522749 605283 1367050
5430 1367050 1357006 1402036 1421604 1201713 1662416 1108292 890229 698237 79288 421962
5420 421962 549340 649984 666414 82329 163965 387233 859395 642651 772885 662237
5410 662237 833470 539200 283444 152750 314627 387948 620279 718975 828501 768417
5400 768417 803763 1017590 524797 650765 326922 396505 290228 330551 692389 343833
5390 343833 474042 695177 644829 348725 608773 753254 578839 318689 -45005 2434
5380 2434 221264 377301 138520 631583 684895 451542 52193 637043 443310 346324
5370 346324 522603 874690 372521 470466 541149 422398 390346 212162 166163 298748
5360 298748 258576 213494 307745 -32620 -7816 306669 259092 296246 619384 838157 878907
5349 878907 533521 534554 310188 242544 33220 244224 349372 5232 12076 -261243 -290476
5338 -290476 405071 799994 649204 871800 918621 540625 176259 219106 13289 176522
5328 176522 129112 18993 45843 158902 309843 -76837 -280806 266522 759835 210991
5318 210991 172911 327033 -229363 -218555 502312 842974 640406 1260891 1299819 867169
5308 867169 676673 592889 1276613 1201688 521406 852830 1195271 495911 734701 884381
5298 884381 854381 401457 63850 115429 82873 495585 631439 381018 362089 785021
5288 785021 817654 588622 481218 282696 185460 -159760 309365 86036 -235141 -157356
5278 -157356 60580 77276 -384781 180480 239219 50793 282365 -315562 185738 487658
5268 487658 705836 686687 830074 817058 796343 352358 -130760 432767 939612 328142
5258 328142 563511 520427 187377 231166 -224034 6921 -101870 -402301 -196542 -52598
5248 -52598 218621 317496 135613 126042 154768 212283 294135 283444 -48533 69893 -67314
5237 -67314 615993 833855 610134 375522 583014 755457 232067 -23898 66584 309823
5227 309823 474870 403591 470752 659805 386113 498080 663139 496148 289239 63700
5217 63700 -8392 344674 335850 440306 1165605 1084884 571758 842055 646563 -97864 -101060
5206 -101060 428240 991191 632834 356305 773017 655391 534489 506156 236028 789393
5196 789393 245478 225384 380222 510090 687653 693423 152076 411474 577811 925861
5186 925861 254838 534807 878317 1044172 402084 370981 121380 -99406 150063 338735
5176 338735 610885 380859 657666 656228 647647 707937 1258170 830754 417534 403911 199698
5165 199698 282436 669335 644139 661371 890371 766709 823228 799499 1189309 1350627 507622
5154 507622 625291 1014758 1162539 1060183 1354987 914178 534508 399615 986768 621443
5144 621443 950919 973763 455516 479094 685032 816454 1189695 744571 244611 748246
5134 748246 404942 379462 789424 679107 871340 938057 664206 209306 932145 1226236
5124 1226236 1109385 1018460 856559 776739 1320179 814322 536654 744001 564588 946519
5114 946519 1102954 978374 1240891 803235 951060 1310459 1105979 1254604 1456567 1168333
5104 1168333 978595 825279 1313199 1543737 1382756 1600175 1461559 1114205 1142807 867615
5094 867615 853003 1175204 1044187 1438533 1155694 1207733 905337 1155599 1317243 1887238
5084 1887238 1772802 1376379 999594 1298079 1734050 1760184 892693 497967 460459 426200
5074 426200 1028910 1076203 1258124 1181861 1385031 1669858 1952063 1972796 1681978 1867712
5064 1867712 1930562 1701552 1762083 1910441 1434522 1178716 1725941 1707606 2059174 2764122
5054 2764122 1987213 2432182 2608546 2150538 2191974 2256949 2268736 2407326 1897978 1838736
5044 1838736 1468949 1689350 1411972 1781149 2262698 2191930 2379772 2098807 2227092 1963606
5034 1963606 2302788 2272098 2452106 2353559 2303662 3026272 3015734 2730683 2304165 2249279
5024 2249279 2697374 2742492 2983389 3428542 3692615 3755430 3537798 3047098 3745955 3589268
5014 3589268 3866471 3706408 3159632 3141633 3835756 4159445 4313808 4641642 4203101 4298893
5004 4298893 5017846 5319955 5918129 5917923 5513618 5709051 5785085 6023602 6492128 6644294
4994 6644294 7004687 7661732 8079395 8121437 9267921 9869331 10618525 10782341 11212781 12434596
4984 12434596 13209070 14092191 15121632 16374076 17277982 18612415 18446144 18029018 17769094
4975 17769094 17154584 16494191 15707389 14703000 13877812 13251534 12758336 12369292 11991503
4966 11991503 11329441 11306643 11247113 11178009 10473964 10409582 10049668 10199115 10192544 9938077
4956 9938077 10531912 10319589 10110709 10305608 10304555 11022063 10696604 10679231 11001893 11196381
4946 11196381 11224805 11241788 11377148 11211817 11630054 11537091 11781736 11584901 11487726 11335009
4936 11335009 11345782 11626818 11361441 11520113 11559427 11636470 11662468 12229469 12334298 11832390
4926 11832390 12286876 13276326 13821661 13718808 13608681 14047566 14160015 14292562 14958160
4917 14958160 15880264 16474663 17249946 18200426 19399510 20500142 21701304 23142740 23912178
4908 23912178 23887952 23326694 22633161 21219602 20186418 19081124 17593831 16096677 16023318
4899 16023318 15081910 14387254 13116492 12253002 11571966 11365711 11651612 11115756 10741002
4890 10741002 10357318 10050007 9553649 9491868 9337284 8930710 9136307 9254608 9562901 9359996
4880 9359996 9193963 9307815 9080990 8988460 9004975 8771185 9283491 9439351 9126097 9235055
4870 9235055 9042426 9506604 9527270 9505915 10069128 10219327 10184645 10145252 10292848 10176373
4860 10176373 10371542 10602176 10595522 11185679 11469022 11466761 11313580 11624464 11950025 12610353
4850 12610353 13105368 13310265 13194769 13344336 13608964 13762935 14509883 14463701 14969075 15515262
4840 15515262 16166813 16897121 16873566 17486606 17831899 17916745 17880894 18217083 19019226 19643550
4830 19643550 19954967 20330903 20812558 20932513 20741593 21250008 21786954 22075939 22369320
4821 22369320 22509853 22820114 23240448 23504829 23248664 24061231 24705801 24810468 25757099
4812 25757099 25879046 25884775 26189400 26016716 26417819 26319148 26971556 27158628 27220215 27092993
4802 27092993 27394615 27366116 26958619 26543094 26044370 25963692 25486425 24891296 23711399 23685014
4792 23685014 23462806 23033693 22756181 23274391 23543821 23185232 23284795 23629155 23488061 23462291
4782 23462291 23511184 24081517 24159907 24349161 24918936 24777589 25443721 25977652 26250253 26971894
4772 26971894 28020882 27950638 28291668 29028594 29327857 29925537 30190407 31443316 32070389
4763 32070389 33047182 33689882 34723602 35236960 36139371 36924117 37809735 38395087 39067516
4754 39067516 40274210 41245168 41724966 41603250 41636946 40895503 40075541 39267499 38014477
4745 38014477 36558052 35153371 33986126 32979623 31097060 30083459 29183980 27880302
4737 27880302 26452937 25710029 24874065 24493240 23490954 22263261 22139086 21685796 20912941
4728 20912941 19962838 19639988 19310953 18770604 18125311 18144671 17595173 17067797 16832851 17244778
4718 17244778 16668918 15932085 15973137 16062488 16011476 15284195 14785187 14373304 13977479 13821369
4708 13821369 13634794 13737376 13668435 13486062 13430417 12943039 12851447 12932084 12594596 12190437
4698 12190437 12150941 12047430 12584425 12402712 12050960 11906848 12282301 12071140 11996534 12361342
4688 12361342 12472582 12271061 12100437 12219078 12372068 12240246 12608670 12861527 12905380 13211861
4678 13211861 13800577 13705303 14231746 14393627 14403408 14957526 15069290 15491279 16059992 16632850
4668 16632850 17531784 17986591 18443661 18742254 19873583 20826875 21590835 22903851 23834791
4659 23834791 24555916 26045916 27218916 28129222 28285811 27976296 27880140 27472630 26885028
4650 26885028 26051733 24879177 24153806 23317732 22260273 21933512 21114291 20734160 19985234
4641 19985234 19137179 19179917 18780530 18871166 18689764 18462470 18512773 17950987 17998623 17863584
4631 17863584 17317973 17384789 17623616 17714596 17594415 17645130 17748376 17740516 18496391 18530997
4621 18530997 18334417 18203970 18059176 18787028 19548753 19691418 20071654 20522867 20956200
4612 20956200 21653334 22310285 22363204 22987103 23112792 23638560 23888640 24509749 25013705 25484871
4602 25484871 25525023 25158255 24699911 23950758 23526422 23589365 23225976 22634219 21790876 21599249
4592 21599249 21561050 21244344 21079773 21024791 20941888 20667348 20167621 19798320 19455702 19582983
4582 19582983 20161252 20154323 19579177 19649976 19896932 19554991 19213977 19391551 19494018 19348473
4572 19348473 19421934 19883697 19634501 19497247 19700559 19410850 19534013 19211465 19343269 19036176
4562 19036176 18553219 18755360 19072167 18819149 18993569 19229699 19133428 18767659 18711999 18457040
4552 18457040 18209409 17689064 17817799 18141528 18405171 18756862 18846430 18888128 18599398 18769750
4542 18769750 18613398 18785930 19118801 18981166 18401542 18147151 17687830 17247580 17000855
4533 17000855 16835994 16741856 16784607 16733911 16735532 16417613 16176063 16899106 16674675 16262845
4523 16262845 16191131 16281726 15816659 15416293 15002013 14940067 15458302 15361599 14922278 13863314
4513 13863314 14230653 14975329 14645236 14460179 14688560 14717430 14177215 14072865 14428514 14362444
4503 14362444 14030771 14417093 14347438 13658596 13640922 13792007 14082020 14311226 14205369 14445283
4493 14445283 14065886 14465353 14835333 14468832 15105660 14814179 13833600 13905760 13932591 13400248
4483 13400248 13369102 13672631 13620402 13538829 13157011 13656625 13255882 13286459 13525731 13989490
4473 13989490 13847482 13585135 14438612 14661132 14229810 15046411 15662882 16168675 16343051
4464 16343051 16571171 17675233 18658146 20109856 21142692 22102174 23303642 23927065 24703779
4455 24703779 25387637 25407119 24356646 22746723 21789489 20424964 19317071 17469124 16380336
4446 16380336 15832681 15393597 14958555 13956176 12834246 12499555 12877229 12120401 11805168
4437 11805168 11224321 11084772 11406947 10574034 10883804 10248217 10240520 9897654 9812469 9785532
4427 9785532 9493736 9263126 9694023 9125704 8122810 8484300 8215757 7892086 7783107
4418 7783107 7986055 8063716 8335759 8115622 7916754 7980219 8070541 8545869 8695819 8695803 8496682
4407 8496682 8424423 8184894 8090367 7933852 8396706 8731446 9117470 8994102 9463307 10117266
4397 10117266 10407758 10591117 10393567 11402421 11972432 13223421 14344247 14866799 15215098
4388 15215098 16373027 17681672 18313754 18249920 17733032 17446636 16912016 15958171 14697415
4379 14697415 13895499 12979718 12209991 11604082 10954395 10661513 10179335 10032619 9132718
4370 9132718 8675250 8796340 8361526 7992294 8090647 7897174 7970239 7144315 7113274 7018596
4360 7018596 7113081 7642364 7847062 7515117 7870507 7925339 7620714 7756290 7571088 7871864
4350 7871864 8123106 9167058 9307036 9518302 9917854 10110062 9704389 9353713 9152588
4341 9152588 9099501 9001567 7913254 7221963 7403059 7493630 7083048 6958589 7090473 6996782
4331 6996782 6472619 6816994 6999987 6973284 6902093 7211157 7189289 7674115 8070978 8380030
4321 8380030 8715028 8778837 9462754 10191709 10984488 11065386 11194016 10880594 10486300 9528974
4311 9528974 9287549 8345757 7446577 6959206 7009139 6619601 6278079 6074067 5621833 5336673
4301 5336673 5145503 5236639 4581292 4467239 4530084 4047701 4408524 4679489 4649413 4092021
4291 4092021 3814478 4062150 4382110 4480221 4692141 4145820 3994721 4158094 4139803 3755805
4281 3755805 3808104 3630124 3488916 4100161 4358453 4603813 4719357 5039891 4860921 5258273
4271 5258273 5745416 5916435 5990466 5822445 5978955 6463859 6351616 5751705 5177972 4793322
4261 4793322 4709368 4927028 4599288 4278288 3924896 3676331 3782220 3879456 3410205 3801495
4251 3801495 4251448 4020121 3953750 4260168 4009140 4161501 3754480 3554937 4050016 4278254
4241 4278254 4674147 4459201 3772519 3686016 4336347 4030256 3565688 3716012 3464423 3418054
4231 3418054 4032570 4112694 3559301 3990206 4314579 4453937 4121754 3938235 3915226 4095070
4221 4095070 4490685 4985574 4804892 4759550 5219216 5068561 4972461 5085494 5308664 5321393
4211 5321393 5079529 4593431 4584430 4868788 5254802 4854155 5592977 5851333 5456990 5583499
4201 5583499 4965548 5090517 5324715 5869030 6033782 5767681 5495737 5472902 5631018 5617454
4191 5617454 5786286 5561805 5528616 5362748 5534434 5750533 6228742 6403057 6566265 6409831
4181 6409831 6021450 5999523 5966829 6459798 6677707 6775825 6777442 6541300 6553988 6811487 7024629
4170 7024629 6789413 6366889 6671896 6616372 7205936 7648151 7763005 8130689 7881603 7711617
4160 7711617 7995688 8184544 8396523 8706968 8846271 8940982 9082354 8796622 8836922 9258086
4150 9258086 8985824 9201645 9592918 9949598 9616684 9524443 9862631 10036577 11009557 11558524
4140 11558524 11651073 11946539 11405904 11422865 11732131 12281775 12602203 12670427 12311396 12043375
4130 12043375 12169023 12395412 12820816 13168513 13133163 13469486 13716821 13957338 14160524 14186113
4120 14186113 14092327 14750551 15197822 15432916 15695165 15834127 16007048 16383969 16914314 17032268
4110 17032268 17230314 17905927 18649897 19255046 19270485 19500654 19813239 20711180 21860508
4101 21860508 21643472 22646783 23065514 23776229 24348882 25176641 25876528 27221218 27679129
4092 27679129 28773226 29816317 30326084 31579519 33564016 34809207 35304054 36717349
4084 36717349 37833397 39590062 41283318 42698917 43836754 45722601 47521102 49779890
4076 49779890 52075124 53739150 55588272 58038265 60249633 62401220 65144605 67257914
4068 67257914 69411922 72181121 74914530 77582469 81236722 84797323 88223224 91990206
4060 91990206 96299419 101751509 107474580 115134148 124019967 133548879 143627882 153588851
4052 153588851 161721180 165681309 164259820 158374889 149099919 139332579 130848432 123002103
4044 123002103 116010225 109314711 103607222 98635477 94237873 91161154 88167037 84788101
4036 84788101 81158674 78507278 76150149 73648499 71303831 69391610 67591399 65857936
4028 65857936 64231783 62529904 61145771 60349795 59418695 58116976 57625744 56763931 56245656
4019 56245656 55968016 55330918 54946480 54921935 54695439 54782093 54530563 54889292 55878085 56288888
4009 56288888 57103421 57796252 58712737 59588494 61305800 62717992 63994160 65415962 66756254
4000 66756254 68391555 69157079 69393063 69505612 68835989 68121340 67219197 65677798 64534620
3991 64534620 63122344 62419001 61539870 60501524 59533803 58981298 58168641 57596454 57406395
3982 57406395 57163260 56820808 56860284 56915704 57271318 57486495 57944922 58455407 59075887 59557086
3972 59557086 60664490 61149793 61344415 62198298 63607219 64954956 65983949 67771406 69590268
3963 69590268 71758625 73737469 76510920 79426429 82478828 85581766 89270774 94441085
3955 94441085 100104118 106390804 114864521 124256600 135308397 146751818 156721453 163836501
3947 163836501 166322176 163249008 155934935 147052802 139313719 132757291 127000206 122854123
3939 122854123 119248894 115960181 114247597 113203049 113002114 113398641 113430749 114683146 116560817
3930 116560817 118108540 120334134 123310222 125971174 129269102 132294716 135450938 139237931
3922 139237931 143059373 147919107 153474353 158443584 163155511 168276908 173656059 178498173
3914 178498173 184193574 189480082 194421623 198985798 203600280 208039809 211808972 215283506
3906 215283506 217287682 219401989 220591132 221626889 222518048 222494086 222047925 221507964 220636597
3897 220636597 219797314 219192850 217767554 216271681 215073568 213999279 212744329 210538331
3889 210538331 208893713 206722978 204102852 201948410 199999215 197493575 194702371 192560616
3881 192560616 190448194 187912328 185467271 182882661 180443876 178243244 176177339 173469653
3873 173469653 170949619 169487618 167580796 166139199 164719531 163268011 162123800 161000561
3865 161000561 159862073 159631971 159025676 158586247 158734221 159109182 159936466 161384996 162902183
3856 162902183 164526834 166548721 168300946 170539690 173028581 175928788 178929179 181953204
3848 181953204 184684526 187656905 190699410 193651279 196414721 198830046 200635136 201664667
3840 201664667 202244417 202364751 201430077 200357699 198027151 194808642 191501597 187769575
3832 187769575 183555076 178845018 174700929 170115256 165081232 159878139 154283788 149762139
3824 149762139 145339947 140570865 135877713 131478454 127369558 123284745 119068093 115473346
3816 115473346 112051884 108814506 105620967 102450388 99895158 97984932 95594542 92742426
3808 92742426 90678925 88758234 87467615 85645007 84451700 83459608 82739221 81685354
3800 81685354 80875422 80371312 79699068 79723655 79603655 79334446 79125771 78834378 78494530 78063752
3790 78063752 78368079 78152393 77909003 77583686 77870232 77490222 77316404 76943201 75854609
3781 75854609 75397967 74804174 74108183 73483545 72163452 70533496 69383178 68452407 67396394
3772 67396394 65466779 64363350 62888827 61331450 60169106 58920262 57642212 56239776
3764 56239776 54598649 52708274 51545179 49811080 48311415 47551281 46257435 45306501
3756 45306501 44185881 43559025 42674501 41700027 40993552 39674793 39255066 38981059 38414236
3747 38414236 37701814 37422282 37278161 36711403 36503873 36522732 36816826 36532525 36546134 36585835
3737 36585835 36611295 36465581 36099594 36845762 37222013 37258541 37233530 36805719 37098169 38015470
3727 38015470 38965137 39398012 39535740 39668158 40315301 40908826 41458232 42241398 42795478
3718 42795478 43415720 44143175 45580453 46470821 47382751 48192386 48581436 49737252 51121868
3709 51121868 52592417 53464524 54925782 56064333 57739296 59324661 60438072 62201730
3701 62201730 63656778 65001265 66095400 67315350 68869950 69772329 70612991 72324323
3693 72324323 73426250 74092837 74878004 75990403 76917289 77315669 78017119 78639966 78821134
3684 78821134 79252867 80457288 80546594 80469242 80779284 80635487 80375156 80764213 80604239 80708063
3674 80708063 81202519 81249208 81848194 82058653 82721381 83339708 84117174 85222489 86350740
3665 86350740 87546160 88599906 89960722 91846923 93787732 95463205 97641256 100232827
3657 100232827 102692141 104442134 106726458 109486449 112399107 115004326 117610078 120867390
3649 120867390 123361897 125897055 128517840 130928348 133113708 135225446 137123724 138789754
3641 138789754 140401297 142157162 143434475 145124228 146278516 147144261 147918733 148632775
3633 148632775 148954645 148939677 149521575 149063648 147993079 147874313 147683696 146517371 145896477
3624 145896477 145423224 145141988 144609867 143549683 143051765 142655772 141865428 140891338 140112154
3615 140112154 139288885 138500710 137518586 136953266 136056510 135646500 135700186 135523000 135638043
3606 135638043 136026632 136760814 136969267 137587269 138701713 139778797 141555162 143329321 144981098
3597 144981098 147098233 149232817 151273650 153297862 155249980 157686569 161195244 164438639
3589 164438639 167521164 171106865 174862472 178624812 183088922 187537640 191997007 195327673
3581 195327673 199622109 204785519 209544652 214191721 219094644 224659009 229655832 234919811
3573 234919811 240816810 246524810 252408033 259604377 266355015 272794624 279845719 287096612
3565 287096612 294645857 302148002 308915515 315520897 322107238 328277288 333940896 339900992
3557 339900992 345383702 349680817 353570568 356693293 359088807 361220017 362464992 363268402
3549 363268402 363434548 363343326 362026211 359974141 357712651 354706190 350931938 347301344
3541 347301344 342825404 337551910 332159710 326405061 321255859 315614088 309635351 303437029
3533 303437029 297860245 291946907 286271307 280565254 274849649 269077637 263953411 258327363
3525 258327363 253113592 248634664 243137449 237606687 232612505 227277239 221981814 216276881
3517 216276881 210491316 204944638 199128959 193454073 188116451 183226869 178158030 172721359
3509 172721359 167531543 162113686 157101628 152297386 147270303 142660070 137989713 133641872
3501 133641872 129501536 125123656 121706328 118307779 114351715 111174917 108263135 105959608
3493 105959608 102854945 100959100 98856450 96798632 95027649 93125152 91873310 90510448
3485 90510448 88969318 87329451 86531413 85697823 84634629 84152735 83986314 83959206 83394629
3476 83394629 83181345 83883120 83675981 84078790 84796363 85315009 86700828 87361155 88214459
3467 88214459 89656076 91804205 92983331 94738571 96412914 98315303 100665072 103140966
3459 103140966 105257053 106947431 109293912 111711754 113816604 115865293 117746164 119583093
3451 119583093 121825496 123584919 124934052 126653661 128016470 128614957 129382146 129914753
3443 129914753 130426423 130256582 130192518 129773632 128991888 128159739 126979501 125423798 124258546
3434 124258546 122666498 120248800 117960022 116282780 113466424 110779425 108576284 106253544
3426 106253544 103511807 101129911 98384418 95559503 93569399 90961271 88569420 85930493
3418 85930493 83680016 82535253 81389974 79751067 78022992 76487968 75637959 75165178
3410 75165178 74268900 74046415 74151722 74309676 74776364 75118044 75901751 76906509 78007567
3401 78007567 78884457 79567793 79439714 79217899 78281712 77639175 76797261 76249289 75570769
3392 75570769 75117097 75263367 74672423 74779427 74359805 74307903 73443783 72645445 71667147 71078262
3382 71078262 70167961 68985704 67812598 66704039 65648817 64552029 62740775 61012373
3374 61012373 59787841 58119412 56345246 55363488 54173557 52365753 51047681 49051540
3366 49051540 47355605 46019380 44556426 43395982 41795448 39961656 39138851 38182241
3358 38182241 36975603 35711019 34742457 34293396 33684934 32789080 31940163 30839524 30227398
3349 30227398 30012749 29357624 28894302 28294426 28072316 27526744 27273046 27621895 27315155
3340 27315155 26889248 26491130 26545845 26161067 25968760 26211595 25719610 25190696 25016060 24512474
3330 24512474 24492014 24586563 24679312 24457260 24199172 23965827 24083960 23895091 23689266 23606769
3320 23606769 23774672 23796653 23530850 23864238 24416812 24628705 24314209 24366997 24555501 24876868
3310 24876868 25089154 25372774 26364839 26377425 25858390 26279854 26724189 26764295 27418969 27753338
3300 27753338 28340867 28826208 28661017 29106843 28998593 29527539 29737762 30243326 30564042
3291 30564042 30401232 31155817 31593682 32147367 32973880 33697263 34323844 35213612 36037135
3282 36037135 36834471 37568676 38516549 39398584 40519062 41382331 42101916 42777093 44104515
3273 44104515 45218509 46295175 47888815 48899222 50000477 52170335 54562196 56770414
3265 56770414 59573674 61969079 64258921 66429345 69009919 71535939 73267011 74553327
3257 74553327 74918838 74165320 73525667 72687735 70937699 69277315 66916351 64849019 63252465
3248 63252465 61810900 59921250 58266243 56362385 54555197 52772273 51001618 49407523
3240 49407523 47224435 45267265 43874582 42447423 40200483 38845650 37083444 35739862
3232 35739862 34242228 33041336 31525561 29892303 28723031 28128507 27460471 26317177
3224 26317177 25070163 24119253 23678235 22951954 21958692 21626312 20710430 20207093 19932271
3215 19932271 19587582 19166522 18633147 18588849 17892216 17241635 17077402 16261816 16160208 16893354
3205 16893354 16296942 16392568 16332653 15483865 14757165 14277747 13894212 13947068 13399918 12922786
3195 12922786 12811029 12796617 12834243 12602521 12206012 11687716 11362945 11334397 11080941 10629334
3185 10629334 10775682 10835650 10576345 9836684 9316464 9616114 9791089 10119202 9851776 9429501
3175 9429501 9071174 8594814 8883533 9654453 9570820 8675454 8246127 8659287 8772208 8317371
3165 8317371 8575131 8924382 8147556 8140285 7720595 7166481 7269785 7601405 7463304 7058809
3155 7058809 6885883 7021473 6943463 6828579 6763596 6886132 7261846 6700147 6368290 6583045
3145 6583045 6435083 6474797 6648996 6435313 6484398 6302602 5934064 5328195 5548643 5563510
3135 5563510 5476436 5297914 5148507 5246004 5619703 5509939 5460555 5483758 5225388 4863585
3125 4863585 4597018 4706609 5009842 4940302 5051114 4780147 5023144 5029711 4739321 4487255
3115 4487255 5029591 5202641 5034812 5001767 4665382 4674093 4546284 4448819 4828448 4329413
3105 4329413 4258841 4108474 3797196 4017561 4174023 4101584 4006477 4487018 4260377 4137958
3095 4137958 4266285 4476097 3988676 4105872 3999495 3941147 4177346 3934149 4206295 4022579
3085 4022579 3755801 4160931 3756038 3692579 4005889 4210271 3811881 3834510 3834641 3578814
3075 3578814 3654873 3865863 3660709 3573028 3975814 4297650 3912815 3728214 3498978 3178163
3065 3178163 2956410 3122099 3278222 3562713 3971854 4094818 3676859 3439907 3321972 3344389
3055 3344389 3631328 3856995 3709984 3464885 3124147 3409415 3749422 3435513 3161610 3160803
3045 3160803 3268197 3308788 3273476 3355554 3155585 3092698 3145868 3049343 3420674 3701276 3746403
3034 3746403 3849405 4235321 4085738 3962011 4163481 3898158 4241460 4390760 3986317 3737472
3024 3737472 4104883 4270873 4457756 4388547 3902638 4040704 4239627 3961002 4130039 3811144
3014 3811144 3605611 4337301 4086350 4390308 4162362 4511980 4710897 4756061 4448342 4039085
3004 4039085 4679943 4831774 4245350 4596521 4732369 4748187 5570981 5875303 5066569 5293412
2994 5293412 5286863 5202268 5274923 5206985 5502001 5480617 5518475 5690996 6264361 6108643 6117569
2983 6117569 6440647 6467071 6710820 6976252 6788389 6608301 7039833 7049047 6925311 7127284
2973 7127284 7324616 7398550 7908626 8118844 7835069 8244463 8835345 8976555 9058541 9335326
2963 9335326 8804533 8886222 9575630 10060525 10265357 10354370 10535355 11394969 12064391 12428213
2953 12428213 12653468 12837800 13628907 14599670 14928508 15197544 15623141 17058798 18164372
2944 18164372 18930572 19276820 20386196 22386136 23452881 24642382 24948310 25864096 26590276
2935 26590276 27216724 26947231 26894243 27117530 27029673 27484350 27951452 27792211 28349462 28189491
2925 28189491 28303164 28744851 29229716 29208605 29555049 30646882 31347466 32254808 32677602
2916 32677602 33684059 35385563 36807630 39005450 41294963 44448374 46707441 48236139
2908 48236139 49217589 48523911 46579667 43689123 41220607 38788998 36224907 33907438
2900 33907438 32095146 30404368 28875206 27912835 27443331 26101072 25393576 24934576 24349508
2891 24349508 23957891 23773217 23379141 23433327 23158212 23063665 22954873 23382820 23247174 23093402
2881 23093402 24122083 24268392 23971229 23951410 23888359 22963122 21924369 21218156 19738268
2872 19738268 18959290 18093462 17157184 16218110 15415221 14373800 13887342 13222650 12783860
2863 12783860 11831619 10517597 10297471 10844534 10895103 10142397 9367584 8862416 8467654
2854 8467654 8285135 8200204 7963060 7326039 6821216 6664158 6717054 6755858 6857801 6494530
2844 6494530 6371113 6130185 5677603 5498543 5384493 5168310 4825399 5386725 5191667 4942814
2834 4942814 4796742 4409591 3944571 4095947 3913855 3840234 3856549 3496586 3434634 3198266
2824 3198266 3388654 3524809 3234809 3225419 2791073 2993737 3219219 3500186 3532597 3437089
2814 3437089 3574120 3235529 2995025 2871670 3430013 3041106 2862952 2583444 2267864 2987190
2804 2987190 3100497 2869652 2420892 2525373 2763937 2523675 2836829 2590856 2098569 2248700
2794 2248700 2549661 2430961 2196303 2383979 2183204 2291917 2611425 2670243 2437999 2201169
2784 2201169 1697677 1937665 2241609 2405810 2376874 2925576 2823058 2417434 2535447 2637974
2774 2637974 2731565 2349077 2503650 2819867 2237591 2263097 2768531 2820728 2649437 2981359
2764 2981359 2650039 2723923 3069785 3641641 3729838 3383093 3124340 2827128 2541174 2160614
2754 2160614 2357640 2506309 2589299 1968940 2185307 2299338 1830055 1810037 1800823 1584491
2744 1584491 1759827 1585431 1251690 1266166 1669953 1430122 990188 1404758 1586568 1524848
2734 1524848 1398989 1281095 1255459 1372662 1539839 1522080 1511045 981506 636786 1010557
2724 1010557 810839 766073 826797 951576 980883 1403431 1481217 1150734 1590376 1482412
2714 1482412 1798767 1414831 934222 770178 472591 937146 1093587 1190645 823520 754759
2704 754759 988412 962108 1007058 889491 438578 890917 729542 942110 519926 14227
2694 14227 418111 633546 634501 912008 965415 811513 998648 437154 617889 607027 1211796
2683 1211796 599869 541778 877177 646204 456810 689892 920864 985167 602088 847251
2673 847251 883574 1288175 795040 418851 343300 304054 542201 244377 482598 -209075
2663 -209075 -402551 368799 994433 1208423 1415176 936584 653142 79740 -47684 298400
2653 298400 455740 922312 781641 733989 593179 678633 888936 793237 725637 756046 905525
2642 905525 470323 929838 892322 775517 577589 365663 654967 623435 461244 316268
2632 316268 478511 270521 531208 1206132 900215 565864 286242 1056651 947023 439576
2622 439576 473912 57057 284024 945029 1195519 1264321 713904 474573 1235126 1186826
2612 1186826 1147463 843467 627985 644312 524072 384972 340190 263753 445283 59080
2602 59080 406484 1001397 241157 113987 535687 744364 775257 917674 566102 296157
2592 296157 964860 831570 650370 964792 807754 797754 1006673 1171302 1021017 912594
2582 912594 762720 757166 1013022 916973 718186 732242 455991 332561 1085684 899905
2572 899905 79628 -117770 234689 -362488 -504109 -498232 37158 353029 388583 272630
2562 272630 611664 512373 206814 100326 -100878 21572 -114384 -277122 -260952 217360
2552 217360 176875 375679 637098 742299 132454 204849 179591 294118 320057 445386
2542 445386 153949 200430 207070 275984 323687 167600 274796 -87881 153067 296456 118582
2531 118582 -17655 123012 226932 388255 139142 -600540 -549171 -431372 95563 136824
2521 136824 308945 128024 387498 509305 627647 530008 445625 219817 -182363 -212944
2511 -212944 -116109 -297813 -244651 -78540 175419 566464 97434 9706 -102296 345238
2501 345238 486935 306638 284053 398355 206549 -191141 -13503 61683 171481 -85205
2491 -85205 -152431 153962 524857 650493 409912 764066 741656 792287 635486 359727
2481 359727 252171 525350 1039054 829249 665991 670285 369094 587520 186158 182209
2471 182209 -13002 -49238 175288 -81167 173670 167109 -339057 -502001 -41710 46665
2461 46665 -470034 116968 357736 110709 271799 65800 198623 7274 462009 136034
2451 136034 -214847 -160286 497270 435724 637394 533249 133374 347167 125961 241840
2441 241840 191980 510535 383785 357040 285264 816271 329552 361523 221809 -66629
2431 -66629 -315123 187953 -53096 -156012 240206 39447 28274 -115870 266826 170280
2421 170280 -21998 361478 332129 446766 55977 61975 122390 20044 580591 576647 29069
2410 29069 297587 451783 239460 72376 -325867 -160295 -435887 -323834 -344173 -396827
2400 -396827 -338650 94113 -49526 719161 93260 -594377 -427663 16490 100864 17505
2390 17505 326347 -187150 18207 -171334 -444578 -539046 -42647 14587 -352477 -500953
2380 -500953 82316 533155 412466 563688 766098 784032 791605 1264057 1128531 1002909
2370 1002909 1004686 851284 1105201 1130104 1019806 190674 -26451 480255 221695 415672
2360 415672 463745 225950 824290 460511 147147 156730 283795 -97434 -204953 -18219
2350 -18219 51332 464908 445650 310962 -48733 410423 76485 -40478 -353436 -61589
2340 -61589 -367194 351950 257260 340158 662741 583310 228846 -205477 438445 313570
2330 313570 275507 142085 440373 29242 -516522 -344241 -92672 116893 158730 26289
2320 26289 -45889 -450702 -10355 234816 173891 314870 582399 109161 -112969 61665
2310 61665 226558 836238 1038047 745839 307773 -113110 -4535 278707 648329 448509
2300 448509 -52430 49638 288273 704106 944072 1193530 428487 113513 384932 255992
2290 255992 6219 284671 684119 804011 540092 295612 696701 965917 531648 218363
2280 218363 558746 639163 799768 563762 688336 938299 1093468 567883 381430 270357
2270 270357 -252844 748377 1248682 723356 -252639 -109069 78658 414382 450632 594915
2260 594915 408435 488451 641408 711866 779891 521195 362263 661275 1043152 616563
2250 616563 658158 336119 908083 703591 514125 -54308 -6090 420369 258154 49755
2240 49755 755974 871781 1041285 960168 784084 1027010 972531 871470 960971 748560
2230 748560 554904 583900 655626 933179 632377 473583 234073 720261 1100721 1023700
2220 1023700 1065671 1104901 999957 1030032 973124 1087838 1102020 1271595 1130504 1214597 1518119
2209 1518119 1130003 1363006 1433224 1378061 1510858 1446525 1371866 1692787 1900498 2237730
2199 2237730 2239067 2468900 2217741 2361996 2911936 2561702 2891850 2757522 2618310 2385015
2189 2385015 2852253 3054867 3454343 3740036 3048170 2349697 2516667 3011953 3327429 3107528
2179 3107528 3332977 3573215 3758457 3635067 3520717 3888956 4089667 4367305 4046569 4375865
2169 4375865 4276111 4663056 4460094 4371976 4622661 4730630 4661566 5047685 5177570 4934317
2159 4934317 5380933 5787332 6060262 5976490 6476438 6462671 6594400 6533633 6704471 6647230
2149 6647230 7139426 7765086 7942902 8328411 8544756 8778125 9180085 9676334 10477831 10871226
2139 10871226 11329828 12199603 13343590 13907692 14501904 14619917 15202384 16419716 17553106
2130 17553106 18598525 19310996 20694910 21868670 23391891 24866794 26936638 29139476
2122 29139476 31134599 33102813 35597413 37741652 40412101 43729980 47567534 53442026
2114 53442026 60480574 68820327 79954960 94241111 111621903 129485959 143505033
2107 143505033 150782580 146381935 130690764 112677061 97271562 84717015 74816783
2100 74816783 66351433 58927794 52785657 47391642 42733557 39290825 36986018 34953956
2092 34953956 32814337 30237872 27975306 26107202 24963756 23065009 20890269 19615579
2084 19615579 18541040 18091656 17490616 16584174 15811704 15282499 14086987 13171870 12797071
2075 12797071 12597168 11591155 10813037 11215201 10900188 10382368 9484579 9056377 9140559
2066 9140559 8720494 8277525 8242569 8098643 8077610 7715047 7184038 6892908 6701651 6713061
2056 6713061 6331371 6722139 6433988 5924718 5875364 6300514 6372205 6129130 6025568 5773501
2046 5773501 5496765 4802019 5155587 5467254 4797414 4322030 3959243 3883168 3960141 3910892
2036 3910892 3897556 3720276 3568912 3155096 2815936 3222884 3281821 3425555 3012093 2277807
2026 2277807 2356021 2378271 2285398 2132346 2511618 3123218 2630134 2167262 2463236 2579816
2016 2579816 2678976 2341232 2688337 2737891 1936677 1689341 2040526 2041303 1600800 1898733
2006 1898733 1781997 1766506 1734890 1423783 1550541 1536492 1762901 1639621 1229317 1586699
1996 1586699 1936910 1962682 1231629 961665 1253061 1076934 1429571 1287190 1292461 1144900
1986 1144900 1102076 1540758 1260242 1461969 1503837 1083679 922625 1277122 1049298 907276
1976 907276 789828 1004260 910727 1120376 1246035 801196 896286 1257063 1282481 1249953
1966 1249953 1318231 1359169 1378556 1200451 669765 680668 690952 794322 1425944 1583024
1956 1583024 1438892 876909 843511 605440 687367 994266 1019639 502814 244258 740057
1946 740057 1167448 643891 428376 632191 479857 284352 443797 636234 710980 407026
1936 407026 376787 470341 1498180 1310234 1138406 726695 833477 992680 971944 1048192
1926 1048192 1062880 1139413 1145792 970935 405119 301958 -92047 306092 773925 731391
1916 731391 418164 368733 714881 663272 499088 557996 383326 242681 709677 571783
1906 571783 712319 942983 992769 647142 425043 590792 266796 344788 256702 661236
1896 661236 544805 649219 511280 529659 582881 409559 403823 428683 492935 353943 369249
1885 369249 644343 875844 531168 358614 493438 251087 1886 -50233 155483 149549
1875 149549 90159 -309544 -238725 -369922 87487 -53006 164432 53563 141143 -54
1865 -54 -185674 -11575 -12655 286194 226809 300018 217112 297764 759506 452279 678884
1854 678884 736259 898941 905426 358961 -184727 -325467 149685 143740 -309448 560883 778239
1843 778239 -122715 309103 760562 826450 763692 1127634 1575717 994259 556984 629552
1833 629552 511237 572250 280943 294942 184069 115908 349714 1073655 677378 553683
1823 553683 348688 790705 924451 622978 488793 362916 -3731 133535 62699 67576
1813 67576 307881 147735 46974 -56653 395027 494653 410701 648340 437940 227912
1803 227912 309551 74063 -76869 573275 896715 595310 162544 -94811 306463 83575
1793 83575 -6024 -18404 -81385 187671 108989 318188 286381 657638 330531 218199 124388
1782 124388 29562 -22433 -535955 -304083 -162408 120228 -421751 -375301 -408502 -560169
1772 -560169 -115436 -115028 -54988 130085 469334 762917 -197844 273366 283378 341498 733515
1761 733515 391994 201959 -537844 -234778 -130927 67781 141075 251212 347737 749490
1751 749490 648651 274684 328627 44580 -225592 -439255 -278505 95644 337433 256830
1741 256830 -200963 -440076 -883387 -542062 -373410 -85722 550767 335346 185326 131112
1731 131112 -267627 172234 1702 -520779 -119336 282960 227609 329719 696404 422544
1721 422544 116708 301912 437435 -90739 -136741 -60740 494821 289315 109976 383373
1711 383373 513111 92505 -220712 -423044 -212571 -346545 -813937 -1177990 -909730 -804806
1701 -804806 -327622 -104950 -70649 132225 -385767 -633884 -167264 106379 -245561 -116790
1691 -116790 278152 253690 -284646 -367331 -334256 -161203 -85378 319374 -56903 340871
1681 340871 83903 191649 507805 247629 371986 89027 326885 86721 277388 533109
1671 533109 361905 575641 407992 446329 552806 391546 531193 365526 -90377 -286472
1661 -286472 -134030 -363455 -526594 -471202 -259367 -293358 -635344 -618369 -227574 -204928
1651 -204928 267773 495072 -48641 -144216 82181 -762252 -950598 -375988 -10377 -233429
1641 -233429 -647258 -538198 16497 219923 -596389 -941281 -1082350 -935784 -684158 -417892
1631 -417892 33959 98360 -77129 -79520 -205488 -112460 -164385 -223530 -77978 -132243 -146781
1620 -146781 -300309 -233908 -519448 -564178 -343950 338728 452472 341630 117029 -436833
1610 -436833 -501728 -330796 -378142 -302823 101913 153777 -1780 288737 -203606 -342147
1600 -342147 196777 474196 646232 356633 405885 105449 -51506 -208770 -475618 -378758
1590 -378758 -625612 -685190 -410487 -202870 180287 65563 168513 177077 484082 -237688
1580 -237688 -558220 -344420 -392809 -197265 180272 326260 385569 -244623 -21297 -175550
1570 -175550 -219746 -246100 -248318 -107360 75444 300403 259036 66985 241257 568656 228386
1559 228386 -570016 -268993 302795 22235 -178058 -57195 473212 93979 126281 222093
1549 222093 69052 393314 418729 605244 352743 81921 -141604 88086 243937 -203927
1539 -203927 326064 -275183 -549757 -101648 72939 -85583 8027 -354857 -365959 -512553
1529 -512553 -320687 121371 355297 -102837 -99672 -127347 -502230 -1042785 -725141 -238968
1519 -238968 -349533 -269741 -392598 -250308 -253438 -219947 -520047 -628705 -279159 181888
1509 181888 -212242 -112466 161998 -315874 179089 -269652 -150464 237860 -96516 -39803
1499 -39803 -42301 -511261 -313548 132170 -346805 -221241 263762 -180817 39666 258255
1489 258255 -87901 -17007 -43010 -420519 -954252 -443839 -65604 -73312 158626 31976
1479 31976 35636 284594 250771 -67598 -93741 12460 37754 -492012 -286031 -13648 129342
1468 129342 297028 155137 178136 694816 775829 616929 569360 28953 187767 33688
1458 33688 -84596 100364 102936 -350414 -64304 -275271 -182780 -345622 -72350 60142
1448 60142 243284 94822 263193 119068 -52402 -100621 579927 431767 -259344 -336674
1438 -336674 -13407 -293252 -456032 266338 -77993 -483103 -477115 184430 297703 676966
1428 676966 411413 31725 96230 598477 396880 265285 -81866 -360366 -403033 96549
1418 96549 506652 223879 -19478 -319386 -356846 -287035 -46647 -17283 -246184 -216377 -160503
1407 -160503 -95004 -430135 -373972 502777 22043 40068 -279870 -172647 -365243 -620322
1397 -620322 -468426 -90623 406013 369180 197900 -305645 78760 97631 113902 -162182
1387 -162182 -152630 -208835 -128136 -527418 -77441 488796 264961 130007 -238601 -293332 17357
1376 17357 -51273 95155 75315 233736 -166224 -339995 -725883 -552625 -161969 -237340
1366 -237340 -139018 -61451 216662 109577 -365723 -435047 53778 -328531 -175312 -290049
1356 -290049 -262640 -372400 92047 188042 120802 -147959 -75395 75027 -226174 -520670
1346 -520670 -9552 -192016 -175336 370451 -177523 -458312 -525401 -389782 -154264 256258
1336 256258 151823 97166 3583 85941 189087 166894 -37748 257074 -24982 252222
1326 252222 181880 -61398 327806 630471 146661 183920 -451457 -311359 -48862 -163333
1316 -163333 -197705 -405160 369776 -38655 -228200 148845 598208 379193 -136232 -377735
1306 -377735 379595 325022 129783 -134798 -1760 -451625 -288380 -192141 -299037 323952
1296 323952 153966 166461 -15147 -110322 19569 -521402 -735726 -301241 -458350 -471182
1286 -471182 -290920 -119789 537689 651966 541074 307653 48777 -216053 -893320 -575538
1276 -575538 94982 391017 137067 -168669 66253 460080 105861 117190 161303 -71810
1266 -71810 179310 298330 337349 47325 -265868 -321042 -305821 -540509 113758 178202 -204449
1255 -204449 -225137 -248108 22431 206803 107831 -29162 -264937 18000 -144020 -127422
1245 -127422 246454 137530 94017 -131272 -57630 -150484 -436865 -364961 -95210 61752
1235 61752 485328 270926 225550 190778 -40422 115353 -42021 66897 -325582 -623945
1225 -623945 -275555 -352552 -298701 -239495 79467 44702 -149397 -471112 101033 -37942
1215 -37942 -310373 71589 -339655 21564 33518 68230 -220678 -237580 -261452 -160523 270951
1204 270951 140535 -319747 -486651 -525811 -530474 -48344 49132 316261 544457 -231319
1194 -231319 -416051 -28104 -138921 -16656 30543 -497471 -246459 268383 -164688 -204109
1184 -204109 -290360 -350484 254258 -112250 -321459 129122 77019 204646 -137244 196520
1174 196520 212483 -248739 -369214 -347383 -87820 101453 -267968 -130641 -203328 -157599
1164 -157599 -340871 -70095 -203351 -215837 44201 -41407 67865 -28896 -296628 -32899
1154 -32899 -45278 -251489 -141069 -310480 -119940 235 -107175 -120316 -284025 -93729
1144 -93729 374864 579351 341273 108518 131052 -150623 -148692 -734646 -536279 -92673
1134 -92673 -789050 -540982 -108587 -429708 -604220 -431250 -82191 -40578 87919 97858
1124 97858 591247 844919 771509 153750 10757 330384 234754 -365290 -794984 -528068
1114 -528068 28356 -167215 340815 544389 622528 313314 32848 -205082 -314189 -42383
1104 -42383 116689 266223 -395147 -735259 -444947 -48549 -22924 629133 -171325 -594469
1094 -594469 -191462 -332888 -691417 -554821 -523260 -405335 -227142 -107350 201840 -28680
1084 -28680 437362 150441 -166951 -133221 -81228 -21287 -136734 110953 498805 -193413
1074 -193413 -295786 -70045 -18545 35294 8158 380471 86656 -234175 -21406 46356
1064 46356 115711 254231 -87335 65613 392677 260800 204575 147324 301653 -443296
1054 -443296 -651737 -214650 369027 -54908 -455664 -67373 86147 338592 306714 353055
1044 353055 203886 316407 412428 3844 -414797 -491140 -256847 45985 318915 669855
1034 669855 205006 234543 -43559 -602590 104590 318142 122302 -45584 254362 149269
1024 149269 97520 251222 -1242 80409 63992 -55159 -444647 -188430 201336 183452
1014 183452 219487 410025 632569 572875 177390 269858 343599 393665 82159 303578 301648
1003 301648 19300 -569775 -884689 -880712 -906807 -326976 -264244 -120116 -353203 -826922
993 -826922 -1007430 -96801 34 17623 -389681 -473171 -32261 231493 -33778 -576725
983 -576725 -379904 -165026 -87678 -933922 -533076 -199600 25098 50400 477331 480511 318341
972 318341 -19388 -17263 -115067 -112703 -143442 -24737 -75382 -267569 -427533 -447882 -369033
961 -369033 -13107 -174202 357959 749096 28068 -102301 -51996 -277775 -40689 -192473
951 -192473 -311993 -39618 -90129 -186947 -208222 -165199 86101 372451 479494 311154 184227
940 184227 27115 278223 540242 240882 189959 63431 280522 339134 -265203 -676945
930 -676945 -469657 -343123 -307803 -350114 -214389 -366324 -390404 -479680 442034 163729 99567
919 99567 22070 91305 -111811 -185994 -155015 -180882 -17398 26082 -48002 286436 194821
908 194821 -423677 -306766 148715 99593 59566 -296831 -151009 -324873 -201305 38363
898 38363 -193444 -234729 -242056 -55833 299913 38102 -18129 -195792 -385188 -347588 -92746
887 -92746 76167 510474 358815 -251878 -45550 25298 119334 108361 386633 294794 470638
876 470638 275910 -56080 -212036 -188908 233196 -455960 -816866 -787182 -144530 -272515
866 -272515 -357684 -436488 -413307 -432420 -236409 -168391 -319592 20203 -8807 -494488 -610731
855 -610731 -81339 -200411 -204744 128850 175369 -243430 -420914 -771543 -303603 -356149 -112407
844 -112407 -639758 -85147 155121 390902 252887 136118 442489 99444 -222522 -160336
834 -160336 -369693 -33031 -17453 -219118 -210517 15684 -269460 -356648 96949 233648 35553
823 35553 217974 364602 429000 -58373 -484306 -158052 235642 222270 226157 211366 -84742
812 -84742 -589764 -354487 48795 -444160 -569869 -594399 -203411 138070 -240471 -347003
802 -347003 24200 -147455 -127410 -41339 -518325 -768257 -319580 84783 232413 -238273
792 -238273 -276045 24907 391449 8320 98976 158286 -414696 -801786 -917424 -629252
782 -629252 173902 280220 185070 -67350 -495103 -555142 -225397 188567 -400322 -617408
772 -617408 -527349 -9090 455649 107857 -107645 -193514 19692 210917 405569 315784
762 315784 212384 449956 618451 371506 274341 145434 229283 -35880 -265611 -41194
752 -41194 22076 -105760 158288 419086 80286 -206170 -209445 -505651 -535448 -542885 -369628
741 -369628 108192 -587813 -568824 227058 -200978 -305775 -217000 -405131 -604510 -1073700
731 -1073700 -709972 -518840 -435308 62025 202297 657510 410696 -271110 -274507 474871
721 474871 56178 -588280 -589939 -359307 324904 52780 117048 -131136 -420710 -386887 -444700
710 -444700 -271502 -263653 -87435 -110338 27842 651907 320357 1605 -295590 -290086 427715
699 427715 96475 -4053 338199 73706 66938 -213107 152513 -93530 13310 170012
689 170012 -33124 -163168 -522008 52594 -487835 -551371 350558 475609 -130500 -58085
679 -58085 213339 208439 444984 105046 -209394 104495 -448718 -197516 -401821 -438110 -109994
668 -109994 107611 215762 129970 453687 261589 -258843 -378337 -14464 -243510 -663880
658 -663880 -509542 200891 55683 -150601 -33733 -209714 -326467 74363 -130103 -144184
648 -144184 -402862 -420904 -120733 57347 178660 448285 558631 739509 389419 192321
638 192321 193534 6692 205716 121556 138306 -179036 -240911 126936 -69615 14297 -75938
627 -75938 -296217 -410582 -96964 138567 -19629 45571 -207702 -299057 -261517 -126869 -29830
616 -29830 -256310 -303454 -168533 -152341 -121726 -136765 -171282 -206401 -60868 326991 449845
605 449845 -122086 86500 200294 -87006 -65643 -180616 -226334 539993 189785 -104214
595 -104214 -365034 89100 206517 30155 -61140 101271 423848 439253 271177 -52748
585 -52748 -303938 -390858 -136878 209756 358557 124656 304521 27175 -28580 381886
575 381886 263976 318922 -56442 -358828 -141898 -367645 101087 231062 162182 -175340
565 -175340 -33179 -288582 -365254 -615029 -403717 -382578 -157211 181259 90409 -247805
555 -247805 -243757 -208286 -175361 -476623 -467808 118741 322433 484141 188881 -408702 -557762
544 -557762 -157104 -224209 301491 390141 42109 -329956 -80926 -22334 376724 -91589
534 -91589 -504399 -224634 -217178 169384 134655 225328 324100 331995 -129642 -265091 -556032
523 -556032 -302993 -179891 -125957 -9017 -169043 -1440 402663 348498 528285 476045
513 476045 185162 -302636 -524636 -269253 -795540 -901695 -560608 -144197 -626 -93615
503 -93615 -444442 -134137 -468536 -200433 243662 364387 455239 242589 276874 -110221
493 -110221 -506216 -385925 -485925 -276233 -3328 -60488 -379825 -304106 -199418 351764
483 351764 676385 50824 74347 -77549 -129627 -250883 151103 724719 336118 -5241
473 -5241 283498 -236127 -701035 -420061 -968700 -736080 -268738 -60121 16147 -251930
463 -251930 -435858 -65572 244049 222076 350606 452953 219074 2685 454564 168580
453 168580 143999 -55260 -88965 -170943 -206601 -377812 30813 -115936 23562 436524 295009
442 295009 228520 -86503 310415 223288 281751 -268343 -627838 -130138 127605 352220
432 352220 343223 282556 -258855 -108584 -202396 -509198 50887 -169039 338602 166637 488397
421 488397 274153 -23353 -225399 -258812 188728 39542 -155419 -204098 -162846 -23910
411 -23910 131454 284144 642468 829772 -14430 -371699 -87800 173535 -82183 74985
401 74985 304401 -98471 608223 668888 374506 532274 683243 74150 277555 631191
391 631191 583841 616348 155691 -52390 73955 -195187 -85459 233463 198247 391629
381 391629 -32125 -96690 62475 72158 121454 44621 -61251 123475 470011 250074 260547
370 260547 -67671 -144667 48246 486974 417619 242758 139119 -98221 80963 52770
360 52770 180622 383567 317074 505458 186956 -124991 -322208 -440910 -100082 521713
350 521713 257263 196362 295189 -275858 294399 372338 -158165 -13311 340346 531849
340 531849 162473 151996 95382 121513 110187 424053 685688 389307 573715 377422 412778
329 412778 252191 161447 -158537 -441611 -480190 155754 722986 166273 -200103 -181947
319 -181947 129694 86126 352086 236308 99161 -3732 16588 115789 -62271 61821
309 61821 568719 841129 824819 498079 815230 991428 321457 -154984 -328165 167499
299 167499 398157 146904 642039 650051 531955 272860 180901 150644 -261589 -145598 162342
288 162342 631764 600335 89252 108909 913588 1126714 218377 65882 44575 623347
278 623347 690481 166502 88126 380101 756210 583765 442753 507644 607550 410648 198984
267 198984 -116177 223831 368632 522842 119572 446938 308573 420576 867854 275014
257 275014 -175152 12502 57477 -78588 -310371 -483480 -210355 149717 671830 541569
247 541569 643657 901801 103845 525963 329541 265976 66283 -217025 109861 230791
237 230791 340242 160486 170958 -21197 -291214 -67099 272129 189713 116577 243816
227 243816 -190487 -534897 135999 470150 472713 422935 112819 96622 387488 631036 441466
216 441466 441386 138811 154833 406789 198834 359857 646621 257514 128403 185507 346257
205 346257 333213 486466 312153 217806 29511 -419320 -164937 -40621 -260373 48057
195 48057 482015 245889 80733 256286 257980 449061 320348 481337 774774 189874
185 189874 19420 -81216 409485 297688 62140 -78537 -74906 -45759 122140 287086
175 287086 -65481 85233 467339 119363 15284 -262277 193414 486759 412673 216348
165 216348 495787 507282 500557 353390 325702 607375 549209 491470 -87406 -57111 152948
154 152948 437712 410516 153289 173996 -204052 174016 510309 434195 446372 231682 162308
143 162308 436733 85698 162958 532197 357286 227759 143990 123027 463367 -9405
133 -9405 -33545 72449 83400 169578 145567 262397 -9077 305431 413997 314383 362907
122 362907 348846 250415 305426 327205 286525 95882 59591 223956 116220 169066 641073
111 641073 944644 841047 609669 548272 252591 151414 -23194 315020 536565 222800
101 222800 217004 161162 625604 615835 677666 223157 238058 599298 377278 231407 273699
90 273699 362633 291675 54743 189304 282395 122092 659171 810923 333878 -157357 -47906
79 -47906 500552 284086 260029 238932 116214 435817 596355 368796 35679 418792 200891
68 200891 -109176 266712 183111 -24869 159513 386005 777776 427267 43153 63197
58 63197 208451 435472 628643 23163 193966 170448 441956 784219 343073 529032
48 529032 586509 77644 52625 55574 301651 164194 317577 81402 -93470 -247868 -52588
37 -52588 152939 374420 377161 305772 484666 652238 432012 357333 80448 93629 318406
26 318406 439183 282995 277084 362548 295707 87176 -153176 205004 391560 329127 287273
15 287273 214280 -31306 428883 527073 658411 408416 104834 117347 379814 476813 480158
4 480158 371909 303091 371928 160313
0 160313
$$ Imaginary data points
##PAGE= N=2
##DATA TABLE= (X++(I..I)), XYDATA
16383 -3207219 -3133490 -2738925 -2712871 -2542204 -2979636 -2802118 -2700333 -2556827 -2372806 -2084208
16373 -2084208 -2026620 -2048959 -2163791 -2435514 -2431826 -2168729 -2350584 -2443051 -2089912 -1915199
16363 -1915199 -1727556 -1412046 -1705949 -1645630 -1479158 -1429264 -1337790 -1472417 -1405934 -1288143
16353 -1288143 -1211176 -1107338 -972097 -907146 -987372 -865735 -721845 -563878 -453343 -756414
16343 -756414 -539188 -574501 -514385 -565580 -784130 -604118 -642174 -354203 -290045 -103744
16333 -103744 -136040 -315467 -406038 -577602 -245256 -142490 -200854 -191106 -289305 210439 496526
16322 496526 342837 15783 258920 409885 421852 578050 441493 191020 184196 856306
16312 856306 793188 802887 860794 893694 861111 1083810 936934 991316 966781 1406512 1087698
16301 1087698 1611153 1403456 1060765 1122517 1596826 1591817 1142783 1399854 1333472 1411093
16291 1411093 1178794 1503769 1710815 1501999 1660336 1721031 1652359 1857884 2082499 2222264
16281 2222264 2251956 2216007 2509941 2480088 2558230 2248690 2431257 2730585 2360247 2429401
16271 2429401 2545019 2518226 2725187 2788268 2509314 2736122 2775603 3051320 3372456 3100330
16261 3100330 2955077 3150479 2943686 3296557 3580279 3502624 3132872 3415060 3609154 3108714
16251 3108714 3034760 3193845 3358856 3468525 3590435 3655190 3565900 3665855 3869555 4332843
16241 4332843 3472283 3407914 3683306 3392142 3675015 3798158 3997055 4074787 3648673 3425043
16231 3425043 3814838 3827986 3725103 3707359 3698747 3529235 3679940 4215570 4118561 3737786
16221 3737786 3832080 3802297 4198775 4414857 4510440 4438440 4043277 3909992 3766879 3676495
16211 3676495 4194989 4199912 4404822 4264456 4174036 3777946 3743408 3977844 4216071 4371267
16201 4371267 4217951 4280938 4551721 4941491 4666833 4930767 4485288 4254151 4966832 4993440
16191 4993440 4743504 4857116 4528603 4764725 4614792 4240710 3928508 4032150 4083344 4115968
16181 4115968 4126082 4015710 4718285 4721074 4887864 4751101 4831448 5096961 4641652 4776893
16171 4776893 5142961 4995233 4763621 4749120 4805192 4714184 4761828 5239776 5578835 5248049
16161 5248049 5105740 5384615 5437894 5187445 5090084 5552681 5307714 5328543 4977456 5049471
16151 5049471 5180035 4991745 5314422 4826961 4911947 5266531 5198285 5653700 5601893 5725653
16141 5725653 5666936 5420220 5640586 5568159 5395279 5573791 5177398 5061440 5140067 5134567
16131 5134567 5259714 5277810 5852082 5487713 5275022 5027861 5174804 5567127 5457078 5354547
16121 5354547 5077465 5641715 5852070 5884598 5489398 5428160 5731185 5665698 6004226 6116839
16111 6116839 5581277 4948457 5281510 5576240 5642306 6124393 6112900 5788441 5470242 4892147
16101 4892147 5415242 5418444 5658661 5538694 5421317 5262979 5756111 5584550 5536711 5315969
16091 5315969 5358767 5712897 5308004 5577852 5117435 5146891 5049183 5244130 4851690 5723032
16081 5723032 5622805 5795912 5638742 5338168 5603974 6022972 5748816 5494670 5193220
16072 5193220 4808009 4720341 4880240 5751144 5377267 5152996 5277969 5732993 5844908 6037420
16062 6037420 6073688 6173719 5845497 5748169 5666912 5941970 5541316 5922852 6196537 5919143
16052 5919143 5924816 5634536 5257404 5383187 5845584 5633286 5578047 5532136 5357788 5742941
16042 5742941 5549084 5055458 5210055 5442557 5781758 5333044 5463103 5667207 5653655 5773892
16032 5773892 6063035 5805595 5587561 5541485 5721864 5510388 5589932 5865045 5976448 6217005
16022 6217005 6293010 6164079 5919855 5883610 5548632 5523964 5559509 5715669 5782082 5957089
16012 5957089 6307469 6923938 6618293 6506467 5888672 5866695 5506457 5598573 5377174 5300654
16002 5300654 5522143 5528980 5717564 5552217 5542655 5378951 5704539 5999688 6456614 6021373
15992 6021373 5639534 6104711 6281157 5898654 6041969 6320418 6391785 5923723 5773577 5968314
15982 5968314 6562094 6879923 6219010 5775385 5702935 5642801 6254203 6333963 6278365 5975108
15972 5975108 6035835 6127512 5374405 5617251 5451924 5525557 5326167 5418719 5211665 5095625
15962 5095625 5462638 5351624 5682465 5833478 6131704 6130706 5613238 5409806 5397123 5358918
15952 5358918 5151803 5424265 5771101 5941849 5753528 5620777 6049211 6090057 6211252 6180902
15942 6180902 6449874 5487558 5558525 5872844 5987483 5828263 5779000 6165849 6035480 6368842
15932 6368842 5685290 5918990 5830158 5490231 5515087 5621856 5712345 5884389 5894985 5589260
15922 5589260 5617414 5603134 5950942 6143671 5922708 5875115 5751695 5756252 6205307 5990850
15912 5990850 5946271 5829241 6205241 6130702 5850398 5915752 5692154 5960209 6091508 5546438
15902 5546438 5258955 5651815 5906763 6281733 5991684 5669916 5483607 5377372 5195606
15893 5195606 5252823 6078989 5735037 5315095 5573072 5635961 5823989 5641882 5433796 5605219
15883 5605219 5543874 5845977 5694129 6263934 5995547 5535053 5803328 5915897 5941673 6079525
15873 6079525 6034016 5685198 5791053 6118122 6075268 5746684 6052467 6147131 6049338 5594985
15863 5594985 5521709 6006227 5897783 5689651 5523159 5684368 5393266 5293595 5566942 5810075
15853 5810075 5968941 6070715 5873925 5851266 6302661 5817569 5830332 5599687 5616891 6238067
15843 6238067 6093907 6026591 5717642 5853616 6282221 6266993 6184477 6378065 5996818 5738489
15833 5738489 5909704 5592657 5422058 5606061 5490794 5578458 6034314 6420068 6175693 5663186
15823 5663186 5361765 5520077 6056676 6023770 6082582 6069664 6061745 5828544 6000469 5818230
15813 5818230 5613524 5234917 5632244 5308779 5212786 5299732 5774709 5804702 5687338 5883299
15803 5883299 5657545 6144547 6232435 6021603 6531333 6212742 5886829 6000845 5779309 5954180
15793 5954180 5599680 5760830 6063673 5477044 5804032 5879097 5956132 6361697 5940947 5986602
15783 5986602 5941003 5125435 5210533 5777120 6255268 5315618 5164143 5552046 5761471 5877489
15773 5877489 5644783 5562553 5360252 6032901 6349178 6135148 6084674 5848109 5572826 6279021
15763 6279021 6247157 5650155 5672336 5649801 5827968 5724098 6152690 5838028 5737701 5841471
15753 5841471 5683555 5818686 5998953 6005777 5707397 5648693 5646035 5665803 5609354 5827202 5555340
15742 5555340 6088015 6687050 6387385 5920211 5966440 5728184 6451978 5839409 6135645 6096324
15732 6096324 5928062 5650413 5932272 6356438 6155138 6259400 6161647 5890411 5660191 6161355
15722 6161355 6125570 6093030 5938282 5588327 5531711 5499617 5665392 5331082 5736342 6237674
15712 6237674 6445302 6098495 6111639 6564684 6229789 5850992 6200075 6173391 5535096 6224943
15702 6224943 5872202 5534901 6167773 6014873 5844902 5530279 5768759 6419818 6560176
15693 6560176 6064911 6500833 6726770 6368618 6458150 6108354 5919270 6048460 5667941 5418360
15683 5418360 5226335 5497152 6488488 6267770 6001039 5897189 5922072 5672795 5869719 6089444
15673 6089444 5535436 5591870 6203993 5836669 5526235 5203596 5664078 6053483 5794910 6074458
15663 6074458 5685115 5580309 5908127 5801731 5790728 5857981 5811822 6232721 5852843 5646335
15653 5646335 5771653 5711917 5814596 5748087 5675334 5546566 5720507 5883261 6003361 5669621
15643 5669621 6403238 6536733 6463940 6274637 6106039 6211783 5981352 5633020 5944577 5887890
15633 5887890 6080539 6154985 5984172 5827408 5622605 5751478 6393209 6605412 6306186 6176847
15623 6176847 5741019 5867108 6139385 6280154 6288174 5676612 5628492 5724803 5596584 6005897
15613 6005897 5918276 5381514 5099649 6037460 5359098 5049062 5739842 6157814 5860206 5700224
15603 5700224 5824932 6097259 6145716 5708607 6111621 5915071 5973717 6268016 6244478 6033032
15593 6033032 6036672 6058901 5918330 6049290 6185464 6040922 6150060 6396683 6539733 6312638
15583 6312638 5970433 5639224 6249287 6269316 6061724 5940028 5815646 5556731 5736456 5957406
15573 5957406 5750917 5451661 5949228 6561633 6324168 6356522 6640832 6599794 6173107 5868128
15563 5868128 5752679 6137514 6229639 5690640 5565665 5425495 5918116 6458939 6122661 5771313
15553 5771313 5672567 6010387 6391452 6602501 6476923 6304165 6238569 6554448 6548480 6525436
15543 6525436 6403286 6432414 5913111 5743795 5770218 5882723 6300742 6301877 6075898 6192002
15533 6192002 6228488 6496370 6217424 5918199 6166072 6479589 6218463 6198419 6020117 6391242
15523 6391242 5699189 5891312 6283246 6467272 6063549 6137380 6377531 6300489 5746119 5571887
15513 5571887 5942186 5661463 5754310 6083693 6124689 6100104 5761487 5849411 6489860 6408029
15503 6408029 6181899 5889238 6173515 5750350 5860367 6365323 6343981 5801306 5747736 6082484
15493 6082484 6056753 5420906 6182687 6362272 6264316 6187058 6332327 6278323 6573751 6550966
15483 6550966 5882017 5613905 5741049 6134219 6255619 5779640 6023185 6261621 6082981
15474 6082981 6286916 6422410 6265316 6451799 6437370 6377191 5894519 6234155 6677531 6183859
15464 6183859 6295964 5995064 5917897 5700415 5731654 6086953 6476886 6441874 5953318 6331349
15454 6331349 6321894 6139300 5983651 6258414 6351099 5842266 6025114 6245828 6356233 6157912
15444 6157912 6508351 6630966 6679378 6340630 6163100 6324531 6114270 6427238 6505438 6151971
15434 6151971 6712388 6274253 5883820 5854827 5734875 5985132 5615408 6363391 6298139 5755530
15424 5755530 5479157 5778056 5885447 5817204 5876013 5937418 6031870 5904056 6108349 6203476
15414 6203476 6349653 5803348 5606301 5944475 5818561 5728552 5991984 5954040 6437779 6556618
15404 6556618 6754286 6311280 5802994 6442960 6160647 5752942 6311096 6565251 6542387 6092315
15394 6092315 5752493 6227291 6152279 5636088 5567820 6271460 6097560 5879534 6333018 6589821
15384 6589821 6506916 6680914 6667159 6064182 6385031 6367322 5906949 5914055 5670453 5826974
15374 5826974 6301418 6265647 6022741 6222180 6382704 6502051 6259162 6155460 6190696 5896728
15364 5896728 5552686 5592344 6072262 5885981 6145858 6038989 6211701 5832568 5764520 5864642
15354 5864642 5839043 6003716 5656446 5573283 5557757 5709968 5915002 6260367 6369003 6369686
15344 6369686 6343804 6047083 6236607 6178869 6121934 6202474 5950799 5598616 5952802 6244708
15334 6244708 6128894 6221992 6157057 6653836 6321794 5998781 6299858 6822177 6500871 6170486
15324 6170486 5897660 5941473 6350940 6478154 5852926 5410157 6147357 6543483 6178025 6345453
15314 6345453 6208766 6290864 6579920 6893654 6849730 6235225 6366949 5532383 5936460 6724700
15304 6724700 6614938 6270115 5829335 6380452 6776347 5753693 5435612 5945997 6381108
15295 6381108 6375776 5960200 6052314 6340620 6553764 6130344 5873969 5739826 6365334 6373948
15285 6373948 6172519 6049444 6498246 6319153 5979817 5895640 6081034 5961201 5815499 6349889
15275 6349889 6700165 6452925 6263368 6350433 6417340 6413096 5960098 6245711 6430636 6110979
15265 6110979 6112043 6159814 6062235 6099839 6202274 6405815 6678207 6606394 6367794 6625571
15255 6625571 6478890 6273143 6839474 6577300 6346870 6867874 6013590 5629490 6330214
15246 6330214 6382642 6326335 6287739 6530874 6617822 6230083 6192920 6352143 6658990 5995110
15236 5995110 6034593 6133040 6350516 6085598 6635845 6500238 5965328 6252067 6369869 6065553
15226 6065553 6152867 6060251 5957438 6133016 6543220 6438687 6344746 6107754 5801063 6086516
15216 6086516 6527708 6607539 6924991 6398492 6249506 6711397 6301179 6558451 6626059 6600914
15206 6600914 6131883 6004627 6382825 6317977 6167934 6352712 6258328 6201651 6238532 6222667
15196 6222667 5924584 5768365 6471139 6653207 5790951 6011013 6460256 6257051 6066804
15187 6066804 6235932 6131078 6457935 6748040 6732424 6691941 6645316 6347186 6341362 6429256
15177 6429256 6389203 6147530 6259328 6309850 6404120 6339649 5924827 6330695 6713968 5978011
15167 5978011 6092141 6595368 5963381 5650465 6235600 6853332 6400886 5958705 6047781 5918114
15157 5918114 6368140 6519363 6396024 6381655 6435968 5791764 5719699 5958929 6581079 6749160
15147 6749160 5903912 6022337 6037371 6363433 6937579 6674636 6197859 6613073 6382032 5935137
15137 5935137 6519353 6585928 6778631 6548199 6016045 6093184 5677922 5531525 6087757 6294840
15127 6294840 6593217 6331387 6460635 5918845 5964923 5838288 5783425 6086357 6215281 6088155
15117 6088155 6379543 6284819 6273048 6789880 6927909 6476485 6240853 6203884 5704657 6381351
15107 6381351 6418315 6424870 6153564 5925085 5584708 5676502 5854662 6035867 6158529 6122516
15097 6122516 5856011 6388725 5802596 6346959 6140106 6317319 6603766 6425758 6376573 6513227
15087 6513227 6277022 6580653 7079340 6620187 6963590 6676458 6310697 6617158 6821262
15078 6821262 6105814 6441485 6450287 6270530 6402991 6501716 6133645 5929412 5964553 6013281
15068 6013281 5988228 5699031 5626585 6026698 6466302 6466950 6203481 6170691 6572007 6693772
15058 6693772 6557360 6645092 6446671 6599412 6856014 6783554 6731310 6837696 6803127 6339238
15048 6339238 6761325 6842317 7054221 6824545 6872075 6787617 6777128 6416518 6250361 6666742
15038 6666742 6373772 6527625 6081048 6333045 6725509 6483499 6938191 6844261 6676012 7016708
15028 7016708 6984549 6769784 6569252 6137065 6269755 6476065 6673826 6879466 6976036 6769706
15018 6769706 6457214 6686912 6405364 6145547 5851517 6282036 6829263 6252763 6325608 6589791
15008 6589791 6317320 5967176 5745236 5288260 6164005 6617116 6375107 6131053 5868556
14999 5868556 6354771 6106058 6304954 6261334 6309884 5895938 6186074 6270093 5979579 6103829
14989 6103829 6345952 6262915 5974658 6031815 6261126 6514962 6623574 6483729 6383496 5731969
14979 5731969 6008080 6547284 6730444 6321113 6501228 6089651 6577014 6440583 6292519
14970 6292519 6362754 6545891 6926788 6929847 6795840 6622978 6676053 6572496 6367287 6623552
14960 6623552 6960619 6562637 6358235 6515986 7257136 6794503 6407426 6729283 7225151
14951 7225151 6838513 6605831 6583900 6619560 6700861 6768525 6434583 6293919 6135066 6693486
14941 6693486 6424902 6745223 6766214 6506961 6389278 6301514 6401280 6173858 5876119 6322628
14931 6322628 6422393 6198038 6029458 6105796 6070788 5790441 5954823 5895155 5975650 6059656
14921 6059656 6147855 6880603 6602348 5852536 5993665 6525468 6477863 6233470 6291384 6277219
14911 6277219 6377965 6414101 6145251 6175184 5954993 5994846 6617814 6718346 6734157 6705508
14901 6705508 6645389 6287877 6531216 6786995 7103306 6818952 6680700 6307131 5991608 6373315
14891 6373315 6754930 6820860 6686383 6495882 6479128 7051577 7209902 6965119 6862995 6971042
14881 6971042 6756706 6446522 6419549 5984739 6632313 6871333 6554054 6409738 6234852 6544808
14871 6544808 6766849 6850577 6923646 6700619 6542593 6684821 6732515 6979673 6565949 6104075
14861 6104075 6178308 6648673 6668817 6547591 7036522 6701606 6871109 6494445 6484272 6443728
14851 6443728 5868748 6224007 6739765 6928963 6893023 6131272 5637453 6048484 6332469 6521662
14841 6521662 6827538 6787484 6684213 7052350 7248969 6565831 6562204 7225139 6718392 6663003
14831 6663003 6769247 6299772 6102957 6287218 6059668 5988349 6126436 6218838 5857494 6120448
14821 6120448 6555514 6602620 6472246 6626209 6572497 6469081 6551376 6879944 6636552 6100795
$$ [...]
##END NTUPLES=NMR SPECTRUM
##END=
