##TITLE=1H_CA-9141-2
 CDCl3
 8 sc, 
 21.4.2023
##JCAMPDX= 6.0         $$ Bruker NMR JCAMP-DX V2.0
##DATA TYPE= NMR SPECTRUM
##DATA CLASS= NTUPLES
##ORIGIN= UXNMR, Bruker Analytische Messtechnik GmbH
##OWNER= root
$$ XWIN-NMR		Version 3.5
$$ Fri Apr 21 13:48:43 2023 Russian Standard Time (UT+4h)  she@DPX200
##.OBSERVE FREQUENCY= 200.13135
##.OBSERVE NUCLEUS= ^1H
##.ACQUISITION MODE= SIMULTANEOUS
##.ACQUISITION SCHEME= undefined
##.AVERAGES= 8
##.DIGITISER RES= 18
##SPECTROMETER/DATA SYSTEM= spect
##.PULSE SEQUENCE= zg30
##.SOLVENT NAME= D2O
##.SHIFT REFERENCE= (INTERNAL, D2O, 0, 15.7293)
##AUDIT TRAIL= $$ (NUMBER, WHEN, WHO, WHERE, WHAT)
$$ ##TITLE= Audit trail, XWIN-NMR		Version 3.5
$$ ##JCAMPDX= 5.01
$$ ##ORIGIN= Bruker BioSpin GmbH
$$ ##OWNER= she
$$ F:/spectra/data/she/nmr/H-F/1/pdata/1/auditp.txt
$$ ##AUDIT TRAIL=  $$ (NUMBER, WHEN, WHO, WHERE, WHAT)
(   1,<2023-04-21 13:47:30.56 +0400>,<she>,<DPX200>,
      <created by zg, POWCHK disabled, PULCHK disabled
       configuration hash MD5:
       00 E9 B6 7A A2 85 ED C7 34 08 36 98 17 FE 4E 26
       data hash MD5: 16K
       22 66 51 BB E2 F9 01 93 B4 80 A1 7C 91 9A 30 85>)
(   2,<2023-04-21 13:47:32.81 +0400>,<she>,<DPX200>,
      <Start of raw data processing
       efp BC_mod = 2 LB = 0.24 FT_mod = 6 PKNL = 1 PHC0 = -19832.85 PHC1 = 9.600801 SI = 16K 
       data hash MD5: 16K
       53 87 3D 07 C5 7B 68 44 DA E3 EC 3E ED B4 1D 7F>)
(   3,<2023-04-21 13:47:55.18 +0400>,<she>,<DPX200>,
      <pk PHC0 = 2.572342 PHC1 = -2.4 
       data hash MD5: 16K
       64 E3 0B 05 74 23 61 DE C3 9C 54 C0 FD 0C 48 D4>)
(   4,<2023-04-21 13:47:58.42 +0400>,<she>,<DPX200>,
      <abs ABSG = 5 
       data hash MD5: 16K
       23 4C B2 43 67 D3 5D FE 38 D2 5E E7 85 C5 AE F1>)
$$ ##END=
$$ 
$$ hash MD5
$$ FF 94 27 08 5F AA 0E 05 48 09 F1 D9 01 D0 B0 15
##$RELAX= 
##$RELAX= 
##$RELAX= 
##$RELAX= 
##$RELAX= 
##$RELAX= 
$$ Bruker specific parameters
$$ --------------------------
##$DU= <F:/spectra>
##$EXPNO= 1
##$NAME= <H-F>
##$PROCNO= 1
##$TYPE= <nmr>
##$USER= <she>
##$AMP= (0..31)
100 100 100 100 100 100 100 100 100 100 100 100 100 100 100 100 100 100 
100 100 100 100 100 100 100 100 100 100 100 100 100 100 
##$AQSEQ= 0
##$AQ_mod= 1
##$AUNM= <au_zg>
##$AUTOPOS= <>
##$BF1= 200.13
##$BF2= 200.13
##$BF3= 200.13
##$BF4= 200.13
##$BF5= 200.13
##$BF6= 200.13
##$BF7= 200.13
##$BF8= 200.13
##$BYTORDA= 1
##$CFDGTYP= 0
##$CFRGTYP= 5
##$CHEMSTR= <none>
##$CNST= (0..31)
1 1 145 1 1 1 1 1 1 1 1 1 1 1 1 1 1 1 1 1 1 1 1 1 1 1 1 1 1 1 1 1 
##$CPDPRG= <>
##$CPDPRG1= <>
##$CPDPRG2= <>
##$CPDPRG3= <>
##$CPDPRG4= <mlev>
##$CPDPRG5= <mlev>
##$CPDPRG6= <mlev>
##$CPDPRG7= <mlev>
##$CPDPRG8= <mlev>
##$CPDPRGB= <>
##$CPDPRGT= <>
##$D= (0..31)
0 1.2 0 0 0 0 0 0 0 0.06 0 0.03 0 0 0 0 0.0002 0 0 0 0 0 0 0 0 0 0 0 0 
0 0 0 
##$DATE= 1682070449
##$DBL= (0..7)
120 120 120 120 120 120 120 120 
##$DBP= (0..7)
150 150 150 150 150 150 150 150 
##$DBP07= 0
##$DBPNAM0= <>
##$DBPNAM1= <>
##$DBPNAM2= <>
##$DBPNAM3= <>
##$DBPNAM4= <>
##$DBPNAM5= <>
$$ [...]
##$SUBNAM3= <"">
##$SUBNAM4= <"">
##$SUBNAM5= <"">
##$SUBNAM6= <"">
##$SUBNAM7= <"">
##$SUBNAM8= <"">
##$SUBNAM9= <"">
##$SW= 18.05172834244
##$SWIBOX= (0..15)
0 0 2 0 0 0 0 0 0 0 0 0 0 0 0 0 
##$SW_h= 3612.71676300578
##$TD= 16384
##$TD0= 1
##$TE= 0
##$TE2= 300
##$TE3= 300
##$TEG= 300
##$TL= (0..7)
0 120 120 120 120 120 120 120 
##$TP= (0..7)
150 150 150 150 150 150 150 150 
##$TP07= 0
##$TPNAME0= <>
##$TPNAME1= <>
##$TPNAME2= <>
##$TPNAME3= <>
##$TPNAME4= <>
##$TPNAME5= <>
##$TPNAME6= <>
##$TPNAME7= <>
##$TPOAL= (0..7)
0.5 0.5 0.5 0.5 0.5 0.5 0.5 0.5 
##$TPOFFS= (0..7)
0 0 0 0 0 0 0 0 
##$TUNHIN= 0
##$TUNHOUT= 0
##$TUNXOUT= 0
##$USERA1= <user>
##$USERA2= <user>
##$USERA3= <user>
##$USERA4= <user>
##$USERA5= <user>
##$V9= 5
##$VALIST= <valist>
##$VCLIST= <CCCCCCCCCCCCCCC>
##$VD= 0
##$VDLIST= <DDDDDDDDDDDDDDD>
##$VPLIST= <PPPPPPPPPPPPPPP>
##$VTLIST= <TTTTTTTTTTTTTTT>
##$WBST= 1024
##$WBSW= 4
##$XGAIN= (0..3)
0 0 0 0 
##$XL= 0
##$YL= 0
##$YMAX_a= 123055
##$YMIN_a= -124299
##$ZGOPTNS= <>
##$ZL1= 120
##$ZL2= 120
##$ZL3= 120
##$ZL4= 120
##$ABSF1= 15.75264
##$ABSF2= -2.29921
##$ABSG= 5
##$ABSL= 3
##$ALPHA= 0
##$AQORDER= 0
##$ASSFAC= 0
##$ASSFACI= 0
##$ASSFACX= 0
##$ASSWID= 0
##$AUNMP= <proc_1d>
##$AZFE= 0.1
##$AZFW= 0.1
##$BCFW= 0
##$BC_mod= 2
##$BYTORDP= 0
##$COROFFS= 0
##$CY= -3
##$DATMOD= 1
##$DC= 0
##$DFILT= <>
##$DTYPP= 0
##$F1P= 0
##$F2P= 0
##$FCOR= 1
##$FTSIZE= 16384
##$FT_mod= 6
##$GAMMA= 0
##$GB= 0
##$INTBC= 1
##$INTSCL= 3.70164e-10
##$ISEN= 128
##$LB= 0.24
##$LEV0= 0
##$LPBIN= 0
##$MAXI= 10000
##$MC2= 0
##$MEAN= 0
##$ME_mod= 0
##$MI= 1.114404
##$NCOEF= 0
##$NC_proc= -9
##$NLEV= 6
##$NOISF1= 3.799351
##$NOISF2= 2.8
##$NSP= 0
##$NTH_PI= 0
##$NZP= 0
##$OFFSET= 15.72926
##$PC= 1
##$PHC0= -19830.28
##$PHC1= 7.200801
##$PH_mod= 1
##$PKNL= yes
##$PPARMOD= 0
##$PSCAL= 0
##$PSIGN= 0
##$REVERSE= no
##$SF= 200.130008460357
##$SI= 16384
##$SIGF1= 3
##$SIGF2= 2
##$SINO= 5.538805
##$SIOLD= 16384
##$SREGLST= <1H.CDCl3>
##$SSB= 0
##$STSI= 16384
##$STSR= 0
##$SW_p= 3612.71676300578
##$SYMM= 0
##$S_DEV= 0
##$TDeff= 16384
##$TDoff= 0
##$TI= <>
##$TILT= no
##$TM1= 0
##$TM2= 0
##$TOPLEV= 0
##$USERP1= <user>
##$USERP2= <user>
##$USERP3= <user>
##$USERP4= <user>
##$USERP5= <user>
##$WDW= 1
##$XDIM= 16384
##$YMAX_p= 368524760
##$YMIN_p= -4232627
$$ End of Bruker specific parameters
$$ ---------------------------------
##NTUPLES= NMR SPECTRUM
##VAR_NAME=  FREQUENCY,     SPECTRUM/REAL,   SPECTRUM/IMAG
##SYMBOL=    X,             R,               I
##VAR_TYPE=  INDEPENDENT,   DEPENDENT,       DEPENDENT
##VAR_FORM=  AFFN,          ASDF,            ASDF
##VAR_DIM=   16384,         16384,           16384
##UNITS=     HZ,            ARBITRARY UNITS, ARBITRARY UNITS
##FACTOR=    0.220516191357247, 1,           1
##FIRST=     3147.89702586118, 0,            0
##LAST=      -464.819737144595, 0,           0
##MIN=       -464.819737144595, -4232627,    0
##MAX=       3147.89702586118, 368524760,    0
$$ Real data points
##PAGE= N=1
##DATA TABLE= (X++(R..R)), XYDATA
$$ [...]
6734a0721L2948k37956K11989K72678k59891n52359m96087p87161Q8112M00454
$$ -10721 22227 -215729 -3740 268938 9047 -543312 -1039399 -1826560 -1738448 -1337994
6724a337994P17017j85055K38553m94942J77975J91930M52649K53410O11460M44102
$$ -1337994 -620977 -806032 -567479 -1062421 -884446 -692516 -239867 13543 625003 1069105
6714A069105j307294r48475P06617J27641O8692l03620k8974Q34413l43652j58877
$$ 1069105 -238189 -1186664 -480047 -352406 -283714 -587334 -616308 218105 -125547 -284424
6704b84424l75672N49566k60250o64808J03629K89633M04612K91675M7242R2174
$$ -284424 -660096 -110530 -370780 -1035588 -931959 -642326 -237714 53961 101203 193377
6694A93377o51029o59633N35170Q79235j60848R643k40079k83000o69434N23599
$$ 193377 -457652 -1117285 -582115 297120 136272 145915 -94164 -377164 -1046598 -522999
6684e22999L33529p99117K79890O719J81460Q7520L67583N01968K31799o76044
$$ -522999 -189470 -988587 -708697 -701978 -520518 -432998 -65415 436553 668352 -7692
6674g692r4731k20109o4986n78475o0916r341J365694M1934N37992k67262r64707
$$ -7692 -102423 -322532 -387518 -965993 -1026909 -1036250 329444 371378 909370 642108 -322599
6663c22599k76957M6406L2353o32098l35383K0861P17969L81681P7199n63389
$$ -322599 -599556 -553150 -520797 -1152895 -1488278 -1467417 -749448 -367767 -290568 -853957
6653h53957J853M81051j04171p65127n5240J209052L17682q82036M17281N83692
$$ -853957 -852104 -371053 -475224 -1240351 -1295591 -86539 231143 -650893 -233612 350080
6643C50080K11692j93145n53406K12952Q65631j302710p85333O40730k76664K08587
$$ 350080 561772 368627 -184779 28173 893804 -408906 -1194239 -553509 -830173 -621586
6633f21586O25242k22699j24124l95386P9187L33832p5601j69604l4150N93523
$$ -621586 3656 -219043 -343167 -738553 -659366 -325534 -401135 -570739 -604889 -11366
6623a1366J36857k69608k55197M1578K65343n00837L46270M70813Q18715p51539
$$ -11366 125491 -144117 -399314 -357736 -92393 -593230 -246960 223853 1042568 291029
6613B91029k19159N33699k59230L72530o01451k93390J92521j94116K22039k17546
$$ 291029 71870 605569 346339 718869 117418 -175972 16549 -177567 44472 -173074
6603a73074N77709o16892l49024M2502L73952Q01180j12260q88101k40616j21014
$$ -173074 404635 -212257 -561281 -518779 -144827 656353 544093 -344008 -584624 -705638
6593g05638n77349O10508J004403l20899k1212j89619p14140l02648R12196O04505
$$ -705638 -1282987 -672479 331924 11025 -10187 -199806 -913946 -1216594 -304398 300107
6583C00107J74094o88975J67672R54137l65772p52411q9599L8219P9109M43429
$$ 300107 474201 -214774 -47102 907035 541263 -211148 -300747 -262528 -183419 260010
6573B60010k23759Q5097J112831J80410j630869n69839k05891M4641P83163K96459
$$ 260010 36251 121348 1234179 1414589 -216280 -786119 -992010 -947369 -164206 132253
6563A32253K58863m76286m09453L09840K43707n95341O17146P99963l81296q19377
$$ 132253 391116 -85170 -494623 -184783 58924 -536417 80729 880692 499396 -319981
6553c19981q1818l9585m98701k35347k47185K75873q7361J91744K03845n20283
$$ -319981 -401799 -441384 -940085 -1175432 -1422617 -1146744 -1234105 -1042361 -838516 -1358799
6543a358799p16127P05504Q89298N55402p72421m47011N51238N74551l34776o52391
$$ -1358799 -2074926 -1369422 -480124 75278 -697143 -1144154 -592916 -18365 -353141 -1005532
6533a005532k02229N56503L08736J67721M48942k10009L14171p7022n36520M42781
$$ -1005532 -1207761 -651258 -342522 -174801 274141 64132 378303 301281 -235239 207542
6523B07542p60275K46888P50076p6739r40667k22639o50498J232029o56635p88422
$$ 207542 -552733 -305845 444231 367492 -573175 -795814 -1446312 -214283 -870918 -1659340
6513a659340M89718N85284j28110K53372K37776J07791K69944j99407K81018N7144
$$ -1659340 -1169622 -584338 -712448 -459076 -221300 -113509 156435 -42972 238046 295190
6503B95190j58331k77537l89386O7172N54636m38608l1676k98728M4810N50811
$$ 295190 136859 -140678 -530064 -462892 91744 -346864 -378540 -677268 -632458 -81647
6493h1647P12667J30952o21080l24342L07683n04517L4388N56119k63134Q89M71238
$$ -81647 631020 761972 140892 -183450 124233 -380284 -345896 210223 -52911 -52022 419216
6482D19216j23047p71562J05336m51053Q4123O72748Q7920k39591R26989K51254
$$ 419216 296169 -475393 -370057 -821110 -736987 -64239 23681 -215910 711079 962333
6472I62333q75807O8228p37062K99016m18585K24401j75287K96042Q37407m35279
$$ 962333 86526 154754 -582308 -283292 -701877 -477476 -652763 -356721 480686 45407
6462D5407o68555L55820K6449n8221K66339K0763n55102k69318J068378M44963
$$ 45407 -623148 -267328 -240879 -299100 -32761 -11998 -567100 -836418 231960 676923
6452F76923l52670L87951r9698O2735m37679J95086m25484N3345J32805m63108
$$ 676923 324253 712204 612506 675241 237562 432648 7164 60509 193314 -269794
6442b69794l5584J85497L7342k9946R6665K96235j139522M56557m54262J75894
$$ -269794 -305378 -119881 -82539 -112485 -15820 280415 -859107 -402550 -856812 -680918
6432f80918M28887k74745Q88802J69806o63171j72045O94797k94355L14466R5653
$$ -680918 -252031 -526776 362026 531832 -131339 -303384 391413 97058 411524 507177
6422E07177J51402o75085K12447l34910K62804l75497L70021N83237n02966o80627
$$ 507177 658579 -16506 195941 -138969 123835 -251662 118359 701596 198630 -481997
6412d81997n62530N01175R6353J5208K54669J148407k07844p44860l47964o72987
$$ -481997 -1044527 -543352 -446999 -431791 -177122 971285 763441 18581 -329383 -1002370
6402a002370R25176j74184L20603n94331P2716R6780k85067J98439L55719O7361
$$ -1002370 -77194 -251378 69225 -525106 -452390 -355610 -640677 -442238 -86519 -19158
6392a9158p38753M05648k19402Q4081O3091l80940r7404N51608N76117o98076
$$ -19158 -757911 -352263 -571665 -487584 -424493 -805433 -902837 -351229 224888 -473188
6382d73188K02599j22414K76423N60098K56581o58523N27441o37220j304669L50037
$$ -473188 -270589 -393003 -116580 443518 700099 41576 569017 -68203 -1372872 -1022835
6372a022835N05467L71280N76024L980k65097N72422n60802M98005m58049p07668
$$ -1022835 -517368 -146088 429936 433916 168819 741241 180439 678444 220395 -487273
6362d87273O57511O74926K64161r80684q09278k03285M17728O90976M46822j80157
$$ -487273 170238 845164 1109325 128641 -680637 -883922 -466194 224782 671604 491447
6352D91447k71725j59832m4036L87671J99897r5429l57850P38437l91957p17767
$$ 491447 219722 59890 15854 403525 603422 507993 150143 888580 496623 -221144
6342b21144j86457j57584K47881L38023J66685k21268l71958L87891M44213J98576
$$ -221144 -407601 -565185 -317304 20719 187404 -33864 -405822 -17931 426282 624858
6332F24858k62628P40331k50874m48059r06725L16466Q92214r84231J62388Q68223
$$ 624858 362230 1102561 851687 403628 -503097 -186631 705583 -278648 -116260 751963
6322G51963K57066n08817m11537n92827j119871J011810R68450o457j65705k8535
$$ 751963 1009029 500212 88675 -504152 -1624023 -612213 356237 349780 184075 155540
6312A55540O06718j0756n30551J06224L78742n00754p99838K74371j6885J00658
$$ 155540 762258 751502 220951 327175 705917 205163 -594675 -320304 -337189 -236531
6302b36531M27108L09359r89352M97679K7006q83656k56691O95542Q3287l14024
$$ -236531 190577 499936 -489416 8263 35269 -848387 -1105078 -409536 -326249 -640273
6292f40273J184803j88949K98333l59076j125203M89173O84693l30395L33992
$$ -640273 544530 355581 653914 294838 -830365 -341192 343501 13106 347098
6283C47098K75162P89115j090618j24467O62513j049072k35638Q25695j9196r91214
$$ 347098 622260 1411375 320757 196290 858803 -190269 -425907 399788 380592 -610622
6273f10622P074K68761K76240K74408L41271m15161j012977o9348J82927J419355
$$ -610622 -603548 -334787 -58547 215861 557132 141971 -871006 -940354 -757427 661928
6263F61928m62730q9812k33121M35476M52983k86381k07083J96842k96183L76195
$$ 661928 199198 109386 -123735 311741 764724 478343 271260 468102 171919 548114
6253E48114j65467j6846J28372P07068l72628m25424k90694l05220R70246l7913
$$ 548114 382647 365801 494173 1201241 828613 403189 112495 -192725 777521 739608
6243G39608o73933J85919K48830k30610j43595l85660L95379j41299P57575M13234
$$ 739608 65675 251594 500424 269814 126219 -259441 135938 -5361 752214 1165448
6233A165448o98991R1079n78705m57179J042929l54891o02213M28586M84639K24163
$$ 1165448 466457 557536 -21169 -478348 564581 209690 -392523 36063 520702 744865
6223G44865l8714r56803N44510M43644K23844K53795j2531m06086K512p9952N10466
$$ 744865 706151 -250652 293858 737502 961346 1215141 1202610 796524 799036 719084 1229550
6212A229550J0643J86642J84561j241691n74206J120410M87848m04521j114273
$$ 1229550 1240193 1426835 1611396 369705 -204501 915909 1403757 999236 -115037
6203a15037r80743M20093J061851K45918p8792J3152O76897l30394L93137l22394
$$ -115037 -1095780 -675687 386164 632082 553290 566442 1243339 912945 1306082 983688
6193I83688r5247j14843J41751O62179k65952j045768q9408P02884L35620o9010
$$ 983688 888441 773598 915349 1577528 1311576 265808 176400 879284 1214904 1145894
6183A145894r09143N35644k47730J88991N74654j016586M62209J191683o23135
$$ 1145894 236751 772395 524665 713656 1288310 271724 733933 1925616 1302481
6174A302481o54186m8586K11787M63054j076760K05005L54838m55167K716N72280
$$ 1302481 648295 599709 811496 1274550 197790 402795 757633 302466 305182 877462
6164H77462O99778p80290L98364j071325r61222P09976J050750K36423l47679
$$ 877462 1577240 796950 1195314 123989 -837233 -127257 923493 1159916 812237
6155H12237l27946K07980l51552k40075K86506O18378j42030l92776j21077p16021
$$ 812237 484291 692271 340719 100644 387150 1005528 863498 470722 349645 -366376
6145c66376O04443L94230O46427l69749M22332R32276o39584M53857r33327o69475
$$ -366376 238067 632297 1278724 908975 1331307 2263583 1623999 2077856 1144529 475054
6135D75054K34103N24062O39040j877p79705k82146l10879J73658m06250M44856
$$ 475054 709157 1233219 1872259 1870382 1090677 808531 497652 671310 265060 709916
6125G09916P1738j46660M34050J44396o34124k04931m68552P49131M8858k45582
$$ 709916 781654 634994 1069044 1213440 579316 374385 -94167 654964 703822 458240
6115D58240o76038M63034j93288p9052N64594J05863L14986m70146l11076k00090
$$ 458240 -217798 245236 51948 -27104 537490 643353 958339 488193 177117 -22973
6105b2973O80673K82719q6422P7780K48164J46052o88654p49324M87630k06629
$$ -22973 657700 940419 853997 931777 1179941 1325993 637339 -111985 375645 169016
6095A69016P77702l20455N94888k90264l05725K21953J29368N5087p27154R116
$$ 169016 946718 626263 1221151 930887 625162 847115 976483 1031570 304416 313532
6085C13532N77730Q3814L0484M22272L10338n05419j076237N67843K73641l52646
$$ 313532 891262 975076 1005560 1427832 1738170 1232751 156514 724357 997998 645352
6075F45352K95358m59532l14784k44389N59144M18120K87915J6828J12437o41775
$$ 645352 940710 481178 166394 -77995 481149 899269 1187184 1204012 1316449 674674
6065F74674k02244L87430N6656k20040o84945J09340P3327O47181K24775n56142
$$ 674674 472430 859860 916516 696476 11531 120871 194198 841379 1066154 510012
6055E10012l20519N78947k22236O60466L28901l54119m4251l51341o26101n45441
$$ 510012 189493 768440 546204 1206670 1535571 1181452 1137201 785860 159759 -385682
6045c85682P15473J90322l4828j58407J185381j379337k81358O67992k07391l0199
$$ -385682 329791 520113 485285 326878 1512259 132922 -148436 519556 312165 281966
6035B81966J69149o14523P95076O9663R8297K69071n42687K86325M98757J82712
$$ 281966 451115 -163408 631668 701331 799628 1068699 526012 812337 1311094 1493806
6025A493806k10491K46820m85565l00099J5719l3899p31093K29927R316q14851
$$ 1493806 1283315 1530135 1044570 744471 760190 726291 -4802 225125 234441 -580410
6015e80410J014346R87079l6592J2653m23766n70498m2796L67855R6962K75833
$$ -580410 433936 1421015 1384423 1397076 973310 402812 360016 727871 824833 1100666
6005A100666J93554m47845k73293K27200Q0028k98558P36082J28534q81535L01531
$$ 1100666 1294220 846375 573082 800282 880310 581752 1317834 1446368 564833 866364
5995H66364L30743j43982M41099Q20j002177J15367p5044l798N95156j71073M11287
$$ 866364 1197107 1053125 1494224 1495044 492867 608234 533190 529392 1124548 953475 1364762
5984A364762L818l3925L82184j13307l56920k10310J11986O29312N82147j040316
$$ 1364762 1368580 1334655 1716839 1603532 1246612 1036302 1148288 1777600 2359747 1319431
5974A319431m10900M46320P7369j329513J030351j41495o72135M3798L92303r856
$$ 1319431 908531 1354851 1432220 102707 1133058 991563 319428 363226 755529 745673
5964G45673N03221j70258k56713M29313n1575L57162k80986p55966L70393M2939
$$ 745673 1248894 1078636 821923 1251236 1199661 1556823 1275837 519871 890264 933203
5954I33203L0288n4944K05888j09596J5376j80984L18046k74368p3836j24994
$$ 933203 963491 908547 1114435 1004839 1020215 839231 1157277 882909 809073 684079
5944F84079N11790M70504n99282J89711O74938q28304m8416O69195n40897l68900
$$ 684079 1195869 1666373 1067091 1256802 1931740 1103436 1055020 1724215 1183318 814418
5934H14418M85736j78039r6829j27401N35191j4993J66593J0536M56954j0234
$$ 814418 1300154 1122115 1025286 897885 1433076 1418083 1584676 1595212 2052166 2041932
5924B041932o65336k82242k49423O5570R5937K8620m62829P36287Q06284K41643
$$ 2041932 1376596 1094354 844931 910501 1006438 1035058 572229 1308516 2114800 2356443
5914B356443p90503l45370P00819J145667j002067L38656o16770o95142K10284
$$ 2356443 1565940 1220570 1921389 3067056 2064989 2403645 1786875 1091733 1302017
5905A302017L66089l44289O50052l15815n75165L00962Q2680q2352m60975l113
$$ 1302017 1668106 1323817 1973869 1658054 1082889 1383851 1466531 1384179 923204 920091
5895I20091J323757p48327j50820N16383m16740n79898L17998k11745J91104p4053
$$ 920091 2243848 1495521 1344701 1861084 1444344 864446 1182444 970699 1161803 1087750
5885A087750K51179j08443J34364o90589L7846J13697J1905N07967K85198r54062
$$ 1087750 1338929 1230486 1364850 674261 712107 825804 837709 1345676 1630874 676812
5875F76812k45960J495963R1226l43629K97272l55114k28320P09743m53767n47410
$$ 676812 430852 1926815 2018041 1674412 1971684 1616570 1388250 2097993 1644226 1096816
5865A096816R7838J97317k37693k42503j42643j95152L44826J40245N37503K1638
$$ 1096816 1194654 1391971 1154278 911775 769132 573980 918806 1059051 1596554 1618192
5855A618192o15955O4757m22288J48465l05335L88459L31327J72435J15144R361
$$ 1618192 1002237 1066994 644706 793171 487836 876295 1207622 1380057 1495201 1504562
5845A504562N4338M70928l28574K79225n1176J74143R0907p88667o42142j2402
$$ 1504562 1558900 2029828 1701254 1980479 1929303 2103446 2194353 1405686 763544 751142
5835G51142P16017J56761n42817m573N85830K01826K99004Q9068m32105j13191
$$ 751142 1467159 1623920 1081103 1076530 1662360 1864186 2163190 2252258 1820153 1706962
5825A706962M30737o5432L21558r53032k32220j32856P2511O39738j23480L00127
$$ 1706962 2137699 2072267 2393825 1440793 1208573 1075717 1148228 1787966 1664486 1964613
5815A964613N44636M06104k05887p02712m7542P82645k54294M30449p37098j21756
$$ 1964613 2509249 2915353 2709466 2006754 1959212 2741857 2487563 2918012 2180914 2059158
5805B059158q04239K16819K95286m86419M64732m1308j16484K662k21567N25471
$$ 2059158 1254919 1471738 1767024 1280605 1745337 1704029 1587545 1590207 1368640 1894111
5795A894111p839J69516J74533L30839k74584r238o39533K9096M66539o04265
$$ 1894111 1886272 2055788 2230321 2561160 2286576 2277338 1637805 1666901 2133440 1529175
5785A529175N90922L74163J35668j79308l19629k55637N6597P0194m41850o39033
$$ 1529175 2120097 2494260 2629928 2450620 2130991 1875354 1931951 2002145 1560295 921262
5775I21262J421303j20831q66376O33078k28838l4006J87575o84510M47802M56120
$$ 921262 2342565 2221734 1355358 1988436 1759598 1725592 1913167 1228657 1676459 2132579
5765B132579N11779k9904j95312n33130j53063L01793q06919j54630J19084k5516
$$ 2132579 2644358 2614454 2419142 1886012 1732949 2034742 1227823 1073193 1192277 1166761
5755A166761l45559o4712N6740J099130K03234J06638K70092o00253m01047O02044
$$ 1166761 821202 756490 813230 1912360 2115594 2222232 2492324 1892071 1491024 2093068
5745B093068k42273M37231L84059m57880l10793k31413L26777J08147L0757l09996
$$ 2093068 1850795 2288026 2672085 2214205 1903412 1671999 1998776 2106923 2137680 1827684
5735A827684k58456R7577J10489n6181J47693j7501j00592j83943L01187J08769
$$ 1827684 1569228 1666805 1777294 1721113 1868806 1851305 1750713 1566770 1867957 1976726
5725A976726k84673J45233n77759N72910K83923Q92355m35580j099309M31119
$$ 1976726 1692053 1837286 1259527 1832437 2116360 3008715 2573135 1473826 1904945
5716A904945j2947k59549l54396K80730Q77241K32970j276577j72032P66731L92294
$$ 1904945 1891998 1632449 1278053 1558783 2436024 2668994 1392417 1220385 1987116 2379410
5706B379410L91462l21584j82328Q8733m13740m2666n16328J44476O46633j76829
$$ 2379410 2770872 2449288 2266960 2355693 1941953 1899287 1382959 1527435 2174068 1997239
5696A997239m55941j83250k06454K44084M3507K69465l49541M2761Q71316n175
$$ 1997239 1541298 1358048 1151594 1395678 1439185 1708650 1359109 1401870 2273186 2268011
5686B268011O083N68491J02176J34534q67561J43057k57788M16064L96755p18666
$$ 2268011 2274094 2842585 2944761 3079295 2211734 2354791 2097003 2513067 2909822 2191156
5676B191156j88565k05698r47285R01770L52217l55358N63248q19076J2466J105051
$$ 2191156 2002591 1796893 849608 1751378 2103595 1748237 2311485 1492409 1504875 2609926
5666B609926K72162j63712n24627J16752j35007o2354J95222j8923l30567K40143
$$ 2609926 2882088 2718376 2193749 2310501 2175494 2113140 2308362 2289439 1958872 2199015
5656B199015m1570l27554q92293P34292Q72194m37235k76165m021L3328K38700
$$ 2199015 2157445 1829891 937598 1671890 2544084 2106849 1830684 1826663 1859991 2098691
5646B098691J72385L17439k47387k92610m30853r98540O62702J149057J7698q77035
$$ 2098691 2271076 2588515 2341128 2048518 1617665 619125 1281827 2430884 2448582 1571547
5636A571547Q6313P51094o61560m39257N09168O05110K13182q12099n55838L89502
$$ 1571547 1657860 2408954 1747394 1308137 1817305 2422415 2635597 1823498 1267660 1657162
5626A657162N67022R3954K97487j24060J71834q3611m1779j021744M03308K85002
$$ 1657162 2224184 2318138 2615625 2491565 2663399 2579788 2538009 1516265 1919573 2204575
5616B204575K15847j9566j11489n63164k53591L38124J49834j96136Q87765m07201
$$ 2204575 2420422 2400856 2289367 1726203 1472612 1810736 1960570 1764434 2652199 2244998
5606B244998m48846M49486p98479n15523J140609k71114l90058P34078O74484
$$ 2244998 1796152 2245638 1447159 931636 2072245 1801131 1411073 2145151 2819635
5597B819635K27076l66692n89158m80246Q10329j5215q806k43057j56975M58429
$$ 2819635 3046711 2680019 2090861 1610615 2420944 2405729 2396923 2153866 1996891 2455320
5587B455320J8137K73777o50918n62216J52035O71198n00735l39565M18712J84983
$$ 2455320 2473457 2747234 2096316 1534100 1686135 2357333 1856598 1517033 1935745 2120728
5577B120728l7582m67744N73543k60915n43068P16626J94545j50931m28334o82235
$$ 2120728 2083146 1615402 2188945 1928030 1384962 2101588 2296133 2145202 1716868 1034633
5567A034633O21626K02143n8611J20861j03840M91764K00824J24096r8101M31626
$$ 1034633 1656259 1858402 1799791 1920652 1816812 2308576 2509400 2633496 2535395 2967021
5557B967021m05389j28921o79157o05982J6882L79994M82576K12466r0590q7300
$$ 2967021 2561632 2432711 1753554 1147572 1164454 1544448 2027024 2239490 2148900 2061600
5547B061600m07727L36811J81780k64771L25233o29209R69990n71293l71221O46857
$$ 2061600 1653873 1990684 2172464 1907693 2232926 1603717 2573707 2002414 1631193 2278050
5537B278050l22153K50859N51309m12984j77566k48934M41732N4883N75642K48641
$$ 2278050 1955897 2206756 2758065 2345081 2167515 1918581 2360313 2415196 2990838 3239479
5527C239479o51968O9769L2659o18202m93983l12712M66314J13874M04888J17850
$$ 3239479 2587511 2657280 2689939 2071737 1577754 1265042 1731356 1845230 2250118 2367968
5517B367968j00504N10927J92782O21677m33946o04261L55812J34639M34777k74293
$$ 2367968 2267464 2778391 2971173 3592850 3158904 2554643 2910455 3045094 3479871 3205578
5507C205578m38005K29693k31910j80110Q22446j4179L65288J068083j245885
$$ 3205578 2767573 2997266 2765356 2585246 3407692 3393513 3758801 4826884 3580999
5498C580999r47927K23281L69010O88201M8298o71914o19606n8440N09635j45202
$$ 3580999 2633072 2856353 3225363 3913564 3961862 3289948 2670342 2611902 3121537 2976335
5488B976335m52287N96912q0718M15383m94381j71647P85436M35979k60659J2348
$$ 2976335 2524048 3120960 3040242 3455625 2961244 2789597 3575033 4011012 3750353 3762701
5478C762701l36591R03728M34446J1643M21431p8881K65712o11437M4176Q69020
$$ 3762701 3426110 4329838 4764284 4775927 5197358 5118477 5384189 4772752 4816928 5685948
5468E685948j98441J42401k55904j065002j491830L65666R35203n9556O31423
$$ 5685948 5487507 5629908 5374004 4309002 2817172 3182838 4118041 4058485 4689908
5459D689908o07728k70721j031912l95764k54937J411878o1892j132772L09042
$$ 4689908 4082180 3811459 2779547 2383783 2128846 3540724 3478832 2346060 2655102
5450B655102N32567K9150Q0914J13217j21255l3837Q32156n97987L1930N68987
$$ 2655102 3187669 3216819 3297733 3410950 3289695 3255858 4088014 3490027 3521957 4090944
5440D090944n41975J175484M19843K19425r53168m19067j15732j4929N69145j377726
$$ 4090944 3548969 4724453 5144296 5363721 4410553 3991486 3875754 3860825 4429970 3052244
5430C052244o6742M13345K22971j225170L50629K388N17649J83985o73146K65371
$$ 3052244 2985502 3398847 3621818 2396648 2747277 2749665 3267314 3451299 2778153 3043524
5420C043524k0015k49081N93595l06545K10612n10400l57356M63779L75750Q1997
$$ 3043524 3023509 2774428 3368023 3061478 3272090 2761690 2404334 2868113 3243863 3325860
5410C325860m81691q2279K40425N43201K07810J87724m83507p39594j46123k6173
$$ 3325860 2844169 2761890 3002315 3545516 3753326 3941050 3457543 2717949 2571826 2545653
5400B545653o57071R24159J72037j2825J07825M84848o95619O44487l17874o72138
$$ 2545653 1888582 2812741 2984778 2971953 3079778 3564626 2869007 3513494 3195620 2523482
5390B523482l6600l00350k54379L30312O17716l9165j482o33690n0825M16181
$$ 2523482 2486882 2186532 1932153 2262465 2880181 2841016 2839534 2205844 2155019 2571200
5380B571200m89189k99709K04409N37774P13105o47035j22240P26556m31900k14264
$$ 2571200 2082011 1782302 1986711 2524485 3237590 2590555 2468315 3194871 2762971 2548707
5370B548707N04231K54647p32153p66062J3052P23246j65668J3075l81458j8032
$$ 2548707 3052938 3307585 2575432 1809370 1822422 2545668 2380000 2393075 2011617 1993585
5360A993585p1405Q96470K93247o33201k90419J159896K6235l31895o44446l86302
$$ 1993585 1922180 2818650 3111897 2478696 2188277 3348173 3374408 3042513 2398067 2011765
5350B011765l18859J2155R52022L35677L85319k81277o61480M6494P84238J22345
$$ 2011765 1692906 1705061 2657083 2992760 3378079 3096802 2435322 2481816 3266054 3388399
5340C388399o22124j34304M99872o36686m00035j9787k98955l26831M06837n12150
$$ 3388399 2766275 2631971 3131843 2495157 2095122 2075335 1776380 1449549 1856386 1344236
5330A344236L72402J182251l3981J05066K18826l47941m42150j32764O17288n3040
$$ 1344236 1716638 2898889 2864908 2969974 3188800 2840859 2398709 2265945 2883233 2830193
5320B830193l45026o33816j63861J72573m8384K82467Q4559j6118l52285K83778
$$ 2830193 2485167 1851351 1687490 1860063 1811679 2094146 2178705 2162587 1810302 2094080
5310B094080m0345q3719Q76979O46371M02780k99795n611m76924k79083r86337
$$ 2094080 2053735 1970016 2846995 3493366 3896146 3596351 3590740 3113816 2834733 1848396
5300A848396K24801L03245M50245M14372j605237p23738J763881J033849K10992
$$ 1848396 2073197 2376442 2826687 3241059 1635822 912084 2675965 3709814 3920806
5291C920806o20682m29554l37300L51673J75199p22262K0868Q06564p13024P9425
$$ 3920806 3300124 2870570 2533270 2884943 3060142 2337880 2358748 3165312 2452288 2531713
5281B531713k3531K40263M1680k15177J0092J97678k43519p6245P81547j16237
$$ 2531713 2508182 2748445 2790125 2574948 2585040 2782718 2539199 2462954 3244501 3128264
5271C128264L75594k7011j593117M89378N29579J43892l2547l02916k61430o5753
$$ 3128264 3503858 3476847 1883730 2373108 2902687 3046579 3014032 2711116 2449686 2383933
5261B383933J99326j48860K97065k69136J75604p774k65717q91785M73864L17431
$$ 2383933 2583259 2434399 2731464 2462328 2637932 2630158 2364441 1472656 1946520 2263951
5251B263951J63536l22917K63121K04412o59370j31812P07745k22868N16079k47843
$$ 2263951 2427487 2104570 2367691 2572103 1912733 1780921 2488666 2265798 2781877 2534034
5241B534034m65958O04642N55031o14011m64583J20670m54915L55637J85435K13416
$$ 2534034 2068076 2672718 3227749 2613738 2149155 2269825 1814910 2170547 2355982 2569398
5231B569398k93637j00920l60734L14325M68570m36736J006692l96508p4046L79834
$$ 2569398 2275761 2174841 1814107 2128432 2597002 2160266 3166958 2770450 2696404 3076238
5221C076238j96012l6005k25493P7388M19464r24014J040448r0426J09012l86805
$$ 3076238 2880226 2844221 2618728 2696116 3115580 2191566 3232014 3141588 3250600 2863795
5211B863795j21574M40909k09002l88720L52967L31948m30024o81602k77075R9716
$$ 2863795 2742221 3183130 2974128 2585408 2938375 3270323 2840299 2158697 1881622 1981338
5201A981338k87782K8571M43225J53092r74739Q82230J05089K00467K20519k08651
$$ 1981338 1693556 1722127 2165352 2318444 1343705 2225935 2331024 2531491 2752010 2543359
5191B543359L45344k59578m32270L97011K54367p00733N68840P00499k59956l19659
$$ 2543359 2888703 2629125 2196855 2593866 2848233 2147500 2716340 3416839 3156883 2837224
5181B837224q8633L00077Q31696q31549m58374P57475p46222J31192m56945p45012
$$ 2837224 2748591 3048668 3880364 3048815 2590441 3347916 2601694 2732886 2275941 1530929
5171A530929P9591K92175K67518O84363k3392R6989r89798L88133J43759n05523
$$ 1530929 1610520 1902695 2170213 2854576 2831184 2928173 1938375 2326508 2470267 1964744
5161A964744n9717M70785P67983M77828j68109j93243K52925n90850k45079P00300
$$ 1964744 1905027 2375812 3143795 3621623 3453514 3260271 3513196 2922346 2677267 3377567
5151C377567Q61309j039949m9635J48160o24032l21501L53846N28908P57920k20553
$$ 3377567 4238876 3198927 3149292 3297452 2673420 2351919 2705765 3234673 3992593 3772040
5141C772040Q9622J41296m43059J97851m77839r06265j71538R65989K12950p6698
$$ 3772040 3861662 4002958 3559899 3757750 3279911 2373646 2202108 3168097 3381047 3304349
5131C304349K7282l60259O36399L59836K25035m95132o92432J6797l29128L0544
$$ 3304349 3331631 2971372 3607771 3967607 4192642 3697510 3005078 3021875 2692747 2723291
5121B723291k11317N95413m77464O7069J243709n15974p9209Q3053m79760k7844
$$ 2723291 2511974 3107387 2629923 2696992 3940701 3424727 3345518 3428571 2948811 2920967
5111B920967l01312Q6358L56954P21214J82429Q37469k97805j53019j99592o83447
$$ 2920967 2619655 2706013 3062967 3784181 3966610 4804079 4506274 4353255 4153663 3470216
5101C470216L59K51086k80402n56562k48579R14526J86383Q05924K29156q71939
$$ 3470216 3470575 3721661 3441259 2884697 2636118 3550644 3737027 4542951 4772107 3900168
5091C900168l66010j32544j56182l32227L9019o05151R97991M44919k77651j30628
$$ 3900168 3534158 3401614 3245432 2913205 2952224 2347073 3345064 3789983 3512332 3381704
5081C381704L54544M54743p85498n89645K41468R18574N23129j87988p66944j339
$$ 3381704 3736248 4190991 3405493 2815848 3057316 3975890 4499019 4311031 3544087 3542748
5071C542748R22811J65086M23777l77526j056960r1521O08166j05687K19096O38264
$$ 3542748 4465559 4630645 5054422 4676896 3619936 3528415 4136581 4030894 4249990 4888254
5061D888254k57504m37532M78737Q2376n71274k82375M02475M41312J9160j06728
$$ 4888254 4630750 4193218 4671955 4754331 4183057 3900682 4303157 4744469 4763629 4656901
5051D656901j27142L11325m75656o63323K15989K87643J046221m47435M66758
$$ 4656901 4529759 4841084 4365428 3702105 3918094 4205737 5251958 4804523 5271281
5042E271281n67669p6431J214090m18034l55968M3339O46049k85684k75303R6655
$$ 5271281 4703612 4627181 5841271 5423237 5067269 5110608 5756657 5470973 5195670 5292325
5032E292325J513893j031800q27713M43110o2785K46789p63985J379096N16983
$$ 5292325 6806218 5774418 4946705 5389815 5327030 5573819 4809834 6188930 6705913
5023F705913k76644l49145R4642L51510o43795L15818P23652K40707m49811M95265
$$ 6705913 6429269 6080124 6174766 6526276 5882481 6198299 6921951 7162658 6712847 7208112
5013G208112M25703J84521o3619j78457K91621k95178J117014L74943O9725L02386
$$ 7208112 7633815 7818336 7754717 7576260 7867881 7572703 8689717 9064660 9134385 9436771
5003I436771m66138Q86079L15216o09123O40607O3536j38068Q96602J024464k85577
$$ 9436771 8970633 9856712 10171928 9562805 10203412 10266948 10128880 11025482 12049946 11764369
4993A1764369J01171R82890K46884J62940M65699P64482R57619J677594M09823
$$ 11764369 11865540 12848430 13095314 13258254 13723953 14488435 15446054 17123648 17533471
4984A7533471O63302J805366J570187R89601Q69227J624236K748158K401097J849455
$$ 17533471 18196773 20002139 21572326 22561927 23431154 25055390 27803548 30204645 32054100
4975C2054100K327968J402995J561963P30950k96834k96676j900781k502739k583891
$$ 32054100 34382068 35785063 37347026 38077976 37781142 37484466 35583685 33080946 30497055
4966C0497055l053865j804348p14434j39619j711820l39703K6614K40603n47820
$$ 30497055 27443190 25638842 24924408 24784789 23072969 22733266 22759880 23000483 22452663
4957B2452663n31285j113042j34467J36545j002353q58193J47059J74766j272461
$$ 22452663 21921378 20808336 20673869 20810414 19808061 18949868 19096927 19271693 17999232
4948A7999232P12M08406l14160p23042K08307p04048J85435l82466n34396j14306
$$ 17999232 17999944 18408350 18094190 17371148 17579455 16875407 17060842 16678376 16143980 16029674
4938A6029674k12417m11373L83719M58296l38297L49405o85013l42346O71322
$$ 16029674 15817257 15405884 15789603 16247899 15909602 16259007 15573994 15231648 15902970
4929A5902970L93536R229j76926J58088L63004M00103M80621N05644j84451N38997
$$ 15902970 16296506 16305735 16128809 16286897 16649901 17050004 17530625 18036269 17851818 18390815
4919A8390815Q9585O78771O86211L81393M19643J338480J530876J616146Q31039
$$ 18390815 18480400 19159171 19845382 20226775 20646418 21984898 23515774 25131920 25962959
4910B5962959J068157J940788J479996J957325K974305J994794J918277K013875
$$ 25962959 27031116 28971904 30451900 32409225 35383530 37378324 39296601 41310476
4902D1310476J448525J099638j739345k156557l815813l860070k366900l063132
$$ 41310476 42759001 43858639 42119294 39962737 36146924 32286854 29919954 26856822
4894B6856822j547100j529519j933745j152445p34366j379344p08804j352633
$$ 26856822 25309722 23780203 21846458 20694013 19959647 18580303 17871499 16518866
4886A6518866o18890L2465o17729l71658J27146r76387m39186r42403l75439J29057
$$ 16518866 15899976 15932441 15314712 14943054 15070200 14093813 13654627 12712224 12336785 12465842
4876A2465842L09055J57716p73460l23833j53953M6210N03364o09348m02719p0388
$$ 12465842 12774897 12932613 12159153 11835320 11681367 11727577 12230941 11621593 11218874 11148486
4866A1148486k94333K36143L84474M88514j36678M44463o96171M03107q2173k42544
$$ 11148486 10854153 11090296 11474770 11963284 11826606 12271069 11574898 11978005 11895832 11653288
4856A1653288m5912j26032n78926P34477P12795p76862l10893O89623M24517M37717
$$ 11653288 11607376 11481344 10902418 11636895 12349690 11572828 11261935 11951558 12376075 12813792
4846A2813792K44143n07952M70116Q7081Q4762R14974o40201J38121o49786L56044
$$ 12813792 13057935 12549983 13020099 13107180 13191942 14106916 13466715 13604836 12955050 13311094
4836A3311094J051498k20091M85928J88389L79188J039832O85233N71581j046297
$$ 13311094 14362592 14142501 14628429 14816818 15196006 16235838 16921071 17492652 16446355
4827A6446355n06680K95490O42896N82970J332533R65645j44829N58485Q94319
$$ 16446355 15939675 16235165 16878061 17461031 18793564 19759209 19614380 20172865 21067184
4818B1067184n16788J352626P08435P29805J766100J631885J021593O67016Q50088
$$ 21067184 20550396 21903022 22611457 23341262 25107362 26739247 27760840 28427856 29277944
4809B9277944J69637O19833J212014O10882R99971N60404N61865J502963n67895
$$ 29277944 29447581 30067414 31279428 31890310 32890281 33450685 34012550 35515513 34947618
4800C4947618P26328N47380j060703k82733j253428j703319k03741j224829m53819
$$ 34947618 35673946 36221326 35160623 34877890 33624462 31921143 31717402 30492573 30038754
4791C0038754j42625q04692j47969k11666k50090l10263k79443P98777j38710
$$ 30038754 29896129 29091437 28943468 28731802 28481712 28171449 27892006 28690783 28552073
4782B8552073K09475Q80760m82738O54291L19177j30340K50278N09123J094346
$$ 28552073 28761548 29642308 29159570 29813861 30133038 30002698 30252976 30762099 31856445
4773C1856445k81612N21249P03098L35196J048189J185835l69178Q00281J485431
$$ 31856445 31574833 32096082 32799180 33134376 34182565 35368400 34999222 35799503 37284934
4764C7284934P05928P82890J632733M42466J831928J047873J352100J281726J450750
$$ 37284934 37990862 38773752 40406485 40848951 42680879 43728752 45080852 46362578 47813328
4755D7813328J681132K479008J585907J802951O85035J415949L16706n32236K6762
$$ 47813328 49494460 51973468 53559375 55362326 56047361 57463310 57780016 57247780 57274542
4746E7274542o21740j377162k150333j562618j939086r22933j640590j303004
$$ 57274542 56652802 55275640 53125307 51562689 49623603 48700670 47060080 45757076
4738D5757076o60919r22778j151828j506323L64920j132545p99450K27640n33833
$$ 45757076 45096157 44173379 43021551 41515228 41880148 40747603 39948153 40175793 39641960
4729C9641960K96888n21211j27204n43329M89702o1456Q78555M7834n71054o14290
$$ 39641960 39938848 39417637 39290433 38747104 39236806 39175350 40053905 40101739 39530685 38916395
4719C8916395n96m68860J076755J536708P27842n38594J66489l53592j67009M15617
$$ 38916395 38915799 38446939 39523694 41060402 41788244 41249650 41416139 41062547 40895538 41311155
4709D1311155m41634l22145M5306m01045R4904R00742l7222O66699j09142j97844
$$ 41311155 40869521 40547376 40592682 40191637 40286541 41187283 41150061 41816760 41707618 41509774
4699D1509774q71314l07818J043212k09338K56906j0257K74580j122952k71194
$$ 41509774 40638460 40330642 41373854 41164516 41421422 41411165 41685745 40562793 40291599
4690D0291599n4853j34012J8918K13245M80511j43242k36739n85934j38317N67706
$$ 40291599 40236746 40102734 40121652 40334897 40815408 40672166 40435427 39849493 39711176 40278882
4680D0278882p8062L01859k45999K53918J23650m64844L71189J328057J28279
$$ 40278882 40200820 40502679 40256680 40510598 40634248 40169404 40540593 41868650 41996929
4671D1996929o2040J024088Q00591J027223J170006J891617J157404J253279J433305
$$ 41996929 41934889 42958977 43759568 44786791 45956797 47848414 49005818 50259097 51692402
4662E1692402J499617K008249K111952K129715K130667J298865K106020J33165
$$ 51692402 53192019 55200268 57312220 59441935 61572602 62871467 64977487 65110652
4654F5110652l17494M9143j589816k087744j159474k332649k871038j826588k596639
$$ 65110652 64793158 64842301 63252485 61164741 60005267 57672618 54801580 52974992 50378353
4645E0378353k233623j632676j627503j375327j407540j333634o20717j410370
$$ 50378353 48144730 46512054 44884551 43509224 42101684 40768050 40147333 38736963
4637C8736963j0155m27076p71567K0349L53494l36153q00146m74687q25389n13115
$$ 38736963 38726808 38299732 37528165 37548514 37902008 37565855 36765709 36291022 35465633 34952518
4627C4952518l17377n9057J10535L66262j025697K28148L33703J35531r04125
$$ 34952518 34635141 34576084 34686619 35052881 34027184 34255332 34589035 34724566 33820441
4618C3820441R85420J01935J26775M07396O30313J11067O97474N99126o8652P07238
$$ 33820441 34805861 34907796 35034571 35441967 36072280 36183347 36880821 37479947 37411295 38118533
4608C8118533J576135J642542Q45802P02423N10562j13296L5468n54136j475843
$$ 38118533 39694668 41337210 42183012 42885435 43395997 43282701 43318169 42764033 41288190
4599D1288190j502391j465136j510922j735583j570681j314259j480007l30587
$$ 41288190 39785799 38320663 36809741 35074158 33503477 32189218 30709211 30378624
4591C0378624k43020j019436o99201o77276L10514q46175j472389o30871J196910
$$ 30378624 30135604 29116168 28416967 27739691 28050205 27204030 25731641 25100770 26297680
4582B6297680J35010r18280j249329n15565j90537O7994P2152j16116k04270p15695
$$ 26297680 26432690 25514410 24265081 23749516 23558979 23626973 23699125 23583009 23378739 22663044
4572B2663044m45550k66883k6733K38721o27080j46949M95546m83863j31100L4591
$$ 22663044 22217494 21950611 21923878 22162599 21535519 21388570 21884116 21400253 21269153 21303744
4562B1303744M37704L8931N09937n20404n10885m39360m62200P74169R9100K64389
$$ 21303744 21741448 21780379 22290316 21769912 21259027 20819667 20357467 21131636 21230736 21495125
4552B1495125n76548L7660J186307L51735o03617O22160l06348L73942M54692
$$ 21495125 20918577 20956237 22142544 22494279 21890662 22512822 22206474 22580416 23035108
4543B3035108q25770R70078R43909N77381m55414k92443O28121r46543m00199
$$ 23035108 22209338 23179416 24123325 24700706 24245292 23952849 24580970 23634427 23234228
4534B3234228l42775j1773p61782j96401j210319J75667J71009n21137j00725
$$ 23234228 22891453 22879680 22117898 21921497 20711178 20886845 21057854 20536717 20435992
4525B0435992J70304k11989k05166m68449p39740J070265o64241j27998k34298
$$ 20435992 20606296 20394307 20189141 19720692 18980952 20051217 19386976 19258978 19024680
4516A9024680j76479M19900K11389q07402n0960l10805l30924R07647k49449m62095
$$ 19024680 18848201 19268101 19479490 18672088 18621128 18310323 17979399 18887046 18637597 18175502
4506A8175502n93357N67531K94356K9421m258J61798n65812m46350Q56789l71054
$$ 18175502 17582145 18149676 18444032 18473453 18469195 18630993 18065181 17618831 18475620 18104566
4496A8104566k35291K1832o84775O99554m20523j92881m3454J57034j56355m51441
$$ 18104566 17869275 17891107 17206332 17905886 17485363 17292482 17249028 17406062 17249707 16798266
4486A6798266N85583P4198M1681n75247K73256o54508J91178M21512l14528L46141
$$ 16798266 17383849 17458047 17499728 16924481 17197737 16543229 16734407 17155919 16841391 17187532
4476A7187532R34145n9945N23927o2040K98703K75477j56814P78094R43533K99251
$$ 17187532 18121677 18061732 18585659 18523619 18822322 19097799 18940985 19719079 20662612 20961863
4466B0961863O57160N44098P46850Q63298J344587J467526J626959J393078J557561
$$ 20961863 21619023 22163121 22909971 23773269 25117856 26585382 28212341 29605419 31162980
4457C1162980K336252L001245K585901K335116K929619K460126Q76833o93577
$$ 31162980 33499232 36500477 39086378 41421494 44351113 46811239 47688072 46994495
4449D6994495j787761k304132k278521k828036l099009k569802k668100k119083
$$ 46994495 45206734 42902602 40624081 37796045 34697036 32127234 29459134 27340051
4441B7340051p22490j248439k448125k313030j86604P0612r04030q93351o26578
$$ 27340051 26617561 25369122 22920997 20607967 20421363 20491975 19587945 18694594 18068016
4432A8068016j006354J41083r23944r6844P0539o94158o77669k7564j263621p22455
$$ 18068016 17061662 17202745 16278801 16181957 16252496 15558338 14880669 14853105 13589484 12867029
4422A2867029M42306P973K82160L65558J02338j415120L78955P64150n95242n47813
$$ 12867029 13309335 13317308 13599468 13965026 14067364 12652244 13031199 13795349 13200107 12652294
4412A2652294K94386J044236m32369O0994J006601k03237L8282k07111m00768
$$ 12652294 12946680 13990916 13558547 13619541 14626142 14422905 14461187 14254076 13853308
4403A3853308J082925P15134K33686n69615L40388L51435J669048L16414N3298
$$ 13853308 14936233 15651367 15885053 15315438 15655826 16007261 17676309 17992723 18046021
4394A8046021M34249N78180Q98704R34785N71182N83830J526393J197002K938541
$$ 18046021 18480270 19058450 19957154 20891939 21463121 22046951 23573344 24770346 27708887
4385B7708887K090907J539051K589410J799100J348541L38852j824667n71389
$$ 27708887 29799794 31338845 33928255 35727355 37075896 37414748 35590081 35018692
4377C5018692k555787k710176k721460k088530j486647j900179j112814m23853
$$ 35018692 32462905 29752729 27031269 24942739 23456092 21555913 20443099 20019246
4369B0019246j488301r58473n60000n93248k04945m16590l67695o99957L34115
$$ 20019246 18530945 17572472 17012472 16419224 16214279 15797689 15429994 14730037 15064152
4360A5064152J72562j26815K16709J09370L41109n81766k493k28244O34909K71679
$$ 15064152 15236714 15109899 15326608 15435978 15777087 15195321 15192828 14964584 15599493 15871172
4350A5871172J492039K008923K84522M88011O09082P227k42307j067022q13644
$$ 15871172 17363211 19372134 19656656 20144667 20753749 20760976 20518669 19451647 18638003
4341A8638003k631527j002705o39728o03840r45154J27925j31433k38646K13337
$$ 18638003 16006476 15003771 14364043 13760203 12815049 12942974 12811541 12572895 12786232
4332A2786232m32264J42190n20421J297179n29422Q9614J49237l2596o67094J49075
$$ 12786232 12353968 12496158 11975737 13272916 12743494 12833108 12982345 12949749 12282655 12431730
4322A2431730M57428M68266l64976M68890J53245J069347K96971J66362m96496
$$ 12431730 12889158 13357424 12992448 13461338 13614583 14683930 14980901 15147263 14650767
4313A4650767j180141l32484p96817r40849l84119o7887l86590o35455n07160
$$ 14650767 13470626 13138142 12341325 11400476 11016357 10948470 10561880 9926425 9419265
4304I419265J64338n15425Q66155L70012l63382j097038p12626R27170N69246
$$ 9419265 9583603 9068178 9934333 10304345 9940963 8843925 8131299 9058469 9627715
4295I627715m39739k73874M15035o039j115981r9860J418278L47814L23468n15222
$$ 9627715 9187976 8914102 9329137 9323098 8207117 8107257 9525535 9873349 10196817 9681595
4285I681595m49004L42377m76042m96024M72864J413172O87047M3596O95766n30644
$$ 9681595 9232591 9574968 9098926 8602902 9075766 10488938 11175985 11219581 11915347 11384703
4275A1384703R2969o4966L02632J190615R43415j80415l07575o66364m42667N2844
$$ 11384703 11477672 11412706 11715338 12905953 13849368 13668953 13361378 12695014 12252347 12305191
4265A2305191p93728k38639P23856j23631j517653j53895M8892m86041k37184
$$ 12305191 11511463 11272824 11996680 11873049 10355396 10201501 10250393 9764352 9527168
4256I527168o02232N7434O67340J11266n57437J06923m27481R9483K71281l87866
$$ 9527168 8924936 8982370 9649710 9760976 9203539 9310462 8882981 8982464 9253745 8865879
4246H865879m52267N3316K73805O85565N34704l28356K19851l99033o79251J589815
$$ 8865879 8413612 8466928 8740733 9426298 9961002 9632646 9852497 9453464 8774213 10364028
4236A0364028J6890p38331O0058P84873l75753L73410K1642j201736N92800K71018
$$ 10364028 10380918 9642587 9702645 10487518 10111765 10485175 10506817 9305081 9897881 10168899
4226A0168899O83749m18202L83174m21674j860J67295q550J32473N52587m10922
$$ 10168899 10852648 10434446 10817620 10395946 10394086 10561381 10552831 10685304 11237891 10826969
4216A0826969k9825m81880n488j70017M01382q0775N35777Q1662n13247K83584
$$ 10826969 10797144 10315264 10309776 10139759 10541141 10460366 10996143 11077805 10564558 10848142
4206A0848142l57056K5092O11295O16099m82955J76875o6622r94743L1203j10215
$$ 10848142 10491086 10516178 11127473 11743572 11260617 11437492 11370870 10376127 10407330 10297115
4196A0297115j62502R3296O19206M91807n62720j74871O09151O83094R89816M29082
$$ 10297115 10134613 10227909 10847115 11338922 10776202 10601331 11210482 11893576 12883392 13312474
4186A3312474j340107m70830K04191M16762M46179L12932L56526r51695L0515
$$ 13312474 11972367 11501537 11705728 12122490 12568669 12881601 13238127 12286432 12316947
4177A2316947J91721j94943k58728J89389O01811P36505L33297M47908K61783
$$ 12316947 12508668 12313725 12054997 12244386 12846197 13582702 13915999 14363907 14625690
4168A4625690l25537j11341J89549j61753k96031P34323Q2942Q0960m95669N44992
$$ 14625690 14300153 14188812 14378361 14216608 13920577 14654900 14737842 14818802 14323133 14868125
4158A4868125J72929K36055J192024o17944J97541J75891m19098P07562k26298
$$ 14868125 15041054 15277109 16469133 15851189 16048730 16224621 15805523 16513085 16286787
4149A6286787J33563K50135j40670K82031R03306p61576L68451L84775N51465
$$ 16286787 16420350 16670485 16529815 16811846 17715152 16953576 17322027 17706802 18258267
4140A8258267N81315J65499j73258L87667P6853M99246j06736K06948R19382k57556
$$ 18258267 18839582 19005081 18831823 19219490 19296343 19795589 19688853 19895801 20815183 20557627
4130B0557627K48351L8691J32664O08753L34157N58828Q92521j69772R61909O92638
$$ 20557627 20805978 20844669 20977333 21586086 21920243 22479071 23371592 23201820 24163729 24856367
4120B4856367j67519J5663K41816Q37880R68349L42414J292208K63637J404851
$$ 24856367 24688848 24704511 24946327 25784207 26752556 27094970 28387178 28650815 30055666
4111C0055666J398940R7923O40681K08346L46692J090527Q81024J069413N52417
$$ 30055666 31454606 31552529 32193210 32401556 32748248 33838775 34719799 35789212 36341629
4102C6341629J31491J979548J121672J197264J256996Q50594J781216J333886
$$ 36341629 36473120 38452668 39574340 40771604 42028600 42879194 44660410 45994296
4094D5994296J717672Q63277K347939K109983J343936K233731K395133J639118
$$ 45994296 47711968 48575245 50923184 53033167 54377103 56610834 59005967 60645085
4086F0645085K048565J965194K069100K937010K052889K452541L015750K541018
$$ 60645085 62693650 64658844 66727944 69664954 71717843 74170384 77186134 79727152
4078G9727152K308441K774267L422571L998256K654880K455760L070278L812616
$$ 79727152 82035593 84809860 88232431 92230687 94885567 97341327 100411605 104224221
4070A04224221K551253L518457L549339L349256K503474L563886M257193K733239
$$ 104224221 106775474 110293931 113843270 117192526 119696000 123259886 127517079 130250318
4062A30250318K648230K549065L742645L875476L536814M639302M702696M775971
$$ 130250318 132898548 135447613 139190258 143065734 146602548 151241850 155944546 160720517
4054A60720517O117927N289449O232186P925521Q031480J0158368J1790217J4229874
$$ 160720517 166838444 172127893 178360079 186285600 194317080 204475448 216265665 230495539
4046B30495539J7269858J8165142J9105476J6279921J2237166N247319o654744
$$ 230495539 247765397 265930539 285036015 301315936 313553102 318800421 312145677
4039C12145677k0829017k7820845k7114205k3337084j8958882j6159554j2865835
$$ 312145677 291316660 263495815 236381610 213044526 194085644 177926090 165060255
4032A65060255j0670464r524372q278954n460270n099371n150413m277798m202680
$$ 165060255 154389791 144865419 136586465 131126195 126026824 120876411 116598613 112395933
4024A12395933l675902k471341k814969k956878k472613k182713j495567j070965
$$ 112395933 108720031 106248690 103433721 100476843 98004230 95821517 94325950 93254985
4016I3254985j267468q67700j53973m69008O22537k05177L14269Q51756O06920
$$ 93254985 91987517 91119817 90965844 90496836 91119373 90914196 91228465 92080221 92687141
4007I2687141J007976J733509K871538J760660K412844J607099K316767J875818
$$ 92687141 93695117 95428626 98300164 100060824 102473668 104080767 106397534 108273352
3999A08273352J848988J266992M41816j505482k697164j003925l478986l508726
$$ 108273352 110122340 111389332 111831148 110325666 107628502 106624577 103145591 99636865
3991I9636865k733437j668642j479526j728568k373614p77293n40020j243809
$$ 99636865 96903428 95234786 93755260 92026692 89653078 88875785 88335765 87091956
3983H7091956l37727L79122M73398l88840l15283j3900N50170N76585J291769
$$ 87091956 86754229 87133351 87606749 87217909 86902626 86888726 87438896 88015481 89307250
3974H9307250J559916J530107Q61545J554773J181332K201895K832844J704151
$$ 89307250 90867166 92397273 93258818 94813591 95994923 98196818 101029662 102733813
3966A02733813L132319K924775K559524K366057M132554L774797M174372M653200
$$ 102733813 105866132 108790907 111350431 113716488 117849042 121623839 125798211 130451411
3958A30451411N059228O007689O664873Q825156Q588525J0155317J1783610J3325648
$$ 130451411 135510639 141518328 148183201 157008357 165596882 175752199 187535809 200861457
3950B00861457J5246407J8886409K1286497K3016358K2961971K1174173J7179555
$$ 200861457 216107864 234994273 256280770 279297128 302259099 323433272 340612827
3943C40612827Q989104m716715j8702732k4838741k2298400j8111010j4573334
$$ 340612827 349601931 344885216 326182484 301343743 279045343 260934333 246360999
3936B46360999j0724848q028537n848624n413669l647484l222956l987733l778288
$$ 246360999 235636151 227607614 221758990 216345321 212697837 209474881 205487148 201708860
3928B01708860l075231l089490l510219l394437m369837l020865k361728l581928
$$ 201708860 198633629 195544139 192033920 188639483 184269646 181248781 178887053 175305125
3920A75305125k009480l008470j931842j565219j415102l70092r29610m22675
$$ 175305125 173295645 170287175 168355333 166790114 165375012 165004920 164075310 163652635
3912A63652635l73520J162436P09608R2555O96877Q46414J821203Q74703J017096
$$ 163652635 163279115 164441551 165151159 165243714 165940591 166787005 168608208 169482911 170500007
3903A70500007J859122R86411J244909J438259P81410J622785J993869O41828
$$ 170500007 172359129 173345540 174590449 176028708 176810118 178432903 180426772 181068600
3895A81068600K68207J655026K278054J613285Q97403O98643N40614L7502L11715
$$ 181068600 181336807 182991833 185269887 186883172 187780575 188479218 189019832 189057334 189369049
3886A89369049J024247n60621N34137j79789q80417P31663K92112p98367j149208
$$ 189369049 190393296 189832675 190366812 190187023 189306606 190038269 190330381 189532014 188382806
3877A88382806j035389j086993o47279q97772j495588j227199q82474r41450j268467
$$ 188382806 187347417 186260424 185613145 184715373 183219785 181992586 181110112 180168662 178900195
3868A78900195p84454j216245n08610k29873k94006n1496l50215j175308P98051
$$ 178900195 178115741 176899496 176390886 176161013 175867007 175815511 175465296 174289988 175088039
3859A75088039J44793o05975J559262N25332J0847J624458J399114Q37409L60125
$$ 175088039 175232832 174626857 176186119 176711451 176722298 178346756 179745870 180583279 180943404
3850A80943404P88981J114454P51916R24474j23662k26726m0935n20296n62163
$$ 180943404 181732385 182846839 183598755 184523229 184399567 184172841 184131906 183611610 183049447
3841A83049447m70265o24154q35098j269931k046110k890514j525922k103410
$$ 183049447 182579182 181955028 181119930 179849999 177803889 174913375 173387453 171284043
3833A71284043k221483k716323l467629l625464l054155l182142l939168k454576
$$ 171284043 169062560 166346237 162878608 159253144 156198989 153016847 149077679 146623103
3825A46623103l174309l595544l561039l296005k547246l138495k645903l677726
$$ 146623103 143448794 139853250 136292211 132996206 130448960 127310465 124664562 120986836
3817A20986836k503519k845465k178318j936629j847324j900566j376518j900225
$$ 120986836 118483317 115637852 113459534 111522905 109675581 107775015 106398497 104498272
3809A04498272j211277l11925j277815o40061M65555k25230K23437L63602J133542
$$ 104498272 103286995 102975070 101697255 101057194 101522749 101297519 101520956 101884558 103018100
3800A03018100J174931R27903J259508J64253J96104N88110R48654P95154M27541
$$ 103018100 104193031 105120934 106380442 106544695 106740799 107328909 108277563 109072717 109500258
3791A09500258Q01861n0745M84488R47178R77099M01325N24676L62829j92243
$$ 109500258 110302119 110251374 110735862 111683040 112660139 113061464 113586140 113948969 113756726
3782A13756726q82007o31082r95092j614712j865253j232925o98892l011039k704642
$$ 113756726 112874719 112243637 111248545 109633833 107768580 106535655 105836763 102825724 100121082
3773A00121082j500429k075686k623786l340775k442116k582527k373233k113813
$$ 100121082 98620653 96544967 93921181 90580406 88138290 85555763 83182530 81068717
3765H1068717k852879k890247j838845k155184k377246k777503k097956j657024
$$ 81068717 78215838 75325591 73486746 71331562 68954316 66176813 64078857 62421833
3757F2421833k097992j925864j471326m33475j587134j094313r22117j432374
$$ 62421833 60323841 58397977 56926651 56493176 54906042 53811729 52889612 51457238
3749E1457238l96874l94285j429174n45012m41587r75513l98140j81273n42446
$$ 51457238 51060364 50666079 49236905 48691893 48250306 47274793 46876653 46695380 46152934
3740D6152934L59487q27048P45760j055574N95051j07382J106866O62404P75941
$$ 46152934 46512421 45685373 46431133 45375559 45970610 45863228 46970094 47632498 48408439
3731D8408439J86802O20918K5490K2741Q71370R62758Q26701N70447K132339J194083
$$ 48408439 48595241 49216159 49241649 49264390 50135760 51098518 51925219 52495666 54628005 55822088
3721E5822088R92418Q02076J183336K041500R67856O48293J655097K489648K350166
$$ 55822088 56814506 57616582 58799918 60841418 61809274 62457567 64112664 66602312 68952478
3712F8952478J798870J731863K514199K412718K689940K736858K598332K172517
$$ 68952478 70751348 72483211 74997410 77410128 80100068 82836926 85435258 87607775
3704H7607775K014052K438477K211415L351334K954052L297386K103941K009914
$$ 87607775 89621827 92060304 94271719 97623053 100577105 103874491 105978432 107988346
3696A07988346K408408K220309J782971J139784J232035J246615K472757K081886
$$ 107988346 110396754 112617063 114400034 115539818 116771853 118018468 120491225 122573111
3688A22573111R55490L17570K73495J337234j6550J7734j3091m03545q61524o96584
$$ 122573111 123528601 123846171 124119666 125456900 125440350 125458084 125444993 125041448 124179924 123483340
3678A23483340l48170k15667k41285L6219P3600k39810n75080M41027J603494
$$ 123483340 123135170 122919503 122678218 122714437 122788037 122548227 121973147 122414174 124017668
3669A24017668R41890L17164J205853J134579R80365J803292K004633K528342
$$ 124017668 124959558 125276722 126482575 127617154 128597519 130400811 132405444 134933786
3661A34933786L077419K694412J857700L369641L901864M066367L647598L083140
$$ 134933786 138011205 140705617 142563317 145932958 149834822 153901189 157548787 160631927
3653A60631927M875726M471454L734633M143946M353546L932407L017258K579294
$$ 160631927 165507653 169979107 173713740 177857686 182211232 186143639 189160897 191740191
3645A91740191L046444K260995K653754J373973J497206K210036J653622P53342
$$ 191740191 194786635 197047630 199701384 201075357 202572563 204782599 206436221 207189563
3637B07189563J131835K59929M65105l78177k80225r22696j700939r60434j551017
$$ 207189563 208321398 208581327 209046432 208668255 208388030 207465334 205764395 204803961 203252944
3628B03252944k331015l302941k351880j451495j761650k962409k090642k520551
$$ 203252944 200921929 197618988 195267108 193815613 192053963 189091554 187000912 184480361
3620A84480361k557795k833369l165242l066044k969358l311753l982738l806551
$$ 184480361 181922566 179089197 175923955 172857911 169888553 166576800 162594062 158787511
3612A58787511m487892l648578m144919k787100k338586k803992k503249k156210
$$ 158787511 154299619 150651041 146506122 143719022 141380436 138576444 136073195 133916985
3604A33916985k332632k534954k933640j071526n74328j328971j563014j762054
$$ 133916985 131584353 129049399 126115759 125044233 124469905 123140934 121577920 119815866
3596A19815866r66884R5330n24011l49590n41332L33202Q81716J181110R08439
$$ 119815866 118848982 118944312 118420301 118070711 117529379 117862581 118744297 119925407 120833846
3587A20833846O47939J552384Q68509P81641J041736J645691J007595J823729
$$ 120833846 121481785 123034169 123902678 124684319 125726055 127371746 128379341 130203070
3579A30203070J506235J365194J450193R79258O2983Q58381J403428Q23557M65679
$$ 130203070 131709305 133074499 134524692 135503950 135566933 136425314 137828742 138652299 139117978
3570A39117978R28968N82139J310912J695466J089113J447964J328815P67239
$$ 139117978 140046946 140629085 141939997 143635463 144724576 146172540 147501355 148268594
3562A48268594J528293Q02138Q07616K330430K106909J304954K087741K890860
$$ 148268594 149796887 150599025 151406641 153737071 155843980 157148934 159236675 162127535
3554A62127535K334854K439045L825825L174275M293471M701391N093208N080260
$$ 162127535 164462389 166901434 170727259 173901534 178195005 182896396 187989604 193069864
3546A93069864N481017P122889P493473O891679O947654P702666Q043472P872345
$$ 193069864 198550881 205673770 213167243 220058922 227006576 234709242 242752714 250625059
3538B50625059Q193933P904337P103858P596269O901477O141152N421822L755486
$$ 250625059 258818992 266723329 273827187 281423456 288324933 294466085 299887907 303643393
3530C03643393L633974K314947K786341J375702O77823k17421k054791k803190
$$ 303643393 307277367 309592314 312378655 313754357 314432180 314214759 312159968 309356778
3522C09356778k857746l847566m871668m920601o186441p223602p618389q449058
$$ 309356778 306499032 302651466 297779798 292859197 286672756 279449154 271830765 263381707
3514B63381707r586121r323002p817784q426572r180665j0033779r183093q033909
$$ 263381707 253795586 244472584 236654800 228228228 219047563 209013784 199830691 191796782
3506A91796782q393048q395705q423820p070523o882012o206409o483983n860208
$$ 191796782 183403734 175008029 166584209 159513686 152631674 146425265 139941282 134081074
3498A34081074o671429n399268n006714m398689m314540m183367m047478l216643
$$ 134081074 127409645 122010377 117003663 112604974 108290434 104107067 100059589 96842946
3490I6842946k800500k986835k463168k762322k833071k718706k816705j524861
$$ 96842946 94042446 91055611 88592443 85830121 82997050 80278344 77461639 75936778
3482G5936778j870307j655519n40586j523115q35008k39619r88485q23620m11697
$$ 75936778 74066471 72410952 71870366 70347251 69512243 69272624 68284139 67460519 67048822
3473F7048822n30880j261641l48060R04832o64838Q7860N18843M11075K08420
$$ 67048822 66517942 65256301 64908241 65813073 65148235 65236095 65754938 66166013 66374433
3464F6374433N07695J185223Q51095P48232J336849J372117J009421J591473Q13563
$$ 66374433 66882128 68067351 68918446 69666678 71003527 72375644 73385065 74976538 75790101
3455G5790101J163488J302545K328871K174989J136136J269044J437502J920505
$$ 75790101 76953589 78256134 80585005 82759994 83896130 85165174 86602676 88523181
3447H8523181J819189J428218J327704R05700J119188J425710N99815Q51080L10236
$$ 88523181 90342370 91770588 93098292 94003992 95123180 96548890 97148705 97999785 98310021
3438I8310021J264741o9206r50291m72366K46399o53818j961237m47838r74807
$$ 98310021 99574762 99505556 98555265 98082899 98329298 97675480 95714243 95266405 94291598
3429I4291598j651709j702320j709648k538841j945246k256281j869951k607022
$$ 94291598 92639889 90937569 89227921 86689080 84743834 82487553 80617602 78010580
3421G8010580k804954o97315k170935l025414j927181j584071k090324j361172
$$ 78010580 75205626 74508311 72337376 69311962 67384781 65800710 63710386 62349214
3413F2349214k179963k184512j808368j587484j065004j284473j246249p92914
$$ 62349214 60169251 57984739 56176371 54588887 53523883 52239410 50993161 50200247
3405E0200247m99266j080251q95434J73864M36904m98560k12841K46032O08419
$$ 50200247 49700981 48620730 47725296 47899160 48336064 47837504 47624663 47870695 48479114
3396D8479114N18212l6921l93386k37661M44985L60785p7303m90824N97579L50586
$$ 48479114 48997326 48960405 48567019 48329358 48774343 49135128 49057825 48567001 49164580 49515166
3386D9515166N4558P95178J62747m45352r918N08722j217644p62734p96554K91327
$$ 49515166 49569724 50364902 50527649 50082297 50072379 50581101 49363457 48600723 47804169 48095496
3376D8095496p58872l47098j501377m53864n59046j462406q23513p65811q31100
$$ 48095496 47336624 46989526 45488149 45034285 44475239 43012833 42189320 41423509 40592409
3367D0592409j832095p83100j365332j000506k19425j580082k187122j485997
$$ 40592409 38760314 37977214 36611882 35611376 35391951 33811869 31624747 30138750
3359C0138750j554660o77794j000733r71316o85294j478691p41555p75781q33016
$$ 30138750 28584090 27906296 26905563 25934247 25248953 23770262 23028707 22252926 21419910
3350B1419910q78080j272100m84185m81548j127727o32901L76714j129641L87472
$$ 21419910 20541830 19269730 18785545 18303997 17176270 16543369 16920083 15790442 16177914
3341A6177914j292427n79779j00661q83210J49205K85956l10319j084851m04650
$$ 16177914 14885487 14305708 14205047 13321837 13471042 13756998 13446679 12361828 11957178
3332A1957178l27604j084912K47236k15723N86777m39180n60372J52508M7438
$$ 11957178 11629574 10544662 10791898 10576175 11162952 10723772 10163400 10315908 10363346
3323A0363346o66952n63205m76025L34590K37422q66663N21099J31260N95773
$$ 10363346 9696394 9133189 8657164 8991754 9229176 8362513 8883612 9014872 9610645
3314I610645o11702l47131q50842M5156O68228k26147j200520O3433L78478J49289
$$ 9610645 8998943 8651812 7800970 7846126 8514354 8288207 7087687 7151120 7529598 7678887
3304G678887l92558o97405N01374J75663p5753j44998K03819m60493l17230N31564
$$ 7678887 7286329 6588924 7090298 7265961 7190208 7045210 7249029 6788536 6471306 7002870
3294G002870L20514N17285K11030k08221k70549p79342j98676n48874P53420j73834
$$ 7002870 7323384 7840669 8051699 7843478 7572929 6793587 6594911 6046037 6799457 6625623
3284F625623n67680O18511j55341O48783P65686k11097q09891J57398M67921M44061
$$ 6625623 6057943 6676454 6521113 7169896 7935582 7724485 6914594 7071992 7539913 7983974
3274G983974m79913l49228M05495J119971j40573r72307O10429N217L99725Q84104
$$ 7983974 7504061 7154833 7560328 8680299 8539726 7567419 8177848 8183065 8582790 9466894
3264I466894L81697J9356j12879n2211k19557O13845N31649M73203L79915j55344
$$ 9466894 9848591 9867947 9755068 9702857 9483300 10097145 10628794 11101997 11481912 11326568
3254A1326568l03515m25254j144141O50252Q51356L53650k90777j59362N45600
$$ 11326568 11023053 10597799 9453658 10103910 10955266 11308916 11018139 10858777 11404377
3245A1404377n79190J85565J04968P035p02698l18051p20012M9337k2243p70302
$$ 11404377 10825187 11010752 11115720 11122755 10420057 10102006 9381994 9431331 9409088 8638786
3235H638786j171074R8483j61866o41723K3124j86992J63281l35383j08235k22549
$$ 8638786 7467712 7566195 7404329 6762606 6785730 6598738 6762019 6426636 6318401 6095852
3225F095852K3313k09393O45653k61733j36280K57300M47682n9654o95957K84005
$$ 6095852 6119165 5909772 6555425 6293692 6157412 6414712 6862394 6802740 6106783 6390788
3215F390788M20605J90422O64126n1151J53845M37138r91018p33105J67771q57871
$$ 6390788 6811393 7001815 7665941 7614790 7768635 8205773 7214755 6481650 6649421 5791550
3205E791550r20083k13563n47341k45936r37437l40366n9013o28642j42533j0463
$$ 5791550 4871467 4657904 4110563 3864627 2927190 2586824 2527811 1899169 1756636 1746173
3195A746173L61036L77076n19172K85036L91396n00599J0959m08590P79813L17186
$$ 1746173 2107209 2484285 1965113 2250149 2641545 2140946 2151905 1743315 2523128 2840314
3185B840314N11125P7619j204483J94122J452097O0287j27049L33573p52142O35553
$$ 2840314 3351439 3429058 2224575 2418697 3870794 3931081 3804032 4137605 3385463 4021016
3175D021016o01457r82220p19632O73264R4878o24016N9550m63491j23409n5265
$$ 4021016 3419559 2437339 1717707 2390971 2485849 1861833 1921383 1457892 1334483 1279218
3165A279218m19585O80935K10540k78843O16796K3851r62890l30578J71359J51849
$$ 1279218 859633 1540568 1751108 1472265 2089061 2112912 1150022 819444 990803 1142652
3155A142652o30829j051974M83386k63254J059986j83960l69037L14063m46112
$$ 1142652 511823 -540151 -56765 -320019 739967 556007 186970 501033 54921
3146E4921J26747N65331m62120r0591L94352N12086j76330j10521O16018l91986
$$ 54921 181668 746999 284879 194288 588640 1100726 924396 813875 1429893 1037907
3136A037907n76929O6443J92139J07598M21811k94930n68069L2318p233k28954
$$ 1037907 460978 527421 719560 827158 1248969 954039 385970 418288 411055 182101
3126A82101m77824J24085J94333p21210K29370O30262J251477o90753q79807Q4432
$$ 182101 -295723 -171638 22695 -698515 -469145 161117 1412594 721841 -157966 -73534
3116g3534o5601m39115L61579k41261k31520k14367P62372N59313l58850k11740
$$ -73534 -139135 -578250 -216671 -457932 -689452 -903819 -141447 417866 59016 -152724
3106a52724k6299M75364N18913r1970p86987l22148J85459O8201P23296K99735
$$ -152724 -179023 296341 815254 723284 -63703 -385851 -200392 -132191 591105 890840
3096H90840m58103J34970j75211m1214o07218J95694j26976L61942m62441l36505
$$ 890840 432737 567707 392496 351282 -255936 -60242 -187218 174724 -287717 -624222
3086f24222O81396k30939K01657n07628m7092o5124J76319P84659m16224m50104
$$ -624222 57174 -173765 27892 -479736 -526828 -591952 -415633 369026 -47198 -497302
3076d97302L38505O30914J75926m64212o25378o8191P32209j13950J296678K15665
$$ -497302 -158797 472117 648043 183831 -441547 -509738 222471 108521 1405199 1620864
3066A620864o38218j64817q75869l34993n00124j03610J28385j34026Q06622M21662
$$ 1620864 982646 817829 -58040 -393033 -893157 -996767 -868382 -1002408 -195786 225876
3056B25876L56573N49214k55172n70438m89872m78528J2461P99293m22189J37582
$$ 225876 582449 1131663 876491 306053 -183819 -662347 -649886 149407 -272782 -135200
3046a35200r0747r1373M13925m29770n58940J031084m79755j64509p1324m40405
$$ -135200 -225947 -317320 96605 -333165 -892105 138979 -340776 -505285 -576609 -1017014
3036a017014K10153J328654l72135k83939n82077J76096J35421Q44209J06018
$$ -1017014 -806861 521793 149658 -134281 -716358 -540262 -404841 439368 545386
3027E45386r7165j00580m88071N6807l77630K79482Q9899R46850M15563j86727
$$ 545386 448221 347641 -140430 -83623 -461253 -181771 -91872 854978 1270541 1083814
3017A083814o01682k70292L95725M6359L38443K09670j193790p1145Q35045n73042
$$ 1083814 482132 211840 607565 653924 992367 1202037 8247 -62898 772147 199105
3007A99105p92032M80904J19698Q06249o40180r10893N95024O38944l54629M69389
$$ 199105 -592927 -112023 7675 813924 173744 -737149 -142125 496819 142190 611579
2997F11579m87452K02748L73671O2219K13594M92505O77328r77247o3807Q7802
$$ 611579 124127 326875 700546 762765 976359 1468864 2146192 1168945 1105138 1192940
2987A192940L81675M6193q81732M02904o69050J042068K96186m79439q749l79919
$$ 1192940 1574615 1620808 739076 1141980 472930 1514998 1811184 1331745 1322996 943077
2977I43077J04603K14650m08910J32346M5109k72042p5083R5183N72559L22865
$$ 943077 1047680 1262330 853420 985766 1030875 758833 683750 778933 1351492 1674357
2967A674357O08014q2693q50773l26943J76446J87806N77670q72797j99228Q97612
$$ 1674357 2282371 2199678 1348905 1021962 1198408 1386214 1963884 1091087 891859 1789471
2957A789471O44978j52712L00P12268o72119j04252q33899M7124K99541O82657
$$ 1789471 2434449 2281737 2282037 2994305 2322186 2217934 1384035 1431159 1730700 2413357
2947B413357j80232l46649N13173R27783N26656j074919l13702Q01866Q61381
$$ 2413357 2233125 1886476 2399649 3327432 3854088 2779169 2465467 3267333 4128714
2938D128714p51061m91003K04768Q53729r8861j028971o36407L50884J54703L56936
$$ 4128714 3377653 2886650 3091418 3945147 3846286 2817315 2180908 2531792 2686495 3043431
2928C043431J91816j56974L2177K72535N40296L08507m35125K19333l9352l97844
$$ 3043431 3235247 3078273 3110450 3382985 3923281 4231788 3796663 4015996 3976644 3578800
2918C578800K4173o163Q2994J158418j91542L4518O6061n20271J085478J21932
$$ 3578800 3602973 3596810 3679804 4838222 4646680 4681198 4747259 4226988 5312466 5434398
2908E434398q22624m91869O44900p4682j048815M62916o34559j38581P47602j90983
$$ 5434398 4611774 4119905 4764805 4690123 3641308 4104224 3469665 3331084 4078686 3887703
2898C887703j555188m35268P49823Q4526o36787J93519j59508O78577n71873q08663
$$ 3887703 2332515 1897247 2647070 2731596 2094809 2288328 2128820 2807397 2235524 1426861
2888A426861J69862R44556q2604n80928K85890Q57357p03665j2787l7280J04253
$$ 1426861 1596723 2541279 2458675 1877747 2163637 3020994 2317329 2304542 2267262 2371515
2878B371515p81020p34132O79280m08480P08461j96994Q73k7410k16562p3877
$$ 2371515 1590495 856363 1535643 1127163 1835624 1638630 1639503 1612093 1395531 1321654
2868A321654L06263m26174J85468l68404M09617o53344P29790j41644p51894L49182
$$ 1321654 1627917 1201743 1387211 1018807 1428424 775080 1504870 1363226 611332 960514
2858I60514J20058k05169l53480o01075N56496M04640K6946j48100l58760K06713
$$ 960514 1080572 875403 521923 -79152 477344 881984 908930 760830 402070 608783
2848F08783J69932j94167l41258k75269N7300n75371Q35776l36609j166791Q61659
$$ 608783 778715 584548 243290 -31979 25321 -550050 285726 -50883 -1217674 -356015
2838c56015j15204m83991k58321N16798O65077o17784N67880M89727k30203o43185
$$ -356015 -471219 -955210 -1213531 -696733 -31656 -649440 -81560 408167 177964 -465221
2828d65221m45701L42922L53989o61060j85715M44440J79629K25595r4589L20590
$$ -465221 -910922 -568000 -214011 -875071 -1060786 -616346 -436717 -211122 -305711 14879
2818A4879O9261k0832q53916o0730K13304M0392M79226o02639k48572n1884q3199
$$ 14879 84140 63308 -790608 -851338 -638034 -597642 -118416 -721055 -969627 -1021511 -1104710
2807a104710Q52528k92719J45334k05239L54106l71481J19850Q79651N34495r45607
$$ -1104710 -252182 -544901 -399567 -604806 -250700 -622181 -502331 377320 911815 -33792
2797c3792m34350k2839Q39207n32209k46412M01166j34998J62933K36051J41004
$$ -33792 -468142 -490981 348226 -183983 -430395 -29229 -164227 -1294 234757 375761
2787C75761r74402L50833J04735M16322L74435n65652m00921m44471L0310O49495
$$ 375761 -598641 -247808 -143073 273249 647684 82032 -318889 -763360 -733050 -83555
2777h3555l13641K2748n11764m12006P14229k7855q5839L82907O58043j041478
$$ -83555 -397196 -374448 -886212 -1298218 -583989 -611844 -697683 -314776 343267 -698211
2767f98211j10726j13752n9993J431037p24811j119427K97125K01089j02759k12128
$$ -698211 -808937 -922689 -982682 448355 -276456 -1395883 -1098758 -897669 -1000428 -1212556
2757a212556M01506J57368n69927R87039R62008p05862p96518K07444J7907m3411
$$ -1212556 -811050 -653682 -1223609 -236570 725438 19576 -776942 -569498 -551591 -595002
2747e95002l25148N39373o43385m30723k31918K54552N71643J00138k02002p7300
$$ -595002 -920150 -380777 -1024162 -1454885 -1686803 -1432251 -860608 -760470 -962472 -1039772
2737a039772L93110O62406r98383k03158Q9511N16943J09805m19200j02696R0129
$$ -1039772 -646662 15744 -982639 -1185797 -1096286 -579343 -469538 -888738 -991434 -901305
2727i01305P896m49701K68317M29987o1126L84377O5741j291998N29339K60858
$$ -901305 -893409 -1343110 -1074793 -644806 -705932 -321555 -255814 -1547812 -1018473 -757615
2717g57615K00734N0260P35358J27369n43616o80815M54402l01334J71644N84532
$$ -757615 -556881 -506621 228737 356106 -187510 -868325 -413923 -715257 -543613 40919
2707D0919n4042j006203j5002P16805j98831m84241J37823K77818m84917J8161
$$ 40919 -13123 -1019326 -1034328 -317523 -516354 -1000595 -862772 -584954 -1069871 -1051710
2697a051710P69502N18381j8827r88780j005976L621Q27760K60578o75000N02675
$$ -1051710 -282208 236173 217346 -771434 -1777410 -1773789 -946029 -685451 -1360451 -857776
2687h57776P68619k64852j50387Q22631p50960j50822M8314K57202K16048m85886
$$ -857776 -89157 -354009 -504396 318235 -432725 -583547 -535233 -278031 -61983 -547869
2677e47869K93396M24916o82103j39448j39117j82385K34091J034844j55808j93670
$$ -547869 -254473 170443 -511660 -651108 -790225 -972610 -738519 296325 140517 -53153
2667e3153K6112J41294j04988J94599n86775q7804K60911l71579K49620L14627
$$ -53153 -27041 114253 9265 203864 -382911 -470715 -209804 -581383 -331763 -17136
2657a7136q32655n22469Q41993l90161o21394L56479L86181l22264P23185N24516
$$ -17136 -849791 -1372260 -530267 -920428 -1541822 -1185343 -799162 -1121426 -398241 126275
2647A26275M40360r20401l73574j74238P14737J20241o51567M41930q17559K90106
$$ 126275 566635 -353766 -727340 -901578 -186841 -66600 -718167 -276237 -1093796 -803690
2637h03690l36681J18032N09845n32737Q50753N5616j129771m17870P62030K89170
$$ -803690 -1140371 -1022339 -512494 -1045231 -194478 -138862 -1268633 -1686503 -924473 -635303
2627f35303r9451j12947l1181m23239k1053K05517J52858K00275l30587L31185
$$ -635303 -734754 -847701 -878882 -1302121 -1323174 -1117657 -964799 -764524 -1095111 -763926
2617g63926P68315m12513m7063K89427O2159k57778O95760j178351r09712Q96751
$$ -763926 4389 -408124 -455187 -165760 -103601 -361379 334381 -843970 -1753682 -856931
2607h56931K68738q4215L6474n02698l78780O08269J176322k45624j63357q5865
$$ -856931 -588193 -672408 -635934 -1138632 -1517412 -909143 267179 21555 -141802 -227667
2597b27667n46963j02269O40221O82161n25696J8692j09679O08769K4333o78085
$$ -227667 -774630 -876899 -236678 445483 -80213 -61521 -171200 437569 461902 -216183
2587b16183Q5535j95667k7483p67667K05889j52678j759N02799J62277k52011
$$ -216183 -130648 -326315 -353798 -1121465 -915576 -1068254 -1070013 -567214 -404937 -656948
2577f56948m5047l70103J16120Q73781l10741m09303J03392L09673K5898R20306
$$ -656948 -701995 -1072098 -955978 -82197 -392938 -802241 -698849 -389176 -363278 557028
2567E57028J48305m09292l41201n58672j60753O76736m5378j167489k29499J061687
$$ 557028 705333 296041 -45160 -603832 -764585 -87849 -133227 -1300716 -1530215 -468528
2557d68528k58959j49500M40805l18254l53904l2919l99188Q59738n64362M95859
$$ -468528 -727487 -876987 -436182 -754436 -1108340 -1141259 -1540447 -680709 -1245071 -749212
2547g49212J67214P40263J57650k6946N3672o00881n05273j95437q6108J94101
$$ -749212 -581998 158265 315915 288969 342641 -258240 -763513 -958950 -1045058 -850957
2537h50957N95572l69150p96568n1470m75642R58290N41132o5017N60005J93967
$$ -850957 -255385 -624535 -1421103 -1472573 -1948215 -989925 -448793 -513810 46195 240162
2527B40162r16038l59496L92660J35626O9203N81710l15920n30898J10626N45645
$$ 240162 -675876 -1035372 -642712 -507086 -437883 143827 -172093 -702991 -592365 -46720
2517d6720J5909k245L59467j082041R8484N43588L00309k64196k37358J76885
$$ -46720 -30811 -33056 326411 -755630 -657146 -113558 186751 -77445 -314803 -137918
2507a37918j9067p36737J95438j049076J61133J105239M86772o67046J18459P6773
$$ -137918 -156985 -893722 -698284 -1747360 -1586227 -480988 5784 -661262 -542803 -466030
2497d66030K44549q0925r2600k36460j96135j4955K21345L27577J39095m14338
$$ -466030 -221481 -302406 -395006 -631466 -827601 -842556 -621211 -293634 -154539 -568877
2487e68877O86774L67507r22058o14157O64922P3477N53237l76814j139167R90196
$$ -568877 117897 485404 -436654 -1050811 -385889 -312412 240825 -135989 -1275156 -284960
2477b84960k03100M88232n53721m52218O08347R14130j62574l55854j56718m45655
$$ -284960 -488060 172 -553549 -1005767 -397420 516710 354136 -1718 -158436 -604091
2467f04091M81156J23898L0665L7813k6758K05665j79554N33360o70252q02835
$$ -604091 -122935 963 31628 69441 42683 248348 68794 602154 -68098 -870933
2457h70933J016016J95091M47218j75798m14041m36979k17847o14008M00613L96736
$$ -870933 145083 340174 787392 611594 197553 -239426 -457273 -1071281 -670668 -273932
2447b73932p29205M09690o5021K05669O37827m7668o10217O94862k76311k01959
$$ -273932 -1003137 -593447 -658468 -452799 185028 137360 -472857 222005 -54306 -256265
2437b56265L88425r13990q22379L69953L26637l81400J466026k1521l02042K19810
$$ -256265 132160 -781830 -1604209 -1234256 -907619 -1289019 177007 155486 -146556 73254
2427G3254P6262K86292L00222l34079k30073j07149p470N71996l30387n02921
$$ 73254 149516 435808 736030 401951 171878 64729 57259 629255 298868 -204053
2417b04053n59382J56640n7867Q66937J04996m18952L13102M04905k5385l60583
$$ -204053 -763435 -606795 -664662 202275 307271 -111681 201421 606326 580941 220358
2407B20358l29552j56732j22521L93049N68080m17631j171270K324N20731o6064
$$ 220358 -109194 -265926 -388447 4602 572682 155051 -1016219 -1013895 -493164 -559228
2397e59228J341763k59297j09614j57158m23681l42612N53803Q8731n89309n6531
$$ -559228 782535 523238 413624 256466 -167215 -509827 43976 132707 -456602 -513133
2387e13133J20019O53869K62409J40778O8669M03505L33980N32636n81257o55409
$$ -513133 -393114 260755 523164 663942 732611 1136116 1470096 2002732 1421475 766066
2377G66066M31774k2617R4532j34235k17156L71201p62938M49172M45033j074826
$$ 766066 1197840 1175223 1269755 1135520 918364 1289565 526627 975799 1420832 346006
2367C46006K5269Q1763J04398n39184K6605O56109k2291p22561l2711K38467M44557
$$ 346006 371275 453038 557436 18252 44857 700966 678675 -43886 -76597 161870 606427
2356F06427L14863j68129l11112m9902N85859j02947k31498o23763o42542O6654
$$ 606427 921290 753161 442049 392147 978006 875059 643561 19798 -622744 -556090
2346e56090O48998j58886L6562J02034L25501k26222k49214J88663j27751l36091
$$ -556090 92908 -65978 -29416 72618 398119 171897 -77317 111346 -16405 -352496
2336c52496M7926J82124r3494L32885N76328L01668N11911p43315o41182p20505
$$ -352496 -304570 -122446 -215940 116945 693273 994941 1506852 763537 122355 -598150
2326e98150L35794M16174k49803L77470q9611j09825P21824O91332k65085l41599
$$ -598150 -262356 153818 -95985 281485 191874 82049 803873 1495205 1230120 888521
2316H88521L28190K8925J11028p12160j46611K23934M16456m47789m10268M15640
$$ 888521 1216711 1245636 1356664 644504 497893 721827 1138283 690494 280226 695866
2306F95866l76287L46673k07900Q85318k08370l3422n44772k20641n9655K8604
$$ 695866 319579 666252 458352 1343670 1135300 1101878 557106 336465 276810 305414
2296C05414J6903n06928L9882r2574L34846M5450j83483Q04715L82603m64398
$$ 305414 322317 -184611 -144729 -237303 97543 142993 -40490 764225 1146828 682430
2286F82430N13570j234615J55810N43588O75011j44931n9765K10555M42708j7641
$$ 682430 1196000 -38615 117195 660783 1335794 1190863 1131098 1341653 1784361 1766720
2276A766720m68847o44606M98971j08959m92465J173614J19318j63685q62170
$$ 1766720 1297873 653267 1152238 1043279 550814 1724428 1843746 1680061 817891
2267H17891m09716k34159O97525L08223m60614L92403P0643J94248q49233J33830
$$ 817891 408175 174016 871541 1179764 719150 1111553 1182196 1376444 527211 661041
2257F61041P07879l81989J47291j76055M24145M90386j58482q17774L69956K16922
$$ 661041 1368920 986931 1134222 958167 1382312 1872698 1714216 896442 1266398 1483320
2247A483320M1920n09183K81808K46381k11016j87600J271116l72550J21539O02866
$$ 1483320 1525240 1016057 1297865 1544246 1333230 1145630 2416746 2044196 2165735 2768601
2237B768601o33229l26288P05941j05344j24591l03860k49964M98887j208406
$$ 2768601 2135372 1809084 2515025 2409681 2285090 1981230 1731266 2230153 1021747
2228A021747J199221P74748J07679M30519l16457N6187k92616m90047L92182k11182
$$ 1021747 2220968 2995716 3103395 3533914 3217457 3273644 2981028 2490981 2883163 2671981
2218B671981J58043K58667j249419L80385k7944k80489R67979R07446l80882o46099
$$ 2671981 2830024 3088691 1839272 2219657 2191713 1911224 2879203 3786649 3405767 2759668
2208B759668J85292l4038m2309p8454K57067L72972j01503m04479n77061J94427
$$ 2759668 2944960 2910922 2868613 2790159 3047226 3420198 3318695 2914216 2337155 2531582
2198B531582M25184K559O08432O55858k37017J31880j26236q198l4462N11135
$$ 2531582 2956766 2959325 3567757 4223615 3986598 4118478 3992242 3984044 3949582 4460717
2188D460717L94087K42237L78478Q61869K4777l23184q5057K62700R63098k38381
$$ 4460717 4854804 5097041 5475519 6337388 6362165 6038981 5953924 6216624 7179722 6941341
2178F941341j12860j94964m17477O1024O03367L07318O40314L28187o25889l83474
$$ 6941341 6828481 6633517 6216040 6277064 6880431 7187749 7828063 8156250 7530361 7146887
2168G146887R04464N30452P13332m29560k12791J254421M64344q4415L67110K76544
$$ 7146887 8051351 8581803 9295135 8865575 8652784 9907205 10371549 10287134 10654244 10930788
2158A0930788n0825O62183K27761j82897N45435j74585O0542J007299P74609K70288
$$ 10930788 10879963 11542146 11769907 11587010 12132445 11957860 12018402 13025701 13800310 14070598
2148A4070598P85936K65502P84820Q20691k8683L61893J025303J933772J213060
$$ 14070598 14856534 15122036 15906856 16727547 16698864 17060757 18086060 20019832 21232892
2139B1232892J55415J004595J936618J603164J151447N67242J282988J982900
$$ 21232892 21388307 22392902 24329520 25932684 27084131 27651373 28934361 30917261
2131C0917261J809101J401816J781893J893429K401732L071890L505808L899215
$$ 30917261 32726362 34128178 35910071 37803500 40205232 43277122 46782930 50682145
2123E0682145L182288L497032M355270M801484O217394P186883Q432923J1170259
$$ 50682145 53864433 57361465 61716735 66518219 72735613 79922496 88355419 99525678
2115I9525678J4327014J9645261K4074797K6472599K7579834K5934632K2999726
$$ 99525678 113852692 133497953 157572750 184045349 211625183 237559815 260559541
2108B60559541J5793160j0989034m1662477m6624581l5265358k5407036j8038903
$$ 260559541 276352701 265363667 223701190 177076609 141811251 116404215 98365312
2101I8365312j3832770j0380094q481937n981407n073104m273298l127242k190706
$$ 98365312 84532542 74152448 65670511 59689104 54616000 50342702 47215460 45024754
2093D5024754l240539l118680l268692l382926j509499k302169j458264j958931
$$ 45024754 41784215 38665535 35396843 32013917 30504418 28202249 26743985 24785054
2085B4785054k335382j677086o75790j359830q44993q90467o84137n99066j15093
$$ 24785054 22449672 20772586 20096796 18736966 17891973 17001506 16317369 15718303 15603210
2076A5603210k81052q82987r88063m15318k59362p7942l47288r30435r75735j409309
$$ 15603210 15322158 14439171 13451108 13035790 12776428 12698486 12351198 11420763 10445028 9035719
2066I035719k0532o41586L75142p53805j70228k89191N5865k7150o49137o46569
$$ 9035719 9015187 8373601 8748743 7994938 7824710 7535519 7591384 7564234 6915097 6268528
2056F268528k52542l68566K29354n9437K49581l23677l87796L73774l13734q7941
$$ 6268528 6015986 5647420 5876774 5817337 6066918 5743241 5355445 5729219 5415485 5327544
2046E327544m30642k67780m85154M51033l05546o08842K48519L15487l52212O1762
$$ 5327544 4896902 4629122 4143968 4595001 4289455 3680613 3929132 4244619 3892407 3954169
2036C954169n77064j20123l26185M69295m54247k52578N47530j93633K10529N36922
$$ 3954169 3377105 3256982 2930797 3400092 2945845 2693267 3240797 3047164 3257693 3794615
2026C794615L06192q36364q33818L98913m9711l2222N0851j079582m47453K32835
$$ 3794615 4100807 3264443 2430625 2829538 2779827 2747605 2798456 1718874 1271421 1504256
2016A504256M83889j3915n85086k43231l21342K3171m8030L76257J51064K06208
$$ 1504256 1988145 1974230 1389144 1145913 824571 847742 799712 1175969 1327033 1533241
2006A533241k24435J11151m90837L13847l92411O23614j19930q5710N1872j34007
$$ 1533241 1308806 1419957 929120 1242967 850556 1474170 1354240 1268530 1320402 1186395
1996A186395o69021L67762P26196p4289q36269l00922j56442K31218M50226l82177
$$ 1186395 517374 885136 1611332 1537043 700774 399852 243410 474628 924854 542677
1986E42677m63958L88745L79094M37558o07604l79622L51591k07660L86706O03303
$$ 542677 78719 467464 846558 1284116 676512 296890 648481 440821 827527 1430830
1976A430830M9130p36459k28268p2816L42994k955M72850q81461j40868q2887
$$ 1430830 1479960 743501 515233 442417 785411 782456 1255306 373845 232977 150090
1966A50090M48571M5023J50189j75589q4472n01671K47874j8721k55170j09553
$$ 150090 598661 643684 793873 618284 533812 32141 280015 261294 6124 -103429
1956a03429M25590K15110j75551J90369m52757m36640k65415k00182O49933J15568
$$ -103429 322161 537271 361720 552089 99332 -337308 -602723 -802905 -152972 -37404
1946c7404N1591j07113L92383p35540L28715J66849J83548N3277K35875j60512
$$ -37404 14187 -92926 299457 -436083 -107368 59481 243029 296306 532181 371669
1936C71669p51264N08688O21506n8859j78717J43105K88901m24936n18040K77322
$$ 371669 -379595 129093 750599 691740 513023 656128 945029 520093 2053 279375
1926B79375Q47780j26094p71744J97884k79043j7740J86577o16380k98847j34177
$$ 279375 1127155 1001061 229317 427201 148158 130418 316995 -299385 -598232 -732409
1916g32409l83340J95663M00966K78263j85405M05998k12731o9032J14541j19659
$$ -732409 -1115749 -920086 -519120 -240857 -426262 -20264 -232995 -302027 -187486 -307145
1906c07145K52067L4742P5933K56327J22516N5372j88203p11973o4970M69596
$$ -307145 -55078 -20336 55597 311924 434440 489812 301609 -410364 -475334 -5738
1896e738l13226n1842o72638M49771M77149l85181Q98879L16080o86909K30583
$$ -5738 -318964 -370806 -1043444 -593673 -116524 -501705 397174 713254 26345 256928
1886B56928n74255N96572K59137J30997k76551k82224k07774p44699K10851Q41201
$$ 256928 -317327 279245 538382 669379 392828 110604 -97170 -841869 -631018 210183
1876B10183K74206j110370p31529J023766M50292n94836r1949O35233j23868m45643
$$ 210183 484389 -625981 -1357510 -333744 116548 -478288 -570237 64996 -58872 -504515
1866e04515J151910m90103k86121M85806P6149J88109j72082m70549L96143n2540
$$ -504515 647395 157292 -128829 356977 433126 621235 449153 -21396 374747 322207
1856C22207p50583o534M6967K31914O54917l29176M82285n81574k99352m7497
$$ 322207 -428376 -434910 -387943 -156029 498888 169712 651997 70423 -228929 -276426
1846b76426k07074J191947n55705L63784K24515n30342L99475K25572L42134k76675
$$ -276426 -483500 708447 152742 516526 741041 210699 610174 835746 1177880 901205
1836I01205j86786o56622M37069O46145m92231j88762J50818l93495r44362K43824
$$ 901205 714419 57797 494866 1141011 648780 460018 610836 217341 -727021 -483197
1826d83197K9224L56520K02596j93420l11070j78872J13200j10366K38189k28724
$$ -483197 -453973 -97453 105143 -88277 -399347 -578219 -465019 -575385 -337196 -565920
1816e65920n10024J05044Q94771L45589l09791k67374q0233L50751p23610J56849
$$ -565920 -1075944 -970900 -76129 269460 -40331 -307705 -387938 -37187 -760797 -603948
1806f03948L16827J153517n30230m40859n44772l11084Q97419l39142Q02786l08535
$$ -603948 -287121 866396 336166 -104693 -649465 -960549 -63130 -402272 400514 91979
1796I1979l60674M64671l47129K47186O9587k20509K59307l35197m6474l7774
$$ 91979 -268695 195976 -151153 96033 165620 -54889 204418 -130779 -177253 -215027
1786b15027j85202j47121N8994J29635L98727l80157k10851J011991l18680n07005
$$ -215027 -400229 -547350 -488356 -358721 40006 -340151 -551002 460989 142309 -364696
1776c64696j06457m4412P6615j56349j01736k82022k44457Q31434N3535O93460
$$ -364696 -471153 -515565 -438950 -595299 -697035 -979057 -1223514 -392080 -338545 354915
1766C54915m26792R749k26041n02027k55224O02118L18744j353115J35025L68634
$$ 354915 -71877 -62128 -288169 -790196 -1045420 -443302 -124558 -1477673 -1342648 -974014
1756i74014O57377K686L95335K51932k39853j58285N6280l32118j46081m12758
$$ -974014 -316637 -313951 81384 333316 93463 -64822 -8542 -340660 -486741 -899499
1746h99499Q45128Q1159p04478O40971O95620k15447m09520J55411k64727m9175
$$ -899499 -54371 26788 -677690 -36719 658901 443454 33934 189345 -75382 -124557
1736a24557P2769k87432j25839n08031M54581l58919q3870O04594n01743k32203
$$ -124557 -51788 -339220 -465059 -973090 -518509 -877428 -961298 -356704 -858447 -1090650
1726a090650J128014p48941O33201o7860n67553K36286K12061M0744m88708J18819
$$ -1090650 37364 -711577 -78376 -146236 -713789 -477503 -265442 -224698 -713406 -594587
1716e94587k47250K44945l58852L54913K56197N26772K56885O96078L6687l30371
$$ -594587 -841837 -596892 -955744 -600831 -344634 182138 439023 1135101 1171788 841417
1706H41417p69607j409975M77872Q8434k31755N95024P80302r4341o08562j41664
$$ 841417 71810 -1338165 -860293 -771859 -1003614 -408590 371712 277371 -331191 -472855
1696d72855L4128L36059q0273L00048N47704j397148o74078O26093M00227l71864
$$ -472855 -438727 -102668 -182941 117107 664811 -732337 -1406415 -780322 -380095 -751959
1686g51959l94327R92339L6531J31100J29033k2250K41282p33476l57789P01690
$$ -751959 -1146286 -153947 -117416 13684 142717 120467 361749 -371727 -729516 -27826
1676b7826K23848k70340l48520k43177j04191M90485O6871l0435O25697L94361
$$ -27826 196022 -74318 -422838 -666015 -770206 -279721 -212850 -243285 382412 776773
1666G76773n46466K96860k02126n13226J2166l65658n1752N89661r9454o85728
$$ 776773 230307 527167 325041 -188185 -176019 -541677 -593429 -3768 -103222 -788950
1656g88950N01238k6233k39154K89326L84906K642r02418j04600p13538N08990
$$ -788950 -287712 -313945 -553099 -263773 121133 123775 -778643 -883243 -1596781 -1087791
1646a087791P54279N8000J55441l80172m16248N66770o19563J41597J192002L40743
$$ -1087791 -333512 -275512 -120071 -500243 -916491 -349721 -969284 -827687 364315 705058
1636G05058O59515j081682k23359L47669r67721K29605k43019j90360L34573m08377
$$ 705058 1364573 282891 59532 407201 -560520 -330915 -573934 -764294 -429721 -838098
1626h38098O65426m70038J15169K74195m01615l37586P43189q465M91563o2236
$$ -838098 -172672 -642710 -527541 -253346 -654961 -992547 -249358 -257823 233740 171504
1616A71504N85172k12791j161811J8782K72245J17199n4190k04910j86797J97348
$$ 171504 756676 543885 -617926 -599144 -326899 -209700 -263890 -468800 -655597 -458249
1606d58249K26378k18561J69232o64333L976O69090q4108R03874J47851p46784
$$ -458249 -231871 -450432 -281200 -945533 -941557 -272467 -356575 547299 695150 -51634
1596e1634Q69L22937m89592K08076j72126L66372k1163q9721l74339K63857k14153
$$ -51634 -50765 272172 -217420 -9344 -181470 184902 163739 74018 -300321 -36464 -250617
1585b50617q67564M3562J055737J60283k82918l36768O22370m61855j21656N00671
$$ -250617 -1118181 -1074619 -18882 141401 -141517 -478285 144085 -317770 -439426 61245
1575F1245j62108K90883j06470J50867m15210L43582Q7770o44865K11850k54733
$$ 61245 -100863 190020 83550 234417 -180793 162789 250559 -394306 -182456 -437189
1565d37189p19246P52412K93795L08124n54161P26833J42199k57306q6157P729
$$ -437189 -1156435 -404023 -110228 197896 -356265 370568 512767 255461 169304 177033
1555A77033J6524l95832k06083m74251n52983L90020k07306k148Q08634K75486
$$ 177033 193557 -202275 -408358 -882609 -1435592 -1045572 -1252878 -1255026 -446392 -170906
1545a70906J06791n66406M55424M63016O24099l57839k66230r13849N60475P26579
$$ -170906 -64115 -630521 -175097 287919 912018 554179 287949 -625900 -65425 661154
1535F61154M26807q41707l02752P17977j33293j137611o65168N05541L96496m39098
$$ 661154 1087961 246254 -56498 661479 528186 -609425 -1274593 -769052 -372556 -811654
1525h11654k69455P97720M09008m03380n68426J176257r4540n66828k25683J457997
$$ -811654 -1081109 -283389 125619 -277761 -846187 330070 235530 -331298 -556981 901016
1515I01016k7991o52438m03555k6415k29930m76472M74382N48546m49731k10483
$$ 901016 873025 220587 -182968 -209383 -439313 -915785 -441403 107143 -342588 -553071
1505e53071R16705m46734k08123L23121j58659n24436L3228P62300L01015J27472
$$ -553071 363634 -83100 -291223 31898 -126761 -651197 -617969 144331 445346 572818
1495E72818P5910m91716M7380k97986l49146L63296J89462p90219n09894r5833
$$ 572818 648728 157012 204392 -93594 -442740 -79444 110018 -680201 -1190095 -1285928
1485a285928M83944K92033L92742J09752J46449k2900M26410p01137k83285Q1330
$$ -1285928 -801984 -509951 -117209 -7457 138992 116092 542502 -158635 -441920 -360590
1475c60590l14434J36086k31447P18930K36453N35092p37149K16326p648J28455
$$ -360590 -675024 -538938 -770385 -51455 184998 720090 -17059 199267 191619 320074
1465C20074k82546J4478J3871k50595P05556j68116J38217j57500l35557J49409
$$ 320074 37528 52006 65877 -184718 520838 352722 490939 333439 -2118 147291
1455A47291N64539m49826j11698q8393M30090m5992p38648L21893K87777r91828
$$ 147291 711830 262004 150306 61913 492003 446011 -292637 29256 317033 -674795
1445f74795N52922Q90840j244247k30364Q6015P1122j54089N67479K10695N70956
$$ -674795 -121873 768967 -475280 -705644 -619629 -548507 -702596 -135117 75578 646534
1435F46534j15619q35461Q05481j15130o38689n11494N36434J060685L31357j366484
$$ 646534 530915 -304546 500935 385805 -252884 -764378 -227944 832741 1164098 -202386
1425b02386k68123j55697k50268M87902L04568L62301m93313L00530j2275l56991
$$ -202386 -470509 -626206 -876474 -388572 -84004 278297 -215016 85514 73239 -283752
1415b83752J00020M13945K76459J96733j023547m77253J190527J67433r04054
$$ -283752 -183732 230213 506672 703405 -320142 -797395 393132 560565 -343489
1406c43489l5091k23710j8106K56919j60995R666K95845P07686o19605J41563
$$ -343489 -378580 -602290 -620396 -363477 -524472 -514806 -218961 488725 -130880 10683
1396A0683L9427k55893o87830Q1184O3323l30724N94084M76802N73724M43012
$$ 10683 50110 -205783 -893613 -812429 -749106 -1079830 -485746 -8944 564780 1007792
1386A007792o3924o71647m95060m84645J392629k40004n25908O93160q11275M96580
$$ 1007792 943868 272221 -222839 -707484 685145 445141 -80767 612393 -198882 297698
1376B97698M93824o77746K00017j87881o97278n6398k08247J81981O49954j94502
$$ 297698 791522 113776 313793 125912 -571366 -627764 -836011 -654030 -4076 -198578
1366a98578M07706K81593j96579K5800O6998m65625k68222j52539L32125K07923
$$ -198578 209128 490721 294142 319942 386940 -78685 -346907 -499446 -167321 40602
1356D0602M0810M03180k6478m56945k10882Q37323l45033L71588j19589m31332
$$ 40602 81412 484592 458114 1169 -209713 627610 282577 654165 534576 103244
1346A03244L90718m84153l33002R1218L73523j32273L76433o5321J39574l68295
$$ 103244 493962 9809 -323193 -231975 141548 9275 385708 320387 459961 91666
1336I1666o22962L75014q8627L65634l93577q52748L84471k09924L88425Q67921
$$ 91666 -531296 -156282 -244909 120725 -272852 -1125600 -741129 -951053 -562628 305293
1326C05293l50144L25269P4012J99498j62858k12054L01928m80550j069977M33078
$$ 305293 -44851 280418 354430 553928 391070 179016 480944 394 -1069583 -636505
1316f36505R77506j57621o0301k34221n6187K34895k73475L05632m74697q26630
$$ -636505 341001 183380 123079 -111142 -167329 67566 -205909 99723 -374974 -1201604
1306a201604O88131K8089J54157J90457L52600j32785n67062M71356M62505J403
$$ -1201604 -513473 -485384 -331227 -140770 211830 79045 -488017 -16661 445844 447247
1296D47247k86387M01145m05097K78247m04177P36767J87851q90410L50681K40121
$$ 447247 160860 562005 156908 435155 30978 767745 955596 65186 415867 655988
1286F55988m41863o74977k09343K16318J58404P73641Q51889r23109M69218p0338
$$ 655988 214125 -460852 -670195 -453877 -295473 478168 1330057 406948 876166 805828
1276H05828L24732l07236n11730m10626M42206p573m40066P46232n55006j637946
$$ 805828 1130560 823324 311594 -99032 343174 335601 -104465 641767 86761 -1551185
1266a551185n13549N71225R20886N99475J57921p99089j94732k46154K64858L90045
$$ -1551185 -2064734 -1493509 -572623 26852 184773 -614316 -809048 -1055202 -790344 -400299
1256d00299J30883L02723n74975k51711L26424L49539N557O09754n50456k82519
$$ -400299 -269416 33307 -541668 -793379 -466955 -117416 -111859 497895 -52561 -335080
1246c35080O05084j60302r12272k26512J99064O48067k56104j53491K05843j14964
$$ -335080 270004 109702 -802570 -1029082 -830018 -181951 -438055 -591546 -385703 -500667
1236e00667m03597J60196O7767j43283k61771N35290L61047n08550L65241j43995
$$ -500667 -904264 -744068 -676301 -819584 -1081355 -546065 -185018 -693568 -328327 -472322
1226d72322j75175k04717M66823J06706o11613L16871k24959R33998K47808l7871
$$ -472322 -647497 -852214 -385391 -278685 -890298 -573427 -798386 135612 383420 345549
1216C45549j39811k03615j128304K11523K28257J84353J8654m09244J73660N52107
$$ 345549 205738 2123 -1126181 -914658 -686401 -502048 -483394 -892638 -718978 -166871
1206a66871O25237K93242k84589p58739l42959n7559Q31797J17882M39871l1727
$$ -166871 458366 751608 467019 -291720 -634679 -692238 139559 257441 697312 665585
1196F65585m30716k59347m8831P78561P1276p21987o45953L03318K47811N38866
$$ 665585 234869 -24478 -73309 705252 776528 54541 -591412 -288094 -40283 498583
1186D98583o2746l15212j0185P7675q44567o1693J087224p63874P5263l02573
$$ 498583 435837 120625 110440 188115 -656452 -718145 369079 -394795 -319532 -622105
1176f22105J05550L27905M21079m26236L63178m21001P59970j36008r0128L02765
$$ -622105 -516555 -188650 232429 -193807 169371 -251630 508340 372332 282204 584969
1166E84969p17814k42763k573L2675M30104k12154n40956r6953J053951j79885
$$ 584969 -132845 -375608 -378181 -345506 84598 -127556 -668512 -765465 288486 108601
$$ [...]
##END NTUPLES=NMR SPECTRUM
##END=
