##TITLE=1H_CA-9141-1
 DMSO-d6
 64 sc, 
 20.4.2023
##JCAMPDX= 6.0         $$ Bruker NMR JCAMP-DX V2.0
##DATA TYPE= NMR SPECTRUM
##DATA CLASS= NTUPLES
##ORIGIN= UXNMR, Bruker Analytische Messtechnik GmbH
##OWNER= root
$$ XWIN-NMR		Version 3.5
$$ Thu Apr 20 14:57:01 2023 Russian Standard Time (UT+4h)  she@DPX200
##.OBSERVE FREQUENCY= 200.1316
##.OBSERVE NUCLEUS= ^1H
##.ACQUISITION MODE= SIMULTANEOUS
##.ACQUISITION SCHEME= undefined
##.AVERAGES= 8
##.DIGITISER RES= 18
##SPECTROMETER/DATA SYSTEM= spect
##.PULSE SEQUENCE= zg30
##.SOLVENT NAME= CDCl3
##.SHIFT REFERENCE= (INTERNAL, CDCl3, 0, 17.0018)
##AUDIT TRAIL= $$ (NUMBER, WHEN, WHO, WHERE, WHAT)
$$ ##TITLE= Audit trail, XWIN-NMR		Version 3.5
$$ ##JCAMPDX= 5.01
$$ ##ORIGIN= Bruker BioSpin GmbH
$$ ##OWNER= she
$$ F:/spectra/data/she/nmr/H-F/1/pdata/1/auditp.txt
$$ ##AUDIT TRAIL=  $$ (NUMBER, WHEN, WHO, WHERE, WHAT)
(   1,<2023-04-20 14:55:39.25 +0400>,<she>,<DPX200>,
      <created by zg, POWCHK disabled, PULCHK disabled
       configuration hash MD5:
       00 E9 B6 7A A2 85 ED C7 34 08 36 98 17 FE 4E 26
       data hash MD5: 16K
       3F A5 05 0F 25 69 EB 32 12 E1 FC 72 24 2B 82 DC>)
(   2,<2023-04-20 14:55:41.60 +0400>,<she>,<DPX200>,
      <Start of raw data processing
       efp BC_mod = 2 LB = 0.24 FT_mod = 6 PKNL = 1 PHC0 = -19838.12 PHC1 = 18.2008 SI = 16K 
       data hash MD5: 16K
       3A AD 88 E8 E1 D8 AB E0 4C 3C BB 50 58 75 F1 9C>)
(   3,<2023-04-20 14:56:11.53 +0400>,<she>,<DPX200>,
      <pk PHC0 = 5.272281 PHC1 = -8.599999 
       data hash MD5: 16K
       90 06 64 45 7D C0 EB 4E 1F AC F0 A6 33 FD 6E 91>)
(   4,<2023-04-20 14:56:14.34 +0400>,<she>,<DPX200>,
      <abs ABSG = 5 
       data hash MD5: 16K
       1F C1 F7 78 7E BF 48 37 E1 0A 63 17 88 BD 1A D4>)
$$ ##END=
$$ 
$$ hash MD5
$$ C3 58 E1 28 7B F8 E0 C1 5C 99 15 EF D8 89 08 7F
##$RELAX= 
##$RELAX= 
##$RELAX= 
##$RELAX= 
##$RELAX= 
##$RELAX= 
$$ Bruker specific parameters
$$ --------------------------
##$DU= <F:/spectra>
##$EXPNO= 1
##$NAME= <H-F>
##$PROCNO= 1
##$TYPE= <nmr>
##$USER= <she>
##$AMP= (0..31)
100 100 100 100 100 100 100 100 100 100 100 100 100 100 100 100 100 100 
100 100 100 100 100 100 100 100 100 100 100 100 100 100 
##$AQSEQ= 0
##$AQ_mod= 1
##$AUNM= <au_zg>
##$AUTOPOS= <>
##$BF1= 200.13
##$BF2= 200.13
##$BF3= 200.13
##$BF4= 200.13
##$BF5= 200.13
##$BF6= 200.13
##$BF7= 200.13
##$BF8= 200.13
##$BYTORDA= 1
##$CFDGTYP= 0
##$CFRGTYP= 5
##$CHEMSTR= <none>
##$CNST= (0..31)
1 1 145 1 1 1 1 1 1 1 1 1 1 1 1 1 1 1 1 1 1 1 1 1 1 1 1 1 1 1 1 1 
##$CPDPRG= <>
##$CPDPRG1= <>
##$CPDPRG2= <>
##$CPDPRG3= <>
##$CPDPRG4= <mlev>
##$CPDPRG5= <mlev>
##$CPDPRG6= <mlev>
##$CPDPRG7= <mlev>
##$CPDPRG8= <mlev>
##$CPDPRGB= <>
##$CPDPRGT= <>
##$D= (0..31)
0 1.2 0 0 0 0 0 0 0 0.06 0 0.03 0 0 0 0 0.0002 0 0 0 0 0 0 0 0 0 0 0 0 
0 0 0 
##$DATE= 1681988138
##$DBL= (0..7)
120 120 120 120 120 120 120 120 
##$DBP= (0..7)
150 150 150 150 150 150 150 150 
##$DBP07= 0
##$DBPNAM0= <>
##$DBPNAM1= <>
##$DBPNAM2= <>
##$DBPNAM3= <>
##$DBPNAM4= <>
$$ [...]
##$SUBNAM3= <"">
##$SUBNAM4= <"">
##$SUBNAM5= <"">
##$SUBNAM6= <"">
##$SUBNAM7= <"">
##$SUBNAM8= <"">
##$SUBNAM9= <"">
##$SW= 18.0517057926174
##$SWIBOX= (0..15)
0 0 2 0 0 0 0 0 0 0 0 0 0 0 0 0 
##$SW_h= 3612.71676300578
##$TD= 16384
##$TD0= 1
##$TE= 0
##$TE2= 300
##$TE3= 300
##$TEG= 300
##$TL= (0..7)
0 120 120 120 120 120 120 120 
##$TP= (0..7)
150 150 150 150 150 150 150 150 
##$TP07= 0
##$TPNAME0= <>
##$TPNAME1= <>
##$TPNAME2= <>
##$TPNAME3= <>
##$TPNAME4= <>
##$TPNAME5= <>
##$TPNAME6= <>
##$TPNAME7= <>
##$TPOAL= (0..7)
0.5 0.5 0.5 0.5 0.5 0.5 0.5 0.5 
##$TPOFFS= (0..7)
0 0 0 0 0 0 0 0 
##$TUNHIN= 0
##$TUNHOUT= 0
##$TUNXOUT= 0
##$USERA1= <user>
##$USERA2= <user>
##$USERA3= <user>
##$USERA4= <user>
##$USERA5= <user>
##$V9= 5
##$VALIST= <valist>
##$VCLIST= <CCCCCCCCCCCCCCC>
##$VD= 0
##$VDLIST= <DDDDDDDDDDDDDDD>
##$VPLIST= <PPPPPPPPPPPPPPP>
##$VTLIST= <TTTTTTTTTTTTTTT>
##$WBST= 1024
##$WBSW= 4
##$XGAIN= (0..3)
0 0 0 0 
##$XL= 0
##$YL= 0
##$YMAX_a= 218494
##$YMIN_a= -248912
##$ZGOPTNS= <>
##$ZL1= 120
##$ZL2= 120
##$ZL3= 120
##$ZL4= 120
##$ABSF1= 16.91675
##$ABSF2= -1.135098
##$ABSG= 5
##$ABSL= 3
##$ALPHA= 0
##$AQORDER= 0
##$ASSFAC= 0
##$ASSFACI= 0
##$ASSFACX= 0
##$ASSWID= 0
##$AUNMP= <proc_1d>
##$AZFE= 0.1
##$AZFW= 0.1
##$BCFW= 0
##$BC_mod= 2
##$BYTORDP= 0
##$COROFFS= 0
##$CY= -3
##$DATMOD= 1
##$DC= 0
##$DFILT= <>
##$DTYPP= 0
##$F1P= 0
##$F2P= 0
##$FCOR= 1
##$FTSIZE= 16384
##$FT_mod= 6
##$GAMMA= 0
##$GB= 0
##$INTBC= 1
##$INTSCL= 3.70164e-10
##$ISEN= 128
##$LB= 0.24
##$LEV0= 0
##$LPBIN= 0
##$MAXI= 10000
##$MC2= 0
##$MEAN= 0
##$ME_mod= 0
##$MI= 1.114404
##$NCOEF= 0
##$NC_proc= -7
##$NLEV= 6
##$NOISF1= 3.799351
##$NOISF2= 2.8
##$NSP= 0
##$NTH_PI= 0
##$NZP= 0
##$OFFSET= 17.00184
##$PC= 1
##$PHC0= -19832.85
##$PHC1= 9.600801
##$PH_mod= 1
##$PKNL= yes
##$PPARMOD= 0
##$PSCAL= 0
##$PSIGN= 0
##$REVERSE= no
##$SF= 200.130003781504
##$SI= 16384
##$SIGF1= 3
##$SIGF2= 2
##$SINO= 5.538805
##$SIOLD= 16384
##$SREGLST= <1H.CDCl3>
##$SSB= 0
##$STSI= 16384
##$STSR= 0
##$SW_p= 3612.71676300579
##$SYMM= 0
##$S_DEV= 0
##$TDeff= 16384
##$TDoff= 0
##$TI= <>
##$TILT= no
##$TM1= 0
##$TM2= 0
##$TOPLEV= 0
##$USERP1= <user>
##$USERP2= <user>
##$USERP3= <user>
##$USERP4= <user>
##$USERP5= <user>
##$WDW= 1
##$XDIM= 16384
##$YMAX_p= 342272457
##$YMIN_p= -607284
$$ End of Bruker specific parameters
$$ ---------------------------------
##NTUPLES= NMR SPECTRUM
##VAR_NAME=  FREQUENCY,     SPECTRUM/REAL,   SPECTRUM/IMAG
##SYMBOL=    X,             R,               I
##VAR_TYPE=  INDEPENDENT,   DEPENDENT,       DEPENDENT
##VAR_FORM=  AFFN,          ASDF,            ASDF
##VAR_DIM=   16384,         16384,           16384
##UNITS=     HZ,            ARBITRARY UNITS, ARBITRARY UNITS
##FACTOR=    0.220516191357248, 1,           1
##FIRST=     3402.57842185555, 0,            0
##LAST=      -210.138341150243, 0,           0
##MIN=       -210.138341150243, -607284,     0
##MAX=       3402.57842185555, 342272457,    0
$$ Real data points
##PAGE= N=1
##DATA TABLE= (X++(R..R)), XYDATA
$$ [...]
5337A3526979l4748L4470j1263R1145j11539J81649M4121j59266K34555M3136
5327A3839239j35633Q0569R1626K22845j6950J20574K99342l4165j53484N1392
5317A4365355J41021k8829j15470J75440J93423K0005l7179j06154K9652J3534
5307A4650798j87855J46290J66485K5478J74340P3239M0186K32374l1584K29848
5297A5519599j54149j26960o5224l7661K55527o626K64208p8915N6629O8161K8543
5286A5723132J36499R6184J40740q9176J70623J30810k6961o9089J3652j84806
5276A6041608K5606K36832K12420L7277k46291n8693j55955J84114J55343J03860
5266A6536121K29679j10424J11214P3978R9925Q1574o3172J87130N7375j81902
$$ plain form
5337 13526979 13492231 13526701 13515438 13606583 13495044 13676693 13720814 13561548 13796103 13839239
5327 13839239 13703606 13784175 13875801 14098646 14081696 14202270 14501612 14467447 14313963 14365355
5317 14365355 14506376 14477547 14362077 14537517 14730940 14750945 14713766 14607612 14637264 14650798
5307 14650798 14462943 14609233 14775718 14801196 14975536 15048775 15088961 15321335 15289751 15519599
5297 15519599 15365450 15238490 15173266 15135605 15391132 15384506 15648714 15569799 15626428 15694589 15723132
5286 15723132 15859631 15955815 16096555 16007379 16178002 16308812 16281851 16212762 16226414 16041608
5276 16041608 16067214 16304046 16516466 16553743 16307452 16248759 16092804 16276918 16432261 16536121
5266 16536121 16765800 16655376 16766590 16840568 16940493 17022067 16958895 17146025 17203400 17021498
5256A7021498r967k1131N2966J41882k4475J80165J43203O3019o9419p5341J76062
5245A7578462J01074j64925K5923K68613m9471l936K1898O6903J2421j05204N0870
5234A7802628P6470K36807o5575j87563J16761J26101k4009J35512K51308M0490
5224A8508930j60983j10168Q2535J7369j31388r064J04176J86815Q6403K03705
5214A8778330k7335J9820j55106n5246Q308q2619j0999J88511o6339J27514K54628
5203A8979467j28045K77595k1271q2943j9982L4138J73496L1973Q5550L0588K0479
5192A9381045l2465l54200R8784N1581J05754j04455o1525N6155M2198L2697K8417
5181A9243986j6236k46059L81226L03430j15251p1829p2247O7975L9388L9890
$$ plain form
5256 17021498 17011531 16990400 17043366 17185248 17160773 17340938 17484141 17547160 17477741 17402400 17578462
5245 17578462 17679536 17514611 17540534 17809147 17759676 17755740 17777638 17844541 17856962 17751758 17802628
5234 17802628 17879098 18115905 18050330 17862767 17979528 18105629 18081620 18217132 18468440 18508930
5224 18508930 18347947 18237779 18320314 18337683 18206295 18197231 18301407 18488222 18574625 18778330
5214 18778330 18750995 18770815 18615709 18560463 18568771 18486152 18475153 18663664 18597325 18724839 18979467
5203 18979467 18851422 19129017 19107746 19024803 19004821 19038959 19212455 19244428 19329978 19360566 19381045
5192 19381045 19348580 18994380 19093164 19144745 19250499 19146044 19084519 19140674 19182872 19215569 19243986
5181 19243986 19227750 18981691 19362917 19666347 19551096 19479267 19407020 19474995 19514383 19554273
5171A9554273M1940j43945L9981P4315J8076J26474j45590q9772N9795M5207n2056
5160A9528698j17297J03008J58157M3010J11389j67200j51383J58764k00013n1029
5150A9416104O6829k8178Q2356N4084k25971K41193K44485k37342j01665J21415
5140A9633310n5955J8676m477J25863j50167j99290K88049K4121R0157J22189
5130A9892476j58495J2814j17261m7263r4906J6388o9782r9716J04011J205P3323
5119A9512794l701j27472o042J53782n729P1909k71094K2556K7564p9780J27611
5108A9422398j08770k68344J44311J78736j40344q4381J40714j292j5336j02618
5098A9165074j0972J05106L5948j32798p9763n7092j02560o2910J47092N3270
$$ plain form
5171 19554273 19596213 19452268 19492249 19566564 19584640 19711114 19565524 19475752 19535547 19580754 19528698
5160 19528698 19411401 19514409 19672566 19715576 19826965 19659765 19508382 19667146 19467133 19416104
5150 19416104 19482933 19454755 19537111 19591195 19365224 19606417 19850902 19613560 19511895 19633310
5140 19633310 19577355 19596031 19591554 19717417 19567250 19367960 19656009 19680130 19770287 19892476
5130 19892476 19733981 19746795 19629534 19582271 19487365 19503753 19433971 19334255 19438266 19439471 19512794
5119 19512794 19509093 19381621 19375579 19529361 19523632 19595541 19324447 19347003 19374567 19294787 19422398
5108 19422398 19313628 19045284 19189595 19368331 19227987 19143606 19284320 19283028 19267692 19165074
5098 19165074 19154102 19259208 19295156 19162358 19082595 19025503 18922943 18860033 19007125 19060395
5088A9060395m3471j77280J7954J17660O1444Q3417k12586r5061p337K11928k0224
5077A8996839j83398j57408O7146J3017r5183r6568o8831J81306l4027K4020L1724
5066A8678637j84156j21458J97357K896P6242j00832k02643J99165j934K46658
5056A8789932O6450J22943j15302O3996J8318q9078p5648O5293K06233l7715K27397
5045A9242819K33743N3746O4596l8319J06494k5661N555K4927j0381K574J98401
5034A9858494O3152o5039N3729k85593j02798l3887J25305L534k12665j22817
5024A9281415j00953q9498r2444l02413j2905P396k41158p9142j02490k7013p9573
5013A8161222K0457m9094j60482N9592k00672L0146J47627K7694J7031N308m0143
$$ plain form
5088 19060395 19016924 18839644 18857598 18975258 19036702 19120119 18907533 18812472 18805135 19017063 18996839
5077 18996839 18813441 18656033 18723179 18736196 18641013 18544445 18475614 18656920 18622893 18646913 18678637
5066 18678637 18494481 18373023 18570380 18573276 18649518 18548686 18346043 18545208 18543274 18789932
5056 18789932 18856382 18979325 18864023 18928019 18946337 18857259 18781611 18846904 19053137 19015422 19242819
5045 19242819 19476562 19530308 19594904 19556585 19663079 19637418 19642973 19667900 19657519 19660093 19858494
5034 19858494 19921646 19856607 19910336 19624743 19521945 19488058 19613363 19616897 19404232 19281415
5024 19281415 19180462 19090964 18998520 18696107 18683202 18690598 18449440 18370298 18267808 18240795 18161222
5013 18161222 18181679 18132585 17972103 18031695 17831023 17861169 18008796 18036490 18053521 18058829 18018686
5002A8018686J20852M901r3245K1331j63220J11940J08487k2118r5309k0284o2144
4991A7929877j33227k1786n7833k30591j29165K3612l66198j74377j10585j03428
4981A6626299k68140k1488m43090k65510K60944k66823j23709j40948k82837N6621
4971A5131319o5676q7867j77432l80477J38080j71814M452k33752r2792l1460
4961A4032581j02142k9154k64257j53559J6582Q0046k25202J7218o9248j76244
4951A3126621j27821j13892O2165j52992K9804J81386m3224n2889k43543l8249
4941A2627366k35674o3872Q8311J0968p7002p2869O1591k26122J11891K7278j10088
4930A2141778j71088k38182J3611O4916k6377k70435O0925L6680n1217K5982k58295
$$ plain form
5002 18018686 18139538 18144439 18051194 18072525 17909305 18021245 18129732 18107614 18012305 17992021 17929877
4991 17929877 17796650 17774864 17717031 17486440 17357275 17380887 17014689 16840312 16729727 16626299
4981 16626299 16358159 16336671 15893581 15628071 15889015 15622192 15498483 15357535 15074698 15131319
4971 15131319 15065643 14977776 14800344 14419867 14557947 14386133 14390585 14156833 14064041 14032581
4961 14032581 13930439 13901285 13637028 13483469 13500051 13580097 13354895 13372113 13302865 13126621
4951 13126621 12998800 12884908 12947073 12794081 12823885 13005271 12962047 12909158 12665615 12627366
4941 12627366 12391692 12327820 12416131 12427099 12350097 12277228 12338819 12112697 12224588 12251866 12141778
4930 12141778 11970690 11732508 11746119 11811035 11784658 11514223 11575148 11611828 11560611 11586593 11328298
4919A1328298k8866j41664j45808j9833J65192J10229k62388K0558j27727n1807
4909A0846184o6981n5564P0797m5672j23144K07366M0585j61171J19832K5907
4899A0858139j18001j14948p5688k99038j11162M2594L5970L020k10802l4502
4889I975582J72197j06162k1796r7162L4651J26769j62843j11830J07265M8329
4879I965000j93164j7374j31180j43812n582k9967K21418j0324k52711k37896
4869I164408P3324J18036M7293j46720j0311j33424J4662J66728L4480n7266j22571
4858I148639j3761n16k56959j3786m0251j30868q448R9312o5547q8565l2943p5980
4846H520327P4230J880j27314j05181P909L7538j31378j7659K0074j10383P1305
$$ plain form
4919 11328298 11299432 11157768 11011960 10992127 11157319 11267548 11005160 11025718 10897991 10846184
4909 10846184 10779203 10723639 10794436 10748764 10625620 10832986 10873571 10712400 10832232 10858139
4899 10858139 10740138 10625190 10549502 10250464 10139302 10181896 10217866 10220886 10010084 9975582
4889 9975582 10147779 10041617 10019821 9922659 9957310 10084079 9921236 9809406 9916671 9965000
4879 9965000 9771836 9754462 9623282 9479470 9473888 9443921 9665339 9655015 9402304 9164408
4869 9164408 9237732 9355768 9403061 9256341 9246030 9112606 9127268 9293996 9328476 9271210 9148639
4858 9148639 9134878 9134362 8877403 8863617 8823366 8692498 8684050 8783362 8717815 8629250 8596307 8520327
4846 8520327 8594557 8596437 8469123 8363942 8371851 8409389 8278011 8260352 8280426 8170043 8241348
4835H241348m5038m4737Q974J49542k2994p3543r2706K4848K8670k2693k95125
4824G856546p3275N4452K25351l8745k07466J34422n1567m1882r0179j33408l2549
4813G601700K14649J69814l58386l4562j0110R3532M888r4136m9157j02466j42599
4802G293167j01125M8238M6778k21467r8195K20732m0864k47764N1391J53119
4792G104010J56715j34575k23915M1100K6738j55140Q6369R3747j33911j49373
4782F711765o2553P3493n3613j73510O2046L8503J2320l6251k54672L50524p980
4771F660072q5980P8970j3673j7424j63826l7468K06757R4388j83863k24827j03824
4760F209302r2300J70868j3831M174J56476j50953k29246p8393J08203j13776
$$ plain form
4835 8241348 8196310 8151573 8160547 8310089 8287095 8213552 8120846 8145694 8174364 8151671 7856546
4824 7856546 7783271 7837723 8063074 8024329 7816863 7951285 7899718 7857836 7767657 7634249 7601700
4813 7601700 7816349 7986163 7627777 7593215 7583105 7676637 7681525 7587389 7538232 7435766 7293167
4802 7293167 7192042 7240280 7287058 7065591 6967396 7188128 7147264 6899500 6950891 7104010
4792 7104010 7260725 7126150 6902235 6943335 6970073 6814933 6901302 6995049 6861138 6711765
4782 6711765 6649212 6722705 6669092 6495582 6557628 6596131 6608451 6572200 6317528 6668052 6660072
4771 6660072 6574092 6653062 6639389 6621965 6458139 6420671 6627428 6721816 6537953 6313126 6209302
4760 6209302 6117002 6287870 6274039 6278213 6434689 6283736 6054490 5976097 6084300 5970524
4750E970524j17279J20567O0124J03807j11870r3577J23734j04091j75814N4851
4740E830976j03251J91826m4960p2749j61514J45969J18318j47893j89874q1767
4730E485081K35785q4201l3074R0886R5776j3955k14769j1905J60305r0041L7277
4719E657165K43304r2799l31426j10521N0432k2412L1013J41267j55595K6862
4709E437290j51583r5083Q5084Q85j00292k8768o3852K01894k678m3988N8451
4698E297360P2023l1975j61342O4042M9681m6952p8543P7602k34618j684j06453
4687D899141j19539J8255J2258l1555n3609K10011k28734K9872R4098j05999q5582
4676D638617J7225Q4879J09238o332R086L9330J2563l9901j46273o5106k1488
$$ plain form
4750 5970524 5853245 5973812 6033936 6137743 6025873 5932296 6056030 5951939 5776125 5830976
4740 5830976 5727725 5919551 5874591 5801842 5640328 5786297 5904615 5756722 5566848 5485081
4730 5485081 5720866 5636665 5603591 5694477 5790253 5776298 5561529 5549624 5709929 5619888 5657165
4719 5657165 5900469 5807670 5476244 5365723 5416155 5393743 5424756 5566023 5410428 5437290
4709 5437290 5285707 5190624 5275708 5276593 5176301 5147533 5083681 5285575 5282897 5238909 5297360
4698 5297360 5369383 5337408 5176066 5240108 5289789 5242837 5164294 5241896 5007278 5005594 4899141
4687 4899141 4779602 4797857 4810115 4778560 4724951 4934962 4706228 4736100 4830198 4724199 4638617
4676 4638617 4655842 4740721 4849959 4843627 4852713 4892043 4904606 4864705 4718432 4653326 4631838
4665D631838p0698P8311K5168j8281N0980O700j36555p4372m1708N7004K18469
4654D726856j67633j01641k0582J11904m3272L0984k2980q9991n935L8645j38685
4643D317670q3658n1732l9030N1378M27n1999J36096J8000J41215K0825l30831
4632D128361Q1709N6487q9542P011n0553j21335p7278m6126N3244J92878J27575
4621D262431j55366j48371L9706N0112R9424j11814r0597O2539M8294P5972j21092
4610D011238k91738M4279J83073m3829l3164j67282R5230M2572m6146K9620L7904
4599C861757j75090L611J18629N6679J15953r2724k0896J64287p7416p5378J64603
4588D044015k8450l24713k9050k4663J13502J58206J3329M4963k78003r674J15762
$$ plain form
4665 4631838 4561140 4639451 4664619 4646338 4697318 4704018 4567463 4493091 4451383 4508387 4726856
4654 4726856 4559223 4457582 4437000 4548904 4505632 4536616 4513636 4423645 4417710 4456355 4317670
4643 4317670 4234012 4182280 4143250 4194628 4195055 4143056 4279152 4297152 4438367 4459192 4128361
4632 4128361 4210070 4266557 4177015 4184026 4133473 4012138 3934860 3888734 3941978 4134856 4262431
4621 4262431 4107065 3958694 3998400 4048512 4147936 4036122 3945525 4008064 4056358 4132330 4011238
4610 4011238 3719500 3763779 3946852 3903023 3869859 3702577 3797807 3840379 3794233 3823853 3861757
4599 3861757 3686667 3690278 3808907 3865586 3981539 3888815 3867919 4032206 3954790 3879412 4044015
4588 4044015 4015565 3690852 3661802 3637139 3750641 3908847 3922176 3967139 3689136 3679462 3795224
4577C795224q3077j35160m2101j3619J08437Q3531p7362n8051j14869j03920K55222
4566C614255O7755j01377o7776l1O7140J0863n282k49729q8301R0830J10437J22564
4554C571348o088K0434n9497j27685j21567j03377l2884j9468J97976j19885k69843
4543B929464J54754P7365J54217M1345j38839j10432j2672J71858q908K38625
4533C496777n2037k49599l5499j7553j84122J76806J33121j98810R0403j38871
4523C020616J03089m5262J87747J5538l35424M3137K8919J24543L7768k33288
4513B947383n8953P2464J06891J40427j71864p1778n7123j1167J29820k76580
4503B749520k090J7108j26195K95228K1219O508O0796o3073j5790K7539j16430
$$ plain form
4577 3795224 3712147 3576987 3534886 3521267 3629704 3713235 3635873 3577822 3462953 3359033 3614255
4566 3614255 3682010 3580633 3512857 3512826 3579966 3590829 3585547 3335818 3247517 3338347 3448784 3571348
4554 3571348 3565260 3585694 3526197 3398512 3276945 3173568 3140684 3121216 3319192 3199307 2929464
4543 2929464 3084218 3161583 3315800 3357145 3218306 3107874 3095202 3267060 3258152 3496777
4533 3496777 3444740 3195141 3159642 3142089 2957967 3134773 3267894 3069084 3159487 3020616
4523 3020616 3123705 3078443 3266190 3281728 2946304 2989441 3018360 3142903 3180671 2947383
4513 2947383 2888430 2960894 3067785 3208212 3036348 2964570 2907447 2896280 3026100 2749520
4503 2749520 2747430 2764538 2638343 2933571 2954790 2961298 3022094 2959021 2943231 2970770 2854340
4492B854340j5056N9298l722Q9276L5134J02319q8295o9866L098k25378r6936
4481B644212k2539n787J85181j46049K4342J0412J21695J5002k78887O5167n2059
4470B560690L6640p780J27794P7941J8907p766j01817r9470j11621J06745P0076
4459B670339J20508O9274N5310Q7017k08134q0799L7554o5399K01800j24251k31269
4448B531950P0194r0753L2713J43642r6609j16122r43J30455J7928M3902J17680
4437B784037j20169l9385l7622N3404n6909J8215P5198K9898O8698m0414k34520
4426B500431J886k2049J6304o5532K39950m1185q5246L5711O9430R4028o4490
4415B679238k7254K4822k1266o2571n2348j02444K21146j2294n2099l4704Q5014
$$ plain form
4492 2854340 2839284 2898582 2894860 2984136 3019270 3121589 3033294 2963428 2966526 2741148 2644212
4481 2644212 2621673 2615886 2801067 2655018 2679360 2689772 2811467 2826469 2547582 2612749 2560690
4470 2560690 2597330 2589550 2717344 2795285 2814192 2806426 2704609 2605139 2493518 2600263 2670339
4459 2670339 2790847 2860121 2915431 3002448 2794314 2713515 2751069 2685670 2887470 2763219 2531950
4448 2531950 2602144 2511391 2544104 2687746 2591137 2475015 2474072 2604527 2622455 2666357 2784037
4437 2784037 2663868 2624483 2586861 2640265 2583356 2601571 2676769 2706667 2775365 2734951 2500431
4426 2500431 2502317 2480268 2496572 2431040 2670990 2629805 2544559 2580270 2649700 2743728 2679238
4415 2679238 2651984 2676806 2655540 2592969 2540621 2438177 2659323 2647029 2594930 2560226 2645240
4404B645240j70942j36565r6578J11063l7434J10222M8191k30728J02927N3719
4394B399115O2007N3783j2495j24329j58198J20454r6010R6829J59640k8753j30743
4383B341300k7739l1444J36919m7152l4023N4995P5201l6739j44059J16236J07077
4372B510572j6466Jl6721j14846J32070L779o8234j44552R3222j54710l2473L15650
4360B487292j67157R6609K8022n352n3822m390J08363M2911l7512k3267j8444
4349B453253k3505q380j01092J37512l04439N3375J3927J8232L5033N3203O6902
4338B394021j9296j9817K7567J6839r788L8567j16673j57233K00693J17791j91917
4327B280754K23693K03701r7611j31633J3785L07043J54972k53062J54419R9587
$$ plain form
4404 2645240 2474298 2337733 2241155 2352218 2314784 2425006 2473197 2242469 2345396 2399115
4394 2399115 2461122 2514905 2502410 2378081 2219883 2340337 2244327 2341156 2500796 2472043 2341300
4383 2341300 2313561 2282117 2419036 2371884 2337861 2392856 2468057 2431318 2287259 2403495 2510572
4372 2510572 2494106 2494107 2457386 2342540 2474610 2478389 2410155 2265603 2358825 2204115 2171642 2487292
4360 2487292 2320135 2416744 2444766 2439414 2385592 2381202 2489565 2532476 2494964 2471697 2453253
4349 2453253 2429748 2421368 2320276 2457788 2153349 2206724 2220651 2238883 2273916 2327119 2394021
4338 2394021 2374725 2354908 2382475 2399314 2389526 2428093 2311420 2154187 2354880 2472671 2280754
4327 2280754 2504447 2708148 2610537 2478904 2492689 2799732 2954704 2701642 2856061 2955648
4317B955648j41890L0146R8005J87204R9277j1689l234K82164j21340n2928m5468
4306C275895j61670p1191j095J36181j62025j10294o7654j34833m8757R7336j66285
4295B585608j07774p6579l270k2150j35499J62911j0076j97559k4522K2073o360
4284B186803J04550k175p7029q5180J17955j2931m2775P5659p853m6850m1254
4273B168920k722j84962k20376J70382J107K9292M5842k01188P6130J71242P2887
4262B126554j13346k5590j98509J57227M998j74473Q8172Q5233j6032Q4122N235
4251B023591q3325q4363M6928J53453j62079o1046O9684M7458O9843k34142j30086
4240A655916K75572M4133j03466o3543J03559l4815m8741r8758P4004J14664J32747
$$ plain form
4317 2955648 2813758 2843904 2941909 3129113 3228390 3216701 3213467 3495631 3374291 3321363 3275895
4306 3275895 3114225 3043034 3041939 3178120 3016095 2905801 2838147 2703314 2654557 2751893 2585608
4295 2585608 2477834 2401255 2397985 2375835 2240336 2403247 2393171 2195612 2171090 2193163 2186803
4284 2186803 2291353 2289178 2212149 2126969 2244924 2231993 2189218 2264877 2257024 2210174 2168920
4273 2168920 2166198 1981236 1760860 1931242 1932349 1961641 2007483 1806295 1882425 2053667 2126554
4262 2126554 2013208 1987618 1789109 1946336 1951334 1776861 1865033 1950266 1934234 2018356 2023591
4251 2023591 1940266 1855903 1902831 2056284 1894205 1833159 1902843 1950301 2020144 1786002 1655916
4240 1655916 1931488 1975621 1872155 1808612 1912171 1877356 1828615 1729857 1803861 1918525 2051272
4229B051272k1877l43236J57106o6758L7781J59110m2188p6524p4381O5880J1992
4218A858177n2018M5385l6394l9169J38362J525J1269M2201j34912j42733M029
4207A695722J65842J24715j96994q784L3858J38610k5541l034L7520Q2163O1061
4196B105138j24508N4506q8264K8099J57348p7543k54171K5004q8656J31986J48970
4185B017909p2278R060q1475j57477j7237L6929P5129O3839R2669k8103j70193
4174A768772j22555K7414L0323j43925r937K74709N4722j68493L3432m7288J91966
4163A889140k52263j7467J00112J3562J18695R8781J88294p8417r9208N8341k5068
4152A994502J6591j22441j87970Q5202J93937J2120j73226J99391O3960j40766
$$ plain form
4229 2051272 2029395 1686159 1843265 1776507 1814288 1973398 1931210 1854686 1780305 1846185 1858177
4218 1858177 1806159 1851544 1815150 1775981 1914343 1915868 1927137 1969338 1834426 1691693 1695722
4207 1695722 1861564 1986279 1789285 1780501 1814359 1952969 1927428 1924394 1961914 2044077 2105138
4196 2105138 1980630 2035136 1946872 1974971 2132319 2054776 1800605 1825609 1736953 1868939 2017909
4185 2017909 1945631 1954691 1873216 1715739 1698502 1735431 1810560 1874399 1967068 1938965 1768772
4174 1768772 1646217 1673631 1703954 1560029 1550092 1824801 1879523 1711030 1744462 1697174 1889140
4163 1889140 1636877 1619410 1719522 1733084 1851779 1950560 2138854 2060437 1961229 2019570 1994502
4152 1994502 2011093 1888652 1700682 1785884 1979821 1991941 1818715 2018106 2082066 1941300
4142A941300N9978K80266J41754j29434q7480L5238j35298K0454k62476J29116
4132A993418J96044k4669j33437j22100J84106J8243r7007l1158o9882k3156l4549
4121A855853L6239K17279j72038R536J21064k2676P3071Q1825O4544L6110N6242
4110B357049J7991K93605K65119Q0922o1478j74879j20377n4790j40350k46470
4100B216342r2871q6617Q776k6556p8283J50469p4374j27578M3559l8054K35440
4089B130253p7271J489L2935J78901k8282P4860K9678m0336R2366p6145K20395
4078B538843r5300K03163L72751J67628M1747k85592j47026j99013j48145P5071
4068B524127k16481j93948L6950j07326k4418M7163j28757N645J07872L9127J27826
$$ plain form
4142 1941300 2001278 2281544 2423298 2293864 2206384 2241622 2106324 2126778 1864302 1993418
4132 1993418 2189462 2164793 2031356 1909256 2093362 2111605 2014598 1983440 1913558 1890402 1855853
4121 1855853 1892092 2109371 1937333 1946869 2067933 2045257 2118328 2200153 2264697 2300807 2357049
4110 2357049 2375040 2668645 2933764 3014686 2953208 2778329 2657952 2603162 2462812 2216342
4100 2216342 2123471 2036854 2045630 2019074 1940791 2091260 2016886 1889308 1932867 1894813 2130253
4089 2130253 2052982 2054471 2087406 2266307 2238025 2312885 2342563 2302227 2394593 2318448 2538843
4078 2538843 2443543 2646706 3019457 3187085 3228832 2943240 2796214 2597201 2449056 2524127
4068 2524127 2307646 2113698 2150648 2043322 2018904 2066067 1937310 1942955 2050827 2089954 2217780
4057B217780j40676l06582j12505J13457L6437N6104j32894j2134k4498l9605
4047A654884J55690K53539J55402Q4934p2384k828j30798q3946K9031P3482m9673
4036B067333j61406L2516Q7349j63445K28401o737n4270J36297l15801o3559L9654
4025A826332R4727q6145k524J26974J00379k12608l3509j95262K56543j3312J536
4014A863131J01219p9079Q4080k3506j41050J1336L5056n9531l1971n9974N1031
4003A750742n8133m8163M1068j51323J40319R1010m3788q9005J78678j29899j57390
3992A524116J4689l7822K7077K12656L11907j53609j50837R2245j9208L391J37539
3981A962144j82763l8011J6178P5222m3436O9862m9136K0747L07122N278n3264
$$ plain form
4057 2217780 2077104 1770522 1658017 1771474 1807911 1864015 1731121 1718987 1694489 1654884
4047 1654884 1810574 2064113 2219515 2304449 2232065 2229237 2098439 2014493 2043524 2117006 2067333
4036 2067333 1905927 1938443 2025792 1862347 2090748 2084011 2029741 2166038 1850237 1786678 1826332
4025 1826332 1921059 1834914 1832390 1959364 2059743 1847135 1813626 1618364 1874907 1861595 1863131
4014 1863131 1964350 1885271 1969351 1945845 1804795 1816131 1851187 1791656 1759685 1699711 1750742
4003 1750742 1692609 1644446 1685514 1534191 1674510 1765520 1721732 1632727 1811405 1681506 1524116
3992 1524116 1538805 1500983 1528060 1740716 2052623 1899014 1748177 1840422 1821214 1824605 1962144
3981 1962144 1779381 1741370 1757548 1832770 1789334 1859196 1810060 1830807 2137929 2143207 2089943
3970B089943j36879j67811J73661J2389q3010N3011j03269j39910j04624L5990
3960A629491O9380P3601M1958J20560J26830j51266J02021K17496Q5159k88015
3950B027215j20536o270r4937r8773J20852J55874r1247J28758r252j13231J48389
3939B046842j33898m247J49486k6208J17262j11836n0931J5903O4799L4680J1365
3928B113217m4806o0372O3666k2444J04928l6447K08194J08840j98222J73634
3918B410188J29829j73449N6470p8252l02555L9568J25199J19920m5698L3137
3908B314357O9119p9883K6208N4395J28628M8375j26224m2403K5586K52378j52535
3897B518001k83127Q8174J89444J52574m2956l7124J06753P6751l14614j47392
$$ plain form
3970 2089943 1953064 1785253 1958914 1971303 1888293 1941304 1838035 1698125 1593501 1629491
3960 1629491 1698871 1772472 1814430 1934990 2061820 1910554 2012575 2230071 2315230 2027215
3950 2027215 1906679 1900409 1805472 1706699 1827551 1983425 1892178 2020936 2011684 1898453 2046842
3939 2046842 1912944 1908697 2058183 2031975 2149237 2037401 1986470 2002373 2067172 2101852 2113217
3928 2113217 2068411 2008039 2071705 2049261 2154189 2117742 2325936 2434776 2236554 2410188
3918 2410188 2540017 2366568 2423038 2344786 2042231 2081799 2206998 2326918 2281220 2314357
3908 2314357 2383476 2303593 2329801 2384196 2512824 2561199 2434975 2392572 2418158 2670536 2518001
3897 2518001 2234874 2323048 2512492 2665066 2622110 2584986 2691739 2768490 2453876 2306484
3887B306484R9900J96694J81752k871O8880L605j26071N2397J43790p105o5576
3876B851879P6282J81890k4615j41558L1492K02392O7589M6732K4069r0944J5070
3865C240278O5814K18203j10101J58224K12411p3239N65J73677J77777K29186
3855D292795J20188j72767m7157J93962J73317J20007L22649j6422J35825L66110
3845E488507J34315K2514J51272M8471M18537K91896L46654L46636L59764L46186
3835G954752K62491L10974L34029M62269J78632L02488L25095L44233m2732j39801
3825A0292430K2001p8182j43555k87608j35935k23025l9775l55234k29213j66941
3815H654963m41012j54165l69522k1025j96174J48836k19245l76524M1948Q8207
$$ plain form
3887 2306484 2406384 2603078 2784830 2781959 2850839 2854444 2728373 2780770 2924560 2917455 2851879
3876 2851879 2928161 3110051 3085436 2943878 2975370 3177762 3245351 3292083 3316152 3225208 3240278
3865 3240278 3306092 3524295 3414194 3572418 3784829 3711590 3712155 3885832 4063609 4292795
3855 4292795 4412983 4240216 4193059 4387021 4560338 4680345 5002994 4986572 5122397 5488507
3845 5488507 5622822 5645336 5796608 5845079 6263616 6555512 6902166 7248802 7608566 7954752
3835 7954752 8217243 8528217 8862246 9324515 9503147 9805635 10130730 10474963 10432231 10292430
3825 10292430 10314431 10236249 10092694 9805086 9669151 9446126 9406351 9051117 8821904 8654963
3815 8654963 8213951 8059786 7690264 7669239 7473065 7621901 7402656 7026132 7068080 7156287
3805G156287K01927r6275J21637m3444l6029K63628L28144j1261J00454K23831
3795H208899P4889K35339K99388O9932L39963M67816L85357L54194L50337L19378
3785A1105492M75167M97400K91924L92232M88837L14176L20514N32884K71710
3776A4690336L34270J75397P9535j33112l9955j45513K34113k4099l1565J89321
3766A5328728J80175J69899L64404M33482L45437L33923Q95536P86278P86371
3757A9624233J251844J205764J553812J808905J687090K037613K028904J127898
3749C2326063N73045l17356j127295j833235k199398k291207k206734k299511
3741B0624372j707231j586037j146005j220071r61473j049294q07955p23543p28912
$$ plain form
3805 7156287 7358214 7261939 7383576 7340132 7304103 7567731 7895875 7884614 7985068 8208899
3795 8208899 8283788 8519127 8818515 8888447 9228410 9696226 10081583 10435777 10786114 11105492
3785 11105492 11580659 12078059 12369983 12762215 13251052 13565228 13885742 14418626 14690336
3776 14690336 15024606 15200003 15279538 15146426 15106471 14960958 15195071 15170972 15139407 15328728
3766 15328728 15508903 15678802 16043206 16476688 16822125 17156048 18051584 18837862 19624233
3757 19624233 20876077 22081841 23635653 25444558 27131648 29169261 31198165 32326063
3749 32326063 32899108 32581752 31454457 29621222 27421824 25130617 22923883 20624372
3741 20624372 18917141 17331104 16185099 14965028 14003555 12954261 12146306 11422763 10693851
3732A0693851n27324m11747o92305k81075k69913m01532k34278l27184j06732
3723G441761l06550k82796j61573j49138k09550k22121l90176m7666K7109n4555
3713E644745j4883j94872j99583k11296j58238K7160j7160j26393K9752M8700
3703D827932j85266N1429n4118l3057j86282k3718O8549j20211j09779J50269
3693D385748j74056R9757J48494r8179R5703p4548k08947n534R8745j01580j9273
3682D146330K5217k01533M646J79845q5415l8628M7471K172o123m0972j74287
3671C858723j51012J19135K29809J36711o2652p2276o9957O514O7874J89189J12702
3660D364760m952j16851J40139J99050r2408O1225Q8395J92702m0873J67712J05299
$$ plain form
3732 10693851 10166527 9754780 9062475 8781400 8511487 8109955 7875677 7548493 7441761
3723 7441761 7135211 6852415 6690842 6541704 6332154 6110033 5719857 5672191 5699300 5644745
3713 5644745 5629862 5434990 5235407 5024111 4865873 4893033 4875873 4749480 4779232 4827932
3703 4827932 4642666 4694095 4639977 4606920 4420638 4396920 4465469 4345258 4235479 4385748
3693 4385748 4211692 4311449 4459943 4361764 4457467 4382919 4173972 4168438 4267183 4165603 4146330
3682 4146330 4171547 3970014 3974660 4154505 4069090 4030462 4077933 4080105 4073982 4033010 3858723
3671 3858723 3707711 3826846 4056655 4193366 4130714 4058438 3988481 3994995 4062869 4252058 4364760
3660 4364760 4359808 4242957 4383096 4582146 4489738 4550963 4639358 4832060 4791187 4958899 5064198
3649E064198R5621J82660K60431L9969J00406M02735K11457j55965J7547K35638
3639F454697K48502J35587J34091J91361k47866j19149P7283J85385l09928j48674
3629F601289j3789m3932r8601j86804r5780j20009r9741m8814n855j55987j45771
3618E586206k70067J99509J34624L6249J2696j69398P3054j56705N7537Q1780
3608E585485R3621J34700J90155J1934N4211K16797K8366j01501P9563R2809J51803
3597F537943J79757J77815J63808L3670K0062K98204J23529J57908K26688K3494
3587G942878o6450J79364J71860k96240j66463n1670N8340j79043N4637k92064
3577G355149O8675R4951j98314l0617q818P4586k3181k22015o9251O4390J77468
$$ plain form
3649 5064198 5159819 5342479 5602910 5642879 5743285 6146020 6357477 6201512 6219059 6454697
3639 6454697 6703199 6838786 6972877 7164238 6916372 6797223 6874506 7059891 6749963 6601289
3629 6601289 6587500 6543568 6444967 6258163 6162383 6042374 5942633 5893819 5887964 5731977 5586206
3618 5586206 5316139 5515648 5650272 5686521 5699217 5529819 5602873 5446168 5503705 5585485
3608 5585485 5679106 5813806 6003961 6015895 6070106 6286903 6315269 6213768 6293331 6386140 6537943
3597 6537943 6717700 6895515 7059323 7092993 7113055 7411259 7534788 7692696 7919384 7942878
3587 7942878 7876428 8055792 8227652 7931412 7764949 7713279 7771619 7592576 7647213 7355149
3577 7355149 7423824 7518775 7320461 7289844 7281026 7355612 7332431 7110416 7041165 7105555 7283023
3566G283023K6292j34005K2478K23023J01963J30074J6394J20342J83682K52862
3556H226128J18909O9630L13912Q6879K08082K62770M34904J73686J39372L41001
3546A0375273M11853K27118L87881K50648L96910K97145K70312L16348N34055
3537A3467543O33064M66037O39545M42247P45395N58703N13024P72588O62095
3528A8900241Q15877Q10081O99538O76584P66722P86114L98543O17876M4572K18077
3518B4734225M11916K4639j22905j52723k88498k02365k02836j36743j06668n12513
3508B3445529l47726j3113n2058j29449K60018k4462K19948M3477K49845K23515
3498B3875524L20879r992J37028J8118l70046k61617j67874l62085p24613l82583
$$ plain form
3566 7283023 7309315 7175310 7197788 7420811 7522774 7652848 7669242 7789584 7973266 8226128
3556 8226128 8345037 8414667 8728579 8815458 9023540 9286310 9721214 9894900 10034272 10375273
3546 10375273 10787126 11014244 11402125 11652773 12049683 12346828 12617140 12933488 13467543
3537 13467543 14100607 14566644 15206189 15648436 16393831 16952534 17465558 18238146 18900241
3528 18900241 19716118 20526199 21225737 21902321 22669043 23455157 23853700 24471576 24516148 24734225
3518 24734225 25146141 25170780 25047875 24895152 24606654 24404289 24201453 24064710 23958042 23445529
3508 23445529 23097803 23084690 23032632 22903183 23163201 23138739 23358687 23402164 23652009 23875524
3498 23875524 24196403 24186411 24323439 24341557 23971511 23709894 23542020 23179935 22455322 22072739
3488B2072739o30366n00001p03860n65027o82590p96778n90727o97402o40826
3479A6265162o19558p18146q65816m80916n88326o83192m63804o32984m81973
3470A0730447l10023j59912l08173l22079l58644k84369k29006l39247r6431m3604
3460H278959k97813l89609j70991L6685j33017j35476K114j77351k05939M7341
3450F854903J2880k46487j50770p2340N0182l7547Q4415N3552j76187M0678k4256
3439F389023Q785L4882m5815J16946K15429j42293Q349J70067J03612J81841j6203
3428G024623q7538J08425k98536N1075K6515j55615k10155k70857j86675r5764
3418E905498j97759j25580M2738k21279j3799l19046j96612j67810l1125p64p5560
$$ plain form
3488 22072739 21442373 20942372 20238512 19673485 18990895 18194117 17603390 16905988 16265162
3479 16265162 15645604 14927458 14061642 13580726 12992400 12309208 11845404 11212420 10730447
3470 10730447 10420424 10260512 9952339 9630260 9271616 8987247 8758241 8418994 8322563 8278959
3460 8278959 7981146 7591537 7420546 7457231 7324214 7188738 7190852 7013501 6807562 6854903
3450 6854903 6867783 6621296 6470526 6398186 6448368 6410821 6495236 6548788 6372601 6413279 6389023
3439 6389023 6397808 6432690 6386875 6503821 6719250 6576957 6585306 6755373 6858985 7040826 7024623
3428 7024623 6937085 7045510 6746974 6798049 6824564 6668949 6458794 6187937 6001262 5905498
3418 5905498 5707739 5582159 5624897 5403618 5389819 5070773 4874161 4706351 4675226 4674462 4598902
3407D598902Q9157n0325l61063j12029J8042o3050j32325M5855r2402j23537K8437
3396C845662P1742l286M2315Q1298L6364n670m2749m2370k4966J04708j8952O2149
3384D106245j46758P9820J1281q8811R911R4430j9139q317J47439P8682K9263
3373D294046J27397m5457o7874r2761k22654K24387J18267j03740k06448j29814
3363C895349j00693j6380j72460R2433K06388q9705Q2773P142j51342j34430j14458
3352C504617Q5126L2796l3806r36j61708j18449J30364L17166k66541j34062J35349
3341C489916J34744O7350j39093K80325J4308p5029j44923N0519J58838p6236
3331C760719J23868j7135J46924K7073M8100R6298J3261J04375j63321K1492R977
$$ plain form
3407 4598902 4688059 4637734 4276671 4164642 4182684 4119634 3987309 4033164 3940762 3817225 3845662
3396 3845662 3917404 3914118 3956433 4037731 4074095 4068425 4025676 3983306 3958340 4063048 4044096 4106245
3384 4106245 3959487 4039307 4050588 3961777 3971688 4066118 4046979 4038662 4186101 4264783 4294046
3373 4294046 4421443 4375986 4308112 4215351 3992697 4217084 4335351 4231611 4025163 3895349
3363 3895349 3794656 3778276 3605816 3698249 3904637 3814932 3897705 3904847 3753505 3619075 3504617
3352 3504617 3589743 3622539 3588733 3587797 3426089 3307640 3438004 3755170 3488629 3354567 3489916
3341 3489916 3624660 3692010 3552917 3833242 3847550 3772521 3627598 3678117 3836955 3760719
3331 3760719 3884587 3867452 4014376 4041449 4089549 4185847 4199108 4303483 4140162 4161654 4171631
3320D171631O5308R7356l6682R0618L06689O9139O0388k9664o1875N7702N0532
3309D841142J82659J70265r3411R9056J16706J14665J67263Q3560J72280R3866
3299E948051K73429K28153J5709R18J69667J11758M5130K90839J20882j86131
3289G018405j01280J53149R4202J91155J84674n8503k03513j09594O9098J20770
3279G358563L51945P7873L19053L7821J17726J57519K42472K25686K87248L32899
3269I508805J25303L59098L49424M26676M22362M00285L55903M03262M99311M06986
3259A3257415O60883O30089J026292J047157R37221J046914J280194J395272J931203
3250B3212640K055059J789349J915885J366366J347043J239104J731420K144782
$$ plain form
3320 4171631 4236939 4334295 4297613 4388231 4694920 4764059 4824447 4794783 4732908 4790610 4841142
3309 4841142 5023801 5194066 5100655 5199711 5316417 5431082 5598345 5681905 5854185 5948051
3299 5948051 6221480 6449633 6465342 6466260 6635927 6747685 6792815 7083654 7204536 7018405
3289 7018405 6917125 7070274 7164476 7355631 7540305 7481802 7278289 7168695 7237793 7358563
3279 7358563 7710508 7788381 8107434 8145255 8262981 8420500 8662972 8888658 9175906 9508805
3269 9508805 9634108 9993206 10342630 10769306 11191668 11591953 11947856 12351118 12850429 13257415
3259 13257415 13918298 14548387 15574679 16621836 17559057 18605971 19886165 21281437 23212640
3250 23212640 25267699 27057048 28972933 30339299 31686342 32925446 34656866 36801648
3242C6801648K255630K493343J668884Q59650O2174k32676j35230L27828P19610
3233D4820861J148669J092827l3440j294844j697181j926264j799672j094248
3225C9216708o36397m75478p01475j258435j956850k129672k275690j784794j410810
3216B6587107j109494q77928r55298j387793j601987j399659j212602r88634r83964
3207A6069748p29040o51375m38345k43388l01681P5246j98112J03882k0249L9997
3197A3706683J83134K91814K61868j0052L51904l9393J40038Q3371k89036j91248
3187A4489083l38452m73226n49451m32896o38318o25436k87819m42100m82240
3178A0219145k09410k38716k76294j05636k67629k92766O3585m3475j77800k74951
$$ plain form
3242 36801648 39057278 41550621 43219505 44079155 44141329 43908653 43773423 44101251 44820861
3233 44820861 45969530 47062357 47028917 45734073 44036892 42110628 40310956 39216708
3225 39216708 38580311 38104833 37403358 36144923 34188073 32058401 29782711 27997917 26587107
3216 26587107 25477613 24599685 23644387 22256594 20654607 19254948 18042346 17053712 16069748
3207 16069748 15340708 14689333 14250988 14007600 13705919 13781165 13583053 13686935 13666686 13706683
3197 13706683 13889817 14181631 14443499 14433447 14785351 14745958 14885996 14969367 14680331 14489083
3187 14489083 14150631 13677405 13127954 12695058 12056740 11431304 11143485 10701385 10219145
3178 10219145 10009735 9771019 9494725 9389089 9121460 8828694 8892279 8848804 8671004 8396053
3168H396053j60157m6603R2649L6971N8047J8142k04107r2922J28393j45056j88997
3157G892413P9547K3202o3826k1810Q5553O1199j9546J5506m4603K23196K34062
3146H464893o910k13050K06279J7491L58650L83740L73477K36942J93467N59416
3136A0574395L92256P54618O89635O68886R28619P52434M84470J18752m28714
3127A4935351m51053m50851m67592l40658j07130m56733k25589N1462k1833L70942
3117A2836316M7061Q5570L51165K66161M05492L87746O58768O70475Q83347J096570
3107A7688671J085108J132859J741855J883595K320373K676056L043326L123463
3099C4695306K712863J966483J42878j810111k818491l493905l394780l202152
$$ plain form
3168 8396053 8235896 8189293 8281942 8318913 8376960 8395102 8190995 8098073 8226466 8081410 7892413
3157 7892413 7971960 7995162 7931336 7909526 7995079 8056278 8036732 8052238 8007635 8230831 8464893
3146 8464893 8457983 8244933 8451212 8468703 8827353 9211093 9584570 9821512 10014979 10574395
3136 10574395 10966651 11721269 12410904 13079790 14008409 14760843 15245313 15364065 14935351
3127 14935351 14484298 14033447 13565855 13225197 13118067 12661334 12435745 12487207 12465374 12836316
3117 12836316 12883377 12968947 13320112 13586273 13991765 14379511 15038279 15708754 16592101 17688671
3107 17688671 18773779 19906638 21648493 23532088 25852461 28528517 31571843 34695306
3099 34695306 37408169 39374652 39517530 37707419 34888928 31395023 28000243 24798091
3091B4798091k609117k022338k012853j451692j177692j166849r54186o09321
3083A2794043p06923p26306m77404m90165m27289l25694m71007m26225k41613
3074H501417l59878k27288j60011m7649k44645l19199j85120O988N2787r895l25965
3063F681542n7971j72731j12098R4152l22445k32024O5968r7567K4436n2506k31619
3052E587137J74378K4912r0358L5640k32926k07051Q6422L985K10692j88727p1959
3041E332145N2836n8779J98086k8581l187p8273P7119j31755j45219Q8866n9834
3030E243424J69205p146K0233J09483K8424j2132J03558J37416J71136J61353
3020F124954L8919j19092j8167J61097J88936L1186J80295J09503L4908k6180
$$ plain form
3091 24798091 22188974 20166636 18153783 16702091 15524399 14357550 13403364 12794043
3083 12794043 12087120 11360814 10883410 10393245 9965956 9640262 9169255 8743030 8501417
3074 8501417 8141539 7914251 7754240 7706591 7461946 7142747 6957627 6964615 7017402 7007507 6681542
3063 6681542 6623571 6450840 6338742 6432894 6110449 5878425 5944393 5846826 5871262 5818756 5587137
3052 5587137 5761515 5786427 5696069 5731709 5498783 5291732 5378154 5382139 5592831 5404104 5332145
3041 5332145 5384981 5326202 5524288 5495707 5492520 5414247 5491366 5359611 5214392 5303258 5243424
3030 5243424 5412629 5405483 5425716 5535199 5563623 5551491 5655049 5792465 5963601 6124954
3020 6124954 6163873 6044781 6026614 6187711 6376647 6407833 6588128 6697631 6732539 6706359
3010F706359J84329L03820K8666P6429K75191K23137K15110K88717J43425M52851
3000H898034N67285L22226J94441J37777K09218o5656J6105q9931J71279n12198
2990I848580o07370o1792k09298m14493l09881n9164l3062m24456k2642O7326
2980G773748m1032l101l91688j37643J26942J72720p8163k2887j16812J08197
2970G390281k7430k7502K50969J12600k17843p5371N9357M3342L32484O7868J68225
2959H076980K00804K05925J19176J26544L34117J26227Q8991k60904l32993M2950
2949H727817Q6365j08284J8847K33053Q883j05545M432J98824N4818J38094M6134
2938I303438M0821J16016M9475J42424M4371J18599k7250L53856K12003R8614
$$ plain form
3010 6706359 6890688 7194508 7223174 7299603 7574794 7797931 8013041 8301758 8445183 8898034
3000 8898034 9465319 9787545 9981986 10119763 10328981 10263325 10279430 10189499 10360778 9848580
2990 9848580 9241210 9179418 8970120 8555627 8245746 8186582 8153520 7729064 7706422 7773748
2980 7773748 7732716 7729615 7337927 7200284 7327226 7499946 7421783 7398896 7282084 7390281
2970 7390281 7362851 7335349 7586318 7698918 7481075 7405704 7465061 7508403 7840887 7908755 8076980
2959 8076980 8277784 8483709 8602885 8729429 9063546 9189773 9278764 9017860 8684867 8727817
2949 8727817 8814182 8705898 8724745 8957798 8966681 8861136 8865568 9064392 9119210 9257304 9303438
2938 9303438 9344259 9460275 9509750 9652174 9696545 9815144 9787894 10141750 10353753 10452367
2928A0452367R6184L29246p1681P5087L09021J83183K09648L48184K36085J36380
2918A2303704K13604K16749K39823K66961M72741J46632J92476K56336K75798
2909A4584824J15503J93862L90271K34128L12036M55470L15292J93172L43648
2900A7138206M04023J27986J51116K15299M23349K11386L93631M90713K71637
2891A9827346L20260N46510N58708N76347L92981M73830M04907P92099O57670
2882B4550658M66316O65039P48001Q56201Q96603R13269Q64394R80841R52890
2873C1894212J181015J071936J179926J045638J538560J481531J531905J335706
2865D2260429J716026J768233K036514K082126K291152K347070K651504K702777
$$ plain form
2928 10452367 10548551 10877797 10806116 10881203 11190224 11373407 11583055 11931239 12167324 12303704
2918 12303704 12517308 12734057 12973880 13240841 13713582 13860214 14052690 14309026 14584824
2909 14584824 14700327 14894189 15284460 15518588 15830624 16286094 16601386 16794558 17138206
2900 17138206 17542229 17670215 17821331 18036630 18459979 18671365 19064996 19555709 19827346
2891 19827346 20147606 20694116 21252824 21829171 22222152 22695982 23100889 23892988 24550658
2882 24550658 25016974 25682013 26430014 27286215 28182818 29096087 29960481 30941322 31894212
2873 31894212 33075227 34147163 35327089 36372727 37911287 39392818 40924723 42260429
2865 42260429 43976455 45744688 47781202 49863328 52154480 54501550 57153054 59855831
2857E9855831L147738L368953L415279M215010M650858N370572O308303P165730
2849I7498274Q239798R774922J1679119J3079603J3237622J0194720L061953m312725
2841A62453286q752495j0576356j0698816q671232o750554m858645l647138k394239
2833A06103811j566942q99016k27914Q2256M73231J019316R81790J131318J372908
2824A08470758J494234J597985J596358J616606J470232J382113J506369J504299
2816A20638954J408622J134366J203692J169327P27308L87370N17418P70837L72140
2807A28330034K05721k85406j80052j76179p37636q76265j153833j275039j661670
2798A22189675j776319j620002k060904k426658k447004k476796k485037k686052
$$ plain form
2857 59855831 63003569 66372522 69787801 74002811 78653669 84024241 90332544 97498274
2849 97498274 105738072 115512994 127192113 140271716 153509338 163704058 166766011 162453286
2841 162453286 153700791 143124435 132425619 123754387 117003833 112145188 108498050 106103811
2833 106103811 104536869 103637853 103409939 103492195 103965426 104984742 105966532 107097850 108470758
2824 108470758 109964992 111562977 113159335 114775941 116246173 117628286 119134655 120638954
2816 120638954 122047576 123181942 124385634 125554961 126282269 126669639 127187057 127957894 128330034
2807 128330034 128535755 128250349 128070297 127894118 127156482 126280217 125126384 123851345 122189675
2798 122189675 120413356 118793354 116732450 114305792 111858788 109381992 106896955 104210903
2790A04210903k754103k919532l000051k901223k862749l066122k758283k671163
2782H1277677k837756k825855k974316k625244k550464k616625k515632k491698
2774E9840087k210645k181689k174857k243195j824994j877096j729059j707295
2766D3891257j716053j323010j363932j094119j427219j206621r27248j072714
2758C3760341q74654r45546p29955q41097n34931p01647p42116o87390p32369
2749B6970636m42969m17787m50732p55117l49799m09427n14178l30744l84991
2740B2914892l93058n14584l71715l50397m49983l65134m04368l33137l51144
2731A9381372p7448j44346k23788l08799j89966j32031k45907k89903N4638l6369
$$ plain form
2790 104210903 101456800 98537268 95537217 92635994 89773245 86707123 83948840 81277677
2782 81277677 78439921 75614066 72639750 70014506 67464042 64847417 62331785 59840087
2774 59840087 57629442 55447753 53272896 51029701 49204707 47327611 45598552 43891257
2766 43891257 42175204 40852194 39488262 38394143 36966924 35760303 34833055 33760341
2758 33760341 32885687 31940141 31210186 30369089 29834158 29132511 28390395 27703005 26970636
2749 26970636 26527667 26109880 25659148 24904031 24554232 24144805 23630627 23299883 22914892
2740 22914892 22521834 22007250 21635535 21285138 20835155 20470021 20065653 19732516 19381372
2731 19381372 19303924 19159578 18935790 18626991 18437025 18304994 18059087 17769184 17823822 17787453
2721A7787453p9039k53577J10465p5362o4558q051m407k2816J47749K09859j95228
2710A7552488K43287J87786m734K22467K62388R044K21569K73526L83975J65996
2700A9517792M87810K41937J9384K08872K18824R3806K84830L54856J05715J33309
2690B1667135J86627L12137K44150L46416K75600K74300L15456J76252K06940
2681B4005013J29939N19817L65712Q8558J52311L48392N98893J97292P24991N39539
2671B7670457N10032N81687R64289P24162Q33932J096362J396046J266494J315186
2662C6358647J696617J576272J777096J640568J985362K031393K118182J715158
2654E0899295J403123J082090O51145j38581o37053q15544j059683j033372p60375
$$ plain form
2721 17787453 17708414 17454837 17565302 17489940 17425382 17417331 17412924 17390108 17537857 17747716 17552488
2710 17552488 17795775 17983561 17978827 18201294 18463682 18472726 18694295 18967821 19351796 19517792
2700 19517792 20005602 20247539 20266923 20475795 20694619 20788425 21073255 21428111 21533826 21667135
2690 21667135 21853762 22165899 22410049 22756465 23032065 23306365 23621821 23798073 24005013
2681 24005013 24134952 24654769 25020481 25109039 25261350 25609742 26208635 26405927 27130918 27670457
2671 27670457 28180489 28762176 29726465 30450627 31284559 32380921 33776967 35043461 36358647
2662 36358647 38055264 39631536 41408632 43049200 45034562 47065955 49184137 50899295
2654 50899295 52302418 53384508 54035653 53897072 53260019 52444475 51384792 50351420 49591045
2645D9591045o42443n99939l43433j49341K87029O25432N61942Q52582J121898
2636E1304772R36843J422091J336700J646713K208108K377819K894217L611313
2628F7738576M289569M638830N206744N294859N292995M620642K217528j532590
2620I7767153m670554o654483p291047o973879o365023n489604m743228m005753
2612E1573582l656700l204222k481091k111093j930580j866464j292116j410114
2604C3621202j250500r98964q16224r84314p09193o78087p73040m25203n96380
2595B6389297n52072m76786n92559k78769l29711m12917k33952l77410l00812
2586B2834309j25187K16202j42356j02217k10309j36835M807m8375r4571k14061
$$ plain form
2645 49591045 48948602 48348663 48005230 47855889 48142918 48768350 49330292 50182874 51304772
2636 51304772 52241615 53663706 55000406 56647119 58855227 61233046 64127263 67738576
2628 67738576 72028145 76666975 81873719 87168578 92461573 97082215 99299743 97767153
2620 97767153 93096599 86442116 79151069 72177190 65812167 60322563 55579335 51573582
2612 51573582 47916882 44712660 42231569 40120476 38189896 36323432 35031316 33621202
2604 33621202 32370702 31371738 30555514 29571200 28862007 28183920 27410880 26985677 26389297
2595 26389297 25837225 25360439 24767880 24489111 24159400 23746483 23512531 23135121 22834309
2586 22834309 22709122 22925324 22782968 22680751 22470442 22333607 22338414 22290039 22195468 21981407
2576B1981407J55250K3315Q9435O7160k002O7609J77243Q341K01685K25431Q7050
2565B3081924K77261J42009K64830N40627L81368K57508K26095K84284M02298
2556B5858204L82491K57034L55453M80627N22640K45042L11757O99788O41761
2547B9754797L94382O10909M95744L44087P38160M97314O23128O80732P10064
2538C4849317P67821Q51256N86152Q03146O91504P08617O03678Q91256P19473
2529D1472220O63840Q45305P82165J007466Q72938O36511Q76451J004954R31478
2520D9093328R17966R42985Q82249R57680J188276J005693J283810J483420J170680
2511E8926087J436256J267027J493781J871309J913717J654712J912844K278945
$$ plain form
2576 21981407 22136657 22159972 22249407 22316567 22314565 22382174 22559417 22567758 22769443 22994874 23081924
2565 23081924 23359185 23501194 23766024 24306651 24688019 24945527 25171622 25455906 25858204
2556 25858204 26240695 26497729 26853182 27333809 27856449 28101491 28413248 29113036 29754797
2547 29754797 30149179 30760088 31255832 31599919 32338079 32835393 33458521 34139253 34849317
2538 34849317 35617138 36468394 37054546 37857692 38549196 39257813 39861491 40752747 41472220
2529 41472220 42136060 42981365 43763530 44770996 45643934 46280445 47156896 48161850 49093328
2520 49093328 50011294 50954279 51836528 52794208 53982484 54988177 56271987 57755407 58926087
2511 58926087 60362343 61629370 63123151 64994460 66908177 68562889 70475733 72754678
2503G2754678K414110K334075K611339K899240L187490L547102L554298L416408
2495I6718740M066105M436412M596431M973328N458653N623685N802212O606535
2487A38282101P179088P557405P626171Q142889Q623431R328455R639282J0059027
2479B06437849J0687241J1379472J1731688J2631426J2930228J3111378J2803761
2472B91713043J2096477J1037984R521478P320349N155639L253120J747235M27132
2464C42272457j023738j534883j871123j968968j838448k457406k667085l245911
2456C25664895m679448n831117p438007r379510j0455545j1332461j1785207j1404943
2448B53358657j0792303j0089351r188291q163949o956825n844973m974668m107380
$$ plain form
2503 72754678 75168788 77502863 80114202 83013442 86200932 89748034 93302332 96718740
2495 96718740 100784845 105221257 109817688 114791016 120249669 125873354 131675566 138282101
2487 138282101 145461189 153018594 160644765 168787654 177411085 186739540 196378822 206437849
2479 206437849 217125090 228504562 240236250 252867676 265797904 278909282 291713043
2472 291713043 303809520 314847504 324368982 331689331 336844970 340098090 341845325 342272457
2464 342272457 341248719 339713836 337842713 335873745 334035297 331577891 328910806 325664895
2456 325664895 320985447 315154330 307716323 298336813 287881268 276548807 264763600 253358657
2448 253358657 242566354 232477003 223288712 215124763 208167938 202322965 197348297 193240917
2440A93240917l257399k269351j462429j011759j08043N19086J143146J583146
2432A88377314J822537K171447K339396K573324K941822K841118K939904K757075
2424B08763937K682604K549894K892431K748749K402706K354490K020602K050811
2416B28466224J359573J075987R91223O98775M9639l40346n98386q81003j039457
2407B29782229j059407r40918j475254j691532j562563j741189k103608k430206
2399B16777552k541712k522235k783758l209141l249511l095412l092312l061703
2391A93221768k930955k896982k972690k951840k783659k941131l126399k965797
2383A69652315l048537l211450l734865l914134l876244l984291m034026m291087
$$ plain form
2440 193240917 189983518 187714167 186251738 185239979 185131936 185651022 186794168 188377314
2432 188377314 190199851 192371298 194710694 197284018 200225840 203066958 206006862 208763937
2424 208763937 211446541 213996435 216888866 219637615 222040321 224394811 226415413 228466224
2416 228466224 229825797 230901784 231893007 232591782 232641421 232301075 231702689 230821686 229782229
2407 229782229 228722822 227781904 226306650 224615118 223052555 221311366 219207758 216777552
2399 216777552 214235840 211713605 208929847 205720706 202471195 199375783 196283471 193221768
2391 193221768 190290813 187393831 184421141 181469301 178685642 175744511 172618112 169652315
2383 169652315 166603778 163392328 159657463 155743329 151867085 147882794 143848768 139557681
2375A39557681m137060m019320m015020m044807l873628m102955l976168l717452
2367A07671271l401305l664201l412935l379932l555401l392544l320563l238096
2359H0306294k706884k573798k497614k478767k390874j919279j706148j681193
2351F2351737j288014j320381q64290r18728j072572m76766k56671m31302l45480
2342E5377533l54476m52359k69974l58569l54051n50215l58988j93747m73790
2333E2011364n69879m26755k34918l86793n39950o03968o13762p58432p71653
2324D7105254j025380r93601j064788j182014j228497j157055j003803j306813
2316C8143303j346678j037358j214511j086774r47454j091308j006606r63808
$$ plain form
2375 139557681 135420621 131401301 127386281 123341474 119467846 115364891 111388723 107671271
2367 107671271 104269966 100605765 97192830 93812898 90257497 86864953 83544390 80306294
2359 80306294 77599410 75025612 72527998 70049231 67658357 65739078 64032930 62351737
2351 62351737 61063723 59743342 58879052 57960324 56887752 56410986 56154315 55723013 55377533
2342 55377533 55023057 54570698 54300724 53942155 53588104 53037889 52678901 52485154 52011364
2333 52011364 51441485 51014730 50779812 50393019 49853069 49249101 48635339 47876907 47105254
2324 47105254 46079874 45086273 44021485 42839471 41610974 40453919 39450116 38143303
2316 38143303 36796625 35759267 34544756 33457982 32510528 31419220 30412614 29448806
2308B9448806r62856j089546r90326j103297q69006o01326o93378r06446p29131
2299B1503494n57662o61686n42777n47331m44613l29217k33259m17837l79176
2290A7389936j71870n25593n0802j76386j10386l89783k16893j61714k14062k82666
2280A5089781k40966j20733l72916k57789k44214k42253k34856k05648l03912
2271A2866494l12557j86187l11457j36667m59800k84602l33508k52912l23266
2262A0265538k32951q2308l18473l05082m50149q5131j2055k50066j81569l23015
2252H024739k06818j26595k68197K4057j82160l96447k52844j30508J22489r591
2242F598125j30875p7349j7693l9159k30655k21014k21595j37601k13967j459
$$ plain form
2308 29448806 28485950 27396404 26406078 25302781 24433775 23832449 23139071 22232625 21503494
2299 21503494 20945832 20284146 19741369 19194038 18749425 18420208 18186949 17769112 17389936
2290 17389936 17218066 16692473 16641671 16465285 16354899 15965116 15748223 15586509 15372447 15089781
2280 15089781 14848815 14728082 14355166 14097377 13853163 13610910 13376054 13170406 12866494
2271 12866494 12553937 12367750 12056293 11919626 11459826 11175224 10841716 10588804 10265538
2262 10265538 10032587 9950279 9631806 9326724 8876575 8791444 8779389 8529323 8347754 8024739
2252 8024739 7817921 7691326 7423129 7447186 7265026 6868579 6615735 6485227 6607716 6598125
2242 6598125 6467250 6389901 6372208 6333049 6102394 5881380 5659785 5522184 5308217 5306758
2232E306758K53057j71708j81218J4738J8038j77880q7408l1639k39807l9864
2222D663067o9847J0023J23537q4149k3881j92517n1925j40311j3090J00574K62926
2211D584407o218j04759K43463j71202k47175J65953k4327n9001J5024j55915
2201D240250j07943l6380R0661n3310m1592N1616L9374O8687j09647Q2698M3795
2190D268209j52743J35875J12135l479n295J76394q3804Q6952o0271P5293j70319
2179D378947p3193k9659J5729J08733N6062j22413n8417P0439K0680M1419M2282
2168D450609k95166p2699n998j08225j35175J31301j4139p7657j29435j18883
2158C624533M0361j05716L3250k55495j38157J1131j2044K94032Q1471o4054k41088
$$ plain form
2232 5306758 5559815 5388107 5206889 5221627 5239665 5061785 4974377 4942738 4702931 4663067
2222 4663067 4593220 4603243 4726780 4642631 4618750 4426233 4374308 4233997 4220907 4321481 4584407
2211 4584407 4578189 4473430 4716893 4545691 4298516 4464469 4440142 4381141 4396165 4240250
2201 4240250 4132307 4095927 4186588 4133278 4091686 4143302 4182676 4251363 4141716 4224414 4268209
2190 4268209 4115466 4251341 4363476 4359997 4354702 4531096 4447292 4534244 4473973 4549266 4378947
2179 4378947 4305754 4276095 4291824 4400557 4456619 4334206 4275789 4346228 4366908 4408327 4450609
2168 4450609 4155443 4082744 4076746 3968521 3833346 3964647 3950508 3872851 3743416 3624533
2158 3624533 3664894 3559178 3592428 3336933 3198776 3209907 3197863 3491895 3573366 3509312 3268224
2147C268224k36581l4082J13528K3383L7791r2812N1107N6193r2811J90110M5330
2136C329380p0758j94816q9046R2147R1740L24158n902n1798j87476l63454o9612
2125B804563J28274Q4518K1307J3717M7865J73745k18522J13006R3029n2070q736
2114C200696k21156L5383J93278J1965k36624N1669M6471l7787O2226k37795j22482
2103B745844J0435j70338J1115J59522L4594N3985k91611J0909J17634Q0910L0724
2092B793723o9523M6271J00506j91299o4343k5087P1869j67557J79128Q8787k9039
2081B733436m6415o6632J01358o2692q8356j59451j68359l2880Q8798k13616m2708
2070B042483r6361j53321q7890J12667J6158j58337J59259k32878j76918o720
$$ plain form
2147 3268224 3031643 2997561 3111089 3134472 3172263 3079451 3130558 3186751 3093940 3284050 3329380
2136 3329380 3258622 3063806 2974760 3066907 3158647 3482805 3476903 3425105 3237629 2874175 2804563
2125 2804563 2932837 3017355 3038662 3052379 3100244 3273989 3055467 3168473 3261502 3209432 3200696
2114 3200696 2979540 3014923 3208201 3220166 2983542 3035211 3081682 3043895 3106121 2868326 2745844
2103 2745844 2756279 2585941 2597056 2756578 2791172 2845157 2553546 2564455 2682089 2762999 2793723
2092 2793723 2724200 2770471 2870977 2679678 2615335 2590248 2662117 2494560 2673688 2762475 2733436
2081 2733436 2687021 2620389 2721747 2659055 2570699 2411248 2242889 2210009 2298807 2085191 2042483
2070 2042483 1946122 1792801 1704911 1817578 1833736 1675399 1834658 1601780 1424862 1418142
2060A418142l0077j21574P9205K36831n2927j35305j9978l0134J99017J6443m7529
2049A512114l1093n8301N7793j46215k59946K25962P999J82356l2862j92132J42963
2038A408638K60J7951j37155j23616N9002J40864L7381k70089j04767K19105K7036
2027A274610r1305N2892J50477j92074r1854L04102P2086J29526k6573r5324J16846
2016A603409p2770J27789j81798N5174O5064j78594J124j38195j14563j5035n9620
2005A091985p515J06636K6525j33799n4166k786j27612k7216J25049j7138J05105
1994A085068k42774K2948J92499j40657j12357J46360j26087N1651j21862j54461
1984F00328K49215J67036k17105r9666K6700J65352j25695J31922N5166q6300
$$ plain form
2060 1418142 1388065 1266491 1345696 1582527 1529600 1394295 1374317 1344183 1543200 1559643 1512114
2049 1512114 1481021 1422720 1480513 1334298 1074352 1300314 1308313 1490669 1457807 1265675 1408638
2038 1408638 1408898 1426849 1289694 1166078 1225080 1365944 1403325 1133236 1028469 1247574 1274610
2027 1274610 1183305 1236197 1386674 1194600 1102746 1406848 1478934 1608460 1581887 1486563 1603409
2016 1603409 1530639 1658428 1476630 1531804 1596868 1418274 1419398 1281203 1166640 1151605 1091985
2005 1091985 1084470 1191106 1217631 1083832 1029666 1026880 899268 872052 997101 979963 1085068
1994 1085068 842294 865242 1057741 917084 804727 951087 825000 876651 754789 600328
1984 600328 849543 1016579 799474 699808 726508 891860 766165 898087 953253 866953
1974H66953q1524R4674L02266j37394N8374J3056J4994M1744n9518n3682J50703
1963A210646J35936J78908K44326j99977J39866L29681K7944K8961j87185m1326
1953A867780J2422l01114m09052n2099j5366l4491O006p232J5112J80168l8953
1942A223181K5740l9806k65647O6528P2979K22332J19546j00290J6535L65991
1932A707089N8892q7789J09990J42013K03157L79726L63832L20555P9520m83588
1922B793397l86879j27599k86064m66653j19597j76630p3610r5452K07628m1317
1912A227224k57835N3239K6691p8679J20664m1011l7203L6122n3351R736J94580
1901A200177n0471L3776Q7915k6576K06147o522J57354K43708J40333j89466k61155
$$ plain form
1974 866953 785429 880103 1182369 1044975 1103349 1116405 1131399 1173143 1113625 1059943 1210646
1963 1210646 1346582 1525490 1769816 1569839 1709705 2039386 2067330 2096291 1909106 1867780
1953 1867780 1880202 1579088 1170036 1117937 1102571 1068080 1074086 1066854 1081966 1262134 1223181
1942 1223181 1248921 1209115 943468 1009996 1082975 1305307 1424853 1324563 1341098 1707089
1932 1707089 1765981 1678192 1788182 1930195 2133352 2513078 2876910 3197465 3276985 2793397
1922 2793397 2406518 2278919 1992855 1526202 1406605 1229975 1156365 1060913 1268541 1227224
1912 1227224 969389 1022628 1049319 970640 1091304 1050293 1013090 1049212 995861 1005597 1200177
1901 1200177 1149706 1183482 1271397 1244821 1450968 1444446 1601800 1845508 1985841 1796375 1535220
1890A535220q9153j07540j82880J29539o6798k22662k9190n5770M1640p855K5630
1879I70181j81450K054J40331q011j51000m2868L4504q5706j8750J7374k0385
1868F56274L1029k6431J12880K6608j57574K59262j4684k57538k3477L2012j13983
1857E24378L29438N7506k09221j1900j01130j40968r6822J42688J44076k036J53059
1846G89068l8751j34252J46385M3360j40346M1974j50478K9513L3625N424o6038
1835E59484l7517j0092J3520K7053q2855K34331J9030p528o2405p9445m4477L3204
1823E62303L8723n4082j0512o9258P6586o4402Q8393K9680j4341J10118p6312
1812F16896j02503k103J07205l3836K5313j05429L8829k02414M2312O1653N0809
$$ plain form
1890 1535220 1446067 1338527 1155647 1285186 1218388 995726 966536 910766 952406 944551 970181
1879 970181 788731 790785 931116 923105 772105 729237 763741 678035 659285 676659 656274
1868 656274 687303 660872 773752 800360 642786 902048 887364 629826 606349 638361 524378
1857 524378 853816 911322 702101 690201 589071 448103 351281 493969 638045 636009 789068
1846 789068 750317 616065 762450 805810 665464 707438 556960 586473 620098 625522 559484
1835 559484 521967 511875 525395 552448 469593 703924 722954 715426 653021 573576 529099 562303
1823 562303 601026 546944 536432 467174 543760 479358 567751 597431 583090 693208 616896
1812 616896 514393 512290 619495 585659 610972 505543 544372 341958 384270 445923 496732
1801D96732o6728M5566J99217j8301K9398o6571r4318P2611j93348j08111l8125
1790B58022J0635N437Q0445r685K43692j59743j37363J77637k41289Q032L5985
1779B71805P1314j59045r5246K11674m0497Q1666R692K22691j17394j1945j50927
1768B93788j08644p4000k2946J15585J75435R1162Q605L9599k06582n5258p0701
1757A86043o588M9718J97304j14261n7650O6048J44306k10916K2421N7946J2928
1746C47299J1081n244P7088p5250l2418J14392j06346n7672o089Q9516j27240
1735B29117J43811q2609J67605q9137J57769J4716l61877M0819L5238L1612J33272
1724D20336j57793K3255J2338k25776L0608L74358K4264k99814m0677J44314J08317
$$ plain form
1801 496732 430004 475570 674787 656486 685884 619313 524995 597606 404258 296147 258022
1790 258022 268657 274094 354539 344854 588546 428803 291440 469077 227788 235820 271805
1779 271805 343119 184074 88828 300502 260005 341671 351363 574054 456660 444715 293788
1768 293788 185144 111144 88198 203783 379218 470380 478985 518584 312002 256744 186043
1757 186043 179455 229173 426477 312216 254566 320614 464920 254004 276425 334371 347299
1746 347299 358380 353136 430224 354974 322556 436948 330602 272930 266841 356357 229117
1735 229117 372928 290319 457924 368787 526556 541272 179395 220214 255452 287064 420336
1724 420336 262543 285798 298136 72360 102968 477326 501590 201776 161099 305413 413730
1713D13730k7997j33717j9480n0813Q8638J79230j22043o9508Q2151N6685P5634
1702D72510n1134J36531Q3646J78141J60449j56570M1145j33264j7841n4550k2005
1691F37058J39228j32814M3587J34841k45444m959j50888J47114L6317k16178
1681C87862O0973j5513r5931q3035O139N2256r4067j5889r7097O8321q4460o1597
1669B7962R7327N0322j28791K27956N1951j01012j08819L6300N3651k32971N7549
1658C1425J29015j7455m5136p346j14130N5045k3464O544L5595q7721J98970Q2710
1646B44052j86234N5379m1444k32632J50710j8089J04486J81870j77627n7270
1636B3201N6586J6053j22000K6818M1212J00544m9590n1262O4795k1902N6982
$$ plain form
1713 413730 385733 252016 232536 181723 270361 449591 327548 258040 340191 396876 472510
1702 472510 421376 557907 641553 819694 980143 823573 864718 731454 713613 659063 637058
1691 637058 776286 643472 687059 821900 576456 571497 420609 567723 604040 387862
1681 387862 448835 433322 337391 254356 260495 312751 218684 202795 105698 174019 89559 27962
1669 27962 125289 175611 46820 274776 326727 225715 116896 153196 206847 -26124 31425
1658 31425 160440 142985 97849 90503 -23627 31418 7954 14498 50093 -37628 161342 244052
1646 244052 57818 113197 71753 -160879 -10169 -28258 76228 258098 80471 23201
1636 23201 79787 95840 -26160 658 41870 142414 92824 41562 106357 84455 141437
1625A41437m9081j86914p2828N7858N8768R009J03416R5301q3884k09756M2197
1614i4477K03564p5871N6293q1413r1035P344J50136j39296M0714q8398Q5888
1603b6551K3409n5951j56328J45547K85060k78005q1802Q7541Q1719k9321J45288
1592A40606p7851m758o8951K014o5026r6880q666R2935J01982l9896J7572p1053
1580g7972L1071j67382l9735J17262k0064q8061p0510P314J53138j02150J14436
1569a42653J12943j0626J85342K8959L2559o2851r9857j14233o0395Q9843r7794
1558a38763m1729M0381O3551l4190k0948j17507r652K25302m3370N1193k9277
1547e5009n2925K12723o4366l2000k4184j26132K82254j27606r3935J15741J5535
$$ plain form
1625 141437 92356 -94558 -167386 -109528 -50760 -41751 61665 156966 73082 -136674 -94477
1614 -94477 109087 33216 89509 8096 -82939 -75595 74541 -64755 -24041 -112439 -26551
1603 -26551 -3142 -59093 -215421 -69874 215186 -62819 -144621 -57080 24639 -4682 140606
1592 140606 62755 57997 -10954 -8940 -73966 -170846 -179512 -86577 15405 -24491 -6919 -77972
1580 -77972 -46901 -214283 -254018 -136756 -156820 -244881 -315391 -308077 -154939 -257089 -142653
1569 -142653 -29710 -40336 145006 173965 206524 143673 43816 -70417 -130812 -40969 -138763
1558 -138763 -180492 -140111 -76560 -110750 -131698 -249205 -258857 -33555 -76925 -25732 -55009
1547 -55009 -107934 104789 40423 8423 -15761 -141893 140361 12755 -81180 34561 50096
1536E0096m5984n3832J40104J62360j10905j52662k9552L22695r3410l37375N4106
1525i4359K98149q3723q9945o1597J29709k43977J32109K8501j9237O5392j70518
1514a09496l9537K60552L9776k30385L5617j68891J40476J71148K9020N8014k28615
1503d2321m7476o9400J01803J21221P9443j19622k1597J64451j19101q0529J66649
1492A33521R7563n9588p6597K4306K25372r9054q4431L9053o6355q7553L7204
1481H3441q9462K53590J08727j90594k87744j04172j2929J50338J43785J65208
1471B20188J26962k7764j26365k11103j85618J38003J95977k9861j04085j04144
1461a07810J1247J51505K8415J74007o7977k12364r6781o385j04851Q6565K84148
$$ plain form
1536 50096 4112 -49720 90384 252744 141839 -10823 -40375 282320 188910 -148465 -94359
1525 -94359 203790 120067 30122 -31475 98234 -145743 -13634 14867 -4370 61022 -109496
1514 -109496 -149033 111519 151295 -79090 -43473 -212364 -71888 99260 128280 186294 -42321
1503 -42321 -89797 -159197 -57394 63827 143270 23648 2051 166502 47401 -33128 133521
1492 133521 231084 171496 94899 119205 344577 245523 161092 200145 133790 46237 83441
1481 83441 -6021 247569 356296 165702 -122042 -226214 -239143 -88805 54980 220188
1471 220188 347150 319386 193021 -18082 -203700 -65697 130280 100419 -3666 -107810
1461 -107810 -96563 54942 83357 257364 189387 -22977 -119758 -126143 -230994 -144429 139719
1450A39719j67701J924m3424K24332L9577j51263J39970o2151N0471n4577m2206
1439G4671n4563j44680J7244P2617k24859J02439J80738k871R3388q5903k801
1428B5420l4337p1896Q740R9290q9680j02208r396j01210J92476K32021l3428
1417A15792o1977N7706r9116j0125Q7202l6739m3235J5777q6180j72391N7126
1406a76160J02963J4347L8075k2255K758M241q4807K7837L2482k8463J02981J1644
1394B5643P1533j14918J19808J63712Q651j5376j56107j30280L4260m2157j17064
1383a52295J10628j24011m1196r169L10029J45807j01046k5707j78671m02Q1994
1372A5961m8981j26917R1051O0675l3058R5423l7789j52045J31615k9056r2056
$$ plain form
1450 139719 -27982 -26058 -69482 154850 194427 43164 183134 120983 171454 116877 74671
1439 74671 20108 -124572 -107328 -34711 -259570 -157131 23607 20736 114124 28221 25420
1428 25420 -8917 -80813 -72073 27217 -62463 -164671 -174067 -275277 -82801 149220 115792
1417 115792 53815 111521 12405 2280 89482 52743 9508 25285 -60895 -233286 -176160
1406 -176160 -73197 -58850 -20775 -43030 -40272 -36031 -120838 -93001 -60519 -88982 13999 25643
1394 25643 97176 -17742 102066 265778 274429 259053 102946 -27334 6926 -35231 -152295
1383 -152295 -41667 -165678 -206874 -216043 93986 239793 138747 113040 -65631 -66033 15961
1372 15961 -33020 -159937 -68886 -8211 -41269 54154 16365 -135680 -4065 -33121 -125177
1361a25177m6952J19783N8530j71317p6145L4289Q7300J50282p1568q4553O9165
1350e6363r7743J34997J90975j13790j8863p9236J04200J64312j24437J90432
1340B94484N0888p0457j26722m168n4654M546p5202l9398K7434n677J1637j19037
1328a06326P7781K365N1938N2906m16470l6026R977K39540l7774J24480R74j33548
1316a70183J10657k4246Q2836j8124J48875j04955j55518J0487J3730k1886J09440
1305a8887l9911j2425J2585p2310j44604J80818J83110R4701j99749j07497J47241
1294B3072Q7836q5768k47349R5143J79090J08414l7885J05274L5169j58416k00813
1283i6233j630q7072j9965K55039N9334j48708N9236J30039o9023q9229l1020
$$ plain form
1361 -125177 -172129 -52346 6184 -165133 -241278 -206989 -119689 30593 -40975 -125528 -56363
1350 -56363 -154106 -19109 171866 58076 39213 -40023 64177 228489 104052 294484
1340 294484 345372 274915 148193 144025 89371 93917 18715 -20683 6751 1074 12711 -106326
1328 -106326 -28545 -26180 25758 78664 -337806 -373832 -363855 -124315 -162089 -37609 -36635 -170183
1316 -170183 -59526 -83772 -936 -19060 129815 24860 -130658 -120171 -106441 -128327 -18887
1305 -18887 -58798 -71223 -58638 -130948 -275552 -94734 88376 183077 -16672 -124169 23072
1294 23072 110908 25140 -222209 -127066 52024 160438 122553 227827 262996 104580 -96233
1283 -96233 -97863 -184935 -204900 50139 109473 -39235 20001 150040 81017 -8212 -39232
1272c9232n6541K4995K0049J60308J2619k33401r1230Q3352J54738k46768L272
1261b07839K13908J90631J47639k35646O782P9688L55n9477q7640l866K2830k19426
1249a52061J04023P7117n8562j21088j68301P2435K2103O9991K35374J5919M107
1238A01057P5952o6371l1215n7884N9044J07543J2581j92128J43717J90596k53421
1227H9471j831R8673r0631J60479N7149M4635j69785l2327J8769K3152j02543
1216I5211j04312J42680j87871m1534m5915Q3958N3241n9094L37504M1395k22830
1205I2433r8503J49669l5921q4315P5230N1567j11746j77935P94J61381j7487
1194E167q0105M6466J94696j21676J20377m4253j00072p7096Q1997l0310j4467
$$ plain form
1272 -39232 -95773 -70778 -50729 109579 122198 -111203 -202433 -119081 35657 -211111 -207839
1261 -207839 6069 196700 344339 108693 115475 195163 195518 136041 48401 44535 67365 -152061
1249 -152061 -48038 29079 -29483 -150571 -318872 -246437 -224334 -154343 81031 96950 101057
1238 101057 177009 110638 79423 21539 80583 188126 200707 8579 152296 342892 89471
1227 89471 87640 186313 95682 256161 313310 357945 188160 155833 174602 197754 95211
1216 95211 -9101 133579 -54292 -95826 -141741 -57783 -4542 -63636 273868 315263 92433
1205 92433 -6070 143599 107678 23363 98593 150160 38414 -139521 -138727 22654 5167
1194 5167 -74938 -28472 166224 44548 164925 120672 20600 -56496 25501 -4809 -19276
1183a9276J57951N0395j25290o8011K04651q1292m6479O3902j17744k33016L20484
1172A06275j3418M7648L4235r2890k78370q123K10068p602L4888J13837j62756
1161a6208j5651K1921K9878o448j31103P1106L1458P6601p6393m0383p4120M6901
1149h2441n8784L95720K3063j27050K9748j18064Q4338K2917l7256o2477Q4759
1138A54473k20466P4339J0410p1410J16257J56201n1387l0870J29020j61519M4819
1127A49867M0036m3472R301J34194j9713J6711K3498n6784j06539Q222j1505L9211
1115A83027J48403q8173M7122j07609J1457j07396J49911L9629O2785J03559j94178
1104B48537M7026k96969q7333J38950Q7496K0237J56440p7452l8521J75303q7368
$$ plain form
1183 -19276 138675 189070 63780 -4231 200420 119128 72649 136551 18807 -214209 106275
1172 106275 92857 140505 174740 81850 -196520 -204643 5425 -2177 32711 146548 -16208
1161 -16208 -31859 -9938 19940 13492 -117611 -46505 -15047 61554 -14839 -55222 -129342 -82441
1149 -82441 -141225 254495 277558 150508 180256 62192 146530 169447 132191 69714 154473
1138 154473 -65993 8346 18756 -52654 63603 219804 168417 137547 266567 105048 149867
1127 149867 189903 146431 155732 289926 270213 286924 310422 253638 147099 155321 143816 183027
1115 183027 331430 243257 290379 182770 194227 86831 236742 276371 339156 442715 248537
1104 248537 295563 -1406 -88739 50211 137707 157944 314384 236932 198411 373714 286346
1093B86346q4993o4062J04256L1563k444q7103L05324l6312j68862J9928n560
1082B98081J41981n5879O7287j15772O3462K4957j81875J96908J46325m5838J25612
1071F65249j0616k52525j6556p9878j79084J06612L37829Q8381j67956r0433j4572
1060C86451J2712J64213J57496l271m4871j11416R3185J33866N2793k4229j16898
1049G00031J50889k09838l5863K77715r4845j12820J38605K3722J55723q4836
1039I08483J7719O4255K27842K63230k6632j47906k8851L57294j63590m7736l4349
1028A389759P1290O8899p888N0956K62401j9967Q8337K8140m4850m8246j5232
1017A823599P7283J7930J36302j44707N7588L56528p8926p1046K75147j22430
$$ plain form
1093 286346 201353 137291 241547 273110 270666 183563 488887 452575 283713 303641 298081
1082 298081 440062 384183 451470 335698 399160 424117 242242 439150 585475 539637 665249
1071 665249 654633 402108 385552 305674 126590 233202 571031 659412 491456 401023 386451
1060 386451 399163 563376 720872 717601 672730 561314 654499 788365 841158 816929 700031
1049 700031 850920 641082 605219 882934 788089 675269 813874 837596 993319 908483
1039 908483 926202 990457 1218299 1481529 1454897 1306991 1278140 1635434 1471844 1424108 1389759
1028 1389759 1461049 1529948 1522060 1573016 1835417 1815450 1903787 1931927 1887077 1838831 1823599
1017 1823599 1900882 1918812 2055114 1910407 1967995 2324523 2245597 2174551 2449698 2327268
1007B327268p9723J98816J22079n8291o582P7188L1045J16424n9282O7631P3512
996B810085J62665J00610J78060L5496J74141r6796K13844K52160K94947K3328
986D148540J20406L16232p5151L70262M45338M63931J69124L91910K54111L84339
976F989042L30417L10533M79344P98772O65312Q63361O71091N45371M95040P51425
966A2899708P34768J240323J525088K087480K168402K977026L208238M627611
958C1468644O315188Q932828J1161616Q218052j739008p974090q578488r815999
950C7988743p772129n755985l943608k879111k028700j706627j163365j034927
942A1704291j031211q03640k40650n71460o52881n59964o77726p14513k60206
$$ plain form
1007 2327268 2247545 2446361 2568440 2510149 2503567 2580755 2611800 2728224 2668942 2736573 2810085
996 2810085 2972750 3073360 3251420 3286916 3461057 3364261 3578105 3830265 4125212 4148540
986 4148540 4268946 4585178 4510027 4880289 5325627 5789558 5958682 6350592 6604703 6989042
976 6989042 7319459 7629992 8109336 8908108 9573420 10436781 11107872 11653243 12148283 12899708
966 12899708 13634476 14874799 16399887 18487367 20655769 23632795 26841033 31468644
958 31468644 37783832 46716660 57878276 66096328 64357320 56383230 47804742 37988743
950 37988743 30216614 24460629 20517021 17637910 15609210 13902583 12739218 11704291
942 11704291 10673080 9869440 9628790 9057330 8404449 7844485 7166759 6452246 6192040
933F192040n99294m14498k86420j18241r3406j08096l82374k19331k45925j42071
923C582384j80406q5478O697m48490j27628N3217m5918j56928p7529L7503r1947
912B465477l37245o1417L2830n4869n0784r0175r2370J6350M8140k51267j22521
901A502149M7144o3380K130p7052j3773J1659j31022j57975J65426j97146j66274
890I21886J9651K88212j24828j89952K26163m6556K0863k3320o4458k4452J6654
879A019863k0895j4825k54810L7506m4293j78914L71265j69357k16075j24483
869D04982N6675J33052p2872Q6291K4031j72139K11971p2541n1517K10985J4326
858G73244m3249p0994l4118j59891o3561j03371O7634J18115J68828m435k2236
$$ plain form
933 6192040 5592746 5178248 4891828 4773587 4680181 4572085 4189711 3970380 3724455 3582384
923 3582384 3401978 3316500 3323197 2874707 2747079 2800296 2754378 2597450 2519921 2557424 2465477
912 2465477 2128232 2066815 2099645 2044776 1993992 1903817 1811447 1827797 1875937 1624670 1502149
901 1502149 1549293 1485913 1488043 1410991 1397218 1408877 1277855 1119880 1285306 1088160 921886
890 921886 941537 1229749 1104921 914969 1141132 1094576 1115439 1092119 1027661 1003209 1019863
879 1019863 998968 984143 729333 766839 722546 543632 914897 745540 529465 404982
869 404982 461657 594709 521837 608128 632159 460020 671991 599450 547933 758918 773244
858 773244 729995 659001 624883 464992 401431 298060 365694 483809 652637 648202 625966
847F25966k97906m5269R7935R3632k2447r5168j58648N3677L0344j85880O7111
836A63347K3129o1677O6019m176N1527q3189j21010P4849p1876n9799j2156L0427
824d585N5740J20295k10893m1312p72M8125K9161p9905o9077M7957M8451K16369
812A59554q7743j6998J16603M3054j11018J15651j02696M407M3888q0480k9745
801E4477L7982J7249m6590J04030j13963j05272O4396O5127r6277J16035N6521
790A53715l47211l0110J4081L5454J09493J17483N0520m8346N5428r7028q3426
779f9947J6824J58703J24974j21109l9942j10487P1090j9615l0112j48425j6570
768a84616J07467m0826Q1486m2665N2852O065j39952L0862p7844K7504j1494J24972
$$ plain form
847 625966 328060 282791 380726 474358 451911 356743 198095 251772 282116 96236 163347
836 163347 186476 124799 190818 186642 238169 154980 33970 108819 36943 -22856 -35012 -4585
824 -4585 51155 171450 -39443 -80755 -81527 -33402 -4241 -84146 -153223 -105266 -56815 159554
812 159554 71811 54813 171416 214470 103452 219103 116407 120814 164702 84222 54477
801 54477 92459 109708 63118 167148 53185 -52087 12309 77436 -18841 97194 153715
790 153715 -193496 -223606 -209525 -174071 -64578 52905 103425 55079 110507 13479 -69947
779 -69947 -53123 105580 230554 109445 69503 -40984 30106 10491 -19621 -168046 -184616
768 -184616 -77149 -117975 -36489 -79154 -26302 -20237 -160189 -129327 -207171 -179667 -191161 -66189
756f6189N5516p0173J92235j26620R7370M8166m6222p451r92L4035p4599j87608
744a52532P9806m4748J00881J07291J65223k31200p0778j524Q8806R686j57621
733a06710m3316K1965j2436o3226J34388j60699J75421p8157N0711J10762J04673
722A33376q0241j81133R0690p0649m1622j68429L7359K24779l085j48488M7554
711a59889R6464j1698r5544J44020q7839N3447j2156R007Q7185P9942N8336j06458
699E4817l4652k8753P4853J56998j72427m7597p9633J78740M4088O580j0097j36267
687F650J72047J79136j13563P1422n413q4066k47471r3770J33063p639j73830
676a63434J14737L08677L6302L7643l00561j87085J4982R2046J3444P8508J55175
$$ plain form
756 -66189 -10673 -80846 111389 -15231 82139 130305 84083 76632 75640 109675 35076 -152532
744 -152532 -72726 -117474 -16593 90698 255921 24721 -46057 -47581 41225 50911 -106710
733 -106710 -150026 -128061 -140497 -203723 -69335 -230034 -54613 -132770 -82059 28703 133376
722 133376 53135 -127998 -37308 -107957 -149579 -318008 -280649 -55870 -58955 -207443 -159889
711 -159889 -63425 -75123 -170667 -26647 -114486 -61039 -73195 -64188 22997 102939 161275 54817
699 54817 20165 -8588 66265 223263 50836 3239 -76394 102346 146434 153014 142917 6650
687 6650 178697 357833 244270 315692 310279 226213 -21258 -115028 18035 10396 -163434
676 -163434 -48697 259980 296282 333925 33364 -153721 -138739 -46693 -33249 45259 200434
665B00434p8643l6783L5086l6161k3234R2528r3235L6218m7573r8070p5653j05912
653b30998N8840J14351K3298j16046N8298J09721L8911j59390O0392J8174J4994
642i455J23981n1260k6993P8390k06186M5419p9949j9361j6196P1414Q3864M7957
630D1625l2129O4373N2147N6074n0916J2525l1477N3826n9429p7965o5561n8118
618i5025J8362J30481J46025j39756l59551R6071K12732r9171J3423Q17k3348
607i8940j44085n5084P2000n1777o0423K92582j19520j72360K31212Q5139o2486
596h3742j6332L09764J3510k93155j80606j00559L3074l8328K66635K43346j88445
585c4838l224J62529O0172j50167k96193O7819J94656o9344o1525j63162K34899
$$ plain form
665 200434 121791 85008 120094 83933 60699 153227 59992 96210 48637 -49433 -125086 -230998
653 -230998 -172158 -57807 -34509 -150555 -92257 17464 56375 -103015 -42623 -24449 -9455
642 -9455 114526 63266 36273 114663 -91523 -46104 -126053 -145414 -161610 -90196 -6332 41625
630 41625 9496 73869 126016 182090 131174 143699 112222 166048 106619 28654 -36907 -95025
618 -95025 -76663 53818 199843 60087 -299464 -203393 9339 -89832 -76409 -75592 -98940
607 -98940 -243025 -298109 -226109 -277886 -338309 -45727 -165247 -337607 -106395 -21256 -83742
596 -83742 -100074 209690 223200 -69955 -250561 -351120 -318046 -356374 -89739 153607 -34838
585 -34838 -38062 124467 184639 34472 -261721 -193902 754 -68590 -130115 -293277 -58378
574e8378n1159r348k20747N0842q485M8466M554j01093J40664M4028o4523Q6655
562a38524O8734J2840l7760j85553L24323J33688k24329k00867L1272N9865K07593
551E1282P5055j94617j80000o3203M9478L4525j29650O054Q9651J39360j3533
540a35598o3991P4139Q7014p4142o034M8217j3233k87343P9240J38674M9930m4002
528a47129p7285J64839j85993l9042J97899J00117L0449j21069J9442j47096M8588
517a56280n3374p2088P7396K71941r1229R4557j8678L8302r6694O6412k5169n4504
505a9408l6178r6267N1045J54598j41901r9527J20714M8912M7850j13885m16052
494e00099j07185K74326J18270Q2609j12872J13067q575k5385k246j7073j57596
$$ plain form
574 -58378 -109537 -118885 -339632 -288790 -297275 -248809 -244255 -345348 -204684 -160656 -225179 -138524
562 -138524 -69790 -56950 -94710 -280263 44060 177748 -46581 -247448 -216176 -156311 51282
551 51282 126337 -68280 -248280 -311483 -262005 -227480 -357130 -351076 -261425 -122065 -135598
540 -135598 -199589 -125450 -38436 -112578 -118612 -70395 -83628 -370971 -291731 -153057 -103127 -147129
528 -147129 -224414 -59575 -245568 -284610 -86711 13406 43855 -77214 -57772 -204868 -156280
517 -156280 -209654 -281742 -204346 67595 -23634 70923 52245 90547 -6147 60265 35096 -19408
505 -19408 -55586 -151853 -100808 53790 -88111 -187638 -66924 -18012 29838 -84047 -500099
494 -500099 -607284 -332958 -214688 -132079 -244951 -131884 -140459 -165844 -168090 -185163 -342759
483c42759j05506J07119J08857j8091J54449O1726j12362l2677J15857J80226
473A16839m6485q1089n8391L245j23028o406R4700J68873o5613m9937k8662q0160
461a56114J76277q7412o1893M090Q4501P3435n3047P2947R9612k15821j04181
450a67606K7731J3340n434K02913Q8687L9553k28075K8399q2708j61260O0457
439a84003L1699l7895R2670L2048M6804P6961k15608M1344j32787j38181J35218
428b51730J7951P888K22583p3061j7125n0804J80365j22296r0508R1919j65306
417b50124J36685o4059p9022o2049l064M7524J15533q4535P3720k168J29396j42188
405a84351j87848J6446P2696n5334N1099n5330O4274j9458r3925J23674o7687
$$ plain form
483 -342759 -448265 -341146 -232289 -250380 -95931 -34205 -146567 -179244 -63387 116839
473 116839 70354 -10735 -69126 -65881 -188909 -195315 -100615 68258 2645 -47292 -75954 -156114
461 -156114 20163 -67249 -129142 -125052 -40551 32884 -20163 52784 152396 -63425 -167606
450 -167606 -139875 -126535 -131969 70944 159631 199184 -28891 -492 -83200 -244460 -184003
439 -184003 -152304 -190199 -97529 -65481 -18677 58284 -157324 -115980 -248767 -386948 -251730
428 -251730 -233779 -225891 -3308 -76369 -93494 -144298 36067 -86229 -176737 -84818 -250124
417 -250124 -113439 -177498 -256520 -318569 -321633 -274109 -158576 -243111 -169391 -171559 -42163 -184351
405 -184351 -372199 -355753 -283057 -338391 -287292 -342622 -278348 -297806 -391731 -268057 -335744
394c35744J27676j50686q4545K04745j21171m2991j61460N5889J40372j60070
384e27985K1158N2198J55882J09851p2725j29717j10539K6248J24286K68587j23159
373b05915p0748J38234q5655L0790r9371j22780K12112M4836q1338j28658j18818
362d87311J32708K7562k05558K19659P7740j2692Q7709k7256n6284K1180l2687
351b55230j24507R9773l7832N7270L4110k5394k93579J57867j38894l4943r9494
340f60853K03477L2972M2099J24005j00068J47360q6029L8351j40341J33304J36473
329a29250j81565j19265M0286K3725j15786N5794J53156M5043J76502J7658j92348
318b26050j7290J3251j30233j62158J86543K50085k6873k46028j18966Q5556J87331
$$ plain form
394 -335744 -208068 -358754 -443299 -238554 -359725 -402716 -564176 -508287 -367915 -527985
384 -527985 -506827 -454629 -298747 -188896 -261621 -391338 -501877 -475629 -351343 -82756 -205915
373 -205915 -276663 -138429 -224084 -193294 -292665 -415445 -203333 -158497 -239835 -368493 -487311
362 -487311 -354603 -327041 -532599 -312940 -235200 -247892 -160183 -187439 -243723 -222543 -255230
351 -255230 -379737 -279964 -317796 -260526 -226416 -251810 -545389 -387522 -526416 -561359 -660853
340 -660853 -457376 -424404 -382305 -258300 -358368 -211008 -297037 -258686 -399027 -265723 -129250
329 -129250 -310815 -430080 -389794 -366069 -481855 -426061 -272905 -227862 -51360 -33702 -226050
318 -226050 -243340 -230089 -360322 -522480 -335937 -85852 -112725 -358753 -477719 -392163 -204832
307b04832J62116j48547k05542J8134k7378J30016K8346j61434r4014j07229K3343
296e87021K29787N3025j6301n7713J42798P0701p9617j15546j16989J75728j78901
285d80049L6826o782l0587j72179K96053N5099L745o331k1237K4025n7502K1354
273c37565j9535R2663k3095M2514r2481j06744M0642J34025J04889k07812p6704
262d49203L9181o572l243j22392j15738n2706K16066M2438O6117j84470L99591
251a70931O6642k79567j39168M3863j23641J04553K71501J09710k08092j30480
241d55610R3399J8493o0520J00092O7503P4237p3354n9992j11302R1329l6804
230c52529r6329q7371N1774R8145r831n113J4980Q8231o0786K9970L5505j42853
$$ plain form
307 -204832 -42716 -191263 -396805 -378671 -406049 -276033 -247687 -409121 -503135 -610364 -587021
296 -587021 -357234 -304209 -320510 -378223 -235425 -164724 -244341 -359887 -476876 -301148 -480049
285 -480049 -443223 -450005 -480592 -652771 -356718 -301619 -297874 -304205 -325442 -301417 -358919 -337565
273 -337565 -357100 -264437 -287532 -245018 -337499 -444243 -403601 -269576 -164687 -372499 -449203
262 -449203 -410022 -416594 -419837 -542229 -657967 -710673 -494607 -452169 -386052 -570522 -170931
251 -170931 -104289 -383856 -523024 -479161 -602802 -498249 -226748 -117038 -325130 -455610
241 -455610 -362211 -343718 -404238 -304146 -236643 -162406 -235760 -295752 -407054 -315725 -352529
230 -352529 -448858 -536229 -484455 -386310 -396141 -401254 -386274 -298043 -358829 -328859 -293354 -436207
218d36207p0241R9081K5793Q9037m783j00728j0009J41656l8233m4521Q799r5374
206d35730j06038K45630j40195j6240O1779j79902P2785J00413P1895m3405q5058
195d54066L84106j57956k0669L0154j55473p4565K30115p1236p1424j3588m3110
184d17712n7450K46624j34865k87540J65961j15229m0943J49292O0666N3098k1854
173c99952j65213k35255J78605K67096L0958M9648l9344j44936R900N4743j95091
162e88841r342K3121j4525J10124n1193J09536K2683R6337j1110J37585J26803
151d8822j16761r6257n3965j0295o277M2854o2034o3656J17834j07759j22277
140e27415m0293J661l0948k6881L0878L24011p2932k38444J69260J26517M8750
$$ plain form
218 -436207 -506448 -407367 -381574 -292537 -297320 -398048 -408057 -266401 -304634 -349155 -340356 -435730
206 -435730 -541768 -296138 -436333 -452573 -390794 -570696 -497911 -397498 -325603 -369008 -454066
195 -454066 -69960 -227916 -248585 -218431 -373904 -448469 -218354 -289590 -361014 -374602 -417712
184 -417712 -475162 -228538 -363403 -650943 -484982 -600211 -641154 -491862 -431196 -378098 -399952
173 -399952 -565165 -800420 -621815 -354719 -323761 -274113 -313457 -458393 -448493 -393750 -588841
162 -588841 -598183 -575062 -589587 -479463 -530656 -421120 -398437 -302100 -313210 -175625 -48822
151 -48822 -165583 -261840 -315805 -326100 -332377 -289523 -351557 -415213 -297379 -405138 -527415
140 -527415 -567708 -566047 -596995 -623876 -592998 -268987 -341919 -580363 -411103 -284586 -235836
129b35836O7775k42949j4366l9101l3487J98569k15925o2360r8320J33847q7699
118f29852J43070Q4824J46122N4908o7975j89460K57802o7828n0314J3021J8039
107b87643j66435l8512J43146m7761j02533m0847J37372k5039M2561Q9394j4098
96c10395j8373j09334R6618L8439p3439K6058k06824K7735N0331P1439j14625
85e22370m6566M0387J3465k566n8231j24849N2443K79645Q4348k892M2647j20094
73c64633o6056K9329j32554L9236J7300r409p1102j28635K26160J58011q9287
62c91640p898q0862O29N2362k04774J06686M4347O519O8002j27997j8906K1828
50e31704R5071J42596N764j22688o7831r0469n4238J61538J07887m4363k4810
$$ plain form
129 -235836 -168061 -411010 -425376 -464477 -497964 -299395 -515320 -577680 -676000 -542153 -629852
118 -629852 -486782 -401958 -255836 -200928 -268903 -458363 -200561 -268389 -318703 -305682 -287643
107 -287643 -454078 -492590 -349444 -397205 -499738 -540585 -403213 -428252 -385691 -296297 -310395
96 -310395 -328768 -438102 -341484 -303045 -376484 -350426 -557250 -529515 -479184 -407745 -522370
85 -522370 -568936 -528549 -515084 -517650 -575881 -700730 -648287 -368642 -284294 -287186 -244539 -364633
73 -364633 -430689 -401360 -533914 -494678 -477378 -486787 -557889 -686524 -460364 -302353 -391640
62 -391640 -399538 -480400 -479771 -427409 -632183 -525497 -481150 -474631 -406629 -534626 -553532 -531704
50 -531704 -436633 -294037 -288273 -410961 -478792 -569261 -623499 -461961 -354074 -398437 -423247
39d23247J3021O9228q4895M9352p3510N4412p3810R9661m0141n766j30921j61710
27g08326J60753K1472R36N6317k4287J86045p8927j74225j65275Q4685J20986
16e19846J48615N3415k32472R4855M1245K7444M0819r3799l069j12254l0073J22889
4d62231o6143J20155j660L1337
0c78542
$$ plain form
39 -423247 -410226 -340998 -425893 -376541 -450051 -395639 -469449 -369788 -409929 -415695 -546616 -708326
27 -708326 -547573 -526101 -525165 -468848 -493135 -307090 -386017 -560242 -725517 -640832 -519846
16 -519846 -371231 -317816 -550288 -455433 -414188 -386744 -345925 -439724 -442793 -555047 -585120 -462231
4 -462231 -528374 -408219 -409879 -378542
0 -378542
$$ Imaginary data points
##PAGE= N=2
##DATA TABLE= (X++(I..I)), XYDATA
16383c572018J2594R1419R2625M6397j66465Q7783J02294J80587R191j09821Q8833
16372c136581J34787K5536m3810K7075J53915J82768q2020j18888J48017m472
16362b713673J41114J38002r3922j95054J02719J38106M9631m4649R5307J15644
16352b266775J09020J45596q8191O2945N3624O6193K1933r7963L7513J02912Q4075
16341a769118o772K6721J20999J4736k7329M4981O8089j11885Q0206J86156j17164
16330a490380p8789J05262m5152J0119J49803R9950N0510J32551L7653O4418M3155
16319i20900K7566L4498J21160j3452k6061j53089N4825J73631M5509J7197K5268
16308f13848K3792N8670l7397p7157l8099K11243K2320K1699P9357N0289m1424
$$ plain form
16383 -3572018 -3559424 -3468005 -3375380 -3328983 -3495448 -3407665 -3305371 -3124784 -3115593 -3225414 -3136581
16372 -3136581 -3001794 -2976258 -3020068 -2992993 -2839078 -2656310 -2738330 -2857218 -2709201 -2713673
16362 -2713673 -2572559 -2434557 -2528479 -2723533 -2620814 -2482708 -2433077 -2477726 -2382419 -2266775
16352 -2266775 -2157755 -2012159 -2100350 -2037405 -1983781 -1917588 -1895655 -1993618 -1956105 -1853193 -1769118
16341 -1769118 -1775890 -1749169 -1628170 -1613434 -1640763 -1595782 -1527693 -1639578 -1559372 -1373216 -1490380
16330 -1490380 -1569169 -1463907 -1509059 -1498940 -1349137 -1249187 -1198677 -1066126 -1028473 -964055 -920900
16319 -920900 -893334 -858836 -737676 -751128 -777189 -930278 -875453 -701822 -656313 -639116 -613848
16308 -613848 -590056 -531386 -568783 -645940 -684039 -472796 -450476 -428777 -349420 -299131 -340555
16297c40555J29313j93577Q166J29791J01009P7528o7196m1438J62304J32478
16287I7823m4972J2788k0637N0384N0560j25690J19762J82423j07464N3262Q6130
16276C54369n1676O2412j17298Q5759J81541J5597k3585K56632j11163k08462
16266D44126J48965M9426N5007j0361P1024r7197l6447J21408r5362m2820P6642
16255F84411K40048J06694l824j35006r2386o8382N137J39856O6328Q9310j17707
16244I14479J69809O0612o420Q204N1202l4644k0997J26788o6813O7986J44944
16233A415150j73676K5428J40793R1125J0837r3118k7769J74467O2394l600o7464
16222A554567J42019m758R4242r1662m3553K02083j01629j19130J11321n4305
$$ plain form
16297 -340555 -211242 -404819 -396653 -266862 -165853 -88325 -155521 -196959 -34655 97823
16287 97823 52851 65639 45002 95386 145946 20256 140018 322441 214977 268239 354369
16276 354369 302693 365105 247807 333566 515107 530704 507119 763751 652588 444126
16266 444126 593091 642517 697524 687163 758187 660990 624543 745951 650589 607769 684411
16255 684411 924459 1031153 1027329 892323 799937 731555 736692 876548 942876 1032186 914479
16244 914479 1084288 1144900 1138480 1146684 1197886 1163242 1142245 1269033 1202220 1270206 1415150
16233 1415150 1241474 1266902 1407695 1498820 1509657 1416539 1388770 1563237 1625631 1622031 1554567
16222 1554567 1696586 1691828 1786070 1694408 1650855 1852938 1751309 1632179 1743500 1689195
16212A689195M1204J09635p6332L0435q1504j48981L5002K01629m698p0199M7995
16201A773381P7938m1405k7068K85199j7071j60041M4413o1175q4623L9372M1053
16190A869973l7906K1759K44085N6643q2939J8518r7128l3966l2913J72559M3739
16179B142424n6379k06r3769J73979J61231J49310M7267j12439J60175J49919
16169B721512q9290k54977k04602n3431J55413M06338n9646k34542j3623m8078
16159B325074K5275L0974k08577K04316R4956k47380L0651J74451R166K46024
16149B684930k307j38166n2940j08254L3405L4089J21867O6271M4925j13407k7796
16138B542617n6444j05772J1432K8453r6910L3442J46109p3231j19043K03509
$$ plain form
16212 1689195 1730399 1840034 1763702 1794137 1712633 1563652 1598654 1800283 1795585 1725386 1773381
16201 1773381 1851319 1809914 1782846 2068045 2050974 1890933 1935346 1874171 1789548 1828920 1869973
16190 1869973 1832067 1853826 2097911 2154554 2071615 2090133 1993005 1959039 1926126 2098685 2142424
16179 2142424 2086045 2085839 1992070 2166049 2327280 2476590 2523857 2411418 2571593 2721512
16169 2721512 2632222 2377245 2172643 2119212 2274625 2680963 2621317 2386775 2373152 2325074
16159 2325074 2350349 2381323 2172746 2377062 2472018 2224638 2255289 2429740 2438906 2684930
16149 2684930 2682623 2544457 2491517 2383263 2416668 2450757 2572624 2638895 2683820 2570413 2542617
16138 2542617 2486173 2380401 2391833 2420286 2323376 2356818 2502927 2429696 2310653 2514162
16128B514162J52042K4187k60339m1856J64931O9554o141n8328O5536j1045p987
16117B604716k17326L5849R9023j1211n7235Q3650J4576k33892J10281J00776
16107B529207J51583J04172l371n7642l42553R9523K8631k2981J63311k8329n0801
16096B570750K9234J40943j34654q8809R1118N5463O5797o8676Q8118J08111n7340
16085B800055l1145m9439J2389j55817J19122J9673M2279R329k083o8249j6433
16074B679681J87294k51261M8801l6211M6380K86719J5907J7520j55668r19r0879
16063B747364J6344l6221k25122K17683q9983J2239J41240L162N7546M7769Q781
16052B900802k37551m0126j41509J20878N0850K55162j94460j14601k7966J03308
$$ plain form
16128 2514162 2666204 2690391 2430052 2388196 2553127 2622681 2616540 2558212 2623748 2612703 2604716
16117 2604716 2387390 2423239 2522262 2511051 2453816 2537466 2552042 2318150 2428431 2529207
16107 2529207 2680790 2784962 2781591 2723949 2381396 2480919 2509550 2486569 2649880 2621551 2570750
16096 2570750 2599984 2740927 2606273 2517464 2608582 2664045 2729842 2661166 2749284 2857395 2800055
16085 2800055 2768910 2719471 2731860 2576043 2695165 2714838 2757117 2766446 2764363 2696114 2679681
16074 2679681 2866975 2615714 2664515 2628304 2674684 2961403 2977310 2994830 2839162 2838243 2747364
16063 2747364 2763708 2727487 2502365 2720048 2630065 2642304 2783544 2786706 2844252 2892021 2900802
16052 2900802 2663251 2623125 2481616 2602494 2653344 2908506 2714046 2599445 2571479 2674787
16042B674787K45193j18999r6866J09976r0835j40290J02941L2752J77982l5295
16032B861346j9009J9670P9581j30203j27695J13663n9865j20344q2785r0523
16022B443836q0866J65015J86057J21799j9101L5236J53296k44433q9653q3175
16012B588011l345j36229l0553J98659J58552J1379R7396J1956l28522K07375
16002B774679j67524m232M4796R8320M1560j38374J69223k74723K17179J59510
15992B920414p7776r3981j53321J77990M8336O2248K0970j59740r3516m7772K06370
15981B810222R1122J01023j13831l6350o7703J1585K6753N7324J11118o8161j23292
15970B799810j20272O9348K79736j2585j32875j0887L1174Q3422o7293K7368j45508
$$ plain form
16042 2674787 2919980 2800981 2704115 2814091 2723256 2582966 2685907 2718659 2896641 2861346
16032 2861346 2842337 2862007 2941588 2811385 2683690 2797353 2737488 2617144 2534359 2443836
16022 2443836 2362970 2527985 2714042 2835841 2816740 2851976 3005272 2760839 2671186 2588011
16012 2588011 2584666 2448437 2417884 2616543 2775095 2786474 2883870 2895826 2567304 2774679
16002 2774679 2607155 2602923 2647719 2746039 2787599 2649225 2818448 2543725 2760904 2920414
15992 2920414 2842638 2748657 2595336 2773326 2821662 2883910 2904880 2745140 2651624 2603852 2810222
15981 2810222 2901344 3002367 2888536 2852186 2784483 2796068 2822821 2880145 2991263 2923102 2799810
15970 2799810 2679538 2748886 3028622 3016037 2883162 2872275 2903449 2986871 2919578 2946946 2801438
15959B801438q0173J81054j23913J04614j55662l7129J01012k2326j00740q3749
15949B584426O2237J68521p1154O7216J23715o8168j22271p5050J92073r4391
15939B767154P9205J25390k7553k64217O1674J2230m9101j51661J32600P0248
15929B755969P5891N2592k83722K23491M9790l61647l9337J78110O2288q1541
15919B631884k0890P9265n2425K9180J63106J07325J9859j22674j70748m0152
15909B623730L8531R8127n3406J36979o1642j46836M6319Q8457M6824J13674o6269
15898B864488J02660K136k58556M1381K09362M2485J9021q5275j66727o6314r887
15887B694774J16610j26065K2893m0931m1319O8251K15280J16824Q992j85962
$$ plain form
15959 2801438 2721265 2902319 2778406 2883020 2727358 2690229 2791241 2768915 2668175 2584426
15949 2584426 2646663 2815184 2744030 2811246 2934961 2866793 2744522 2669472 2861545 2767154
15939 2767154 2846359 2971749 2944196 2679979 2741653 2753883 2704782 2553121 2685721 2755969
15929 2755969 2831860 2884452 2600730 2824221 2874011 2512364 2473027 2651137 2713425 2631884
15919 2631884 2610994 2690259 2637834 2667014 2830120 2937445 2957304 2834630 2663882 2623730
15909 2623730 2662261 2760388 2706982 2843961 2782319 2635483 2681802 2770259 2817083 2930757 2864488
15898 2864488 2967148 2969284 2710728 2752109 2961471 3003956 3022977 2937702 2770975 2704661 2694774
15887 2694774 2811384 2685319 2708212 2667281 2625962 2694213 2909493 3026317 3035309 2849347
15877B849347p6507O2979m2040j3399R6815j9951k3110R0825n4565l7464p1948
15866B760982K01546k4627L1074J32925k56034n3712M5312O2540J50617O4837
15856C115460j48875l6800o6855P256J621J71488O9219k92813j0260q9805j26687
$$ plain form
15877 2849347 2772840 2835819 2793779 2780380 2877195 2857244 2834134 2924959 2870394 2832930 2760982
15866 2760982 2962528 2937901 2968975 3101900 2845866 2792154 2837466 2900006 3050623 3115460
15856 3115460 2966585 2929785 2862930 2870186 2871807 3043295 3112514 2819701 2809441 2719636 2592949
$$ [...]
##END NTUPLES=NMR SPECTRUM
##END=
