##TITLE=1H_CA-9140-1
 CDCl3
 8 sc, 
 17.4.2023
##JCAMPDX= 6.0         $$ Bruker NMR JCAMP-DX V2.0
##DATA TYPE= NMR SPECTRUM
##DATA CLASS= NTUPLES
##ORIGIN= UXNMR, Bruker Analytische Messtechnik GmbH
##OWNER= root
$$ XWIN-NMR		Version 3.5
$$ Mon Apr 17 15:51:20 2023 Russian Standard Time (UT+4h)  she@DPX200
##.OBSERVE FREQUENCY= 200.13135
##.OBSERVE NUCLEUS= ^1H
##.ACQUISITION MODE= SIMULTANEOUS
##.ACQUISITION SCHEME= undefined
##.AVERAGES= 8
##.DIGITISER RES= 18
##SPECTROMETER/DATA SYSTEM= spect
##.PULSE SEQUENCE= zg30
##.SOLVENT NAME= CDCl3
##.SHIFT REFERENCE= (INTERNAL, CDCl3, 0, 15.9496)
##AUDIT TRAIL= $$ (NUMBER, WHEN, WHO, WHERE, WHAT)
$$ ##TITLE= Audit trail, XWIN-NMR		Version 3.5
$$ ##JCAMPDX= 5.01
$$ ##ORIGIN= Bruker BioSpin GmbH
$$ ##OWNER= she
$$ F:/spectra/data/she/nmr/H-F/1/pdata/1/auditp.txt
$$ ##AUDIT TRAIL=  $$ (NUMBER, WHEN, WHO, WHERE, WHAT)
(   1,<2023-04-17 15:50:02.78 +0400>,<she>,<DPX200>,
      <created by zg, POWCHK disabled, PULCHK disabled
       configuration hash MD5:
       00 E9 B6 7A A2 85 ED C7 34 08 36 98 17 FE 4E 26
       data hash MD5: 16K
       A5 13 EB 98 96 A4 95 10 F5 C8 F8 FC 8A 63 5F D4>)
(   2,<2023-04-17 15:50:05.46 +0400>,<she>,<DPX200>,
      <Start of raw data processing
       efp BC_mod = 2 LB = 0.24 FT_mod = 6 PKNL = 1 PHC0 = -19829.97 PHC1 = 10.80081 SI = 16K 
       data hash MD5: 16K
       97 B6 2C 74 06 9A 51 56 56 C2 AE 6B 9A 87 C8 7B>)
(   3,<2023-04-17 15:50:31.84 +0400>,<she>,<DPX200>,
      <pk PHC0 = -161.9139 PHC1 = 2.8 
       data hash MD5: 16K
       DA F2 F5 8C D4 12 38 BC 7B CF A5 FF 3E DB 27 F5>)
(   4,<2023-04-17 15:50:35.01 +0400>,<she>,<DPX200>,
      <abs ABSG = 5 
       data hash MD5: 16K
       F3 28 70 9C 43 F8 A5 3D 73 FA A8 EB B2 8D DC CE>)
$$ ##END=
$$ 
$$ hash MD5
$$ CC 21 87 06 E6 29 95 7E 29 E1 BD A0 99 F5 21 49
##$RELAX= 
##$RELAX= 
##$RELAX= 
##$RELAX= 
##$RELAX= 
##$RELAX= 
$$ Bruker specific parameters
$$ --------------------------
##$DU= <F:/spectra>
##$EXPNO= 1
##$NAME= <H-F>
##$PROCNO= 1
##$TYPE= <nmr>
##$USER= <she>
##$AMP= (0..31)
100 100 100 100 100 100 100 100 100 100 100 100 100 100 100 100 100 100 
100 100 100 100 100 100 100 100 100 100 100 100 100 100 
##$AQSEQ= 0
##$AQ_mod= 1
##$AUNM= <au_zg>
##$AUTOPOS= <>
##$BF1= 200.13
##$BF2= 200.13
##$BF3= 200.13
##$BF4= 200.13
##$BF5= 200.13
##$BF6= 200.13
##$BF7= 200.13
##$BF8= 200.13
##$BYTORDA= 1
##$CFDGTYP= 0
##$CFRGTYP= 5
##$CHEMSTR= <none>
##$CNST= (0..31)
1 1 145 1 1 1 1 1 1 1 1 1 1 1 1 1 1 1 1 1 1 1 1 1 1 1 1 1 1 1 1 1 
##$CPDPRG= <>
##$CPDPRG1= <>
##$CPDPRG2= <>
##$CPDPRG3= <>
##$CPDPRG4= <mlev>
##$CPDPRG5= <mlev>
##$CPDPRG6= <mlev>
##$CPDPRG7= <mlev>
##$CPDPRG8= <mlev>
##$CPDPRGB= <>
##$CPDPRGT= <>
##$D= (0..31)
0 1.2 0 0 0 0 0 0 0 0.06 0 0.03 0 0 0 0 0.0002 0 0 0 0 0 0 0 0 0 0 0 0 
0 0 0 
##$DATE= 1681732202
##$DBL= (0..7)
120 120 120 120 120 120 120 120 
##$DBP= (0..7)
150 150 150 150 150 150 150 150 
##$DBP07= 0
##$DBPNAM0= <>
##$DBPNAM1= <>
##$DBPNAM2= <>
##$DBPNAM3= <>
##$DBPNAM4= <>
$$ [...]
##$SUBNAM3= <"">
##$SUBNAM4= <"">
##$SUBNAM5= <"">
##$SUBNAM6= <"">
##$SUBNAM7= <"">
##$SUBNAM8= <"">
##$SUBNAM9= <"">
##$SW= 18.05172834244
##$SWIBOX= (0..15)
0 0 2 0 0 0 0 0 0 0 0 0 0 0 0 0 
##$SW_h= 3612.71676300578
##$TD= 16384
##$TD0= 1
##$TE= 0
##$TE2= 300
##$TE3= 300
##$TEG= 300
##$TL= (0..7)
0 120 120 120 120 120 120 120 
##$TP= (0..7)
150 150 150 150 150 150 150 150 
##$TP07= 0
##$TPNAME0= <>
##$TPNAME1= <>
##$TPNAME2= <>
##$TPNAME3= <>
##$TPNAME4= <>
##$TPNAME5= <>
##$TPNAME6= <>
##$TPNAME7= <>
##$TPOAL= (0..7)
0.5 0.5 0.5 0.5 0.5 0.5 0.5 0.5 
##$TPOFFS= (0..7)
0 0 0 0 0 0 0 0 
##$TUNHIN= 0
##$TUNHOUT= 0
##$TUNXOUT= 0
##$USERA1= <user>
##$USERA2= <user>
##$USERA3= <user>
##$USERA4= <user>
##$USERA5= <user>
##$V9= 5
##$VALIST= <valist>
##$VCLIST= <CCCCCCCCCCCCCCC>
##$VD= 0
##$VDLIST= <DDDDDDDDDDDDDDD>
##$VPLIST= <PPPPPPPPPPPPPPP>
##$VTLIST= <TTTTTTTTTTTTTTT>
##$WBST= 1024
##$WBSW= 4
##$XGAIN= (0..3)
0 0 0 0 
##$XL= 0
##$YL= 0
##$YMAX_a= 604724
##$YMIN_a= -424743
##$ZGOPTNS= <>
##$ZL1= 120
##$ZL2= 120
##$ZL3= 120
##$ZL4= 120
##$ABSF1= 15.87581
##$ABSF2= -2.176042
##$ABSG= 5
##$ABSL= 3
##$ALPHA= 0
##$AQORDER= 0
##$ASSFAC= 0
##$ASSFACI= 0
##$ASSFACX= 0
##$ASSWID= 0
##$AUNMP= <proc_1d>
##$AZFE= 0.1
##$AZFW= 0.1
##$BCFW= 0
##$BC_mod= 2
##$BYTORDP= 0
##$COROFFS= 0
##$CY= -3
##$DATMOD= 1
##$DC= 0
##$DFILT= <>
##$DTYPP= 0
##$F1P= 0
##$F2P= 0
##$FCOR= 1
##$FTSIZE= 16384
##$FT_mod= 6
##$GAMMA= 0
##$GB= 0
##$INTBC= 1
##$INTSCL= 3.70164e-10
##$ISEN= 128
##$LB= 0.24
##$LEV0= 0
##$LPBIN= 0
##$MAXI= 10000
##$MC2= 0
##$MEAN= 0
##$ME_mod= 0
##$MI= 1.114404
##$NCOEF= 0
##$NC_proc= -7
##$NLEV= 6
##$NOISF1= 3.799351
##$NOISF2= 2.8
##$NSP= 0
##$NTH_PI= 0
##$NZP= 0
##$OFFSET= 15.94962
##$PC= 1
##$PHC0= -19991.88
##$PHC1= 13.60081
##$PH_mod= 1
##$PKNL= yes
##$PPARMOD= 0
##$PSCAL= 0
##$PSIGN= 0
##$REVERSE= no
##$SF= 200.129964361638
##$SI= 16384
##$SIGF1= 3
##$SIGF2= 2
##$SINO= 5.538805
##$SIOLD= 16384
##$SREGLST= <1H.CDCl3>
##$SSB= 0
##$STSI= 16384
##$STSR= 0
##$SW_p= 3612.71676300578
##$SYMM= 0
##$S_DEV= 0
##$TDeff= 16384
##$TDoff= 0
##$TI= <>
##$TILT= no
##$TM1= 0
##$TM2= 0
##$TOPLEV= 0
##$USERP1= <user>
##$USERP2= <user>
##$USERP3= <user>
##$USERP4= <user>
##$USERP5= <user>
##$WDW= 1
##$XDIM= 16384
##$YMAX_p= 482658919
##$YMIN_p= -535435
$$ End of Bruker specific parameters
$$ ---------------------------------
##NTUPLES= NMR SPECTRUM
##VAR_NAME=  FREQUENCY,     SPECTRUM/REAL,   SPECTRUM/IMAG
##SYMBOL=    X,             R,               I
##VAR_TYPE=  INDEPENDENT,   DEPENDENT,       DEPENDENT
##VAR_FORM=  AFFN,          ASDF,            ASDF
##VAR_DIM=   16384,         16384,           16384
##UNITS=     HZ,            ARBITRARY UNITS, ARBITRARY UNITS
##FACTOR=    0.220516191357247, 1,           1
##FIRST=     3191.9969315912, 0,             0
##LAST=      -420.719831414583, 0,           0
##MIN=       -420.719831414583, -535435,     0
##MAX=       3191.9969315912, 482658919,     0
$$ Real data points
##PAGE= N=1
##DATA TABLE= (X++(R..R)), XYDATA
$$ [...]
6176F82056J2445m1854r7432O8390N6834m090n1511j6607K2646L9555j1980M543
$$ 682056 694501 652647 555215 623605 680439 676349 624838 608231 630877 670432 658452 662995
6164F62995N5200p529Q7M8805j3878q1812J9722k13J0396j7776P5647q069p581
$$ 662995 718195 710666 710753 759558 745680 663868 683590 683377 693773 675997 751644 743575 735994
6151G35994Q3153m4657n606K0242J8254M2992p5257M6934Q2816k3724R965L9061
$$ 735994 819147 774490 768884 789126 807380 850372 775115 822049 904865 881141 891106 930167
6139I30167l0445J8056J6828j3012J1282n0801J29113N4046k9145j936N5950O1028
$$ 930167 899722 917778 934606 921594 932876 882075 1011188 1065234 1036089 1034153 1090103 1151131
6127A151131j5744j9231J4995J7173l8806J5552K7842m3328J277R733Q1958P1293
$$ 1151131 1135387 1116156 1131151 1148324 1109518 1125070 1152912 1109584 1110861 1120594 1202552 1273845
6115A273845k6827M7680M5293N5489J40896O1457O2342j554J6758J47264M3835
$$ 1273845 1247018 1294698 1339991 1395480 1536376 1597833 1660175 1658621 1675379 1822643 1866478
6104A866478L1215K3524Q0437J07130J6084P2931J46286R0603P7541J34139J94155
$$ 1866478 1897693 1921217 2001654 2108784 2124868 2197799 2344085 2434688 2512229 2646368 2840523
6093B840523J22520J25595J89190J14669L9106J04274J35108J13546J59878K12517
$$ 2840523 2963043 3088638 3277828 3392497 3431603 3535877 3670985 3784531 3944409 4156926
6083D156926K57272K95155L14966M28383M83344N51884Q52376R26062Q50605Q90061
$$ 4156926 4414198 4709353 5024319 5452702 5936046 6487930 7340306 8266368 9116973 10007034
6073A0007034Q81259Q81912R07016J096338J295032R59261n9582j256888j756086
$$ 10007034 10888293 11770205 12677221 13773559 15068591 16027852 15968270 14711382 12955296
6064A2955296j889437j685348j454238j224311r74466p51049n90156l18005m01985
$$ 12955296 11065859 9380511 7926273 6701962 5727496 4976447 4386291 4068286 3666301
6055C666301l03476k78457k32360j49699j88743j50090k35575j10453p7195o5489
$$ 3666301 3362825 3084368 2852008 2702309 2513566 2363476 2127901 2017448 1940253 1874764
6045A874764o1868n0333j01196p2972l7338p5990r5918K749p6866J7329j73119
$$ 1874764 1812896 1762563 1661367 1588395 1551057 1475067 1379149 1381898 1305032 1322361 1149242
6034A149242q2154P1521k1317M8443p1130p4795p5R045o3828j2675O8329L4605
$$ 1149242 1067088 1138609 1117292 1165735 1094605 1019810 1019735 1028780 964952 952277 1020606 1055211
6022A055211M0226k6490J24o741m7584p9953j14263l168j3739k8757r9992L4524
$$ 1055211 1095437 1068947 1069071 1062330 1014746 934793 820530 817362 803623 774866 674874 709398
6010G09398N9295j2100k7871n3014P1826P8950k0410L399M6066k9681m4477m1734
$$ 709398 768693 756593 728722 675708 747534 826484 806074 809473 855539 825858 781381 739647
5998G39647Q882O2420N2700n6230l0030q5930l9174K7395k3824K6175P84J8612
$$ 739647 748529 810949 863649 807419 777389 691459 652285 679680 655856 682031 682815 701427
5986G01427J3955n3424J473Q546m5369j5114m6541O0721N3959k1320Q1516N9301
$$ 701427 715382 661958 663431 671977 626608 611494 564953 625674 679633 658313 739829 799130
5974G99130l506m0758O5371j10l9263j10275J3600O4420L591J8642j1346l8304
$$ 799130 795624 754866 820237 820127 780864 670589 684189 748609 752200 770842 759496 721192
5962G21192j16225j6594O1340n4849l1510O4584J9072o9170m4970N999M2271N5741
$$ 721192 604967 588373 649713 594864 563354 627938 647010 577840 532870 538869 581140 636881
5950F36881k8025p270K2445K9165N797k6330j4831K0516K8547m8757L0544l5925
$$ 636881 608856 601586 624031 653196 658993 632663 617832 638348 666895 618138 648682 612757
5938F12757P576L6076m0099J9816J042p1552M445O3250K9831L458K3567N785n1033
$$ 612757 620333 656409 616310 636126 637168 565616 570061 633311 663142 666600 690167 695952 644919
5925F44919J1225m1037M7701P8997M7811k368p0415Q198R5470k585p912m4199
$$ 644919 656144 615107 662808 741805 789616 787248 716833 725031 820501 817916 810004 765805
5913G65805Q5221K1026N8722K7245N3177J55218N6481p079q1565q7902K9349n8389
$$ 765805 851026 872052 930774 958019 1011196 1166414 1222895 1215816 1134251 1046349 1075698 1017309
5901A017309O6692M9176K0341k2505M7246M417p6095r131K2871M3295l2675N6301
$$ 1017309 1084001 1133177 1153518 1131013 1178259 1182676 1106581 1097450 1120321 1163616 1130941 1187242
5889A187242K6619M6304L259p8958j18248m6304J5049l1752L294O5224J6406J4866
$$ 1187242 1213861 1260165 1263424 1184466 1066218 1019914 1034963 1003211 1006505 1071729 1088135 1103001
5877A103001p7350J7460L6026j6353J1916P223J4551M0395o732M1134n249j39031
$$ 1103001 1025651 1043111 1079137 1062784 1074700 1081923 1096474 1136869 1130137 1171271 1166022 1026991
5865A026991o5343k7113q4180r0332m5514m2498O1596k4292K0856r521p8931m1633
$$ 1026991 961648 934535 850355 760023 714509 672011 733607 709315 730171 720650 641719 600086
5853F00086n2439J7045M899Q081o6877N9657O5959l0944n0642J9535K6693l8686
$$ 600086 547647 564692 569591 577672 510795 570452 636411 605467 554825 574360 601053 562367
5841E62367L8392q360n8323M7373p791L1499k7540K7305k186q335J2095J7570
$$ 562367 600759 592399 534076 581449 573658 605157 577617 604922 602736 594401 606496 624066
5829F24066n219J6454r4967K9451L7018l118j5969m3997M1733m0866O3605p7j8698
$$ 624066 618847 635301 540334 569785 606803 603685 587716 543719 585452 544586 608191 608114 589416
5816E89416K8319j5150K2021j5950l8193Q2036K2968o5547Q5352K5701P0693k1658
$$ 589416 617735 602585 624606 608656 570463 652499 675467 609920 695272 720973 791666 770008
5804G70008k1184k7116J0867K5450R8638k1496l4502O1104p6205K3909n3652M4647
$$ 770008 748824 721708 732575 758025 856663 835167 800665 861769 785564 809473 755821 800468
5792H00468j9283J6690n6250J799k3970l6803N9811J4294l3519R1525j630J5601
$$ 800468 781185 797875 741625 743424 719454 682651 742462 756756 723237 814762 813132 828733
5780H28733l9953j2003K4225m45l4117j3184J6509M9179k7386k2280M365M5248
$$ 828733 788780 776777 801002 800557 766440 753256 769765 818944 791558 769278 773643 818891
5768H18891O3472Q250j4419P0017r562O379R1921O740k1427l986J0842k2682K1220
$$ 818891 882363 890613 876194 946211 936649 943028 1034949 1041689 1020262 1016276 1027118 1004436 1025656
5755A025656r1227K4688J5628o978Q946l159k6188n2110K6076O9892l9085K9944
$$ 1025656 934429 959117 974745 967767 976713 973554 947366 895256 921332 991224 952139 982083
5743I82083L0008k7722o4449k9907J3391l1957m4672O670N2625m4689K6015K6932
$$ 982083 1012091 984369 919920 890013 903404 871447 826775 833445 886070 841381 867396 894328
5731H94328j18506L2210k4919l7972N0300L8679N478n4108K2736L7274J0880K659
$$ 894328 775822 808032 783113 745141 795441 834120 839598 785490 808226 845500 856380 859039
5719H59039O080k6968o4233K6752K7218j2752P5761q8838K4332J9230P509L3824
$$ 859039 865119 838151 773918 800670 827888 815136 890897 802059 826391 845621 853130 886954
5707H86954o2720j8076q891L6690P46M860k4645m807L6009J8197p735k6170J6120
$$ 886954 824234 806158 797267 833957 834703 839563 814918 810111 846120 864317 856582 830412 846532
5694H46532L6448q8941q522m8711n557P5134J0595K8672j7592J1881o995L8923
$$ 846532 882980 794039 785517 736806 731249 806383 816978 845650 828058 839939 832944 871867
5682H71867J91k1342O13l8268Q768J7474K5598k4942J0083J0848N0336l9932j4149
$$ 871867 872058 850716 851329 813061 821829 839303 864901 839959 850042 860890 911226 871294 857145
5669H57145R3018q6636j495N6834K2015J7558J7438m196p076j0081K1774K3888
$$ 857145 950163 863527 862032 918866 940881 958439 975877 971681 964605 954524 976298 1000186
5657A000186P2224q075j5478Q34N8749J7401j5523R6668q034o8813o0636K0432
$$ 1000186 1072410 1064335 1048857 1049691 1108440 1125841 1110318 1206986 1198952 1130139 1069503 1089935
5645A089935P4848P497j22038N9977L5228N0558K6649R682l5179O7231N01k1268
$$ 1089935 1164783 1172280 1050242 1110219 1145447 1196005 1222654 1232336 1197157 1264388 1264889 1243621
5633A243621J4379m1166O0317O9973j2502L0360N3005l6919K8813K8494L440M3932
$$ 1243621 1258000 1216834 1277151 1347124 1334622 1364982 1417987 1381068 1409881 1438375 1441815 1485747
5621A485747N3913p1850K1836k2610R488O8211M123K6548N3494M5378j7543M8882
$$ 1485747 1539660 1467810 1489646 1467036 1476524 1544735 1548858 1575406 1628900 1674278 1656735 1705617
5609A705617L8287N9250k5083N9744J21846N1206R1274j4618O7930N4799O8831
$$ 1705617 1743904 1803154 1778071 1837815 1959661 2010867 2102141 2087523 2155453 2210252 2279083
5598B279083L2195N419L3542N5514O6656K1763l963N1631R6184M9099m073p161
$$ 2279083 2311278 2316697 2350239 2405753 2472409 2494172 2490209 2541840 2638024 2687123 2683050 2675889
5586B675889O226M2535L485L7026M0136m6645M3036O9510P8478J1543K90K4398
$$ 2675889 2682115 2724650 2728135 2765161 2805297 2758652 2801688 2871198 2949676 2961219 2961509 2985907
5574B985907K8000M7894P4813L8799J0727P6434L482j4066R2461M0871M8117j6518
$$ 2985907 3013907 3061801 3136614 3175413 3186140 3262574 3266056 3251990 3344451 3385322 3433439 3416921
5562C416921n8957P9400N9137M1861M4889L7122l2716K2206K3669j1161L8099
$$ 3416921 3357964 3437364 3496501 3538362 3583251 3620373 3587657 3609863 3633532 3622371 3660470
5551C660470Q209J7074q3383o3662M0182L4583Q5654J1474l005l5185L4462N0914
$$ 3660470 3668679 3685753 3602370 3538708 3578890 3613473 3699127 3710601 3707596 3672411 3706873 3757787
5539C757787r890N8841R0091O6565J38093J06849L5324L2478p54N9880J08252
$$ 3757787 3747897 3806738 3896829 3963394 4101487 4208336 4243660 4276138 4275384 4335264 4443516
5528D443516M6481Q7196J17468O3999N3172R4304Q2156N5346J12836Q2038Q0396
$$ 4443516 4489997 4577193 4694661 4758660 4811832 4906136 4988292 5043638 5156474 5238512 5318908
5517E318908N2251R8812J39390J49256J24612J37442J16839J44534J64084J26572
$$ 5318908 5371159 5469971 5609361 5758617 5883229 6020671 6137510 6282044 6446128 6572700
5507F572700J94299J78394J92746K06087K58646K29547K73291L07365K72078L26268
$$ 6572700 6766999 6945393 7138139 7344226 7602872 7832419 8105710 8413075 8685153 9011421
5497I011421M18952L42050L46811M08094N60755O05372N51351O12790O91447O99541
$$ 9011421 9430373 9772423 10119234 10527328 11088083 11693455 12244806 12857596 13549043 14248584
5487A4248584O81026P59986Q46066P66099O50268P04565O32016M91870M18989
$$ 14248584 14929610 15689596 16535662 17301761 17952029 18656594 19288610 19780480 20199469
5478B0199469K47137J48160R2871k7775m9895L5005P6514Q6803R3450J31439L25064
$$ 20199469 20446606 20594766 20687637 20659862 20609967 20644972 20721486 20808289 20901739 21033178 21358242
5467B1358242L99863M04098M24049M36271M46469L57866K43780J46948Q6272N6882
$$ 21358242 21758105 22162203 22586252 23022523 23468992 23826858 24070638 24217586 24303858 24360740
5457B4360740r3729k22152l39219m74567n21521m43605n63112o26235n73175n27438
$$ 24360740 24267011 24044859 23705640 23231073 22709552 22265947 21702835 21076600 20503425 19975987
5447A9975987m65104k98762l13905k34738j90671r6047j42915j61484j68673j92557
$$ 19975987 19510883 19212121 18898216 18663478 18472807 18376760 18233845 18072361 17903688 17711131
5437A7711131k22121l86549m77275n16815n75598o63937p33983p64724q10968
$$ 17711131 17489010 17102461 16625186 16108371 15532773 14868836 14134853 13370129 12559161
5428A2559161o75462o40385n98636n58314n08231l90102l64995l60383l19971
$$ 12559161 11883699 11243314 10644678 10086364 9578133 9188031 8823036 8462653 8142682
5419H142682k06907j78994k14023k00510k03349p8030m1950q7958j67516j44287
$$ 8142682 7935775 7756781 7542758 7342248 7138899 7060869 7018919 6930961 6763445 6619158
5409F619158j14492p8739n6097l9585p0757o0388r5907r2869L6748n0673n6307
$$ 6619158 6504666 6425927 6369830 6330245 6259488 6199100 6103193 6010324 6047072 5996399 5940092
5398E940092J6282O8259m6770N9037k9296M6838M6053J34473J22969Q8180K1285
$$ 5940092 5956374 6024633 5977863 6036900 6007604 6054442 6100495 6234968 6357937 6446117 6467402
5387F467402J21161J23083O7729R3032O6760L1028o792L1302R4283O3689K1234
$$ 6467402 6588563 6711646 6779375 6872407 6939167 6970195 6963403 6994705 7088988 7152677 7173911
5376G173911o3820l6772J996r935j3826K0940J0534k3945K4359Q2972R9790j4466
$$ 7173911 7110091 7073319 7075315 7065380 7051554 7072494 7083028 7059083 7083442 7166414 7266204 7251738
5364G251738J1607L0030L8813j640K1318N9426J7154J35291O1157L4999O8112
$$ 7251738 7263345 7293375 7332188 7330548 7351866 7411292 7428446 7563737 7624894 7659893 7728005
5353G728005l3896K1083j00584j7596j2214k0615k6133j6829p0711m6890n0408
$$ 7728005 7694109 7715192 7614608 7597012 7584798 7564183 7538050 7521221 7450510 7403620 7353212
5342G353212N3402P294m954m3360N980K5614J9187P6753O635L9151l1042O8376
$$ 7353212 7406614 7413908 7408954 7365594 7371574 7397188 7416375 7493128 7499763 7538914 7507872 7576248
5330G576248n2351o0209m9714l7273j7866J2659l2741j2704L3776K4553L7190
$$ 7576248 7523897 7463688 7413974 7376701 7358835 7371494 7338753 7326049 7359825 7384378 7421568
5319G421568N0266k6380j0620M7395K7591Q8915J06443R4328P3409M0162J02517
$$ 7421568 7471834 7445454 7434834 7482229 7509820 7598735 7705178 7799506 7872915 7913077 8015594
5308H015594J10080P0740J03569J35387R9074J01867J23385J78974Q2074Q7665
$$ 8015594 8125674 8196414 8299983 8435370 8534444 8636311 8759696 8938670 9020744 9108409
5298I108409J01629K00736J72323M9663J52620J66475J49736J88292J75969J97606
$$ 9108409 9210038 9410774 9583097 9632760 9785380 9951855 10101591 10289883 10465852 10663458
5288A0663458J52139J64018K23479J44394J99912K85714L19384K66545K96923
$$ 10663458 10815597 10979615 11203094 11347488 11547400 11833114 12152498 12419043 12715966
5279A2715966M18598N36131M38625N88129N72684N51631O65831P97575R05168
$$ 12715966 13134564 13670695 14109320 14697449 15270133 15821764 16487595 17285170 18190338
5270A8190338Q32180P03769N63099N17787N22120N07096M14166L83077K13316
$$ 18190338 19022518 19726287 20289386 20807173 21329293 21836389 22250555 22633632 22846948
5261B2846948N4513j13316j89132k77097k70857j70124j05120O7738Q2490J84785
$$ 22846948 22901461 22788145 22599013 22321916 22051059 21880935 21775815 21843553 21926043 22110828
5251B2110828L82742L99209M96727O59744Q25808R33014J064163J238345J117543
$$ 22110828 22493570 22892779 23389506 24049250 24875058 25808072 26872235 28110580 29228123
5242B9228123J301207J473074J699022J949621K047159J641589J047297R10945
$$ 29228123 30529330 32002404 33701426 35651047 37698206 39339795 40387092 41298037
5234D1298037Q72624R78352J071955J048128Q71395K44543o22093j367092j809384
$$ 41298037 42170661 43149013 44220968 45269096 46140491 46385034 45762941 44395849 42586465
5225D2586465k057927j927748j682744j340510j078344q08779n25934k57350n5397
$$ 42586465 40528538 38600790 36918046 35577536 34499192 33690413 33164479 32907129 32851732
5216C2851732K68388M65438N94322O69144P85583R76126R80505J241457J547775
$$ 32851732 33120120 33585558 34179880 34849024 35634607 36610733 37591238 38832695 40380470
5207D0380470J651998J712039J331134Q30762P97592R24579J033182J163542J290963
$$ 40380470 42032468 43744507 45075641 45906403 46703995 47628574 48661756 49825298 51116261
5198E1116261J302472R49495K35931o74906j440917j907713k047424j809729j614707
$$ 51116261 52418733 53368228 53604159 52929253 51488336 49580623 47533199 45723470 44108763
5189D4108763j155445q13634m57308j93960J80700M07397N76600P40096Q91447
$$ 44108763 42953318 42139684 41682376 41488416 41669116 42076513 42653113 43393209 44284656
5180D4284656J015046R99282J106160J237804J273951J323906J073073P34471
$$ 44284656 45299702 46298984 47405144 48642948 49916899 51240805 52313878 53048349
5172E3048349N72662M10773L27967K84670L37852M19536M29488M43403L99632
$$ 53048349 53621011 54031784 54359751 54644421 54982273 55401809 55831297 56274700 56674332
5163E6674332K46372J69767J76513Q5596K33081N01722P20346Q56625J139403
$$ 56674332 56920704 57090471 57266984 57352580 57585661 58087383 58807729 59664354 60803757
5154F0803757J452383J708008J990984K196532K565922K738766K800319L000531
$$ 60803757 62256140 63964148 65955132 68151664 70717586 73456352 76256671 79257202
5146G9257202K965636K967230K909508K773522K512231J929028J328739O25067
$$ 79257202 82222838 85190068 88099576 90873098 93385329 95314357 96643096 97268163
5138I7268163J4789m46224p39031o89927m47298j11259L76256Q09139J222285
$$ 97268163 97282952 96836728 96097697 95407770 94960472 94849213 95225469 96034608 97256893
5129I7256893J635672J852505K072796K329374K307961K351705K261016K001878
$$ 97256893 98892565 100745070 102817866 105147240 107455201 109806906 112067922 114069800
5121A14069800J849499J605386J377655J418824J512652J596439J705721J729866
$$ 114069800 115919299 117524685 118902340 120321164 121833816 123430255 125135976 126865842
5113A26865842J864327J997785K117625K135610K016111J808559J361792Q99537
$$ 126865842 128730169 130727954 132845579 134981189 136997300 138805859 140167651 141067188
5105A41067188N12172L37200M04214Q32788J414508K146527K991704L711910M278274
$$ 141067188 141579360 141916560 142320774 143153562 144568070 146714597 149706301 153418211 157696485
5096A57696485M835471N188285N236757N117975M615282L876986K765233J004309
$$ 157696485 162531956 167720241 172956998 178074973 182690255 186567241 189332474 190336783
5088A90336783j130284l199827m891039o008686o464189o175721n907621n370736
$$ 190336783 189206499 186006672 181115633 175106947 168642758 162467037 156559416 151188680
5080A51188680m666863m006271l273726k625339j983195j485667j084737o33895
$$ 151188680 146521817 142515546 139241820 136616481 134633286 133147619 132062882 131428987
5072A31428987j81612K91807Q70624J535778K113953K695814L279382L663466
$$ 131428987 131247375 131539182 132409806 133945584 136059537 138755351 142034733 145698199
5064A45698199M057125M411254M608535M567428M348645L900735L246842K012433
$$ 145698199 149755324 154166578 158775113 163342541 167691186 171591921 174838763 176851196
5056A76851196K05769j969112m171877n941455p160573p725524p657650p190981
$$ 176851196 177056965 175087853 170915976 164974521 157813948 150088424 142430774 135239793
5048A35239793o687814o006408n314809m531498l746577k895491k282647j701630
$$ 135239793 128551979 122545571 117230762 112699264 108952687 106057196 103774549 102072919
5040A02072919j191784o49226j74453J88239M76559P06189Q83153Q69544Q56775
$$ 102072919 100881135 100231909 100057456 100245695 100722254 101428443 102311596 103181140 104037915
5031A04037915O33808M57888K80351J26683k9632j91058n63273p85193j215184
$$ 104037915 104671723 105129611 105409962 105536645 105507013 105315955 104752682 103967489 102752305
5022A02752305j540318j863224k069206k157580k104226j835355j500301j156331
$$ 102752305 101211987 99348763 97279557 95121977 93017751 91182396 89682095 88525764
5014H8525764p45374l50879k8071K52966O57812P46863Q72007R77665Q62970O30599
$$ 88525764 87780390 87429511 87401440 87654406 88312218 89059081 89931088 90908753 91771723 92402322
5004I2402322K62547k40384q53190j556630k516968l304578l740216l784156l565132
$$ 92402322 92664869 92424485 91571295 90014665 87497697 84193119 80452903 76668747 73103615
4995G3103615l248413k823878k327802j818124j413404j068137o71441m21162
$$ 73103615 69855202 67031324 64703522 62885398 61471994 60403857 59732416 59311254
4987E9311254j75722J70008N48295Q97807R70653O34473L58444L95674N19598
$$ 59311254 59135532 59305540 59853835 60751642 61722295 62356768 62715212 63110886 63630484
4978F3630484N19589M06029J33159j48060k27319k56907m24262j211831k556563
$$ 63630484 64150073 64556102 64689261 64541201 64313882 64056975 63632713 62420882 59864319
4969E9864319l440983l679169l406859l071261k652765k241728j687581j349166
$$ 59864319 56423336 52744167 49337308 46266047 43613282 41371554 39683973 38334807
4961C8334807r74085o77984m66496k24093j28526n8784m1020K6246M51087R15475
$$ 38334807 37360722 36682738 36216242 35992149 35863623 35804839 35763819 35790065 36241152 37156627
4951C7156627N86962q16421j928834k207318k010920j764668j569071j180281
$$ 37156627 37743589 36927168 34998334 32791016 30780096 29015428 27446357 26266076
4943B6266076r23657q19400o59620n51784m27664l21244l37285k18096k98712
$$ 26266076 25342419 24523019 23863399 23311615 22883951 22562707 22225422 22007326 21708614
4934B1708614j97594j38964p3938k9735N698Q5370J5254k0848l1145P11m7584
$$ 21708614 21511020 21372056 21298118 21268383 21274081 21359451 21374705 21353857 21322712 21323423 21275839
4923B1275839m150k6399m2181R6120Q3126J50945J83087J59875K65501K22106
$$ 21275839 21271689 21245290 21203109 21299229 21382355 21533300 21716387 21876262 22141763 22363869
4913B2363869K34235L14129M02627M50357M42140M32554N85934O74916O07382
$$ 22363869 22598104 22912233 23314860 23765217 24207357 24639911 25225845 25900761 26508143
4904B6508143P32334P94374Q77058R56001J185653J243873J433832J672728J938833
$$ 26508143 27240477 28034851 28911909 29867910 31053563 32297436 33731268 35403996 37342829
4895C7342829K400196K825495L474703M001116M501890M898991N170822N166297
$$ 37342829 39743025 42568520 46043223 50044339 54546229 59445220 64616042 69782339
4887F9782339N024381N157126N747797O233838N364517J287456m584602q491695
$$ 69782339 74806720 79963846 85711643 91945481 97309998 98597454 94012852 85521157
4879H5521157r801047r500018q660478p471154o038924m761695l681535k916327
$$ 85521157 75720110 66220092 57559614 50088460 44049536 39287841 35606306 32689979
4871C2689979k358790j959412j619594j548545j304847j199458j015989q52724
$$ 32689979 30331189 28371777 26752183 25203638 23898791 22699333 21683344 20830620
4863B0830620p62868o49326n77886n31558m95833m35244l44034l36746l34392
$$ 20830620 20067752 19418426 18840540 18308982 17813149 17377905 17033871 16697125 16362733
4854A6362733l07553l07406j86301k83165j62974k01880j37145q1882p6075j55497
$$ 16362733 16055180 15747774 15561473 15278308 15115334 14913454 14776309 14694427 14618352 14462855
4844A4462855o1264p1831n0811k2550L4151n640l929m6189m4709p8729o9130n4278
$$ 14462855 14401591 14329760 14278949 14256399 14290550 14284910 14280981 14234792 14190083 14111354 14042224 13987946
4832A3987946j8396o5460j16969k6116p3418m3221N0279m3377K2573l165j6335
$$ 13987946 13969550 13904090 13787121 13761005 13687587 13644366 13694645 13651268 13673841 13670676 13654341
4821A3654341J00848J26582O6973J20054J42105R6509Q8008Q9845J31537Q0547
$$ 13654341 13755189 13881771 13948744 14068798 14210903 14307412 14395420 14485265 14616802 14697349
4811A4697349J77406J32804J60140J59731J89393J35842J67844J11477K11172
$$ 14697349 14874755 15007559 15167699 15327430 15516823 15652665 15820509 15931986 16143158
4802A6143158J59698K07190L07528J70791J82164L02956K85672L33730L17630
$$ 16143158 16302856 16510046 16817574 16988365 17170529 17473485 17759157 18092887 18410517
4793A8410517L44957M23980M69426O29108P11093Q21573Q95582J068556J378194
$$ 18410517 18755474 19179454 19648880 20277988 20989081 21810654 22706236 23774792 25152986
4784B5152986J518694J680832J594985J468914J422122J735745K184883K489054
$$ 25152986 26671680 28352512 29947497 31416411 32838533 34574278 36759161 39248215
4776C9248215J737090o97260k581546k971683k844307k420515j960096j559969
$$ 39248215 40985305 40288045 37706499 34734816 31890509 29469994 27509898 25949929
4768B5949929j063393o36484l47128j58539q2793q5656j22008r0744O7706Q8042
$$ 25949929 24886536 24250052 23902924 23744385 23661592 23575936 23453928 23363184 23430890 23518932
4758B3518932k09987m60360m34705l97773l25490l07773j89125j19185k9197J45366
$$ 23518932 23308945 22848585 22413880 22016107 21690617 21382844 21193719 21074534 21045337 21190703
4748B1190703O1087M3406J48890J32199J18470J91978L55373K71845J23154J14405
$$ 21190703 21251790 21295196 21444086 21576285 21694755 21886733 22242106 22513951 22637105 22751510
4738B2751510J63662J28535J12857O2257R8161J72230J50913J67499J62774K92909
$$ 22751510 22915172 23043707 23156564 23218821 23316982 23489212 23640125 23807624 23970398 24263307
4728B4263307L07382K22241K66120K47556L09504M83978M19894L88641J8399k50225
$$ 24263307 24570689 24792930 25059050 25306606 25616110 26100088 26519982 26908623 26927022 26676797
4718B6676797l17069k49552k20876j20279N6335L9440J32447J24859Q7451J20597
$$ 26676797 26359728 26110176 25889300 25769021 25825356 25864796 25997243 26122102 26209553 26330150
4708B6330150K80390J86025J91888K42264K35828K47204K98566K37102K98597
$$ 26330150 26610540 26796565 26988453 27230717 27466545 27713749 28012315 28249417 28548014
4699B8548014L81322L61816L07592L37185L63990L56580L85933L87416M07185
$$ 28548014 28929336 29291152 29598744 29935929 30299919 30656499 31042432 31429848 31837033
4690C1837033L84304M30706M83132L96761M56757N16942M37740N37048N72534
$$ 31837033 32221337 32652043 33135175 33531936 33988693 34505635 34943375 35480423 36052957
4681C6052957N75884O06021N84044O70834O73096P50025O75656Q38247Q70483
$$ 36052957 36628841 37234862 37818906 38489740 39162836 39912861 40588517 41426764 42297247
4672D2297247Q99030J023604R59785J069469J226594J280623J317705J389897
$$ 42297247 43196277 44219881 45179666 46249135 47475729 48756352 50074057 51463954
4664E1463954J575871J557960J592771J713551J690829J546124J339062J141527
$$ 51463954 53039825 54597785 56190556 57904107 59594936 61141060 62480122 63621649
4656F3621649J025333R25494P47113N28344L87442J61830j30935k04727k75289
$$ 63621649 64646982 65572476 66319589 66847933 67235375 67397205 67266270 67061543 66786254
4647F6786254l73102l94350l57970l32637j55977j7074J37785L01911M63924P05433
$$ 66786254 66413152 66018802 65660832 65328195 65172218 65155144 65292929 65594840 66058764 66764197
4637F6764197R00111J081795J249679J321896J505556J602660J616848J524449
$$ 66764197 67664308 68746103 69995782 71317678 72823234 74425894 76042742 77567191
4629G7567191J474534J275772J061030O79600K16637l48898p19395j255363j690224
$$ 77567191 79041725 80317497 81378527 82058127 82274764 81925866 81206471 79951108 78260884
4620G8260884j957064k221430k249947k271626k213691k061569j893637j730627
$$ 78260884 76303820 74082390 71832443 69560817 67347126 65285557 63391920 61661293
4612F1661293j563166j276119j142580r77953q60370p19994o22065m19127l67797
$$ 61661293 60098127 58822008 57679428 56701475 55841105 55121111 54499046 54079919 53712122
4603E3712122l71908k47076k66318k46543l03040l73539m17776o69504q30055
$$ 53712122 53340214 53093138 52826820 52580277 52277237 51903698 51485922 50816418 49986363
4594D9986363r40898j067000j232832j376722j391268j446320j440637j424740
$$ 49986363 49045465 47978465 46745633 45368911 43977643 42531323 41090686 39665946
4586C9665946j390299j244391j175450j087723j053436r26186r53574p87478p01794
$$ 39665946 38275647 37031256 35855806 34768083 33714647 32788461 31834887 31047409 30345615
4577C0345615o31939n43635n48908m87637m30471m01589l82437l77135l72903
$$ 30345615 29713676 29170041 28621133 28133496 27703025 27301436 26918999 26541864 26168961
4568B6168961k77017k88120l02688k46638k66749m08629k46043k79086l86706
$$ 26168961 25891944 25603824 25301136 25054498 24787749 24379120 24133077 23853991 23467285
4559B3467285l43557k56351l27215l57722l02113k10648k12326j47464k01478
$$ 23467285 23123728 22867377 22540162 22182440 21880327 21669679 21457353 21309889 21108411
4550B1108411k22217j70522o2952p2271j28911k19534o3247j11657j79024j63193
$$ 21108411 20886194 20715672 20652720 20580449 20451538 20232004 20168757 20057100 19878076 19714883
4540A9714883j20962j83650m7437j63496j36597p5223l9975j29144j15351j19556
$$ 19714883 19593921 19410271 19362834 19199338 19062741 18987518 18947543 18818399 18703048 18583492
4530A8583492j53857r9707j29513o7230m5801P0073o7338j21480m8599J6404J22875
$$ 18583492 18429635 18329928 18200415 18133185 18087384 18157457 18090119 17968639 17920040 17936444 18059319
4519A8059319L7622O9187K2487O6469r44M5643J12362O3781J06400O3937l739
$$ 18059319 18096941 18166128 18188615 18255084 18254140 18299783 18412145 18475926 18582326 18646263 18642524
4508A8642524j02117l5908o3641r8496o9958K659q546J52116Q2104R3915J30065
$$ 18642524 18540407 18504499 18440858 18342362 18272404 18275063 18266517 18418633 18500737 18594652 18724717
4497A8724717J39445J29470P8085J29741J17410J48783K18028K23648J04753J11701
$$ 18724717 18864162 18993632 19071717 19201458 19318868 19467651 19685679 19909327 20014080 20125781
4487B0125781J12917J54971J31535R8482K78765L15230L24957L33293L74821M49073
$$ 20125781 20238698 20393669 20525204 20623686 20902451 21217681 21542638 21875931 22250752 22699825
4477B2699825M59031M92854N00139M78559M79822M37942M40599M10295N15575
$$ 22699825 23158856 23651710 24151849 24630408 25110230 25548172 25988771 26399066 26914641
4468B6914641M81088N05500M90974N03616O16772P29438Q35764Q78659J088873
$$ 26914641 27395729 27901229 28392203 28895819 29512591 30242029 31077793 31956452 33045325
4459C3045325J098338J149761J154365J278683J459552J503407J558637J599068
$$ 33045325 34143663 35293424 36447789 37726472 39186024 40689431 42248068 43847136
4451D3847136J767052J900105K021281K327141K756776L035522L479765L960263
$$ 43847136 45614188 47514293 49535574 51862715 54619491 57655013 61134778 65095041
4443F5095041M449158M765811N012671N094977N139051N130164N146415M752662
$$ 65095041 69544199 74310010 79322681 84417658 89556709 94686873 99833288 104585950
4435A04585950L594989J369130j555974m272887o043558o702687o702625o216376
$$ 104585950 108180939 109550069 107994095 103721208 97677650 90974963 84272338 78055962
4427G8055962n532483m824923m080764l419584k860621k390149j838581j594542
$$ 78055962 72523479 67698556 63617792 60198208 57337587 54947438 53108857 51514315
4419E1514315j400073j197352q51408p19217n11669k92188k19553j91120m9292
$$ 51514315 50114242 48916890 48065482 47346265 46834596 46542408 46322855 46131735 46082443
4410D6082443Q6855J98406L59883N03013O63446O92024R71024R91158J009895
$$ 46082443 46169298 46367704 46727587 47230600 47894046 48586070 49557094 50548252 51558147
4401E1558147J092728R90479R76744J036746J077203J135680J164667J222870
$$ 51558147 52650875 53641354 54618098 55654844 56732047 57867727 59032394 60255264
4393F0255264J264807J309121J511781J610740J771028K015811K233446K274292
$$ 60255264 61520071 62829192 64340973 65951713 67722741 69738552 71971998 74246290
4385G4246290K456777K550299K782053L126415L362538L629869L978441M268045
$$ 74246290 76703067 79253366 82035419 85161834 88524372 92154241 96132682 100400727
4377A00400727M680577N151746N749418O678283P814044R372206J0952901J3162009
$$ 100400727 105081304 110233050 115982468 122660751 130474795 139847001 150799902 163961911
4369A63961911J6184918J9266833K2643454K5381082K7159324K7923709K6314735
$$ 163961911 180146829 199413662 222057116 247438198 274597522 302521231 328835966
4362C28835966K5089176K8213798L4478103L7946734K6019887q686313m0665470
$$ 328835966 353925142 382138940 416617043 454563777 480583664 471897351 431231881
4355D31231881n3307434n3916725m9504626m3031468l5498607k8059101k1451560
$$ 431231881 377924447 324007722 274503096 231471628 195973021 167913920 146462360
4348A46462360j6363012j2729903j0476136r057685q075497p155254o344267n684644
$$ 146462360 130099348 117369445 106893309 97835624 89760127 82604873 76260606 70575962
4340G0575962m932470m163202l655730l039299k597774k411718k238428j977613
$$ 70575962 65643492 61480290 57824560 54785261 52187487 49775769 47537341 45559728
4332D5559728j865298j865700j846091j701590j596832j411750j458112j285799
$$ 45559728 43694430 41828730 39982639 38281049 36684217 35272467 33814355 32528556
4324C2528556j109411j124980j056246r57715q37368p81461o89260o21111n21875
$$ 32528556 31419145 30294165 29237919 28280204 27442836 26661375 25972115 25351004 24829129
4315B4829129o02420m96298n15855n09245o67389o77631o86274p46256p93348
$$ 24829129 24226709 23730411 23214556 22705311 22037922 21360291 20674017 19927761 19134413
4306A9134413p10612o26166n74719n76400m78844l46311l93763l33256l29958
$$ 19134413 18423801 17797635 17222916 16646516 16167672 15821361 15427598 15094342 14764384
4297A4764384k50758k98463k84979l74557k86657l35040l63930l22082j45343
$$ 14764384 14513626 14215163 13930184 13555627 13268970 12933930 12570000 12247918 12102575
4288A2102575k11794j86494j41253j35716k68354l09552k15995k10794j78897
$$ 12102575 11890781 11704287 11563034 11427318 11158964 10849412 10633417 10422623 10243726
4279A0243726l5101l7351r5815p5459k2209r4367j16987j45088r9214j47542j03661
$$ 10243726 10208625 10171274 10075459 10000000 9977791 9883424 9766437 9621349 9522135 9374593 9270932
4268I270932j0044O267k0239J6440J00745Q4164O3567N4490J3852N7543J72984
$$ 9270932 9260888 9267155 9246916 9263356 9364101 9448265 9511832 9566322 9580174 9637717 9810701
4257I810701J26157J08428J35396J07508j09536k21653m41855n02927l98067m23712
$$ 9810701 9936858 10045286 10180682 10288190 10178654 9957001 9515146 9012219 8614152 8190440
4247H190440l89691k47805k25094j61931m2419J4922J3504K9616K9373o2973K6041
$$ 8190440 7800749 7552944 7327850 7165919 7123500 7138422 7151926 7181542 7210915 7147942 7173983
4236G173983N3327P8880Q8717N1990L0018R0381J21613J63359J74850J41506J04393
$$ 7173983 7227310 7306190 7394907 7446897 7476915 7567296 7688909 7852268 8027118 8168624 8273017
4225H273017J17696J13142J72962J92800Q9883l0653k01789l45271l71320m09530
$$ 8273017 8390713 8503855 8676817 8869617 8959500 8928847 8727058 8381787 8010467 7600937
4215G600937k38340k18787j96390j75146k52560j83115k78397k00162k08032j79649
$$ 7600937 7362597 7143810 6947420 6772274 6519714 6336599 6058202 5858040 5650008 5470359
4205E470359j03634k272j21861p9514J8247M9174P9931O866J8899O7590Q7598
$$ 5470359 5366725 5364453 5242592 5163078 5181325 5230499 5310430 5317296 5336195 5403785 5491383
4194E491383K7297P0625Q4557j2685L2816k8165n9368m1844j12046j43133j75226
$$ 5491383 5518680 5589305 5673862 5661177 5693993 5665828 5606460 5564616 5452570 5309437 5134211
4183E134211j90079j07061j37939j42539j00876j04479m9861j39403j550j6837
$$ 5134211 4944132 4837071 4699132 4556593 4455717 4351238 4301377 4161974 4160424 4143587
4173D143587n3111l6485q4081l988j6365N9607m3555r4616m1486o9679M2900L6096
$$ 4143587 4090476 4053991 3969910 3965922 3949557 4009164 3965609 3870993 3829507 3759828 3802728 3838824
4161C838824K1560k4752N3983M6814q3751k4943P837J8637K2192k070j5474p143
$$ 3838824 3860384 3835632 3889615 3936429 3852678 3827735 3835572 3854209 3876401 3874331 3858857 3851714
4149C851714J8542K4234J5922Q6997L3764m7720n3786L1029P4817J9949p381L2267
$$ 3851714 3870256 3894490 3910412 3997409 4031173 3983453 3929667 3960696 4035513 4055462 4048081 4080348
4137D080348O193P791k6209K2938P451q3190n1144j1899o8777l6050q2047j24159
$$ 4080348 4086541 4094332 4068123 4091061 4098512 4015322 3964178 3952279 3883502 3847452 3765405 3641246
4125C641246n1849n8208m1848J1699o0519L4746K1244o1045R79N5221J01469l7888
$$ 3641246 3589397 3531189 3489341 3501040 3440521 3475267 3496511 3435466 3436445 3491666 3593135 3555247
4113C555247m1465m0J2280O8567P2401L7932K0401L6535J0324L3174J8416J05293
$$ 3555247 3513782 3513742 3526022 3594589 3666990 3704922 3725323 3761858 3772182 3805356 3823772 3929065
4101C929065j4940k99R7493K377O6854J02548l9577o7603K843K4074o6063r403
$$ 3929065 3914125 3913826 4011319 4013696 4080550 4183098 4143521 4075918 4078761 4102835 4036772 4027369
4089D027369o4747L6268J542q8116L6828L22J9750q267p382j2914K8626p9382
$$ 4027369 3962622 3998890 4000432 3912316 3949144 3949466 3969216 3960949 3953567 3940653 3969279 3889897
4077C889897L325l2629K623j5498r330o8554j231K6529N1830Q6525O7904l573
$$ 3889897 3893222 3860593 3863216 3847718 3838388 3769834 3768603 3795132 3846962 3933487 4001391 3997818
4065C997818k5245M6700J02934P4243R4364R4540Q5163J30191J34749J16332J28485
$$ 3997818 3972573 4019273 4122207 4196450 4290814 4385354 4470517 4600708 4735457 4851789 4980274
4054D980274J18304J04681m7640k28108j98157l06760k22397k63198j78801k28628
$$ 4980274 5098578 5203259 5155619 4927511 4729354 4422594 4200197 3936999 3758198 3529570
4044C529570j27401p6288j55031o1420m321k2064P002l2489o7350l0026m1907
$$ 3529570 3402169 3325881 3170850 3109430 3105109 3083045 3090047 3057558 2990208 2960182 2918275
4033B918275O0310J5027J0669j611m2730o0445K1145j6639K0588m1991m5270M0337
$$ 2918275 2978585 2993612 3004281 3002670 2959940 2899495 2920640 2904001 2924589 2882598 2837328 2877665
4021B877665o485o3872K8101j2205K927j04179l4114L2203n376L5679M5195J5485
$$ 2877665 2871180 2807308 2835409 2823204 2826131 2721952 2687838 2720041 2714665 2750344 2795539 2811024
4009B811024m6265M0054M8995J8621k2667M347l726R2694K589N6021m7511r377
$$ 2811024 2764759 2804813 2853808 2872429 2849762 2854109 2850383 2943077 2945666 3001687 2954176 2944799
3997B944799K5139K7772P747K1080N5292J4251N5830Q3871l9151L1305J30991
$$ 2944799 2969938 2997710 3005457 3026537 3081829 3096080 3151910 3235781 3196630 3227935 3358926
3986C358926J1126O4123L6911M2727L1782L4638Q9980R7086O5104O8349M5230
$$ 3358926 3370052 3434175 3471086 3513813 3545595 3580233 3670213 3767299 3832403 3900752 3945982
3975C945982M3064J31710R9777j1912N8148Q6857R7042J12453N9919O4309N1599
$$ 3945982 3989046 4120756 4220533 4208621 4266769 4353626 4450668 4563121 4623040 4687349 4738948
3964D738948R6325Q652J14566P7123p2334Q180L695O5825R2614P6548n336Q9170
$$ 4738948 4835273 4843925 4958491 5035614 4963280 4971460 4975155 5040980 5133594 5210142 5204806 5293976
3952E293976P0817M4233K0608Q7892J24753J13299N6695P0479R75K8024J22091
$$ 5293976 5364793 5409026 5429634 5517526 5642279 5755578 5812273 5882752 5883727 5911751 6033842
3941F033842R9957R3954J02372J18944J30683R6193P4673J95960J68016J21173
$$ 6033842 6133799 6227753 6330125 6449069 6579752 6675945 6750618 6946578 7114594 7235767
3931G235767J94485J19054J96903J53275Q0756R3862K64014K33119J84399J84364
$$ 7235767 7430252 7549306 7746209 7899484 7980240 8074102 8338116 8571235 8755634 8939998
3921H939998J74882K33895L32604L24072K14604K63103L21579L49916L11675L40497
$$ 8939998 9114880 9348775 9681379 10005451 10220055 10483158 10804737 11154653 11466328 11806825
3911A1806825L42371L76266J60945J43681K07243K22254J69730K34507L52045
$$ 11806825 12149196 12525462 12686407 12830088 13037331 13259585 13429315 13663822 14015867
3902A4015867M28893M14372M75989N79900O40880Q21814R41096J161566J288468
$$ 14015867 14444760 14859132 15335121 15915021 16555901 17377715 18318811 19480377 20768845
3893B0768845J365850J529341J295668J151131J419101K062328K660773K378049
$$ 20768845 22134695 23664036 24959704 26110835 27529936 29592264 32253037 34631086
3885C4631086m09290k293718k389031k073871j680194j396523r47630o01409j99035
$$ 34631086 34221796 31928078 29539047 27465176 25784982 24388459 23440829 22839420 22640385
3876B2640385l4544J40329K83003L10732L49772K86497L71160M06961M06853N07833
$$ 22640385 22605841 22746170 23029173 23339905 23689677 23976174 24347334 24754295 25161148 25668981
3866B5668981N56354O30736O22746O45070N95693O83968P55681P93985P23065
$$ 25668981 26225335 26856071 27478817 28123887 28719580 29403548 30159229 30953214 31676279
3857C1676279Q35331Q95191Q47216Q58432R03516R65884J032712R71581J060056
$$ 31676279 32511610 33406801 34254017 35112449 36015965 36981849 38014561 38986142 40046198
3848D0046198J037421J061778J138278J214164J331718J245993J293302J414211
$$ 40046198 41083619 42145397 43283675 44497839 45829557 47075550 48368852 49783063
3840D9783063J505631J472293J519639J637201J702091J786589J769107J856662
$$ 49783063 51288694 52760987 54280626 55917827 57619918 59406507 61175614 63032276
3832F3032276J999561K122644K163371K280513K355462K430169K395448K504105
$$ 63032276 65031837 67154481 69317852 71598365 73953827 76383996 78779444 81283549
3824H1283549K689269K742186K806065K819446K956166L114153L194444L226102
$$ 81283549 83972818 86715004 89521069 92340515 95296681 98410834 101605278 104831380
3816A04831380L236137L265001L369614L375666L345162L335731L321479L208501
$$ 104831380 108067517 111332518 114702132 118077798 121422960 124758691 128080170 131288671
3808A31288671L245438L324597L254977L148155L003132L053815L012420K811633
$$ 131288671 134534109 137858706 141113683 144261838 147264970 150318785 153331205 156142838
3800A56142838K669647K590352K430326K133039J889636J644145J401136J183698
$$ 156142838 158812485 161402837 163833163 165966202 167855838 169499983 170901119 172084817
3792A72084817R71999P22551M57833K25611Q3234k37371m72074o71513r45867
$$ 172084817 173056816 173779367 174237200 174462811 174546045 174308674 173836600 173165087 172219220
3783A72219220j192261j460575j738787k053956k234838k571208k752769l000197
$$ 172219220 171026959 169566384 167827597 165773641 163538803 160967595 158214826 155214629
3775A55214629l132923l298068l445838l588016l720851l703187l851833l907087
$$ 155214629 152081706 148783638 145337800 141749784 138028933 134325746 130473913 126566826
3767A26566826l980846m010492m096843m109096m096817m091205m097992m040290
$$ 126566826 122585980 118575488 114478645 110369549 106272732 102181527 98083535 94043245
3759I4043245l872331l883980l825073l760698l632628l539045l417107l168283
$$ 94043245 90170914 86286934 82461861 78701163 75068535 71529490 68112383 64944100
3751F4944100l032843l075029k847064k753511k598784k610902k408478k265690
$$ 64944100 61911257 58836228 55989164 53235653 50636869 48025967 45617489 43351799
3743D3351799k174200j959952j876289j757674j598423j544676j459756j218863
$$ 43351799 41177599 39217647 37341358 35583684 33985261 32440585 30980829 29761966
3735B9761966j230611j217887j079941j018019r70240q77465q73128p85143o90969
$$ 29761966 28531355 27313468 26233527 25215508 24245268 23367803 22494675 21709532 21018563
3726B1018563o27127o64898o10724m98018m82169n05334l67537m05605m10344
$$ 21018563 20391436 19726538 19115814 18617796 18135627 17630293 17262756 16857151 16446807
3717A6446807l42498k34447j91349k17341k41391j50232k02032k02437j36359
$$ 16446807 16104309 15869862 15678513 15461172 15219781 15069549 14867517 14665080 14528721
3708A4528721p6763j20482j99232k24297k75037l73270l34410l03640k31032j54256
$$ 14528721 14451958 14331476 14132244 13907947 13632910 13259640 12925230 12621590 12390558 12236302
3698A2236302j37306j17579j98706o8538r231n631l2907j28016j9420L9952m4196
$$ 12236302 12098996 11981417 11782711 11714173 11704942 11699311 11666404 11538388 11518968 11558920 11514724
3687A1514724q631k3048M9700K6744j01042j40543j72257j49179k11190j24080
$$ 11514724 11506093 11483045 11532745 11559489 11458447 11317904 11145647 10996468 10785278 10661198
3677A0661198j83352j5382k2714j09816k8180j8085p3281J615m8230Q117J06197
$$ 10661198 10477846 10462464 10439750 10329934 10301754 10283669 10210388 10212003 10163773 10171890 10278087
3666A0278087J0494N2435K7063j5522l9102Q0790K215q072M0317m3979j13342
$$ 10278087 10288581 10341016 10368079 10352557 10313455 10394245 10396460 10388388 10428705 10384726 10271384
3655A0271384n2352P5674O7955n8971j6105J0399k0591m4710o3174k0907m3179
$$ 10271384 10219032 10294706 10362661 10303690 10287585 10297984 10277393 10232683 10169509 10148602 10105423
3644A0105423L7835O8347p6016m3110M2589m3166M618N5414O535L7070Q3649O6357
$$ 10105423 10143258 10211605 10135589 10092479 10135068 10091902 10096520 10151934 10158469 10195539 10279188 10345545
3632A0345545Q9235Q6381L8788R3313M2029J00032J69362J11749R2028J90538
$$ 10345545 10434780 10521161 10559949 10653262 10695291 10795323 10964685 11076434 11168462 11359000
3622A1359000J78190J48300J98921R8755R4185J73053J71152J22560J98960K67826
$$ 11359000 11537190 11685490 11884411 11983166 12077351 12250404 12421556 12544116 12743076 13010902
3612A3010902L34598J86044L15333L23613J96318L19234L66277L38076L74870
$$ 13010902 13345500 13531544 13846877 14170490 14366808 14686042 15052319 15390395 15765265
3603A5765265M42446L39035L54508M59210N24763L26510M16662M19236L98459
$$ 15765265 16207711 16546746 16901254 17360464 17885227 18211737 18628399 19047635 19446094
3594A9446094M13966L66831L45753L46442L32789K34067K72691K62759J98570
$$ 19446094 19860060 20226891 20572644 20919086 21251875 21485942 21758633 22021392 22219962
3585B2219962J42943J74229K39616J52341J81406J00360J08554J14007K331N8280
$$ 22219962 22362905 22537134 22776750 22929091 23110497 23210857 23319411 23433418 23435749 23494029
3575B3494029P5939J03982J8136L5173J02611Q0923J37063J87690K06940J36671
$$ 23494029 23569968 23673950 23692086 23727259 23829870 23910793 24047856 24235546 24442486 24579157
3565B4579157J81488K35267K55156K86685L23094L75787L95566L66156M22588
$$ 24579157 24760645 24995912 25251068 25537753 25860847 26236634 26632200 26998356 27420944
3556B7420944M16036L72580M32587M84960N09943M23208M20701M67974M49287
$$ 27420944 27836980 28209560 28642147 29127107 29637050 30060258 30480959 30948933 31398220
3547C1398220N12716M83490M93664N13145N17284N47277N86269O71344O32974
$$ 31398220 31910936 32394426 32888090 33401235 33918519 34465796 35052065 35723409 36356383
3538C6356383O30664O97257P40608O72245O25755O84107N81015N89354O04033
$$ 36356383 36987047 37684304 38424912 39097157 39722912 40407019 40988034 41577388 42181421
3529D2181421N62019M67797N10396N46006M81120N13777N06550N10334M68012
$$ 42181421 42743440 43211237 43721633 44267639 44748759 45262536 45769086 46279420 46747432
3520D6747432N06152N61019M67139N68956N18798M68818M53108M57957N83506
$$ 46747432 47253584 47814603 48281742 48850698 49369496 49838314 50291422 50749379 51332885
3511E1332885N81186N67855N15277O30592O74945P00066Q71303Q86486R03648
$$ 51332885 51914071 52481926 52997203 53627795 54302740 55002806 55874109 56760595 57664243
3502E7664243R36717J032427J162444J145319J278940J401147J446587J441348
$$ 57664243 58600960 59633387 60795831 61941150 63220090 64621237 66067824 67509172
3494F7509172J610595J706316J789229J929037J969829K033355K241716K321560
$$ 67509172 69119767 70826083 72615312 74544349 76514178 78547533 80789249 83110809
3486H3110809K425777K650051K699187K871879L062699L192247L394563L513895
$$ 83110809 85536586 88186637 90885824 93757703 96820402 100012649 103407212 106921107
3478A06921107L676527L877599M041690M172121M307691M448302M461857M536817
$$ 106921107 110597634 114475233 118516923 122689044 126996735 131445037 135906894 140443711
3470A40443711M703700M858633N027498N103967N345615N599802N848067O207557
$$ 140443711 145147411 150006044 155033542 160137509 165483124 171082926 176930993 183138550
3462A83138550O576839P068705P531657Q102510Q768313R240376R921714J0395974
$$ 183138550 189715389 196784094 204315751 212418261 221186574 230426950 240348664 250744638
3454B50744638J0901371J1172723J1407744J1443274J1259335J0723308R888999
$$ 250744638 261646009 272818732 284226476 295669750 306929085 317652393 327541392
3447C27541392Q764667P357008N816462M367276L144081K039836J276002R23006
$$ 327541392 336306059 343663067 349479529 353846805 356990886 359030722 360306724 361229730
3439C61229730P73582N67423M11602K90185N8289m79991j217992k096461l059121
$$ 361229730 362003312 362570735 362982337 363272522 363330811 362850820 361632828 359536367 356477246
3430C56477246m122171m877499n399600n405996n117255m437464l424588k353489
$$ 356477246 352355075 347477576 342077976 336671980 331554725 327117261 323692673 321339184
3422C21339184j191709O4178J135000K174706L108281L858335M558984N149572
$$ 321339184 320147475 320211653 321346653 323521359 326629640 330487975 335046959 340196531
3414C40196531N566448N893040O074068O089679O056339N891299N697646N553872
$$ 340196531 345762979 351656019 357730087 363819766 369876105 375767404 381465050 387018922
3406C87018922N322423N094982M899429M663385M334217M064997L810741L359229
$$ 387018922 392341345 397436327 402335756 406999141 411333358 415398355 419209096 422568325
3398D22568325L141773K891162K564796K167124J931891J836357J668021J603581
$$ 422568325 425710098 428601260 431166056 433333180 435265071 437101428 438769449 440373030
3390D40373030J777583J913182K142027K443488K769336L070109L308813L586462
$$ 440373030 442150613 444063795 446205822 448649310 451418646 454488755 457797568 461384030
3382D61384030L750372L806392L782811L597311L023225K273237J041541l70616
$$ 461384030 465134402 468940794 472723605 476320916 479344141 481617378 482658919 482288303
3374D82288303k038741l716455n320158o741821p843567q672726r250399r630513
$$ 482288303 480249562 476533107 471212949 464471128 456627561 447954835 438704436 429073923
3366D29073923r912888j0213992j0623873j1206734j1851278j2722506j3836305
$$ 429073923 419161035 408947043 398323170 387116436 375265158 362542652 348706347
3359C48706347j4894065j5949600j6668303j7072700j7105411j6661375j5863292
$$ 348706347 333812282 317862682 301194379 284121679 267016268 250354893 234491601
3352B34491601j4926080j3828132j2585021j1412442j0267684r258998q277147
$$ 234491601 219565521 205737389 193152368 181739926 171472242 162213244 153936097
3345A53936097p453570o706614n965392n270954m738946m335295l798957l409106
$$ 153936097 146482527 139775913 133810521 128539567 123800621 119465326 115666369 112257263
3337A12257263l074905k676880k423935k215434k110689j990867j914543j797170
$$ 112257263 109182358 106505478 104081543 101866109 99755420 97764553 95850010 94052840
3329I4052840j818642j785714j688984j671225j647162j589994j542118j465108
$$ 94052840 92234198 90448484 88759500 87088275 85441113 83851119 82309001 80843893
3321H0843893j414643j406050j402387j315989j376349j486625j495957j551488
$$ 80843893 79429250 78023200 76620813 75304824 73928475 72441850 70945893 69394405
3313F9394405j681300j672395j635288j720632j575982j673967j565922j472497
$$ 69394405 67713105 66040710 64405422 62684790 61108808 59434841 57868919 56396422
3305E6396422j465948j449707j324219j179660j206238j260323j217051j098739
$$ 56396422 54930474 53480767 52156548 50976888 49770650 48510327 47293276 46194537
3297D6194537j071437j062819r54897q97566q87643q03967o89612o30251n71184
$$ 46194537 45123100 44060281 43105384 42207818 41320175 40516208 39826596 39196345 38625161
3288C8625161n34843m67203m02985l45474k80100k71568k35660j88225j61728
$$ 38625161 38090318 37623115 37220130 36874656 36594556 36322988 36087328 35899103 35737375
3279C5737375j81688j30961j07382j4659M2450n1282M0931m5774O3740J93939
$$ 35737375 35555687 35424726 35317344 35302685 35345135 35293853 35334784 35289010 35352750 35546689
3269C5546689N7441N6833J20796J11410Q8136K10305J64585K72430J91501K44934
$$ 35546689 35604130 35660963 35781759 35893169 35981305 36191610 36356195 36628625 36820126 37065060
3259C7065060K76680L04101L33888L84597N34965M94852L89699N09163N63257
$$ 37065060 37341740 37645841 37979729 38364326 38899291 39394143 39783842 40293005 40856262
3250D0856262O50814O42511O29109P28376P74630P87691Q27606R27860Q77095
$$ 40856262 41507076 42149587 42778696 43507072 44281702 45069393 45896999 46824859 47701954
3241D7701954R07061R25650J010343J067225J043179J198908J240248J246392
$$ 47701954 48609015 49534665 50545008 51612233 52655412 53854320 55094568 56340960
3233E6340960J404916J451692J512155J690009J758682J799012J866631K042279
$$ 56340960 57745876 59197568 60709723 62399732 64158414 65957426 67824057 69866336
3225F9866336K105461K336140K458936K595772K859592L078360L243071L486984
$$ 69866336 71971797 74307937 76766873 79362645 82222237 85300597 88543668 92030652
3217I2030652L830053M210643M459741M696624M851643N017877N159765N292717
$$ 92030652 95860705 100071348 104531089 109227713 114079356 119097233 124256998 129549715
3209A29549715N383613N170592M922811M500423L935316L355625K893609K624649
$$ 129549715 134933328 140103920 145026731 149527154 153462470 156818095 159711704 162336353
3201A62336353K745426L069741L431087L868081M317316M843635N522268O164618
$$ 162336353 165081779 168151520 171582607 175450688 179768004 184611639 190133907 196298525
3193A96298525O694940P046604P293158P583606P501346P302620P147769O585216
$$ 196298525 202993465 210040069 217333227 224916833 232418179 239720799 246868568 253453784
3185B53453784N821026N147607M416352L649479L191125K812295K604462K575463
$$ 253453784 259274810 264422417 268838769 272488248 275679373 278491668 281096130 283671593
3177B83671593K657703K688150K509475J885722Q27835o86507k005324k931303
$$ 283671593 286329296 289017446 291526921 293412643 294240478 293553971 291548647 288617344
3169B88617344l014884k419435j407756o2688J462050L087904M498970N818894
$$ 288617344 285602460 283183025 281775269 281712581 283174631 286262535 290761505 296580399
3161B96580399P047543P930553Q415580Q592225Q440686P890172O974273N374486
$$ 296580399 303627942 311558495 319974075 328566300 337006986 344897158 351871431 357245917
3153C57245917L314739Q15198j973377m596823o859046q515871r420713r796207
$$ 357245917 360560656 361375854 359402477 354805654 347946608 339430737 330010024 320213817
3145C20213817r782515r528509q916716q456484q306417q402362q637897q849997
$$ 320213817 310431302 300902793 291986077 283529593 275223176 266820814 258182917 249332920
3137B49332920q840201q444933p775223o850303n751672m695709l553636k489385
$$ 249332920 240492719 232047786 224272563 217422260 211670588 206974879 203421243 200931858
3129B00931858j701036q91232k20075K36830M23040M94553M05875J10763l77860
$$ 200931858 199230822 198339590 198119515 198356345 198779385 199273938 199679813 199790576 199412716
3120A99412716r25219j696314k575258l305594l896975m431811m745174m952592
$$ 199412716 198487497 196791183 194215925 190910331 187013356 182581545 177836371 172883779
3112A72883779m810021m642740m523984m563174m957665n709391o556614p190094
$$ 172883779 168073758 163431018 158907034 154343860 149386195 143676804 137120190 129930096
3104A29930096p455966p320926o999629o429404n875745n197896m541557m001044
$$ 129930096 122474130 115153204 108153575 101724171 95848426 90650530 86108973 82107929
3096H2107929l488178l026886k691987k360186k027193j820315j558138j277025
$$ 82107929 78619751 75592865 72900878 70540692 68513499 66693184 65135046 63858021
3088F3858021r29666p93661n57665l09236r9260O174J38759K94032L53121L04876
$$ 63858021 62928355 62134694 61577029 61267793 61168533 61174707 61313466 61607498 61960619 62265495
3078F2265495J84970J09508m8297m08427q92592j405912j668708j844620j926376
$$ 62265495 62450465 62559973 62511676 62103249 61210657 59804745 58136037 56291417 54365041
3069E4365041j792464j626647j331987j136436r27182p13952n69278m19505l70620
$$ 54365041 52572577 50945930 49613943 48477507 47550325 46836373 46267095 45847590 45476970
3060D5476970l73181m05587m31512m99518o77167p41721q56096r95743j055446
$$ 45476970 45103789 44698202 44266690 43767172 43090005 42348284 41492188 40496445 39440999
3051C9440999j187921j371807j350374j268893j321095j110980j019293j037628
$$ 39440999 38253078 36881271 35530897 34262004 32940909 31829929 30810636 29773008
3043B9773008r11313r09877q19667o70120o15342o64240n60501m34777l41608
$$ 29773008 28861695 27951818 27132151 26462031 25846689 25182449 24621948 24187171 23845563
3034B3845563j97114j60965o2779j27350j38199N4406P9733L28201K47170l72762
$$ 23845563 23648449 23487484 23424705 23297355 23159156 23213562 23293295 23621496 23868666 23495904
3024B3495904r62648j134729j020599r31483q37249p32229n56082m66919l69569
$$ 23495904 22533256 21398527 20377928 19446445 18609196 17876967 17320885 16853966 16484397
3015A6484397j74129j79441j76113j89399k28187j70006j94102m8737l8494N1505
$$ 16484397 16310268 16130827 15954714 15765315 15537128 15367122 15173020 15124283 15085789 15137294
3005A5137294K28296K56812M69587M82667N69073O31078M70155N33448O56129
$$ 15137294 15365590 15622402 16091989 16574656 17143729 17774807 18244962 18778410 19434539
2996A9434539R41464J394701R78396o04792j568081j808428j632512j488374j284290
$$ 19434539 20376003 21770704 22749100 22144308 20576227 18767799 17135287 15646913 14362623
2987A4362623r22248o96905n45030l92585l12155l71028j94921j29467j14398
$$ 14362623 13440375 12743470 12198440 11805855 11493700 11122672 10927751 10798284 10683886
2978A0683886k05774j84946m6704o4245j6495Q4468J74843K25024J74963K45892
$$ 10683886 10478112 10293166 10246462 10182217 10165722 10250190 10425033 10650057 10825020 11070912
2968A1070912K71327K29476J39935K63249N16851O13325K54713l82604q47423
$$ 11070912 11342239 11571715 11711650 11974899 12491750 13105075 13359788 12977184 12129761
2959A2129761r37106p40214p08275o93293m21484l21887k66807j92473j86938
$$ 12129761 11192655 10452441 9744166 9050873 8629389 8307502 8040695 7848222 7661284
2950G661284j37084j17771j63038p5701o2351j75407p2491L1275l0314k2226j2213
$$ 7661284 7524200 7406429 7243391 7167690 7105339 6929932 6857441 6888716 6858402 6836176 6823963
2939F823963l1608n3300l8761q1174o5708j04258r8973q08p9609l1556J2302r9463
$$ 6823963 6792355 6739055 6700294 6619120 6553412 6449154 6350181 6349373 6269764 6238208 6250510 6151047
2927F151047J2390L0940r9109j5110K5303m2892l7168K5613K6134q923m281M1954
$$ 6151047 6163437 6194377 6095268 6080158 6105461 6062569 6025401 6051014 6077148 6068225 6063944 6105898
2915F105898P8183O1399J4728J6618k9101M4064M6245P1075J7509L5569M0200
$$ 6105898 6184081 6245480 6260208 6276826 6247725 6291789 6338034 6409109 6426618 6462187 6502387
2904F502387M1937L9251P6125J49474J58983O8260J16147J55296K09384J98858
$$ 6502387 6544324 6583575 6659700 6809174 6968157 7036417 7152564 7307860 7517244 7716102
2894G716102K30296K89106J87694J03492p4373k29307l17342j62797j61910j68959
$$ 7716102 7946398 8235504 8423198 8526690 8452317 8223010 7905668 7742871 7580961 7412002
2884G412002q4165j24756j0238J65k3654L3924M9502J6840M1838p649k5400L6187
$$ 7412002 7327837 7203081 7192843 7193008 7169354 7203278 7252780 7269620 7311458 7303809 7278409 7314596
2872G314596J02838R8693J45497K46570K74760K82024L37369L60407L12055K86192
$$ 7314596 7417434 7516127 7661624 7908194 8182954 8464978 8802347 9162754 9474809 9761001
2862I761001L76512L37672M90255K93818j76696m21320o20348n19907n82960m51311
$$ 9761001 10137513 10475185 10965440 11259258 11082562 10661242 10040894 9520987 8938027 8486716
2852H486716k57026k74505k29971j24197j37942o1645n1985n4605o4458r5989
$$ 8486716 8229690 7955185 7725214 7601017 7463075 7401430 7349445 7294840 7230382 7134393
2842G134393j27271j33828j09906J9757j7846N1689J23481J62737J10750J03204
$$ 7134393 7007122 6873294 6763388 6783145 6765299 6816988 6940469 7103206 7213956 7317160
2832G317160J54617K33447K11882K7511M2292J08449l4638j86095l46105l59195
$$ 7317160 7471777 7705224 7917106 7944617 7986909 8095358 8060720 7874625 7528520 7169325
2822G169325k78092k30844k86935j56644o3938j57131o8821q4972j11263o8207
$$ 7169325 6891233 6660389 6373454 6216810 6152872 5995741 5926920 5841948 5730685 5662478
2812E662478j74339j16863p9542p2090K6142p145k0025m9987j9991J2958m0012
$$ 5662478 5488139 5371276 5291734 5219644 5245786 5238641 5218616 5168629 5148638 5161596 5121584
2801E121584j0318K6374Q1972P5433n7925n6970l5749q2272q0548j45156j07071
$$ 5121584 5111266 5137640 5219612 5295045 5237120 5180150 5144401 5062129 4981581 4836425 4729354
2790D729354p2865n927k6709n9458M7619R496j9245P340K995L648P5227J02015
$$ 4729354 4656489 4650562 4623853 4564395 4612014 4621510 4602265 4609605 4612600 4616248 4691475 4793490
2778D793490O8533L6399P8828M3172J07342N8928J8934L8142P3003k1293J1187
$$ 4793490 4862023 4898422 4977250 5020422 5127764 5186692 5205626 5243768 5316771 5295478 5306665
2767E306665N415L930k6754m293M0355L5942j3666J05240j4Q5186L339O7274N1665
$$ 5306665 5312080 5316010 5289256 5284963 5325318 5361260 5347594 5452834 5452820 5538006 5541345 5608619 5660284
2754E660284M9881K10576K13329J36975J50150J38554J60623K20540K62743L50939
$$ 5660284 5710165 5920741 6134070 6271045 6421195 6559749 6720372 6940912 7203655 7554594
2744G554594K41492L02459L01722L13848L03076K94896K87213L44816J31592K7158
$$ 7554594 7796086 8098545 8400267 8714115 9017191 9312087 9599300 9944116 10075708 10102866
2734A0102866p461N0623m9065n8707J888O3269P7290M4493L2066m7118M5900P0203
$$ 10102866 10095405 10146028 10096963 10038256 10040144 10103413 10180703 10225196 10257262 10210144 10256044 10326247
2722A0326247J04729Q6191K01251K05417J42863K57366K42988L36539M41226L68440
$$ 10326247 10430976 10517167 10718418 10923835 11066698 11324064 11567052 11903591 12344817 12713257
2712A2713257L66125M24816M81251N78780M87038J3617n52327q61243q39617q86612
$$ 12713257 13079382 13504198 13985449 14564229 15051267 15064884 14512557 13651314 12811697 11925085
2702A1925085p64191p49141n74074l60596l97840l53600k58856j41668j34630
$$ 11925085 11160894 10411753 9837679 9477083 9079243 8725643 8466787 8325119 8190489
2693H190489j58549q5068j05148j10151n0477j45247o7045J6891P575j705P3979
$$ 8190489 8031940 7946872 7841724 7731573 7681096 7535849 7468804 7485695 7493270 7491565 7565544
2682G565544J9654l5332O6557P6932r0942j8800q1090k02199l25553l32396l76892
$$ 7565544 7585198 7549866 7616423 7693355 7602413 7583613 7502523 7300324 6974771 6642375 6265483
2671F265483l73761l89181m12619l11205l26285k69202k07101k47070j99809j66229
$$ 6265483 5891722 5502541 5089922 4778717 4452432 4183230 3976129 3729059 3529250 3363021
2661C363021j84955j39655p9240j35253j12597j46903m789p2663j22462o4819
$$ 3363021 3178066 3038411 2959171 2823918 2711321 2564418 2559629 2486966 2364504 2299685
2651B299685o6834r8537q2318j7761o0271k3202o1010j19377m8165p2181j2141
$$ 2299685 2232851 2134314 2051996 2034235 1973964 1950762 1889752 1770375 1722210 1650029 1637888
2640A637888k5654o3728n1093N0424l3390m3484k4706j6433m2212m8903N7980
$$ 1637888 1612234 1548506 1497413 1547837 1514447 1470963 1446257 1429824 1387612 1338709 1396689
2629A396689n8731R8r495l3631j8073J8829j4766l736k3912j31115M9225j3282
$$ 1396689 1337958 1338056 1328561 1294930 1276857 1295686 1280920 1277184 1253272 1122157 1171382 1158100
2617A158100m8570J2729l9012R8296m8807J0948o9981J0414M8355o4131m5625
$$ 1158100 1109530 1122259 1083247 1181543 1132736 1143684 1073703 1084117 1132472 1068341 1022716
2606A022716k4720o3204P750L1038n4656M1160j5869m7651L3405m6322J1333n1657
$$ 1022716 997996 934792 942542 973580 918924 960084 944215 896564 929969 883647 894980 843323
2594H43323j6949j0026L0351m4427k0645N6936P733j995R694l7687Q183l9186
$$ 843323 826374 816348 846699 802272 781627 838563 846296 844301 853995 816308 824491 785305
2582G85305M145l343k8886m3212m6474L6216N2906J04934j1788q0663m4868J9076
$$ 785305 789450 786107 757221 714009 667535 703751 756657 861591 849803 769140 724272 743348
2570G43348n9444M2984q7509p200L8039k1896J4503l5409N7551o620q0282l5860
$$ 743348 683904 726888 639379 632179 670218 648322 662825 627416 684967 678347 598065 562205
2558E62205l2958k7238l8976K1103M4771J1771K4476O118k6591o1971M7515Q3603
$$ 562205 529247 502009 463033 484136 528907 540678 565154 571272 544681 482710 530225 613828
2546F13828j4648M183O4381k7891j4601l6238m0925N0313k8106r215k4166k0398
$$ 613828 599180 603363 667744 639853 625252 589014 548089 598402 570296 561081 536915 516517
2534E16517m7553L588L3167o0687M8171J8702k0353M3858j6828n7013M9880N008
$$ 516517 468964 472552 505719 445032 493203 511905 491552 535410 518582 461569 511449 516457
2522E16457m8513M0945J7963m7070m2955j4187J0378l5887J4885O5713k6103l6608
$$ 516457 467944 508889 526852 479782 436827 422640 433018 397131 412016 477729 451626 415018
2510D15018N4411l0722m2779R1244j4332l5641J3180n722L4548M0297o1319m0755
$$ 415018 469429 438707 395928 487172 472840 437199 450379 444657 479205 519502 458183 417428
2498D17428Q3772m9161m8516J7028j5095j02994R6384K3773J919M486o0128R0124
$$ 417428 501200 452039 403523 420551 405456 302462 398846 422619 424538 429024 368896 459020
2486D59020j920M1959k7335m6336N1816Q769K2330j1488J770n5891K5198k0415
$$ 459020 457100 499059 471724 425388 477204 485973 508303 496815 498585 442694 467892 447477
2474D47477k7497N2791j8435P890n7904J13424q8019j5119J7224n387k5630J13755
$$ 447477 419980 472771 454336 462226 404322 517746 429727 414608 431832 426445 400815 514570
2462E14570M0868r501K9502q914k1833N887O8036Q7413m841m3732J4523j5363
$$ 514570 555438 545937 575439 566525 544692 550579 618615 706028 701187 657455 671978 656615
2450F56615l1378j3141m8261K4231N2799m6765j0406j2413R719L0338q64m4040
$$ 656615 625237 612096 563835 588066 640865 594100 583694 571281 581000 611338 610474 566434
2438E66434K7436o499P2031O4114k3631J2018m1952k6780m429R3566Q9892J9773
$$ 566434 593870 587371 659402 723516 699885 711903 669951 643171 638742 732308 822200 841973
2426H41973l8095l6809J7999j6584J7500l743n1696N5208M0342p7465l1771P9441
$$ 841973 803878 767069 785068 768484 785984 782241 730545 785753 826095 748630 716859 796300
2414G96300j6687l3180N2667O0715l960j00688M7431j996o0524j3542M0263L8262
$$ 796300 779613 746433 799100 859815 855855 755167 802598 800602 740078 726536 766799 805061
2402H05061M0834j8598K1693r725j3699K1421K2966M0973n9116o8777N1449L8629
$$ 805061 845895 827297 848990 839265 825566 846987 869953 910926 851810 783033 834482 873111
2390H73111k0632q490n7638m6196j3989m4328l9686N6309m6495N942Q0866p0626
$$ 873111 852479 843989 786351 740155 726166 681838 642152 698461 651966 657908 738774 668148
2378F68148N885L3588m6490k2619L6122l0491k4748k0047M5574l6814J9954K7259
$$ 668148 674033 707621 661131 638512 674634 644143 619395 599348 644922 608108 628062 655321
2366F55321j220j1688o5785k8897L0449J5299N5201m5157J4846m0641m6068l2405
$$ 655321 654101 642413 576628 547731 578180 593479 648680 603523 618369 577728 531660 499255
2354D99255m639L3797j4361l9935l7913J7985j4764J2363k2588P883n2644L6575
$$ 499255 494616 528413 514052 474117 436204 454189 439425 451788 429200 437083 384439 421014
2342D21014K0185l1829L59k3885m4395K087L9681K2755l9738L2469l4562j0682
$$ 421014 441199 409370 409729 385844 341449 343536 383217 405972 366234 398703 364141 353459
2330C53459L5056j4126L3530q5504L1011N886n6809M1504K0240j3928r787J8774
$$ 353459 388515 374389 407919 322415 353426 359312 302503 344007 364247 350319 340532 359306
2318C59306m5812k9097K9158j0087j7168L5960o4566o1745K2918k52j7053K580
$$ 359306 313494 284397 313555 303468 286300 322260 257694 195949 218867 218615 201562 204142
2306B04142n346N067J1972L0550n2082l6597N4520j7178K7486M5931l5527m2092
$$ 204142 198796 203863 215835 246385 194303 157706 212226 195048 222534 268465 232938 190846
2294A90846k7146N4263l3156l039J7014J891l2820j7198J9852K6556P497p4878
$$ 190846 163700 217963 184807 181768 198782 200673 167853 150655 170507 197063 204560 129682
2282A29682K3170k058l8543n221P790M5247N616N2387l2904q4389k0701j5961
$$ 129682 152852 150794 112251 107030 114820 160067 165683 218070 185166 100777 80076 64115
2270F4115J7280N2138L2741K8781L7428J8725p1304q6902N1985N3220l6773p0511
$$ 64115 81395 133533 166274 195055 232483 251208 179904 93002 144987 198207 161434 90923
2258I0923L2262j3685k115L2178J8111k2349q723N1486n6589K130J0909j3749
$$ 90923 123185 109500 107385 139563 157674 135325 126602 178088 121499 123629 134538 120789
2246A20789q1829j9330P8655j5864O4219K943J0828M9250p5924k3464l151K2110
$$ 120789 38960 19630 98285 82421 146640 149583 160411 209661 133737 110273 107122 129232
2234A29232j0808R4854n602o4880l2452k1238P648L7547l1218L1816K2893k0091
$$ 129232 118424 213278 207676 142796 110344 89106 96754 134301 103083 134899 157792 137701
2222A37701K2773n5203P1468J0651o5292q220N475p249o0245N164L1884J8650
$$ 137701 160474 105271 176739 187390 122098 113878 119353 112104 51859 57023 88907 107557
2210A07557J1950k904m5551J0267O2797j9602q609J9553l1889p0802N8312J7420
$$ 107557 119507 116603 71052 81319 144116 124514 115905 135458 103569 32767 91079 108499
2198A08499M0618N5585m0896n0042Q7753k2950K226J0371J5377o5108K7230k764
$$ 108499 149117 204702 163806 113764 201517 178567 180793 191164 206541 141433 168663 165899
2186A65899L3000q907m5020J7050R459k1110j6577K6726J2253K1153m8181J7568
$$ 165899 198899 189992 144972 162022 171481 150371 133794 160520 172773 193926 145745 163313
2174A63313j6058o327j8217L8959K5939j831K032o8366l2907L1555P334J9037
$$ 163313 147255 140928 122711 161670 187609 185778 187810 119444 86537 118092 125426 144463
2162A44463N8278k1954k2138l7180l277L8825m7125m6732J7718K7612M0819n096
$$ 144463 202741 180787 158649 121469 118192 157017 109892 63160 80878 108490 149309 144213
2150A44213M5582l8982n0653L0939l7559o2762L2619M9814p4221m564L3387k4664
$$ 144213 189795 150813 100160 131099 93540 30778 63397 113211 38990 34426 67813 43149
2138D3149l5468P2186j9398j5385k1604K7273j6160k3127L6024J4800J7459O4154
$$ 43149 7681 79867 60469 45084 23480 50753 34593 11466 47490 62290 79749 143903
2126A43903m1742l6050N8271o1288K8198k2407J1295R7598m0191m1810L3860K3654
$$ 143903 102161 66111 124382 63094 91292 68885 80180 177778 137587 95777 129637 153291
2114A53291k6946L142j7166n2288K5799L7582o9935j9239J6154m423J4167M3804
$$ 153291 126345 129487 112321 60033 85832 123414 53479 34240 50394 45971 60138 103942
2102A03942L7728N4255l3237o7129K6584m2861J348M1829m8015J645L9105J6602
$$ 103942 141670 195925 162688 95559 122143 79282 80630 122459 74444 76089 115194 131796
2090A31796l2659L9572k9182l3965N4346J5526o4767J369L3180k7765M2798M1848
$$ 131796 99137 138709 109527 75562 129908 145434 80667 82036 115216 87451 130249 172097
2078A72097l0046P1649R785n6052k9941K5257m161l87r645j3327j1826M057L1870
$$ 172097 142051 213700 223485 167433 137492 162749 158588 158201 148556 135229 123403 127460 159330
2065A59330p277j2024l6051M2566L7324Q725j3417J1448p6679m7266K2646K6474
$$ 159330 152053 140029 103978 146544 183868 192593 179176 190624 113945 66679 89325 115799
2053A15799K1740K7646P217n6177n36l7715L8179O881k34N1198n5314J9317j281
$$ 115799 137539 165185 172402 116225 115689 77974 116153 123034 122800 173998 118684 138001 136720
2040A36720J1437K8670K3783o3870N4076N1244k5563q0181n887O2570L0071k9341
$$ 136720 148157 176827 200610 136740 190816 242060 216497 136316 130429 192999 223070 193729
2028A93729k2912J3294j6713l6231J2750O910N8694J9601J198m3914L4042j5193
$$ 193729 170817 184111 167398 131167 143917 150827 209521 229122 230320 186406 220448 205255
2016B05255m7465r292k8832K8757j397j307M8191K2249l5436N469J5325Q44L873
$$ 205255 157790 148498 119666 148423 147026 145719 193910 216159 180723 186192 201517 202361 206234
2003B06234m134K0208J7821L8442o2003k1833M5047K4454K0182p8927L4827J18801
$$ 206234 202100 222308 240129 278571 216568 194735 239782 264236 284418 205491 240318 359119
1991C59119o187r8465M9854P4170k0739K1243k9739N0806M486l1929L0975p2252
$$ 359119 352932 254467 304321 378491 357752 378995 349256 400062 404548 372619 403594 331342
1979C31342J024P1919K2414J2504L7957k8652k8849n861r498Q8307K9879m0616
$$ 331342 332366 404285 426699 439203 477160 448508 419659 413798 404300 492607 522486 481870
1967D81870J3741J6556R4529m1583j0629N1833l3867k1366P4030k8717P4322j315
$$ 481870 495611 512167 606696 565113 554484 606317 572450 551084 625114 596397 670719 669404
1955F69404o396n311J3704K5794J04642j9976J1026J9812P9618L1140j485L5451
$$ 669404 663008 657697 671401 697195 801837 781861 792887 812699 892317 923457 921972 957423
1943I57423N8885L6846j7583O5632M2971N5190N9617R2707k7939L4058J19130
$$ 957423 1016308 1053154 1035571 1101203 1144174 1199364 1258981 1351688 1323749 1357807 1476937
1932A476937P6361J12538Q6544J09721P7632J12434J47894J06531J61619K15490
$$ 1476937 1553298 1665836 1752380 1862101 1939733 2052167 2200061 2306592 2468211 2683701
1922B683701J76479K28076K76914L48207L92386N26941O38135O46582O80258N98385
$$ 2683701 2860180 3088256 3365170 3713377 4105763 4632704 5270839 5917421 6597679 7196064
1912G196064N63870O45604R56464J308835J134809m05238j534262j591383j384948
$$ 7196064 7759934 8405538 9362002 10670837 11805646 11400408 9866146 8274763 6889815
1903F889815j249978r83947q08808o12787l74736l42999k05086j39347j52238
$$ 6889815 5639837 4655890 3847082 3234295 2859559 2516560 2311474 2172127 2019889
1894B019889j05559k22080j09400j08289j75169j39506l9296j22611l8060k8938
$$ 2019889 1914330 1692250 1582850 1474561 1299392 1159886 1120590 997979 959919 930981
1884I30981l0998n8347r1987L871m2782l1234L3647j5080j08905q820m3587M244
$$ 930981 899983 841636 749649 753520 710738 679504 713151 698071 589166 580346 536759 541003
1872E41003j8221R166q7810J3244M8544l8729M811n1242M831j3606j1055j5210
$$ 541003 522782 531948 444138 457382 505926 467197 472008 420766 425597 411991 400936 385726
1860C85726O6927J737j24235j8039j9355R195k6863K2156M0910m1751q823j7865
$$ 385726 452653 454390 330155 312116 292761 301956 275093 297249 338159 296408 287585 269720
1848B69720N122k0842l132m1566k180J329j3719j8376N2516M05l0285l9765M353
$$ 269720 274842 254000 250868 209302 207122 208451 194732 176356 228872 229277 198992 159227 163580
1835A63580M0547N3603J1575q9777m0163K1206p614j2805r861l98j2677J6167
$$ 163580 204127 257730 269305 179528 139365 160571 152957 140152 130291 129893 117216 133383
1823A33383P0788Q182p8081o0486O1216J9247q3317M4607j2766J2923O1847p165
$$ 133383 204171 212353 134272 73786 135002 154249 70932 115539 102773 115696 177543 170378
1811A70378n7263j1391O6578k4608q4860K3941K9357k6006k2451J7161k375L8358
$$ 170378 113115 101724 168302 143694 58834 82775 112132 86126 63675 80836 78461 116819
1799A16819M9515q8760J5993K0454N801o485l2591J3527L1837l9111r784j2091
$$ 116819 166334 77574 93567 114021 119822 113337 80746 94273 126110 86999 77215 65124
1787F5124j004q720P1206l1243m0053j5702N5270L3308L3501j3185o3243J3398
$$ 65124 64120 55400 126606 95363 55310 39608 94878 128186 161687 148502 85259 98657
1775I8657K9652l2585L545k9983N2960J3102p9739p7J6061R11K3423k1947l1237
$$ 98657 128309 95724 99269 69286 122246 135348 55609 55532 71593 72504 95927 73980 42743
1762D2743K2242n775O074J2024P2483J8753m2060J5311k0410p9804Q475K6835
$$ 42743 64985 59210 65284 77308 149791 168544 126484 141795 121385 41581 50056 76891
1750G6891O2815L8550o5114j1970o7801k7178l1579N5860N1425m9087q926N0526
$$ 76891 139706 178256 113142 101172 33371 6193 -25386 30474 81899 32812 23886 74412
1738G4412j8523J7115J3298k6485l9901j1185L7706O0200L6358j7488L6691n7411
$$ 74412 55889 73004 86302 59817 19916 8731 46437 106637 142995 125507 162198 104787
1726A04787m8786l4073j5362J3738P2892j9396l0756J7763j9194k7253J2852m6181
$$ 104787 56001 21928 6566 20304 93196 73800 43044 60807 41613 14360 27212 -18969
1714a8969P060O1795m4783J2841M087K0214n0041j6061Q500N0899N3354K0339
$$ -18969 -11909 49886 5103 17944 22031 42245 -7796 -23857 -15357 35542 88896 109235
1702A09235o3917m1964M8334k9039o638P1246n8651K4875Q2936j2433j002m8742
$$ 109235 45318 3354 51688 22649 16011 87257 28606 53481 136417 123984 122982 74240
1690G4240J5413L4764J0200p0617k0645k2347l5427N4903L4778p1409M6381o216
$$ 74240 89653 124417 134617 64000 43355 21008 -14419 40484 75262 3853 50234 44018
1678D4018L9983n6298k8691k607N8328M60J0107m097j8437mR2042l8884r8163
$$ 44018 84001 27703 -988 -3595 54733 55193 65300 61203 42766 42762 134804 95920 -2243
1665b243J839j2617Q9217l2855o2967K6051J8929J6056l2329n6054K1895L2090
$$ -2243 -404 -13021 76196 43341 -19626 6425 25354 41410 9081 -46973 -25078 7012
1653G012m2648J1377O0260j0572l5842M5979P2046q2529n575L2659n9348O4565
$$ 7012 -35636 -24259 36001 25429 -10413 35566 107612 25083 19508 52167 -7181 57384
1641E7384J6804j4065j2705K1728J1029j7128r2568m118L2522j3442j0222k2702
$$ 57384 74188 60123 47418 69146 80175 63047 -29521 -33639 -1117 -14559 -24781 -47483
1629d7483m8657r205L1117O6121L6363L6199J6157q891n7912m0626K5687l647
$$ -47483 -96140 -105345 -74228 -8107 28256 64455 80612 71721 13809 -26817 -1130 -4777
1617d777j0425K8901N8856q780m8742m1756L2250K94P7888k5390J3898M993K4040
$$ -4777 -15202 13699 72555 63775 15033 -26723 5527 5821 83709 58319 72217 77210 101250
1604A01250q527k9030Q35K1586k8763m729n1969j092q451M1006l9502k8539N1712
$$ 101250 92723 63693 64528 86114 57351 52622 653 -439 -8890 32116 -7386 -35925 15787
1591A5787M2052J6171k8361n7138q411M8418j0374O8951m9836o2625M5743J2915
$$ 15787 57839 74010 45649 -11489 -19900 28518 18144 87095 37259 -25366 20377 33292
1579C3292K2207K0593n9436P3440K981m1469j146j3813m3433k5470L9701J7166
$$ 33292 55499 76092 16656 90096 93077 51608 50462 36649 -6784 -32254 7447 24613
1567B4613N807J3144L5627n0006L2127q1538l57J5618J8510K1907k2586l1485
$$ 24613 30420 43564 79191 29185 61312 -20226 -20583 -4965 13545 35452 12866 -18619
1555a8619P5654m1126l6201N8014L2585l324k4558p295l7556j8980R944N5877
$$ -18619 57035 15909 -20292 37722 70307 66983 42425 35130 -2426 -21406 -11462 44415
1543D4415N302m3798J895M2576K0321p0203K4533j7332J6925n3733j3284N0071
$$ 44415 49717 5919 7814 50390 70711 508 25041 7709 24634 -29099 -42383 7688
1531G688k4093R116j7160m1203J7822N5161j2589M6911n7067j0022p5896L9602
$$ 7688 -16405 -7289 -24449 -65652 -47830 7331 -5258 41653 -15414 -25436 -101332 -61730
1519f1730K7306J5262L0560R016O0390o4321l6609M8819l6042j0226m0025O9284
$$ -61730 -34424 -19162 11398 20414 80804 16483 -20126 28693 -7349 -17575 -57600 11684
1507A1684M7026M8874k3455L2384k1668p2444J5547m9612M5020J5333l4887J122
$$ 11684 58710 107584 84129 116513 94845 22401 37948 -11664 33356 48689 13802 14924
1495A4924n862m4618P73j4450L842M0862M9292q254o5312j5434M6506k4473j9806
$$ 14924 9062 -35556 -34783 -49233 -45391 -4529 44763 36509 -28803 -44237 2269 -22204 -42010
1482d2010K8648M3995M8245J4363j03018k9228K483K3360K6482l1614m5808l9981
$$ -42010 -13362 30633 78878 93241 -9777 -39005 -36522 -13162 13320 -18294 -64102 -104083
1470a04083R9492j5940J2327k8384n5403k2327Q6935L4502P1181l8568k7464J3132
$$ -104083 -4591 -20531 -8204 -36588 -91991 -114318 -27383 7119 78300 39732 12268 25400
1458B5400K356l2288j3117J1558k1784J509j1589J3022O6105m3170N05M4151k3488
$$ 25400 27756 -4532 -17649 -6091 -27875 -26366 -37955 -24933 41172 -1998 -1493 42658 19170
1445A9170K3075K5276j7711l7696l186K0710L1218j1435o2431n0185L9316L0118
$$ 19170 42245 67521 49810 12114 8928 29638 60856 49421 -13010 -63195 -23879 6239
1433F239K2847o5591J9318M0763q843k713J1016N591K2240o3189J1759J5552O873
$$ 6239 29086 -36505 -17187 23576 14733 12020 23036 28627 50867 -12322 -563 14989 21862
1420B1862K7478j00287L8066k6144J0966J8032M6122k4891j7857J200j8944M2569
$$ 21862 49340 -50947 -12881 -39025 -28059 -10027 36095 11204 -6653 -5453 -24397 18172
1408A8172j4501P7440k4824l0847n2107j3544J3270K164j0858L7928j6506j2387
$$ 18172 3671 81111 56287 25440 -26667 -40211 -26941 -24777 -35635 2293 -14213 -26600
1396b6600K7784L3586L02l3060J942L5591k1861l1565m852j3280j9426O8738k4880
$$ -26600 1184 34770 35072 2012 3954 39545 17684 -13881 -18733 -32013 -51439 17299 -7581
1383g581k3879J9424l0275K4961O1345N3038oK6914j06119o5580l531J3158M5618
$$ -7581 -31460 -12036 -42311 -17350 43995 97033 97027 123941 17822 -47758 -51289 -38131 7487
1370G487k3306p28M6886J909m2198N8104J6113j6597p6383j0351M1823l0312n7055
$$ 7487 -15819 -16547 30339 32248 -9950 48154 64267 47670 -28713 -39064 2759 -27553 -84608
1357h4608R5046N2542l6348m6155l3940O1058J9819o9995j3693N7375k2856k1453
$$ -84608 10438 62980 26632 -19523 -53463 7595 27414 -42581 -56274 1101 -21755 -43208
1345d3208P3975k0833l7938K3923K5122J1687j6203R590l8426o0903J01659n849
$$ -43208 30767 9934 -28004 -4081 21041 32728 16525 26115 -12311 -73214 28445 22596
1333B2596m8988M996q1004J8110O8225M6182K3079l053K822j3287l8440j7507
$$ 22596 -26392 -21396 -102400 -84290 -16065 30117 53196 50143 52965 39678 1238 -16269
1321a6269M3426O4603j5878o1328J8935m6283l7187J0515J2797Q4979l0946L3661
$$ -16269 27157 91760 75882 14554 33489 -12794 -49981 -39466 -26669 58310 27364 61025
1309F1025R91j6767k4533l4955L7710p6761n1162J350L995J3425p106J5761N3521
$$ 61025 62016 45249 20716 -14239 23471 -53290 -104452 -103102 -99107 -85682 -92788 -77027 -23506
1296b3506J1R845k5265L3795q279k6434N9742m4892L1615o7824k7536J4073K2308
$$ -23506 -23495 -13650 -38915 -5120 -13399 -39833 19909 -24983 6632 -61192 -88728 -74655 -52347
1283e2347L5345Nk1029l5566j6145Q9657K6098L0625j3708l1404l8538K1618l7886
$$ -52347 -17002 -16997 -38026 -73592 -89737 -80 26018 56643 42935 11531 -27007 -5389 -43275
1270d3275K3774L9504l3442o740M031J0692l9316j5801N1636j282l7198J0111
$$ -43275 -19501 20003 -13439 -20179 -16148 -5456 -44772 -60573 -8937 -10219 -47417 -37306
1258c7306J1338r521J0847k2087L932j1211K0317j942K564K3897k0787N6177K589
$$ -37306 -25968 -35489 -24642 -46729 -42797 -54008 -33691 -35633 -33069 -9172 -29959 26218 28807
1245B8807o471l2733o358K2651L0200r789K1894L6622l4682p191m1728K356j718
$$ 28807 22336 -10397 -16755 5896 36096 26307 48201 84823 50141 42950 1222 3578 1860
1232A860j9295L8162J7574O3676k2399p370k2665k8419K2770m4379m2044O1389
$$ 1860 -17435 20727 38301 101977 79578 72208 49543 21124 43894 -485 -42529 18860
1220A8860o9438N274K5748l4307L6244j5571L025o669J594L1695N3532m5544J4480
$$ 18860 -50578 -45304 -19556 -53863 -17619 -33190 -30165 -36834 -35240 -3545 49987 4443 18923
1207A8923O5275j00410O100J7121p4993j8203K8636K3395q667K0477N3436m5459
$$ 18923 84198 -16212 -10112 7009 -67984 -86187 -57551 -34156 -42823 -22346 31090 -14369
1195a4369n4064j1360K0146M3657P6353k0062q3685o23L938K2232R271J7834l8654
$$ -14369 -68433 -79793 -59647 -15990 60363 40301 -43384 -44007 -40069 -17837 -8566 9268 -29386
1182b9386Q124L7233k054l0474l6558P2431O769K0759q250o2548K3726k1020o1410
$$ -29386 -21262 15971 13917 -16557 -53115 19316 26085 46844 38594 -23954 -228 -21248 -82658
1169h2658M0313k2914L5758J4741J126L190l8877J8858j9131j0593K8479L054
$$ -82658 -42345 -65259 -29501 -14760 -13634 -10444 -49321 -30463 -49594 -60187 -31708 -28654
1157b8654N9362j2573J6948o0585L6879J9196l2971L5874l6108K4980K9904J0957
$$ -28654 30708 18135 35083 -25502 11377 30573 -2398 33476 -2632 22348 52252 63209
1145F3209K7689j5703k0550m617n267M5705p3076k8577K4344L5404M437m619j6653
$$ 63209 90898 75195 54645 50028 44761 90466 17390 -11187 13157 48561 52998 48379 31726
1132C1726L5059n9636n5619j3386M0586l4472M1269M2601N362o2703L5107J4560
$$ 31726 66785 7149 -48470 -61856 -21270 -55742 -14473 28128 33490 -29213 5894 20454
1120B0454m3625L8700p468J8971l0526l0343N263P0115k8479n1023m477Q771j2037
$$ 20454 -23171 15529 8061 27032 -3494 -33837 -28574 41541 13062 -37961 -42438 -33667 -45704
1107d5704j0190L8116J3181P962M9193K4756j0161k9372k7903l7616k132l794
$$ -45704 -55894 -17778 -4597 3365 52558 77314 67153 37781 9878 -27738 -29870 -33664
1095c3664O2498P647p787k6430l256k0076o6686L7631L1998K405j653K7276p599
$$ -33664 28834 36481 28694 2264 -992 -21068 -87754 -50123 -18125 -15720 -17373 9903 2304
1082B304k232J8997q704l0781j3907k63o0475J0687M5470k1454J07810n7617N348
$$ 2304 72 19069 10365 -20416 -34323 -34586 -95061 -84374 -38904 -60358 47452 -10165 -4817
1069d817r716j6579K4063M7456K7609n6678M6244l2290j1230K0033k9906L890
$$ -4817 -14533 -31112 -7049 40407 68016 11338 57582 25292 14062 34095 4189 8079
1057H079k441n0008L9450J0234l8110k0565K7933k2852K6898k9798K640j763O112
$$ 8079 5638 -44370 -4920 5314 -32796 -53361 -25428 -48280 -21382 -51180 -48540 -50303 -44191
1044d4191L4123L3823j7611N044m759R4567j0440n7200n3454L843K0294j1400
$$ -44191 -10068 23755 6144 11188 6429 100996 90556 33356 -20098 -16255 4039 -7361
1032g361O2868q735k1366o9109R231J4936N2216n2362m865L4331Q856R186k9014
$$ -7361 55507 46772 25406 -43703 -34472 -19536 32680 -19682 -24547 9784 18640 27826 -1188
1019a188M0569k1299j3869l1565M8027l9865q3215L9013j7102j4021J9541O1636
$$ -1188 39381 18082 4213 -27352 20675 -19190 -102405 -63392 -80494 -94515 -74974 -13338
1007a3338J2281k313j5936o685j9413Q2865m6402k5336M8296j2771j610P258q5348
$$ -13338 -1057 -3370 -19306 -25991 -45404 37461 -8941 -34277 14019 1248 -362 6896 -78452
994g8452L0780J59208r2529n7125K5375K9819j9116k0737N1758o724o3792k9377
$$ -78452 -47672 111536 19007 -38118 -12743 17076 -2040 -22777 28981 22257 -41535 -70912
982g0912J4759o271K1548P4411r38l4570L2636j2135J9302M1026m4339p7996j4253
$$ -70912 -56153 -62424 -40876 33535 32597 -1973 30663 18528 37830 78856 34517 -43479 -57732
969e7732J9913q524j4024M8926J97m7880k6328Q906K4367J9344m4938O880P2782
$$ -57732 -37819 -46343 -60367 -11441 -11244 -59124 -85452 -76546 -52179 -32835 -77773 -70893 1889
956A889K9905n7737J7929l5796m355l6867N1289j9915L9974K9681Q413m7594l0320
$$ 1889 31794 -25943 -8014 -43810 -48165 -85032 -33743 -53658 -13684 15997 24410 -23184 -53504
943e3504J4970j429O574M5625k6376l1106J3601n0381M8821l2488L8572n634L5954
$$ -53504 -38534 -39963 -33389 12236 -14140 -45246 -31645 -82026 -33205 -65693 -27121 -32755 3199
930C199M09m1032K479l1902L978M3554J1007n9528M867N7432J5155k1764o0612
$$ 3199 3608 -37424 -34945 -66847 -62869 -19315 -8308 -67836 -62969 -5537 9618 -12146 -72758
917g2758J8955k8154R4953m8001k3774M1597N3538k5162l3210Q1596K0907p7251
$$ -72758 -53803 -81957 12996 -35005 -58779 -17182 36356 11194 -22016 59580 80487 3236
905C236q7993J7892M4386n0244J0497K3079L3222O959k9774j842L9760m8665N3630
$$ 3236 -84757 -66865 -22479 -72723 -62226 -39147 -5925 1034 -28740 -30582 9178 -39487 14143
892A4143J11q830L0512r1407L8950M6186j02508m090J2989O4063p019N003j4922
$$ 14143 14254 5424 35936 -55471 -16521 29665 -72843 -76933 -63944 119 -6900 -1897 -16819
879a6819K3749j3400J5364K7095j3805o1470J4398J8620n2424k1747K0392O1032
$$ -16819 6930 -6470 8894 35989 22184 -39286 -24888 -6268 -58692 -80439 -60047 985
867I85l8539n9907m278m334M3929J09373k1422o2925k0322q646l1493Q0003M9368
$$ 985 -37554 -97461 -101739 -106073 -62144 47229 25807 -37118 -57440 -66086 -97579 -17576 31792
854C1792j8160j02473Q0789J2845j5M5522q359o6949M4882K7418m6919q380J7572
$$ 31792 13632 -88841 -8052 4793 4778 50300 41941 -25008 19874 47292 373 -8007 9565
841I565r6599N8730K3297K1068j7131j9181M2105O457L1011j0789m2355j648N6872
$$ 9565 -87034 -28304 -5007 16061 -1070 -20251 21854 28311 59322 48533 6178 4530 61402
828F1402j0867m4452j4967J6528n8671Q233O8551m3309l9295O2653p5899R989
$$ 61402 50535 6083 -8884 7644 -51027 -42794 25757 -17552 -56847 5806 -70093 -60104
816f0104N2269j2995j9065L63J7718j379j9086L730K1275n3290L8484K080o5812
$$ -60104 -7835 -20830 -39895 -39532 -21814 -23193 -42279 -38549 -17274 -70564 -32080 -30000 -95812
803i5812N5776N9081J3903J2713q165m1801R806k8j008J0131k4432J4320k293
$$ -95812 -40036 19045 32948 45661 37496 -4305 5501 5473 4465 14596 -9836 4484 2191
790B191k5280k1522L9315j7471l4258P603l222M3087J0040k0425k0010K3341l0108
$$ 2191 -23089 -44611 -5296 -22767 -57025 -49422 -52644 -9557 483 -19942 -39952 -16611 -46719
777d6719m4415O5090m582P249J8674l1240J1023M2701l0156j9395L2625N9736
$$ -46719 -91134 -26044 -30626 -23377 -4703 -35943 -24920 17781 -12375 -31770 855 60591
765F0591m817J1025p9614N0671l1568J9199m3238r8608K8549M6296P3873l5038
$$ 60591 55774 66799 -12815 37856 6288 25487 -17751 -116359 -87810 -41514 32359 -2679
753b679k60k0149L0226k6369m3595Q5079R608k5484L5501N376k1450J9047m1793
$$ -2679 -2939 -23088 7138 -19231 -62826 22253 31861 6377 41878 47254 25804 44851 3058
740C058R5922o8012r9168J2417O017K6148J2514O4474q2845J9483j1109J5967
$$ 3058 98980 30968 -68200 -55783 -49766 -23618 -11104 53370 -29475 -9992 -21101 -5134
728e134j9922k1432K4592K4151J4746k346K6546j3932L1464M7011p2479o184o1106
$$ -5134 -25056 -46488 -21896 2255 17001 14655 41201 27269 58733 105744 33265 27081 -34025
715c4025m8195j6028N1520K576N2186O2199m5790o486J8453l5729M816N6288k4100
$$ -34025 -82220 -98248 -46728 -44152 8034 70233 24443 17957 36410 681 5497 61785 37685
702C7685r096L3296m2366N0244k5419p3378R200R233j2343r271o5410L7089N3122
$$ 37685 28589 61885 19519 69763 44344 -29034 -19834 -10601 -22944 -32215 -97625 -60536 -7414
689g414o9653k9785J03147q013K094k5030k0024K2224J7373M4632j0245k9240
$$ -7414 -77067 -106852 -3705 -11718 -9624 -34654 -54678 -32454 -15081 29551 19306 -9934
677i934n9866Q39L0303Q6803k5530m2802N9938l037q3738L3040P9343k2101j2849
$$ -9934 -69800 -68961 -38658 48145 22615 -20187 39751 36714 -47024 -13984 65359 43258 30409
664C0409k4577M3087p849o761m5098P174K0583J5299N0330j09426m3052L4674
$$ 30409 5832 48919 41070 34309 -10789 -3615 16968 32267 82597 -26829 -69881 -35207
652c5207K82p937M3602K2773j3379p261j5538J0043k620J2915r61q718L4363L2528
$$ -35207 -34925 -42862 740 23513 10134 2873 -12665 -2622 -5242 7673 6712 -2006 32357 64885
638F4885l3002j468J6858j2739J408k3925N694m5269K121K3271q729k464P2276
$$ 64885 31883 30415 47273 34534 35942 12017 17711 -27558 -25437 -2166 -10895 -13359 58917
625E8917k3155j4818k6703L578n7708R570P3937p860k8537j769o23J7209l0006
$$ 58917 35762 20944 -5759 -2181 -59889 -50319 23618 15758 -12779 -14548 -15171 2038 -27968
612b7968l1413K1149K0205N1203l4778m974N642J8535J7177k9654L120m0039L6898
$$ -27968 -59381 -38232 -18027 33176 -1602 -6576 -934 17601 34778 5124 8244 -31795 5103
599E103n566J7857K4970J5315k9880n120l6460k8996K6600N7836j6257n6593l5815
$$ 5103 -463 17394 42364 57679 27799 22679 -13781 -42777 -16177 41659 25402 -31191 -67006
586f7006P1918K7702N2843K8970o3814m8433m6680j5997J04532n469m229K9369
$$ -67006 4912 32614 85457 114427 50613 2180 -44500 -60497 44035 38566 34337 63706
574F3706o4003n8417K6637O6528k7911J9031K609l0317n32n5631n7672M5244J0795
$$ 63706 -297 -58714 -32077 34451 6540 25571 28180 -2137 -2669 -58300 -115972 -70728 -59933
561e9933P2862j6120Q904j2211M9468k848k2979K2292N0447l9600m4054q379M076
$$ -59933 12929 -3191 5713 -6498 42970 40122 17143 39435 89882 50282 6228 -2151 1925
548A925Q022j5797k6337L8484K4479q2843l5527O2813L8391J0467j6855J0228
$$ 1925 9947 -5850 -32187 6297 30776 -52067 -87594 -24781 13610 24077 7222 17450
536A7450L3911m9344j2257M7992M6549p7623k4595P3160L5146L2513j4069q344
$$ 17450 51361 2017 -10240 37752 84301 6678 -17917 55243 90389 122902 108833 100489
524A00489M089j10107P171p4820l6776K3154J1129k504M7322N2697j8731k5245
$$ 100489 104578 -5529 1642 -73178 -109954 -86800 -75671 -78175 -30853 21844 3113 -22132
512b2132r61P980L3636j4425n1339L3320p193K3915k0745L6973j8588L1941m7244
$$ -22132 -23093 -15113 18523 4098 -47241 -13921 -21114 2801 -17944 19029 441 32382 -14862
499a4862L0069J9486l7690l2858r548j120P7343M7018q1602l3047K6337N7561
$$ -14862 15207 34693 -2997 -35855 -45403 -46523 30820 77838 -3764 -36811 -10474 47087
487D7087n5307j2262n082m387j4632p825L5038l7934M3711K5181o5790M4148J8374
$$ 47087 -8220 -20482 -25564 -29951 -44583 -52408 -17370 -55304 -11593 13588 -52202 -8054 10320
474A0320k9009j2180M2636J5135n7420K0574j2382L9799l3117N364L0936L5347
$$ 10320 -18689 -30869 11767 26902 -30518 -9944 -22326 17473 -15644 -10280 20656 56003
462E6003l1721o981m2849N2287K5420L759n9791m80m872K0679L5575n1041r203
$$ 56003 24282 17301 -25548 26739 52159 55918 -3873 -4353 -9225 11454 47029 -4012 -13215
449a3215K7799k8763J1094J6615m206k0039K7292N8439k5808N0552k9660n184
$$ -13215 14584 -14179 -3085 13530 9324 -10715 16577 75016 49208 99760 70100 64916
437F4916l8670K7024k0894N959P431L107j839O1865j04915m8990L1791O5123K969
$$ 64916 26246 53270 32376 38335 45766 48873 47034 108899 3984 -45006 -13215 51908 54877
424E4877M6864n8613K0939r708J31k3649o0919J5117K9121J179O1j1566j2627
$$ 54877 101741 43128 64067 54359 54490 30841 -30078 -14961 14160 15339 15400 3834 -8793
411h793q168M2201L0785j9185K5980n1948M0439l7645m2886J9564K0473J1637
$$ -8793 -16961 25240 56025 36840 62820 10872 51311 13666 -29220 -9656 10817 22454
399B2454J065K1469N306p0563O2970P5119j77582M7795P2801j3909l5193j9284
$$ 22454 23519 44988 50294 -20269 42701 117820 -59762 -11967 60834 46925 11732 -7552
387g552K474K7107M1775n0799J6598L0137L8781l6247L1380k7524m9522L3887
$$ -7552 -5078 22029 63804 13005 29603 59740 98521 62274 93654 66130 16608 50495
375E0495n7541o7N6750l4688l5153J06963l4093j7594j3689M466J4683k5804L0002
$$ 50495 -7046 -7113 49637 14949 -20204 86759 52666 35072 21383 25849 40532 14728 44730
362D4730m7651M5808K352k8408L0688k681p5726P5148R1011m0355l6353J5056
$$ 44730 -2921 42887 45239 16831 47519 44838 -30888 44260 135271 94916 58563 73619
350G3619l6301L7346j00951m1122P9190L7223L07P213k9194m0741L0732N4886
$$ 73619 37318 74664 -26287 -67409 11781 49004 49311 56524 27330 -13411 17321 72207
338G2207L029j30345J5966l9254K061J09463o085J4929M7482m8062m4525N3778
$$ 72207 75236 -55109 -39143 -78397 -76336 33127 27042 41971 89453 41391 -3134 50644
326E0644n7347m8074R539m410N1062j1663M0605L0975K4073M0837o8176j639K0524
$$ 50644 -6703 -54777 -45238 -49648 1414 -10249 30356 61331 85404 126241 58065 56426 76950
313G6950k9502K9242Q837n9945k4j3850K2817j7912p400j1256J7645Q4838J8493
$$ 76950 47448 76690 85527 25582 25558 11708 34525 16613 9213 -2043 15602 100440 118933
300A18933o3259n2211Q8226l0604p5272O4121r8975k9487K6236N8982l502L745
$$ 118933 55674 3463 91689 61085 -14187 49934 -49041 -78528 -52292 6690 3188 6933
288F933j1249j5861J6534p037P5841M1782J8213k1810k4507l0366M3951k4387
$$ 6933 -4316 -20177 -3643 -10680 65161 106943 125156 103346 78839 48473 92424 68037
276F8037l8463J9631M3967o9025K1959k4176j6379J729K286J4960L1817J7810
$$ 68037 29574 49205 93172 24147 46106 21930 5551 7280 9566 24526 56343 74153
264G4153l4410L6754q031R978n2389k0105O6550o910O608k0680J8786Q574l3540
$$ 74153 39743 76497 68466 78444 26055 5950 72500 65590 72198 51518 70304 78878 45338
251D5338M3792l2413J226K5718m4196j7632m1092L8478J2545K73j7480L8080J700
$$ 45338 89130 56717 57943 83661 39465 21833 -19259 19219 31764 32037 14557 52637 54337
238E4337p1345N2150O4409n1949m6657k8697k0359L8178k1823M4110K0482J1901
$$ 54337 -17008 35142 99551 47602 945 -27752 -48111 -9933 -31756 12354 32836 44737
226D4737p6759m4524K1684J70090q928j9571K4J1833K409l5166Q006q978j1694
$$ 44737 -32022 -76546 -54862 115228 106300 86729 86753 98586 100995 65829 73835 64857 53163
213E3163L8602p0673m400N899k5502K8867p956Q50l3035L9071K2434K9147k4101
$$ 53163 91765 21092 16692 22591 -2911 25956 18000 18850 -14185 24886 47320 76467 52366
200E2366n1877J1849M2212k5969J8950o7826J9505K3398J4471M0874k5700j6184
$$ 52366 489 12338 54550 28581 47531 -20295 -790 22608 37079 77953 52253 36069
188C6069O8746K716j1012n8045q986k801k152J7440l1580n396q290p205J8962
$$ 36069 104815 107531 96519 38474 29488 26687 24535 41975 10395 4999 -3291 -10496 8466
175H466N0604m6474m1649K8108M6965k2420p56M3416J2732M0397j9890J3389p4901
$$ 8466 59070 12596 -29053 -945 46020 23600 22844 66260 78992 119389 99499 112888 37987
162C7987R538J0923l6879N674M0193M7821m5871K7208L5993n7146n8118L8575
$$ 37987 47525 58448 21569 27243 67436 115257 69386 96594 132587 75441 17323 55898
150E5898j9578M2749k6681n9448o1058N6158N8387K933k3049q3473P8235J8716
$$ 55898 36320 79069 52388 -7060 -68118 -11960 46427 49360 26311 -57162 21073 39789
138C9789n088o430j7909M350K0899K6225K8495l1989j5353l143n011M8823k7590
$$ 39789 34701 28271 10362 14712 35611 61836 90331 58342 42989 39846 34835 83658 56068
125E6068n8016M1593J5593m3621j845K7853j9510K0752l9560O38J4373K8385K6447
$$ 56068 -1948 39645 55238 11617 9772 37625 18115 38867 -693 -55 14318 42703 69150
112F9150o9238J7338K8505j0828j2538r860R547O3607p538l1204M2585L5625p0416
$$ 69150 -88 17250 45755 34927 22389 12529 22076 85683 78145 46941 89526 125151 54735
99E4735j0244l9828N2677K4737j5091O0851n5441l1620J6784J6654o004K16l1312
$$ 54735 44491 4663 57340 82077 66986 127837 72396 40776 57560 74214 68210 68426 37114
$$ [...]
##END NTUPLES=NMR SPECTRUM
##END=
