##TITLE=1H_CA-9139-23x
 DMSO
 8 sc, 
 18.4.2023
##JCAMPDX= 6.0         $$ Bruker NMR JCAMP-DX V2.0
##DATA TYPE= NMR SPECTRUM
##DATA CLASS= NTUPLES
##ORIGIN= UXNMR, Bruker Analytische Messtechnik GmbH
##OWNER= root
$$ XWIN-NMR		Version 3.5
$$ Tue Apr 18 15:25:55 2023 Russian Standard Time (UT+4h)  she@DPX200
##.OBSERVE FREQUENCY= 200.13135
##.OBSERVE NUCLEUS= ^1H
##.ACQUISITION MODE= SIMULTANEOUS
##.ACQUISITION SCHEME= undefined
##.AVERAGES= 8
##.DIGITISER RES= 18
##SPECTROMETER/DATA SYSTEM= spect
##.PULSE SEQUENCE= zg30
##.SOLVENT NAME= DMSO
##.SHIFT REFERENCE= (INTERNAL, DMSO, 0, 15.7491)
##AUDIT TRAIL= $$ (NUMBER, WHEN, WHO, WHERE, WHAT)
$$ ##TITLE= Audit trail, XWIN-NMR		Version 3.5
$$ ##JCAMPDX= 5.01
$$ ##ORIGIN= Bruker BioSpin GmbH
$$ ##OWNER= she
$$ F:/spectra/data/she/nmr/H-F/1/pdata/1/auditp.txt
$$ ##AUDIT TRAIL=  $$ (NUMBER, WHEN, WHO, WHERE, WHAT)
(   1,<2023-04-18 15:24:41.00 +0400>,<she>,<DPX200>,
      <created by zg, POWCHK disabled, PULCHK disabled
       configuration hash MD5:
       00 E9 B6 7A A2 85 ED C7 34 08 36 98 17 FE 4E 26
       data hash MD5: 16K
       63 89 07 04 5C 44 D4 81 17 AF D7 B2 89 8D 9C 3B>)
(   2,<2023-04-18 15:24:43.29 +0400>,<she>,<DPX200>,
      <Start of raw data processing
       efp BC_mod = 2 LB = 0.24 FT_mod = 6 PKNL = 1 PHC0 = -19827.15 PHC1 = 7.80081 SI = 16K 
       data hash MD5: 16K
       F6 2F 0E 0A 8F 9D 37 78 DF 17 7A E6 09 3F F1 52>)
(   3,<2023-04-18 15:25:04.37 +0400>,<she>,<DPX200>,
      <pk PHC0 = -5.652131 PHC1 = 4 
       data hash MD5: 16K
       36 D5 17 37 42 AF 5B 40 1D 5D 82 F5 B4 AE 9C D4>)
(   4,<2023-04-18 15:25:07.54 +0400>,<she>,<DPX200>,
      <abs ABSG = 5 
       data hash MD5: 16K
       17 94 85 F6 C2 E4 8D 5D FA 9C D8 48 86 0F 89 C0>)
$$ ##END=
$$ 
$$ hash MD5
$$ 1C 7A B7 B7 3F 4C 39 54 91 55 1E BE D7 1E 65 49
##$RELAX= 
##$RELAX= 
##$RELAX= 
##$RELAX= 
##$RELAX= 
##$RELAX= 
$$ Bruker specific parameters
$$ --------------------------
##$DU= <F:/spectra>
##$EXPNO= 1
##$NAME= <H-F>
##$PROCNO= 1
##$TYPE= <nmr>
##$USER= <she>
##$AMP= (0..31)
100 100 100 100 100 100 100 100 100 100 100 100 100 100 100 100 100 100 
100 100 100 100 100 100 100 100 100 100 100 100 100 100 
##$AQSEQ= 0
##$AQ_mod= 1
##$AUNM= <au_zg>
##$AUTOPOS= <>
##$BF1= 200.13
##$BF2= 200.13
##$BF3= 200.13
##$BF4= 200.13
##$BF5= 200.13
##$BF6= 200.13
##$BF7= 200.13
##$BF8= 200.13
##$BYTORDA= 1
##$CFDGTYP= 0
##$CFRGTYP= 5
##$CHEMSTR= <none>
##$CNST= (0..31)
1 1 145 1 1 1 1 1 1 1 1 1 1 1 1 1 1 1 1 1 1 1 1 1 1 1 1 1 1 1 1 1 
##$CPDPRG= <>
##$CPDPRG1= <>
##$CPDPRG2= <>
##$CPDPRG3= <>
##$CPDPRG4= <mlev>
##$CPDPRG5= <mlev>
##$CPDPRG6= <mlev>
##$CPDPRG7= <mlev>
##$CPDPRG8= <mlev>
##$CPDPRGB= <>
##$CPDPRGT= <>
##$D= (0..31)
0 1.2 0 0 0 0 0 0 0 0.06 0 0.03 0 0 0 0 0.0002 0 0 0 0 0 0 0 0 0 0 0 0 
0 0 0 
##$DATE= 1681817080
##$DBL= (0..7)
120 120 120 120 120 120 120 120 
##$DBP= (0..7)
150 150 150 150 150 150 150 150 
##$DBP07= 0
##$DBPNAM0= <>
##$DBPNAM1= <>
##$DBPNAM2= <>
##$DBPNAM3= <>
##$DBPNAM4= <>
##$DBPNAM5= <>
$$ [...]
##$SUBNAM3= <"">
##$SUBNAM4= <"">
##$SUBNAM5= <"">
##$SUBNAM6= <"">
##$SUBNAM7= <"">
##$SUBNAM8= <"">
##$SUBNAM9= <"">
##$SW= 18.05172834244
##$SWIBOX= (0..15)
0 0 2 0 0 0 0 0 0 0 0 0 0 0 0 0 
##$SW_h= 3612.71676300578
##$TD= 16384
##$TD0= 1
##$TE= 0
##$TE2= 300
##$TE3= 300
##$TEG= 300
##$TL= (0..7)
0 120 120 120 120 120 120 120 
##$TP= (0..7)
150 150 150 150 150 150 150 150 
##$TP07= 0
##$TPNAME0= <>
##$TPNAME1= <>
##$TPNAME2= <>
##$TPNAME3= <>
##$TPNAME4= <>
##$TPNAME5= <>
##$TPNAME6= <>
##$TPNAME7= <>
##$TPOAL= (0..7)
0.5 0.5 0.5 0.5 0.5 0.5 0.5 0.5 
##$TPOFFS= (0..7)
0 0 0 0 0 0 0 0 
##$TUNHIN= 0
##$TUNHOUT= 0
##$TUNXOUT= 0
##$USERA1= <user>
##$USERA2= <user>
##$USERA3= <user>
##$USERA4= <user>
##$USERA5= <user>
##$V9= 5
##$VALIST= <valist>
##$VCLIST= <CCCCCCCCCCCCCCC>
##$VD= 0
##$VDLIST= <DDDDDDDDDDDDDDD>
##$VPLIST= <PPPPPPPPPPPPPPP>
##$VTLIST= <TTTTTTTTTTTTTTT>
##$WBST= 1024
##$WBSW= 4
##$XGAIN= (0..3)
0 0 0 0 
##$XL= 0
##$YL= 0
##$YMAX_a= 86112
##$YMIN_a= -96523
##$ZGOPTNS= <>
##$ZL1= 120
##$ZL2= 120
##$ZL3= 120
##$ZL4= 120
##$ABSF1= 15.74579
##$ABSF2= -2.30606
##$ABSG= 5
##$ABSL= 3
##$ALPHA= 0
##$AQORDER= 0
##$ASSFAC= 0
##$ASSFACI= 0
##$ASSFACX= 0
##$ASSWID= 0
##$AUNMP= <proc_1d>
##$AZFE= 0.1
##$AZFW= 0.1
##$BCFW= 0
##$BC_mod= 2
##$BYTORDP= 0
##$COROFFS= 0
##$CY= -3
##$DATMOD= 1
##$DC= 0
##$DFILT= <>
##$DTYPP= 0
##$F1P= 0
##$F2P= 0
##$FCOR= 1
##$FTSIZE= 16384
##$FT_mod= 6
##$GAMMA= 0
##$GB= 0
##$INTBC= 1
##$INTSCL= 3.70164e-10
##$ISEN= 128
##$LB= 0.24
##$LEV0= 0
##$LPBIN= 0
##$MAXI= 10000
##$MC2= 0
##$MEAN= 0
##$ME_mod= 0
##$MI= 1.114404
##$NCOEF= 0
##$NC_proc= -8
##$NLEV= 6
##$NOISF1= 3.799351
##$NOISF2= 2.8
##$NSP= 0
##$NTH_PI= 0
##$NZP= 0
##$OFFSET= 15.74909
##$PC= 1
##$PHC0= -19832.8
##$PHC1= 11.80081
##$PH_mod= 1
##$PKNL= yes
##$PPARMOD= 0
##$PSCAL= 0
##$PSIGN= 0
##$REVERSE= no
##$SF= 200.130004492079
##$SI= 16384
##$SIGF1= 3
##$SIGF2= 2
##$SINO= 5.538805
##$SIOLD= 16384
##$SREGLST= <1H.CDCl3>
##$SSB= 0
##$STSI= 16384
##$STSR= 0
##$SW_p= 3612.71676300578
##$SYMM= 0
##$S_DEV= 0
##$TDeff= 16384
##$TDoff= 0
##$TI= <>
##$TILT= no
##$TM1= 0
##$TM2= 0
##$TOPLEV= 0
##$USERP1= <user>
##$USERP2= <user>
##$USERP3= <user>
##$USERP4= <user>
##$USERP5= <user>
##$WDW= 1
##$XDIM= 16384
##$YMAX_p= 337450688
##$YMIN_p= -1053388
$$ End of Bruker specific parameters
$$ ---------------------------------
##NTUPLES= NMR SPECTRUM
##VAR_NAME=  FREQUENCY,     SPECTRUM/REAL,   SPECTRUM/IMAG
##SYMBOL=    X,             R,               I
##VAR_TYPE=  INDEPENDENT,   DEPENDENT,       DEPENDENT
##VAR_FORM=  AFFN,          ASDF,            ASDF
##VAR_DIM=   16384,         16384,           16384
##UNITS=     HZ,            ARBITRARY UNITS, ARBITRARY UNITS
##FACTOR=    0.220516191357247, 1,           1
##FIRST=     3151.8654914119, 0,             0
##LAST=      -460.851271593882, 0,           0
##MIN=       -460.851271593882, -1053388,    0
##MAX=       3151.8654914119, 337450688,     0
$$ Real data points
##PAGE= N=1
##DATA TABLE= (X++(R..R)), XYDATA
$$ [...]
8014 -7717 -277251 -75184 -315958 -240931 113068 -118106 -75048 -186022 -183409 296719 231626
8003 231626 -14113 -296191 -234622 -96290 -247760 -254740 -43887 -194472 -423854 -671341
7993 -671341 -650789 -351914 -302446 -486443 225984 -298431 -303428 57466 -223210 -116537
7983 -116537 -114690 88279 -292846 -263341 -119038 240624 -23366 -266139 -21010 276027
7973 276027 223103 183866 238853 199443 -110104 117638 258098 199748 -130672 -380083 -415869
7962 -415869 -572497 -519201 -415342 -125023 57182 -320106 -60581 217156 160981 -228186
7952 -228186 -443438 -385361 -380110 -134255 112849 225566 569923 50530 -359163 -562457
7942 -562457 -404003 -178567 -428515 -522236 55274 12094 -130075 242214 -216889 157113
7932 157113 280481 271610 144568 -220600 -312347 -310065 -557473 -377591 -286130 -324884 -343831
7921 -343831 -64347 195093 146874 285933 -145666 -2057 -7556 -188387 72361 -174745
7911 -174745 -296206 -33807 -215345 -465619 -454429 -99763 82653 249576 332261 -42116
7901 -42116 -699682 -656782 -354522 -213094 -233537 -453266 -640825 -371830 -381522 -398136 -197665
7890 -197665 -160766 44068 -33463 155457 300148 38886 -406454 -193221 -185184 -46227
7880 -46227 9726 43755 116986 -253347 -652695 -424729 -441197 -420647 -195970 84599 44095
7869 44095 -112583 -43954 -215854 -183449 -144357 -442571 -416564 -70448 130666 -79865 127267
7858 127267 138089 119415 199304 31730 296991 206777 31701 -154949 -32278 -28057 -463142
7847 -463142 -476292 -388127 -535213 -135445 1276 11696 286279 193418 95862 65957 -181301
7836 -181301 -161145 -433153 -312035 -57665 -35421 89285 286043 200038 -28227 -304810
7826 -304810 -229907 -273807 -168308 -432703 -432121 -81410 -33961 243794 -71067 -541116 -630623
7815 -630623 -401086 -368187 -250472 -222709 213641 -277500 -478050 -95867 145120 -103875
7805 -103875 -392027 -675934 -848505 -1053388 126703 549384 -44528 -140975 -132062 17097
7795 17097 34831 -215059 -462167 -310213 -356927 -228521 21943 54888 125397 -244032 -410290
7784 -410290 -414952 -81193 130775 103224 28743 -338374 -470235 -618950 -414650 -145062
7774 -145062 -166702 -216740 -381456 -467068 133398 -93464 -79618 -125944 -436583 -647673 -291273
7763 -291273 -339335 -472291 -196835 -198097 -190711 -211796 -261429 -257678 -75866 -44977 -222847
7752 -222847 -266465 -562573 -607518 -574628 -328005 -433241 -291099 29490 -158934 -221801
7742 -221801 143915 127585 91303 -290727 -679922 -585808 -219842 428215 101631 212294
7732 212294 122687 -251087 -159163 -560487 -549205 -124997 169162 335006 72315 -176710
7722 -176710 -247258 -178556 -117058 69451 -126775 -225318 121386 152059 -13410 -80476 140679
7711 140679 480536 503855 -33583 -162702 139010 201442 -317761 -670826 -419388 -529229
7701 -529229 -722338 -542321 -441250 -173233 56920 28754 -68678 -269311 -682182 -287689
7691 -287689 -110322 14822 227377 -113488 -57210 -410956 -309621 -671183 -777024 216056
7681 216056 -236496 -307529 -136719 -295743 -229757 -585168 -359519 -206021 179931 -35751
7671 -35751 -383277 -395994 -531440 -304959 -300904 -575792 -409501 -203345 -163344 -170288 -97914
7660 -97914 10239 -35019 32567 131213 -70404 -40614 -353725 -561591 -583201 -454140 -140367
7649 -140367 -217783 -263046 -521175 -197101 -30305 361183 577658 -102486 -192484 -112696
7639 -112696 -144431 -343021 -579523 78570 183294 -120221 -153505 2034 -26264 -417241
7629 -417241 -250984 229818 319456 424527 -163974 -247088 -137917 -513494 -691139 -702712
7619 -702712 -270692 -363351 45694 -576739 -348933 140048 127812 -163543 17009 183458
7609 183458 12931 108221 -40898 473128 373760 133705 -315925 -397708 -118340 46248
7599 46248 -175885 338801 484794 260115 -67036 233759 206897 7500 294516 241008
7589 241008 117136 76257 253903 -21567 -7049 -9044 200325 382821 447045 -69785 -3861
7578 -3861 104266 211241 -252688 -470371 -215459 -40545 -38468 -213302 -230824 -793313 -671333
7567 -671333 -248844 -138606 294093 -357381 -420974 50690 116834 607707 394362 49082
7557 49082 -552803 -392856 -158805 -334038 -308129 -205276 40924 42307 140937 16353 58523
7546 58523 -149064 -510721 -235565 21597 -189995 59580 -110345 -418535 -156518 219224
7536 219224 -52472 -337275 -413109 -330881 -228327 181502 207860 27754 -215477 -86901
7526 -86901 -209934 -3927 5218 -235192 -22424 -322074 -78602 -227543 -251697 -382813
7516 -382813 -289752 -350628 -87781 -319264 64123 46819 311869 299553 187590 16418
7506 16418 -65342 213002 415500 -16013 -204667 -300324 -374605 -146714 50750 -73060
7496 -73060 -115155 -303400 -650595 -775539 -273451 143525 -57247 -310441 -473062 -88759
7486 -88759 104869 92086 413788 256430 195277 629021 447096 66786 -25711 32450 164922
7475 164922 173395 206255 -20536 -193121 -141502 -255779 195173 358402 213450 147672 125876
7464 125876 -150062 631870 256742 -130810 -339192 -175212 204872 454274 301349 237148
7454 237148 7527 -123210 -59304 -130531 3094 183432 502277 118931 -59505 92678
7444 92678 60826 -290817 -148951 -533 217277 272443 186043 237922 -100122 -5699 148335
7433 148335 77828 344030 526526 510572 205923 164024 342631 -89336 -423297 -224514
7423 -224514 184924 180898 70634 302922 274876 8391 -309118 -117204 -162984 40618
7413 40618 30850 -261087 -360866 -183706 -42031 -319329 -217703 193118 197583 33228 -23815
7402 -23815 -171295 -107672 68055 241651 166419 -57230 -368748 -245095 -164325 174513
7392 174513 -65513 -407993 -184737 317556 617390 412758 17125 365996 416209 100335
7382 100335 56362 -28113 -70863 -412375 -176850 -6715 63010 -395757 -568324 247131
7372 247131 427402 474912 224743 -259531 -570253 -456025 -66662 268087 235960 192938
7362 192938 129665 63863 -289298 -482797 -49731 -216738 116623 182765 331322 347045
7352 347045 9137 106769 -251004 -464274 -348983 -221692 13955 -183030 -231849 -195756
7342 -195756 163732 -6817 89819 385638 -24993 -44143 -265767 -468817 -247301 -99484
7332 -99484 -98030 54108 -54667 -183200 -302919 -192479 123906 32597 156120 200292 -233862
7321 -233862 17193 175473 260671 -341869 -601454 -474238 -304926 -23812 -180087 -110666
7311 -110666 -239492 6837 46912 -112223 -66302 -174822 -285887 186529 534083 69964
7301 69964 -213300 -369052 -263985 -435589 -91158 160254 -67593 -180786 -500484 -428576
7291 -428576 -195591 -269110 -47273 181123 64118 -67874 -292444 -573593 -519683 -87052
7281 -87052 -101564 95452 -29682 89763 -314449 -517202 -100023 -47599 61248 119515
7271 119515 -174830 -153399 54068 325653 239444 -19947 -97877 86798 57787 79009 268666
7260 268666 232696 -106334 9979 -20079 147339 -44841 150807 -56707 -386274 -16338
7250 -16338 -178114 164206 760925 674560 279399 129335 512069 398771 -84548 59731
7240 59731 142506 446949 187311 -217342 -359635 -51087 203916 -388497 -250811 16382
7230 16382 -92302 -59166 -540169 -574384 -103364 184396 316952 277880 115201 -263118
7220 -263118 -579194 -142916 -150633 -297064 -230524 -294781 -527146 -370449 -348149 -354140 -173371
7209 -173371 -36141 19504 303644 -29904 -146775 -421806 -48591 174532 -85949 -83459
7199 -83459 -163169 -415361 -16233 -53626 817 73875 -173134 -217833 -573548 -298060 -469292
7188 -469292 -416909 -111798 -99655 -393490 -60168 61743 -124185 -17942 239414 197984
7178 197984 428278 8780 -237211 -196109 28377 82191 -113225 265296 81685 -129232
7168 -129232 85538 -36774 -87629 49232 131416 179488 -155083 -19425 -160789 -494745
7158 -494745 -458168 -85295 40158 39097 -326195 -513756 -291762 -215042 -471014 -708657
7148 -708657 -335014 -185139 21602 15370 -341290 -135710 -305585 51952 262500 45628
7138 45628 -123079 -257569 -313332 -287623 27963 90363 517213 296825 105290 79300 -235017
7127 -235017 -512663 -781963 -435470 -284748 -491719 -205170 -179847 -305453 -121153 -343388
7117 -343388 -145405 -168913 -286451 174145 176179 -182768 -394514 -356585 -415684 -437628 -621610
7106 -621610 -327774 -133001 54784 317728 308602 498322 362762 136247 -299672 -136277
7096 -136277 -216110 283173 162788 -183093 97015 -217985 22870 236477 8324 234926
7086 234926 88519 -22028 139786 50981 -62037 -173854 13326 165116 297830 -141066
7076 -141066 -52046 210557 251427 -79228 -557138 -459101 29804 -13302 266 52970 -12634
7065 -12634 -447721 -392855 -260240 -355130 -393543 -219333 305162 -106445 -294405 -90607
7055 -90607 170234 613191 317211 404897 188972 126099 527007 620610 87196 91350 -115400
7044 -115400 9618 -108090 -492704 -232982 -61218 212561 -70451 -76437 -168511 -402746
7034 -402746 -614007 -618562 -384227 -646570 -454837 -313883 -92010 172477 133397 205622
7024 205622 130998 -307622 -205604 -207312 -253628 -36553 237141 765 -249472 -86774
7014 -86774 -101409 -219722 -473340 -159837 -350372 -376654 -498441 -18137 -30927 309520
7004 309520 133801 -215682 -432306 -174492 -219296 -227460 -350465 -474941 -136713 -378659
6994 -378659 -184412 140757 513298 -48982 -199563 -121917 64487 -67850 90521 -142248
6984 -142248 -59910 295447 219449 11525 -171556 154681 534071 399100 -150278 -185286
6974 -185286 -87065 79394 -169677 -244950 477045 381444 84426 -136888 -444533 -107985
6964 -107985 -409398 -356637 -176630 -142885 -422160 -297286 -97319 227677 -110453 -36642
6954 -36642 215009 299614 277125 -2861 16476 -18422 34182 -342866 -425717 -234233 27823
6943 27823 158075 -105119 -270459 -460941 -501222 -495279 -223921 -312417 -34543 -76648 -59942
6932 -59942 -218 -82682 -140930 -233660 -96015 -198995 -11307 196163 114440 -144140 188360
6921 188360 -267753 -437800 -204192 89565 -34653 -359469 -313875 -266135 -57603 -113535
6911 -113535 105564 -283321 -201057 124381 32899 15925 249640 197369 -120275 -119832 -186203
6900 -186203 128362 -260223 -435049 -343052 -160659 -130650 -123360 353526 160811 -287471
6890 -287471 -284926 -486019 -196348 -293997 -37190 46089 341116 370819 106969 -299423 125049
6879 125049 290687 72297 471071 -25397 49746 -52346 -285219 -189345 130629 -226689
6869 -226689 -103356 -224544 -324023 -214823 -298960 -93718 19789 345715 535408 370560
6859 370560 -244583 -231885 -205753 -38474 195492 16080 -67003 67676 338417 424058
6849 424058 223521 46252 -35857 -198433 -1097 90068 -154919 -144103 -160777 -11626
6839 -11626 -3291 1854 17890 52874 -61630 -225452 -107477 -38405 -188855 -151785 -496133
6828 -496133 -586860 -639599 -290754 13781 -222631 -186718 -355233 -167844 336028 -45666
6818 -45666 -124522 89716 76281 -41438 -121597 -216206 -175794 -331582 -258602 -87357 -409917
6807 -409917 38349 367381 -85822 -325650 -513073 -425704 117917 -73727 29512 278166
6797 278166 336786 27467 -188713 70171 116724 -121392 -120486 -10193 -417683 -265771 -3684
6786 -3684 -181663 34763 -130682 -503292 -526810 -112790 30888 43094 180373 226313 -110349
6775 -110349 -288838 -121041 -21237 -89399 -313776 -236536 160466 -203561 -117166 -52744 67620
6764 67620 -28494 -72913 -430168 -82280 368766 541085 78982 -248319 -130692 -268886
6754 -268886 -502414 -311938 -113922 405818 316768 7593 -107752 -3298 -284640 -500386
6744 -500386 39535 -11285 -368550 -270558 -323938 -11909 485802 19214 -56540 -236578
6734 -236578 -376266 -748060 -445969 -527490 -305755 -251087 -202047 -331532 23250 514660
6724 514660 382304 -27488 149049 -117440 -296656 -102916 -32468 310398 587953 547946
6714 547946 126338 -102644 -183708 -631362 -460319 -114618 100696 539868 510517 394096
6704 394096 30330 -329613 -232873 243522 178074 -250599 7530 49053 208755 326548
6694 326548 520661 341279 -177075 -70834 190859 316597 83141 79349 337326 224690
6684 224690 110087 242351 -8705 -34257 69476 297422 479875 200843 387310 297364
6674 297364 -73193 -79421 57949 162194 362154 493625 96339 211914 561606 416496
6664 416496 3346 -172186 -168579 -238964 -45438 -275616 -214000 -224615 -287802 -151023 -286114
6653 -286114 -496252 -770478 -242507 -27423 -220557 -306003 -355409 -396414 -336838 155365
6643 155365 19637 -231120 19049 95736 -222301 -389576 -12657 137119 135631 163597
6633 163597 96453 318386 418679 -9235 -217144 -94479 -64075 -400455 -175685 75678
6623 75678 -34987 -10667 147590 -274818 -510948 -365926 -144368 101876 259038 109422
6613 109422 -180651 -125582 77308 395721 496022 567059 262271 -179048 -428273 -590245
6603 -590245 -385626 -252158 -155891 -201441 38901 -143414 -170530 -316929 -243106 -653146
6593 -653146 -445175 -429463 -178197 382418 29333 -293021 -313372 -492313 -453315 -222500
6583 -222500 -186583 220617 523131 255147 209430 205449 46630 265312 37243 240012
6573 240012 37231 377144 152731 -345007 -549742 -315793 -344148 -191138 5283 -80370
6563 -80370 -140480 -137941 -286925 -247731 -495866 -367019 53119 93922 109787 -153827 10944
6552 10944 208047 296488 -95018 -249749 -176499 -374718 -271800 -45506 278414 -69241
6542 -69241 -250053 -384262 175738 -10646 -198646 -137890 89075 -45788 -178762 -134291
6532 -134291 103454 496642 410653 288164 242395 102736 26179 432732 227708 146491
6522 146491 -618668 -514628 -201170 -68402 -164185 -320289 -477597 -212317 69763 5918
6512 5918 63004 -258601 -208041 -416969 -346048 -131819 71944 319465 382922 -11200 26552
6501 26552 -210681 -831919 -353701 -15456 -460896 -704440 -135825 -113556 193238 -106643
6491 -106643 -264114 149766 100678 -40537 -46963 344206 634344 393212 335641 -157717
6481 -157717 -372798 125924 226945 354935 -1634 -203885 -205366 -457029 -30591 294431
6471 294431 129551 261913 94236 -43026 293619 -156530 -59177 -203810 197905 248316
6461 248316 336007 209435 258891 106197 -148428 44406 -300300 -356064 -264947 -24602
6451 -24602 12028 30539 -128087 183091 437721 143247 -145505 -58162 242497 13772
6441 13772 -4225 -99400 40106 504324 219325 75882 163082 150021 57189 71083 -208728
6430 -208728 -17272 394333 516129 360745 451283 198707 81096 -85114 -53238 147120
6420 147120 131227 95682 28884 45150 -27173 -71190 -76349 -110067 80847 -85680 -225599
6409 -225599 -119166 -79406 16287 42036 -127599 1612 214013 347253 222969 3985
6399 3985 369791 205810 -92146 166904 90387 56154 300986 13010 -456553 -298089
6389 -298089 -172836 -351101 -174489 95588 -308380 -413520 169775 180560 -133336 -428602
6379 -428602 -54183 -113492 -363600 -448351 -576643 -393918 -214549 -40946 136736 -55066
6369 -55066 -18192 16463 -113374 -134119 -167468 -361670 -334799 35529 -219251 -254547 -96030
6358 -96030 191213 122238 211946 -106486 95520 198463 364799 461381 567809 440652
6348 440652 -64908 -173626 160114 325117 551641 313432 -167791 -62098 -334921 -344557
6338 -344557 -80482 7258 68732 -2758 -75063 -294521 -549992 73550 169727 -356147 -216864
6327 -216864 -518332 -551445 -165800 -99488 -220235 -97013 -153905 30332 -258631 -339268
6317 -339268 -28672 -343357 -476363 -384254 129943 -247164 -292876 -154996 -728 -12082
6307 -12082 94846 402023 183945 5247 108897 319443 538866 234057 444506 477375
6297 477375 481159 356660 373762 486726 327845 631735 692631 656537 234429 -25191 250193
6286 250193 326290 411836 -308217 -647857 -377478 -84240 330409 489254 414039 600232
6276 600232 675172 448349 388287 341641 283287 69527 342444 333577 -222312 210750 909190
6265 909190 799757 597988 318349 -107288 98668 289746 115061 -331163 -41245 84088
6255 84088 437006 120988 201559 536456 386078 127518 -64881 -11443 59059 114357 63053
6244 63053 262494 645922 385278 203207 -150540 -418452 -226736 -324583 -252246 -206682
6234 -206682 -224104 102911 394084 125625 33220 85136 -21148 -259363 -236749 181703
6224 181703 -67086 -270563 -13131 242692 -5578 88259 232841 241245 369296 197581
6214 197581 274345 225802 181562 16611 271308 265427 130631 54231 64266 40030 -59991
6203 -59991 -383989 238875 171313 -117477 -74114 -78874 -401208 -267226 -160947 228838 -77257
6192 -77257 -163263 -341386 169527 -134377 -101164 162516 -243043 -254868 -273711 -20444 90372
6181 90372 42363 286089 127113 -66206 35763 -127061 -197993 -115247 277879 493209
6171 493209 341287 312184 264206 99097 -74812 -94799 11128 -121525 -231587 25299
6161 25299 283008 136765 -136110 -144602 453573 133604 13887 -291578 164840 153617
6151 153617 213122 266565 116354 111064 -155498 -82627 115337 -123 -9506 163977 213620
6140 213620 80652 -128781 -98309 206846 -153774 27666 -115956 -68492 268451 181856
6130 181856 374489 303354 103857 97816 217699 -216519 -263599 -130746 191291 -187944
6120 -187944 -167702 -137532 -126293 -246485 -119216 240880 187567 -218709 -291716 375210 538682
6109 538682 19788 217919 20466 -85572 -250100 -391826 -228703 -378353 -121967 -420148
6099 -420148 -249167 -411817 -415888 -120911 225375 -63346 -178808 -1046 14128 178183
6089 178183 451092 204568 150631 521745 97750 -202247 26074 145234 281463 66860
6079 66860 -133678 -307033 -231072 -154325 -9651 -81325 28089 142445 135033 272866 -290058
6068 -290058 -21469 269235 25305 214226 404836 400879 253516 184570 326094 782720
6058 782720 531271 156711 287864 -34102 -99757 132923 -235999 -322305 -224679 -19511
6048 -19511 19435 34952 -65983 349990 480531 547310 367849 515809 851502 859532 817309
6037 817309 543951 470787 484388 5260 22963 202318 399584 377293 555482 752278
6027 752278 346250 305571 297872 62749 415391 616835 504033 269134 -64085 412177
6017 412177 194539 282181 -91567 -132478 -199533 -113551 7454 28073 226052 145430 -287560
6006 -287560 -190903 207516 497839 238930 158414 -45877 -75072 190831 440164 280132
5996 280132 494641 532342 504688 667401 962638 847881 937051 745314 724984 471710
5986 471710 282300 381671 20505 297683 498071 189265 370848 392748 27864 690289
5976 690289 517646 17972 -96112 107174 590259 551605 597171 448054 277748 -154998
5966 -154998 -158270 209475 269372 509826 193923 335203 154302 -204271 -442048 91454
5956 91454 86665 849 298525 381640 292089 -8379 378659 355225 406689 309288 36444
5945 36444 -214219 -136577 -497076 -430237 -217353 98157 16128 -237543 -46445 -247296
5935 -247296 -42397 568073 364509 371282 122705 211483 381168 97335 101299 114724 -4903
5924 -4903 -402712 -14142 -144277 -210485 -90270 364210 -217131 -403210 -486047 -358193
5914 -358193 -240371 -235257 -350802 207952 111220 -77800 76719 326883 9469 -477203
5904 -477203 -488424 -241574 -188247 -156276 148760 -63200 -157483 -217339 -107457 121195 -47183
5893 -47183 -195549 86879 -126055 80225 -143977 -50194 -90450 -40577 460308 656260
5883 656260 142352 -85959 -18841 35454 236972 48385 -180848 -138402 -2871 111343
5873 111343 284328 153049 343670 397830 98770 165909 164900 16918 258918 435072
5863 435072 559339 523391 341127 162616 130710 203652 -56598 -185663 30299 -32564
5853 -32564 279511 297161 -74219 -261800 -329602 29537 232538 44434 610432 517959
5843 517959 294268 -225678 -231402 -184388 -87229 100001 143175 141273 21493 81692 70075
5832 70075 462902 630951 406644 -185986 -388562 -11746 -90152 -335995 61647 -530269
5822 -530269 -508272 -231332 -63200 252856 349526 477784 597268 530337 335611 41154
5812 41154 457163 444933 -176865 -289633 215410 1993 170456 210660 -248811 57362
5802 57362 315705 -222755 -192115 240498 95441 135651 66623 -444233 -518606 -372341 19719
5791 19719 210305 537250 665535 282429 148980 42094 248631 436390 565364 227029
5781 227029 133020 289571 259833 316346 294962 477448 196241 56132 472254 414164 244431
5770 244431 177891 318317 377538 129936 451062 525597 343961 109178 -123301 127197
5760 127197 672029 446380 399706 -62269 -317334 -104987 220048 517773 730464 492723
5750 492723 259219 494935 343129 -94444 -293681 -492856 -129375 54199 -431471 -163211
5740 -163211 -232346 -217384 -55194 140458 45392 -550332 -531398 -111700 -67532 40521 186807
5729 186807 523703 -249703 -194613 -25059 353171 -78637 -62244 211594 451626 660542
5719 660542 605314 417970 238061 169882 165490 -91289 87254 290934 -225704 -295300 -230836
5708 -230836 211529 12761 -312867 80382 248677 131353 260830 193561 5162 -40205
5698 -40205 -125095 39057 389517 281802 467329 74913 -82481 362775 212225 672505
5688 672505 633071 152397 108967 -222181 -117974 -13584 -137411 -284150 50551 -76476
5678 -76476 -33514 466241 501210 476293 447124 126082 293551 710480 336144 369107 516114
5667 516114 354251 392869 465729 132770 30780 -18911 -29756 161565 165347 447 41069
5656 41069 119949 174829 207998 67796 -32746 -95950 354698 604366 242989 21881 87878
5645 87878 683724 655325 467179 540669 -207385 -6543 423243 373791 405379 286875 -42725
5634 -42725 204760 457247 502499 631010 376221 49733 102057 500743 278991 -130580
5624 -130580 96215 319192 184254 80014 105562 443266 424073 273927 34562 27170
5614 27170 -89057 -172498 269419 430678 464143 418554 231420 214226 101701 427716 540643
5603 540643 66934 350331 537346 416270 193192 60971 41088 158344 185636 306275
5593 306275 295508 237307 174810 190819 314079 299418 65345 402962 253487 254057 780181
5582 780181 555886 663656 980576 851465 833001 638941 267044 -137035 -94705 -181916
5572 -181916 34917 37301 136336 456191 628420 415518 548418 292018 352200 331028 -23471
5561 -23471 -49967 36118 -7732 220981 407909 177305 284628 128884 55002 -31280 276627
5550 276627 792952 455605 236053 488612 394044 542191 87009 253925 702193 728418
5540 728418 810168 413129 -100337 101632 -144086 231808 584704 512624 188481 310859
5530 310859 494470 352570 -256075 87303 280406 118376 198895 189553 83044 44200
5520 44200 399081 530673 720514 592549 400275 345911 458103 599740 419719 384674
5510 384674 708751 487340 413347 644966 447044 477983 403614 385878 475088 693622 711133
5499 711133 474555 554224 398412 290708 386132 712180 801932 821316 768443 393646 437184
5488 437184 275973 508205 400190 236380 -123040 221193 843691 631399 827809 1012442
5478 1012442 957290 659130 478010 462419 768132 843422 528605 360725 397635 599111
5468 599111 552047 774298 833156 966971 943263 470539 323853 541471 249830 61083
5458 61083 374024 607685 558957 446960 396062 448547 381873 340077 743435 657014 700732
5447 700732 864496 822928 537381 358700 286156 583247 797370 783064 508774 750573
5437 750573 834026 778075 496229 526943 743826 812127 93816 202406 246818 667218 944355
5426 944355 814255 451344 263471 102023 300319 619045 293627 386737 551246 645039
5416 645039 647373 677477 972032 1036268 1006526 1239289 680415 569409 737359 1058151 780636
5405 780636 866716 956962 822428 1249604 1167611 1270774 1174493 974149 605389 741058
5395 741058 839443 1197929 1410468 1111173 988413 803460 818653 676655 735493 781371
5385 781371 607743 226378 503251 575569 902218 959795 517171 580315 876497 1105795
5375 1105795 1018033 1567697 1539018 1403232 1249769 1172893 1396323 964585 1000378 1086960
5365 1086960 1108673 1179525 1417893 1305285 1201025 1358630 1234821 1080135 1608628 1587977
5355 1587977 1364917 1406318 1666148 1236999 1344389 1020624 1143925 1525309 1323584 1273788
5345 1273788 1153956 1472125 1431637 1608208 1484447 1095657 1498247 1865202 1761670 1626821
5335 1626821 1306587 1266206 1355864 1659255 1654181 1916810 2269808 2047953 2182563 1862166
5325 1862166 1263249 1535122 1479418 1111751 1236935 1589744 1695863 2254890 2237452 1716043
5315 1716043 2201174 2025909 1777449 1946512 2012576 1763572 1865516 2107988 1955262 1969815
5305 1969815 2183259 2441201 2586438 2106191 2155827 2308125 2138883 2636627 2721587 2693135
5295 2693135 2685677 2794371 2782889 2506076 2349851 2300847 2470836 2563668 2543787 2762084 2834209
5284 2834209 2798537 3081270 2928238 2772384 2770659 3145886 3226006 3173682 3674889 3592270 3759099
5273 3759099 3725949 3556176 3421397 3302311 3446059 3777842 4113193 4320341 4348401 4377484
5263 4377484 4240716 4010115 4150809 4301411 4487804 4828968 4910657 4872038 4950827 5183093
5253 5183093 5393441 5211801 5518240 5400591 5659050 5973419 5916507 6176224 6594118 6733244
5243 6733244 6812363 7064899 7104049 7341882 7605912 7740666 7628213 8367730 8750762 8329613
5233 8329613 8586584 8735873 8628005 9116104 9369969 9951044 10328811 10896703 10810018 10898675
5223 10898675 11070679 11037812 11554560 12401931 12508945 12550403 12694908 13106486 13237410 13664735
5213 13664735 14155151 14502001 15133444 15589659 15808294 15973902 16684109 17462261 18397567
5204 18397567 19014211 19608661 20318001 21022613 21684771 22562948 23304565 24342018 25646746
5195 25646746 26425710 27843968 29264221 30372781 31848610 33012626 35082758 37122183
5187 37122183 38984866 41255084 43951484 47117318 50418172 54636036 59155845 63735349
5179 63735349 69654076 75823368 82867643 90769665 99235301 108038460 117206104 125541422
5171 125541422 132120886 135724197 135747302 131539183 124605053 115418951 105522111 95880433
5163 95880433 86457050 77813984 70525435 64123892 58403246 53673921 49305358 45753373
5155 45753373 42332371 39623718 37139993 35265860 33347380 31199091 29216974 28130541
5147 28130541 27187049 26107027 24624326 23411963 22472491 21590555 20755938 20047941 19175795
5138 19175795 18078300 17620704 17063272 16147421 15443173 14873438 14591084 14130365 13165115
5129 13165115 13005099 12257945 12102861 11802798 11182580 10858933 10612249 10450927 10329212
5120 10329212 10220056 9489716 8935956 8786629 8657008 8581568 8712952 8384111 8233425 8124465
5110 8124465 8021356 7742424 7131519 7328135 7062275 6843045 6622621 6448536 6564417 6655207
5100 6655207 6461579 6102691 6434608 6434283 6017695 5437371 5567094 5485802 5390824 5274813
5090 5274813 4964725 5202415 5071573 4642194 4903185 5329865 5249978 5083578 4818373 4706101
5080 4706101 4662007 4345001 4114393 3782966 3875863 4331693 4555655 4189416 4169399 4128344
5070 4128344 4397640 4088719 3990425 3517310 3217060 3318362 3335645 3454427 3466091 3736827
5060 3736827 3400674 3535979 3302543 3332811 3433107 3798541 3547263 3881232 3671196 3538580
5050 3538580 3519427 3401306 3695068 3881869 3636825 3380392 3736271 3722702 4106802 4491636
5040 4491636 4070282 3791116 4318300 4502410 4551541 4472918 4863682 4973810 5041319 5043186
5030 5043186 4891126 4780604 4841864 5328912 5555295 6102140 6220549 6435906 6461082 6528278
5020 6528278 6107078 5923549 5956918 5952155 5588183 5034340 5251753 5068581 5030735 4952657
5010 4952657 4619972 4691169 5134915 5333688 5381353 5115477 5765381 5293933 4998899 5494488
5000 5494488 5710819 5727668 5430511 5336355 5687941 5558382 5135308 5526214 5902336 5619310
4990 5619310 5222883 5208235 5161785 4771807 4713490 4604541 4948176 5027979 5077443 5119756 5156157
4979 5156157 5498406 5198587 4764053 4678946 5088069 5248910 5112690 5340756 5384215 5136648
4969 5136648 4922785 4828144 4907265 4981943 5118461 4735497 4367097 4332457 4235280 4094183
4959 4094183 3745051 3296141 3259778 3637089 3292870 3267802 3595631 3823855 3599352 3232673
4949 3232673 3124160 3382941 3456637 2952782 3130544 3157454 3193701 3182073 3137768 3098267 2872987
4938 2872987 2762989 3058765 3199334 3340333 3107817 2752252 2643556 2653792 1972446 1960669
4928 1960669 2044271 2148028 2130320 1641424 1677036 1768118 1586086 1903117 1923504 1828841 1663180
4917 1663180 1921027 2143798 1528671 1411821 1922750 2358047 1909185 1724431 1699683 1619093
4907 1619093 1971982 1562587 1381315 1200314 1354896 1692732 1779860 1796350 1487775 1259319
4897 1259319 793455 982622 1406556 1794840 1600789 1125738 994475 1041400 941337 969175
4887 969175 1124051 988834 1557346 1342478 1399827 1209721 1111931 1223275 1374026 1284582
4877 1284582 1023493 1183457 1452027 1600394 1265651 1376117 1572155 1838140 1551566 1665907
4867 1665907 1265646 1124702 1128013 1152650 1114411 1070771 895865 1043958 1115208 1041980 903546
4856 903546 1049752 1231850 934959 942376 818890 932312 1111460 1110109 958963 770182
4846 770182 934095 821230 1227585 1052473 657551 532377 762851 989312 855605 847211
4836 847211 741764 679395 755507 1096347 1164454 1138156 1325148 1495569 1153996 1332496
4826 1332496 1133820 935346 951855 1067027 1029666 1169043 1278472 1123719 1128407 903240
4816 903240 869440 823697 958596 1063851 1058214 1199431 1457281 1087021 1144870 1154797 1321429
4805 1321429 1052834 966705 900138 1352344 1330557 838878 1245032 1149380 1146304 1130951 1418932
4794 1418932 1581816 1397658 1081448 1497810 1239248 1432656 1639770 1471854 1348181 750936
4784 750936 775526 1043390 1203057 920599 800292 1199981 1234099 1165715 1621372 1004119
4774 1004119 866206 1099783 755687 738112 1161479 1436215 1126429 947502 1018200 1029902
4764 1029902 912709 1158759 1438429 1667549 1689367 1594732 1256283 1276679 1041490 1376827
4754 1376827 1505500 1090088 865150 1310993 1224332 1010058 1054055 1011461 1180198 957462
4744 957462 919699 1141271 1118082 1226264 1499881 1836443 1331230 1444380 1572446 1155483
4734 1155483 1119045 1085438 1095469 889825 1183097 977026 1041613 982388 994660 1056774 950860
4723 950860 1400474 1630161 1398589 1649170 1522551 1229951 1406647 1384324 1026571 938441
4713 938441 828943 909996 1284741 1365998 1359586 1755701 1468013 1328632 1501253 1275533
4703 1275533 1405166 1419036 1049448 1128852 1378093 1302075 1461710 1414391 1898699 1984547
4693 1984547 1690451 1636439 1608621 1525228 1310804 1717089 1991554 2240307 1636715 1994289
4683 1994289 2226996 1974595 2019748 2083730 2195037 1764862 1822243 1962786 2013752 1786240
4673 1786240 1600059 1637793 2041180 1807749 1673995 1754169 1731424 1387863 1586447 1526563
4663 1526563 1655277 1810767 1600804 1448457 1195117 1783460 1901286 1589779 1356208 1112309
4653 1112309 1656861 1342658 1246923 1793054 1662646 1574078 1572214 1379370 1642414 1726692
4643 1726692 1664662 1673805 1511462 1347178 1532688 1574824 1690144 1823215 1419535 1442959
4633 1442959 1517046 1414248 819928 583944 950670 1182273 950682 1372886 1321795 1165957
4623 1165957 877722 922597 1006818 1060106 961587 809154 684201 901685 759271 450343
4613 450343 716504 1146726 1265291 1139369 1414153 1333935 1355632 1421028 1499103 1224046
4603 1224046 994321 837010 778620 946130 1121623 932740 987405 1074515 865550 1207576
4593 1207576 1348060 1200407 1333402 1751219 1233274 877064 1397851 1492501 1241500 1292306
4583 1292306 1022804 1259044 1494112 1477655 1701567 1556060 1267281 1174245 1498740 1116063
4573 1116063 1343220 1425320 1346292 1127422 984715 696794 781394 1027084 1006532 1235493
4563 1235493 1053792 849771 790630 1227113 1515871 958934 881808 1178471 1107605 1176371
4553 1176371 1346348 1139751 800182 1295154 1396445 1008128 1280913 1539225 1810840 1731945
4543 1731945 1553492 1516025 1599199 1448723 1426273 1444436 1375201 1302976 1161469 1307088 1644136
4532 1644136 1671305 1668690 1343163 1492087 1691062 1767180 1895117 1640222 1610342 1451483
4522 1451483 1640706 1259816 1512570 2048938 1656945 1757784 2112911 1865821 1938077 1581036
4512 1581036 1614858 1850036 2076357 2009563 2160669 1737208 2094856 2293085 2305503 2066656
4502 2066656 2205402 2421542 2316004 2825384 2576907 2432867 2560841 2457692 2414492 2581414
4492 2581414 3043477 3260146 2947886 2830472 2622096 2178831 2440313 2624518 2786133 2754345
4482 2754345 2341330 2580068 2540869 2650515 2367272 2841744 2655726 2496482 2401228 2529215
4472 2529215 2880761 3043721 3290162 3553919 3807182 3917235 4007678 4118232 3618994 3727838
4462 3727838 3734521 3544051 3516492 4032682 3786765 4092460 4137382 4387391 4554878 4553455 5051838
4451 5051838 4772684 5008553 4913734 4998089 4889088 5212680 5660285 5674013 5558920 5544236
4441 5544236 6178271 6366999 6008610 6424648 6924339 6487645 6503951 6728310 6849978 7174432
4431 7174432 7497629 7790841 7469083 7669166 8368291 8420589 8453764 8967047 9006645 9783200
4421 9783200 10378217 10259590 10177871 10256277 10718127 10769182 11045019 11499765 11665038 11885762
4411 11885762 12243524 12586740 13041753 13754671 14158394 14325922 14712850 15354150 15702397
4402 15702397 16376516 16879979 17351713 17903812 18884545 19482736 20615529 21238143 22287528
4393 22287528 23946455 25495498 27070994 28657929 30771731 32497583 34136081 36842135
4385 36842135 39894973 42705105 45989619 49284988 52256715 55060743 57600433 60245034
4377 60245034 63318778 67010700 70894148 74525086 77513404 80069040 81469150 82716279
4369 82716279 84416258 86003546 87989360 89964419 91226845 91507225 90722822 88911403
4361 88911403 86519726 84135417 82249969 80330107 78231277 75734915 73273929 69885492
4353 69885492 65924796 61892915 58526463 55361636 52564832 50067294 46791598 43261671
4345 43261671 39968127 37027161 34268468 31686491 29253421 27448083 25688497 24024553
4337 24024553 22570233 21573922 20228470 19051109 18288546 17656913 16786904 15515412 14631121
4328 14631121 14162511 13800746 13173506 12533506 11852250 11876310 11826561 11342947 11195221 10593983
4318 10593983 9870865 9464189 8985830 8695234 8252153 8353611 8381522 8290624 8127348 7844953
4308 7844953 7381598 7019988 7019227 6820249 6356652 6427585 6309904 6080745 5639327 5496019
4298 5496019 5428841 5908527 6081882 5546299 5304683 5063151 4677154 4821409 4650195 4851717
4288 4851717 4604648 4279953 4447742 4443583 4266238 4132795 4259260 4333447 4008560 3640897
4278 3640897 3329374 3651988 4134814 3706265 3846900 3781181 3548874 3743198 3947609 3905215
4268 3905215 3549204 3036279 2923114 3377831 3244917 2909508 2958376 2694622 2922593 2842398
4258 2842398 2989248 3123396 3273500 3787325 3409707 2653191 2808402 2720122 2718598 2880128
4248 2880128 2991843 2506926 2410015 2365899 2159730 2191755 2051321 2276182 2576948 2710033
4238 2710033 2564875 2517399 2379359 2373578 2659059 2659284 2589052 2634037 2690097 2819996 2641948
4227 2641948 3121640 2952116 3034477 3260781 2976878 3063754 2845221 2942765 3128942 3185690
4217 3185690 3070424 3204927 3215129 3388061 3792314 3823644 3774846 4079794 4800011 5214132
4207 5214132 5498751 6077266 5767332 5844679 5858680 5660100 5124213 4830346 4338095 3973416
4197 3973416 3478099 3253545 3234957 3279149 3513987 3352060 2971374 2776574 2755919 2751556
4187 2751556 2899575 2877820 2906062 2761600 2807644 3012557 2835116 2680518 2620587 2801716
4177 2801716 2865614 2623310 2247111 2056131 2328081 2785661 2566701 2475826 2854304 2663168
4167 2663168 2924185 2525971 2116188 2239907 2398895 2699668 2802588 2660621 2186142 2676052
4157 2676052 3174328 3001213 2547574 2422389 2770993 3138214 3068315 3123421 3002139 2697039
4147 2697039 2866366 3015233 3282936 3208157 3307819 3299677 3139952 3104418 3488709 3660550
4137 3660550 3687059 3247580 3730461 3604156 3687437 3957567 3770600 3677339 3421042 3297176
4127 3297176 3449288 3486600 3782318 4008353 3931450 3824445 4046863 4310864 4524530 4427773
4117 4427773 4575089 4541678 4251072 4464682 4912425 4623755 5017580 5319680 5478680 5816196
4107 5816196 5932966 5811988 5789668 6038155 5991641 6189763 5960923 6360759 6586956 6603637
4097 6603637 7294376 7217576 7562055 7780879 7650330 8034030 8129085 7946983 8531527 9031998
4087 9031998 9214246 9652229 9642550 9964452 10239641 11049548 11113312 11542273 12136702 12424568
4077 12424568 12600645 12825685 13222794 14175658 14818188 15108302 15892038 16248439 17217214
4068 17217214 17521823 17615388 18520220 19200861 19482471 20222899 20995700 21767265 22439935 22813166
4058 22813166 23552137 23967153 25175561 25717577 26279221 26995964 27441692 27810450 28224809
4049 28224809 28112102 28338596 28860642 29237613 29642967 30048958 30318473 30751738 31101964
4040 31101964 31387535 31572801 31529437 31361333 30658540 30308413 30005197 29060196 28754702 28843097
4030 28843097 28487343 28085737 27877394 27322317 26825267 26781483 26006099 25081865 24729264 23856447
4020 23856447 23187989 22627395 21949908 20875901 20245339 20189351 19746355 19179230 18742337
4011 18742337 18077064 17257571 17013013 16812415 15972524 15366585 15101489 15399872 14807714
4002 14807714 14461800 14593901 14458677 14440401 14045218 14245856 14199239 14152656 13997285 14451471
3992 14451471 15128626 16079005 17207481 18111496 19572606 21058462 22450371 23432727 22737368
3983 22737368 21423856 19830811 18149244 16427233 14679866 13289461 12278523 11262009
3975 11262009 10489096 9395561 8802527 8510567 8213517 7337356 7415343 7160158 6867172
3966 6867172 6824655 6302624 5932355 5966219 5562238 5319255 5580552 5032929 5031731 4638172
3956 4638172 4569695 4865847 4670917 4512163 4280827 4149572 4161363 4235830 3853767 3933004
3946 3933004 4102299 4070331 4153282 3746830 3839345 3666647 3525543 3473374 2664034 2464992
3936 2464992 2935013 3082857 2829206 3091774 2667695 2950339 3178719 3226239 2895086 2791416
3926 2791416 2886816 2379542 2429479 2464403 2288059 2105720 2177549 1826223 2041010 2152238
3916 2152238 1884292 2122843 2163459 2511286 2474445 2284424 1990818 1851991 2508095 2581745
3906 2581745 2872107 2660606 2154646 2507330 2477983 2236300 2420667 2267351 2043415 2370446
3896 2370446 2579366 2505874 2759779 2382013 2691714 2691029 2205399 2092222 2887885 3040862
3886 3040862 2642589 2488060 2093320 2134350 2286696 2281305 2324462 2329195 2606350 2588912 2383497
3875 2383497 2489981 3012536 3083306 3228818 2787559 3004042 3027186 3071188 2952999 2724135
3865 2724135 2631339 2709805 2603067 2567913 2539299 2764772 3090104 2970753 2799896 2527574
3855 2527574 2947177 3060304 2632524 2748320 3187536 3278863 3271686 3417419 3281640 3204447
3845 3204447 3348157 3026554 2938754 2881523 3319258 3817828 3590989 3162741 3269915 3148994
3835 3148994 2999159 2896791 3461579 3642547 3312521 3064461 3497728 3510539 3404648 3592054
3825 3592054 3670441 4005550 4198218 4059607 3956143 3805112 3851599 4197553 4489304 4174997
3815 4174997 4403308 4292121 4383855 4081883 4022072 4318184 4308365 4637251 4753369 4235913
3805 4235913 4255614 4369251 4652095 4908819 4584822 5025968 5244007 5194132 5335629 5357177
3795 5357177 5419611 5788628 5669527 5100686 5574402 5532343 5622455 5537073 5454815 5825255
3785 5825255 5903649 6002033 6268138 6566027 6729520 6676934 6276744 6400102 6518436 6722507
3775 6722507 6999751 6928854 7373948 7630571 7201234 7495088 7827373 8016092 8217077 8481213
3765 8481213 8962914 8915373 8447932 8472689 8588804 8763155 8680575 8247047 7970436 8005702
3755 8005702 8111850 7884333 7259138 7636015 7587229 7642081 7253688 7211748 7645712 7405461
3745 7405461 7224574 7437359 7038807 7031857 7210037 7105993 7045796 7220896 7650019 7801339
3735 7801339 7970007 7963144 7728948 7733086 7872134 8104314 8382842 8218344 8278280 7909275
3725 7909275 7907273 8234838 7819323 7593925 7621561 7702421 7925471 8061375 7769892 7938121
3715 7938121 8052701 8044607 7988990 8217484 8325361 8426364 8224933 8305808 8847651 9237031
3705 9237031 9054720 8712653 8603939 9013234 9201802 9499106 9625651 9519043 9882664 10401148
3695 10401148 10156085 9471957 9872969 10415203 10377239 10161329 10194850 9920884 10054953 9882753
3685 9882753 10073120 10125311 10218841 10229893 10133821 10196704 10541748 10597118 10688489 10406791 10347086
3674 10347086 10398410 9928695 9626506 9768676 9967921 10119559 9872092 9700865 9779241 9715137
3664 9715137 9599736 9690856 9740857 10202146 10450594 10547853 10702842 10922052 10712219 10603880
3654 10603880 10710088 10913258 11110589 11338627 11504253 11494298 11191039 11446369 11757889 11953868
3644 11953868 12184428 12232009 12288771 12627491 12646686 12723828 13076450 13342594 13493657 13529517
3634 13529517 13925915 13765588 14067626 13899755 14457475 15298856 15592681 15608716 15837704 16159684
3624 16159684 16364222 16782024 16792161 17165609 17993661 18508766 18679248 18698817 19192173 19801298
3614 19801298 20663471 21461211 22104003 22651275 23173210 24378616 25458121 26457777 27462094
3605 27462094 28260077 29425167 31015002 32828120 34861132 36392169 38318485 40571511
3597 40571511 43121793 46074493 48474661 51190725 54201299 57024716 59978601 63540787
3589 63540787 65906978 68644074 70597960 72505227 73962524 74740183 75533692 75679529 75562959
3580 75562959 75019022 75026946 75011294 74995103 75074923 74911206 74051585 73225425 72152782 70820960
3570 70820960 68889512 66742443 64350093 61796175 58924122 55523391 52419369 49503669
3562 49503669 46881197 44507140 42546875 40539898 38335008 36272972 35018175 33474214
3554 33474214 32593823 31052377 29721319 28619673 27698182 27129019 26631828 26231342 25475644
3545 25475644 24885045 24386451 23737155 23086781 22523550 22264275 22272199 22239530 21771665 21508996
3535 21508996 21325664 20841729 20782952 20943009 21215129 20845487 21038418 21170121 21195084 21160792
3525 21160792 21468885 21142839 21356056 21293018 21263579 21424559 21509202 21666899 21349099 21367581
3515 21367581 21410519 21416429 21068054 20942064 20814839 20174225 20004961 20165493 20264387 19770326
3505 19770326 19645172 19965279 19898624 19289777 19461967 19116730 19049656 19041435 18972229 18631886
3495 18631886 18085769 18374196 18269838 18418291 18248977 18247294 18645417 18799844 18813801 18854083
3485 18854083 19086745 19539383 19720078 19689341 20199701 20376587 20525727 21292567 21678215 21971543
3475 21971543 22266037 22096264 22522237 23356148 24156212 24752035 25466932 26375555 27172618
3466 27172618 27775686 28240858 29085575 29312925 30330646 30728772 31001554 31263170 31454252
3457 31454252 31745373 31479955 31534513 31797097 31396359 30955220 30636919 30482576 30903437 30807082
3447 30807082 30896538 31503352 31200461 31109503 31546712 31854013 32140163 32463568 33490406 34075221
3437 34075221 34305667 35038561 35818114 37133702 38244691 39213643 40222792 41489578 43092272
3428 43092272 44940508 47207214 48754063 50497032 52970234 55927485 58740880 61523220
3420 61523220 64692676 68875042 72978128 76957185 81730111 86398511 91471282 96462673
3412 96462673 101194575 105761491 110200700 113911326 117036104 119998871 122466674 123971296
3404 123971296 125141945 126222544 126502026 126347639 126317514 125818808 125131654 124623005 123365969
3395 123365969 122607528 121824429 119998741 118026568 116087823 112972002 109607930 106054613
3387 106054613 102132814 97975029 93821272 88957906 84544586 80151158 75907356 71847234
3379 71847234 67745051 64408833 61586454 58444599 55099704 52598166 50222430 48405052
3371 48405052 46505261 44350132 42478253 41518489 40094926 38523846 37704868 37043578 36382365
3362 36382365 35433622 34134088 33943064 33649226 32884868 32274857 31595740 31722307 32102536
3353 32102536 32351999 32570252 32641935 32382580 32343006 32819582 33047364 33299060 33666270 34296623
3343 34296623 34409981 35033430 35114247 35229802 35453462 35506451 35606962 35562612 35534848 35525106
3333 35525106 35389261 34847482 34050157 33653571 33306028 32607982 32358969 32207471 32295291 32144017
3323 32144017 31909909 31974329 31903764 31652831 31888131 31869560 31982499 31935100 32234582 32581310
3313 32581310 32403649 32588487 32911905 33101477 33531833 34035161 34536061 35314626 36253421
3304 36253421 36919284 37079568 37821074 38737056 39731123 40725781 41643602 43132871 44089849
3295 44089849 45167340 46398920 47716776 49013145 50407928 52095169 53903209 55449577
3287 55449577 57609258 59857019 61825480 64156108 67183295 70077005 73264896 76628963
3279 76628963 79948106 84006743 88367935 92940500 98105277 103183956 108624204 114406958
3271 114406958 119934205 125948569 131759031 136881450 141587494 145307525 148324769 150446068
3263 150446068 151735638 152381122 152080792 152115619 151695533 150471023 149667307 148911280 147690253
3254 147690253 146211955 144214670 141208038 138021303 134190707 129438349 124012071 118315104
3246 118315104 112162362 105585790 99275709 93169711 87007586 81472145 76954396 72563851
3238 72563851 68311562 64475450 61351435 58330920 55471464 52872665 50611484 48240594
3230 48240594 45969030 44108485 42610893 41067445 39612633 37810880 37032203 35780867
3222 35780867 34485122 33586309 32888047 32340964 31458820 30558189 29495242 28875915 28275832
3213 28275832 27934832 27328003 26714643 26128155 25586398 25069910 24735863 24225750 24125291
3204 24125291 24050412 23606606 23497030 23251900 22874363 22804092 22431384 22189583 22239031 22223241
3194 22223241 22310391 22099617 22410283 21865782 22180285 22482414 22285941 22573169 22966516 23102793
3184 23102793 23000374 23486801 23415768 23639289 24242199 24494034 24742424 24729297 24759843 24359878
3174 24359878 24076442 23865108 23804026 23780607 23753232 23687724 23164150 22859060 21896397 21733593
3164 21733593 22012017 21615131 20902654 20769107 20959705 21274056 21289714 21344577 21297056 21176313
3154 21176313 21858832 21937158 21741228 22380348 23070497 23890880 24702661 24992619 25389535 25964837
3144 25964837 27009000 27385345 28215605 28877007 29729224 30805861 32266786 33695158 34861387
3135 34861387 36209785 36976107 37996359 39512496 41257026 42895020 44232164 45759112
3127 45759112 47986439 49333012 51142186 52499187 53707162 54624689 54998718 55400424 56446288
3118 56446288 56452960 55939345 55725738 54719110 53626417 52577692 51427650 50175334 48902637
3109 48902637 47881747 47346198 46474392 45966378 45358082 45330229 45702545 45906563 46075399
3100 46075399 46884348 47671707 48374090 49547950 50209849 51251420 51488260 51600621 51745824
3091 51745824 51477636 50210727 48625642 47526570 46422784 44752196 42705760 40614499
3083 40614499 38275162 36007436 34594546 32836263 30566557 29342449 28188850 26542108
3075 26542108 25382634 24569445 23071365 21734741 21196873 20348414 19764078 19533694 18878248
3066 18878248 18274998 17456204 17196233 16831999 16701738 16377985 15936778 16199067 15990933
3057 15990933 15625971 15423231 15281978 15190302 15173272 15188709 15014798 14492973 14619255 14799620
3047 14799620 15133009 15077624 15161581 15345007 15671282 16050047 16352441 16595185 16759318 16967219
3037 16967219 16784788 16565713 16630465 16605531 16584750 16404918 15690072 15245623 15016644 14547510
3027 14547510 14361445 13860985 13517722 13170889 12415202 12417069 12082087 12057883 11458391 11227971
3017 11227971 10707051 10869660 10561252 10467740 10284400 9963689 9683662 9676677 9669080 9874804
3007 9874804 9942120 10147996 10353619 9689506 9292819 9447537 9404715 9664383 9704015 9376096
2997 9376096 9345435 9771835 9536200 9234594 9632918 9356834 9460027 10020944 10090294 10183202
2987 10183202 10027460 9829728 9865788 9837240 9943191 10249981 10843750 10936161 10527995 10691470
2977 10691470 10917442 10657794 10793123 11118370 11293026 11446701 11206833 11211164 11276659 11081466
2967 11081466 11396613 11203658 11761120 12065529 12314387 12553530 12343021 12315660 12850000 13021621
2957 13021621 12961028 12720378 12733683 13138962 13613805 13661238 13554372 13314090 13679123 14238593
2947 14238593 14682382 15235261 15279655 15114974 15617050 16339862 17015284 17103333 17406910 17801164
2937 17801164 18386683 18967350 19419380 19726286 20113402 20516502 21117231 21368494 22283691
2928 22283691 23252017 23484123 24020531 24479146 25424818 25806144 26247189 27015866 27735019
2919 27735019 28735763 29301072 30384497 30660770 31622598 32639015 33697562 34252711 34773840
2910 34773840 35729519 36512616 36935807 37829940 39005176 39622170 40869116 41802973 42869622
2901 42869622 44059719 45363096 46688107 48502092 50120197 52207909 53836043 55127011
2893 55127011 57598296 60005069 62233790 64945297 67439385 70671343 73957621 77165711
2885 77165711 80500216 84699993 89320997 93734435 97828701 102251798 107465537 112261063
2877 112261063 116102126 120633375 126442619 132657234 139003816 146849715 155624900 165759581
2869 165759581 177653046 190717549 204531841 220076663 237634784 256961034 277374708
2862 277374708 297252358 315327281 329760312 337450688 336744973 327630511 311685882 291034676
2854 291034676 267696172 243974409 222332779 202334928 185075257 169454809 155800505
2847 155800505 143702302 132640593 123375213 115237979 107798463 100767507 94884314 89480415
2839 89480415 84493486 79763234 75838833 71961171 68265509 64963891 61996832 59387025
2831 59387025 56943629 54571440 52717156 50486074 48156996 45765592 44027861 42670240
2823 42670240 40876220 39812009 38177344 36776783 35264821 33349356 32477816 31371969
2815 31371969 30517067 29409187 28600703 27549656 26684072 25871842 25043077 24276316 23549725
2806 23549725 23055286 22387818 22042050 21391337 21006890 20581060 19706032 18990218 18697367
2797 18697367 18047493 17099192 16876658 16855841 16585188 16428391 15934146 15451829 14456471 14034548
2787 14034548 13700870 13422816 13151635 13093737 12589056 12428818 12119318 11805616 11690944 11310200
2777 11310200 10943849 10444544 9853949 9657702 10140869 9999133 10023914 9379035 8951361 8944712
2767 8944712 8704957 8791597 8989704 8493537 7773094 7695242 7806492 7602114 7583908 7442835
2757 7442835 7239997 7152073 7381079 7043814 6833689 6919345 6575790 6400332 5988406 5758668
2747 5758668 5875450 5656120 5422331 5731686 5844737 5375244 5145303 5353797 5572786 5400013
2737 5400013 5508882 5345154 5186487 4946814 5216115 5143033 5334033 5059267 5164567 5063678
2727 5063678 4779229 4865509 4935455 4666277 4642885 4740711 4908776 4510970 4039546 3851939
2717 3851939 3419321 3703159 4186950 4038423 3710598 3901095 4197404 3863299 3864957 3751326
2707 3751326 3269415 3330243 3098241 2911001 3277059 3300406 3296115 2946020 2795912 3205349
2697 3205349 3025952 2768126 2882666 2814895 2806067 3240505 3241055 3220405 3303111 3200558 3095222
2686 3095222 3213477 3145525 3359654 2889286 2993243 3028436 2735888 2975587 2490351 2634598
2676 2634598 3152124 2989150 2661321 2229379 2503712 2517716 2517584 2522958 2414170 2778062 2686843
2665 2686843 2121288 2248433 2184028 2046334 2090110 2526592 2090064 2237715 1949768 2076184
2655 2076184 1943798 2171820 1972716 1941625 2253988 2291346 2008545 2029229 2090460 1729254
2645 1729254 1917251 1956553 2091722 2016100 2032564 2083130 2175302 1903464 1858723 2028709 1960131
2634 1960131 1639578 1735008 1710073 1409394 1501448 1529260 1484003 1231972 1738177 2235117
2624 2235117 2472534 2625226 2762640 2449957 2080574 1838608 1524980 1593343 1598149 1411971
2614 1411971 1381278 1638458 1489414 1366471 1369480 1400139 2000808 1707484 1768604 1984179
2604 1984179 1857034 1902679 1920223 1938254 1670773 1692134 1819018 2076373 1855785 1763786
2594 1763786 1930536 1743562 1353822 1784133 2027917 2180947 1931517 2158816 1924002 1702096
2584 1702096 1496781 1720012 1776004 1993360 2558894 2873664 2554561 2621004 2735907 2831785
2574 2831785 3009430 2720187 2196730 2272248 2190635 2317699 2125435 1999642 1842843 1939410
2564 1939410 1985884 2039433 1483575 1336829 1261726 1208148 1324760 1316647 1397151 1073163 1120133
2553 1120133 488425 732154 715070 489573 798772 673944 953139 1178978 803423 1052194
2543 1052194 1089961 1492954 1389256 1155246 1396594 1323163 1465099 972123 703022 901584
2533 901584 1004891 1098445 1297905 792571 678370 1018297 1117884 767666 724466 754039
2523 754039 852525 1276825 958713 809047 663481 435989 673795 696188 706299 1033751
2513 1033751 895649 831188 666966 847726 934070 752221 737268 910553 564314 765798
2503 765798 822150 745973 555869 528354 780065 729332 676111 544947 571836 704071 778560
2492 778560 781732 472660 467904 528950 743195 812846 760533 726509 652997 596424 847966
2481 847966 501910 267581 504980 759369 725019 1006028 808153 350333 148261 587970
2471 587970 723158 660314 562509 254464 707581 1049248 1166782 1029365 1299578 1122678
2461 1122678 780904 862084 826437 864555 700343 524326 569103 576977 677568 679244 646668
2450 646668 259557 504190 517790 472325 718586 817112 603452 631372 526794 134216
2440 134216 133145 282321 626339 633244 605015 458327 438539 426683 89360 309300 438607
2429 438607 381295 679661 380386 667841 615843 380056 673099 646395 814656 482830
2419 482830 514412 393433 204934 370472 799225 1042267 672043 45321 -30462 394227
2409 394227 833273 751175 798805 310288 235274 597794 442468 530288 446595 551502 546362
2398 546362 396317 417406 931772 683933 602766 686396 503760 221728 454187 341814
2388 341814 327071 765131 384984 350638 739865 80040 -186518 123357 198940 179553
2378 179553 417870 862366 988205 345523 29882 314110 640059 790976 577523 861607
2368 861607 652816 820004 541152 1015547 1280149 1095722 1259720 1016486 843250 1307860
2358 1307860 1836073 1682517 1486598 1499661 1176796 999767 966564 859852 928972 710169
2348 710169 281931 159144 521585 479445 807408 959828 711618 691283 949262 643794
2338 643794 901356 1276389 809578 522392 271464 540981 759091 768649 403426 528906
2328 528906 718238 862211 996715 1059403 866312 487030 1234812 947873 366197 816241
2318 816241 477936 127965 612949 459397 600014 811873 619446 732320 530961 697274
2308 697274 427321 296212 429912 475443 528172 673125 383010 527682 793214 903910
2298 903910 985274 609569 653068 931063 866912 754198 880043 1434224 1397521 676775
2288 676775 630436 907610 594801 -46 166885 546296 470003 668986 756345 790670
2278 790670 902628 777116 675966 806199 603394 331299 357425 287263 650242 360414
2268 360414 370392 523856 202700 617400 507779 446877 563872 614689 495068 1155280
2258 1155280 973449 735588 864275 967854 1212102 910529 740750 884569 1142135 914042
2248 914042 1421539 1347484 1284253 1444253 1234743 905578 704159 660671 755621 1032483
2238 1032483 1411046 1405689 1385733 1480136 1362020 1023923 1537827 1590341 1426283 1341843 1370087
2227 1370087 1515598 1671225 1827895 1868294 1647548 1854614 1789291 1726003 1747451 1862983
2217 1862983 1736129 1676098 1902371 2043386 1898471 1850616 1910239 1938733 2157376 2426093
2207 2426093 2197647 1968513 1886273 1867017 1530767 1734674 2163847 2316196 2268799 2494730
2197 2494730 2284040 2496339 2693279 2260878 2662404 2703975 2748327 2526527 2613347 2450257
2187 2450257 2241544 2196029 2295611 2949756 2996608 3008591 3060169 3188070 3164187 2984217 2821487
2176 2821487 2900003 3439993 3190876 3072620 3369655 3683288 3821195 4048521 4445943 4476140
2166 4476140 4328041 4391670 4587424 4991881 5201346 5256857 5364859 5596494 5391076 5878731
2156 5878731 6301011 6258160 6104809 6101077 6070396 6289426 6462524 7129349 7372632 7455254
2146 7455254 7753906 7726897 7937918 7926624 8522234 8727864 8547709 9029549 9076944 9465443
2136 9465443 9529798 10132366 10115260 10323706 10705659 11087479 11192850 11308548 12073414 12556265
2126 12556265 12825722 13604017 14128270 14527907 15264006 15890831 16748879 17820506 18352846
2117 18352846 18841228 19353702 20489381 21363888 22550781 24184068 25109957 26541230 28070222
2108 28070222 29952646 31782038 34003806 35972251 37887686 40745591 44374648 47773854
2100 47773854 52267176 57568711 63490699 70196027 78690192 89729946 102927708 117114936
2092 117114936 129147470 140987736 145962113 139912722 128763527 114546619 99531471
2085 99531471 85726312 73690725 64362053 57071866 51386835 47077089 42804042 39781691
2077 39781691 37044810 34946952 33375682 31574482 29509477 27104069 25485777 23832393
2069 23832393 21984759 21011211 19644139 18408018 17653701 17051796 15956171 15774838 15223456
2060 15223456 14521753 13654709 13079388 12385098 11710137 11407239 11060594 10538874 10391791
2051 10391791 9869174 9191400 8923303 8575389 8642248 8386754 8190547 7543040 7381581 7285674
2041 7285674 6808259 6770743 6280864 6000090 5897555 5992875 6157693 5972510 5545798 5440627
2031 5440627 5481875 4971825 4894630 4883825 5074009 4617118 4492130 4497704 4383118 4412795 3888941
2020 3888941 3610000 3378928 3674922 3959196 3394405 2898024 3052628 2697913 2952003 2896841
2010 2896841 2816388 2800972 2413544 2264222 2494814 2489852 2466367 2348115 2012827 2029288 2099697
1999 2099697 2124484 1914115 2157585 1994443 2095052 1820597 1700059 1559098 1284988 1774177
1989 1774177 2156032 2163652 1957371 1699881 1863511 2034836 2179923 1765490 1574158 1381567
1979 1381567 1128581 1281337 1438360 1529323 1389100 1341758 1090567 907359 1120502 1180493
1969 1180493 1146872 1383248 1606409 1418292 1355668 1248198 1195420 1002206 961385 1126135
1959 1126135 1284703 1216413 1230236 1009339 697422 976799 1236576 1525058 1576986 1322885
1949 1322885 1286462 1294589 1326483 1095600 1128920 1574539 1253104 655286 851440 1389540
1939 1389540 1284145 684566 908005 1203018 1261343 1053369 1121816 1149054 788283 922952
1929 922952 719656 637410 927577 1138747 994000 1004589 1043191 955139 935528 608259 661641
1918 661641 853201 618884 195784 567741 796268 970962 848876 837796 652030 354216
1908 354216 520147 407652 267839 314030 355694 116249 299224 321930 317651 44246 154020
1897 154020 479723 344472 467459 572459 648382 757842 717844 626485 916963 838775
1887 838775 396776 460754 350970 429015 763415 968688 361411 301773 296039 165251 156920
1876 156920 322270 572691 729247 651240 554891 172964 -103846 205226 585594 670793
1866 670793 518349 331579 367461 666085 482949 552844 414140 357236 581537 688368
1856 688368 517293 483436 652014 298478 316355 214011 679527 841734 689856 703048
1846 703048 420652 308105 430500 405673 217579 303134 407718 298802 349381 301529
1836 301529 81192 153688 353345 763201 577788 342331 676997 762767 572039 519674
1826 519674 580214 1035999 888357 809032 821726 927803 884636 947123 955191 742299 910773
1815 910773 647403 397962 223801 307516 380206 544920 781927 870873 1060564 732892
1805 732892 199886 269644 479033 35671 143989 483702 266643 20205 -111389 7352
1795 7352 92696 507185 30964 -332201 -202638 -408722 -3247 147920 362688 94431
1785 94431 153658 223486 -35624 160246 334726 476085 686757 596679 500744 658025 326825
1774 326825 242455 319053 94677 1634 276109 394262 568392 147886 -310661 141896
1764 141896 -161969 -321407 -181233 151167 292868 158345 482386 213862 109401 415679
1754 415679 411230 -53327 -20863 167479 270722 235678 285291 15522 -19128 136830 199399
1743 199399 461134 344816 145932 101787 -109534 -241675 -179756 167298 203333 79021
1733 79021 113467 140945 105175 251998 419979 238989 64068 -419549 -657722 -271996
1723 -271996 144350 -1398 -227910 -715344 -442805 190553 -3594 32467 -262204 -341105
1713 -341105 -957 -10310 163953 293045 573151 504921 -4982 196784 233266 -126157
1703 -126157 -356244 -471307 -209400 -106260 396220 438700 294882 -67969 -343463 -283932
1693 -283932 -30304 420512 639873 546416 282321 403315 -8571 -154053 360559 581419
1683 581419 789461 264068 -130308 -289791 -276689 76785 299598 306338 40317 -141476
1673 -141476 -161313 -767081 -643064 -767838 -520572 238168 191964 227664 75658 -68686
1663 -68686 -260259 -577952 -125334 68075 -97492 276377 546571 460811 386430 482864
1653 482864 613203 526810 139733 116410 98901 270384 177687 -39501 -538774 -76689
1643 -76689 -79372 -7817 -6026 -439942 225089 755311 303206 78773 141429 -262569 -233486
1632 -233486 138467 -17057 -422836 -509813 -311915 -110030 72195 -209354 -341501 -142306
1622 -142306 58760 262371 118629 52726 -216653 -176052 29669 206062 81885 -189742
1612 -189742 -537789 -396923 129156 308298 208383 -206843 -29672 -61041 -128604 -355367
1602 -355367 -265363 -237646 -124 142890 267644 318631 243495 435070 441090 316559 21127
1591 21127 -97704 122544 93991 -75655 -81041 -367154 53591 477617 312902 -22370
1581 -22370 -110628 25180 368983 117071 165076 55753 -236421 -275986 -158501 146488
1571 146488 134158 90474 -96338 -111651 -364145 314612 414347 181234 127480 43714 23884
1560 23884 257894 -191369 -219019 273214 247089 493142 699860 571653 158161 -89847
1550 -89847 -179218 -34237 -86682 -265372 -403609 -87269 -157440 108673 -138838 58520
1540 58520 -49382 -17709 -48260 -178411 -45197 536356 578713 149073 32910 99084 -151994
1529 -151994 -327763 -76998 -60079 -425613 -591058 -138968 144794 -160961 -281158 -79194
1519 -79194 -206339 -133764 -92746 -147665 -19409 78691 -39454 -48305 -85808 -423995 -249644
1508 -249644 -120055 -61827 4148 -368048 -122883 -179737 -413646 -284743 -421462 -254748
1498 -254748 47449 320092 207673 -58099 25221 232982 176638 274725 528314 -127526
1488 -127526 159991 154781 -107604 97397 339782 249717 144596 487652 604384 72480
1478 72480 63648 118366 231880 193111 14606 245644 348750 -161697 74284 441573 542277
1467 542277 247188 -143150 -476599 -138147 66908 -240445 -235520 -190985 -123064 -4780
1457 -4780 -260345 33850 -187816 -231811 -337965 -120768 318641 -277507 -198931 -18374
1447 -18374 -164034 -304039 -211944 -135342 707085 450680 209179 241539 287319 97239 141452
1436 141452 -39677 140997 -141151 -270324 -274990 -207984 179205 -103987 -302609 -359588
1426 -359588 -416747 -467058 -285862 7822 -222293 -193989 -281615 -524166 -511138 -117441 144025
1415 144025 86178 -126952 4724 422450 412331 -91806 -123676 -147463 -321216 14915
1405 14915 -238446 -265005 -199152 104934 122341 30967 12143 -109843 61590 335526 18016
1394 18016 -79870 205221 92540 -171625 -169589 -103313 257688 191387 72932 -183674 -45919
1383 -45919 -187127 -290508 217719 338194 -132043 5579 75741 275626 455818 208265
1373 208265 173062 -142546 -292066 -218267 -254060 -28255 306437 369829 300688 552935 278288
1362 278288 -87639 190777 -445880 -29030 -257822 -328323 -193924 -117304 380253 388736
1352 388736 251135 128037 -253458 -118402 -19985 -4900 -59920 -457054 -303422 -89727
1342 -89727 -68358 -17827 -92119 77095 290856 259800 -177513 -5291 477609 96432 -124184
1331 -124184 389677 231633 -336877 -72183 -127120 -18383 -136243 -439807 -438819 -404757 -74476
1320 -74476 -131902 -350983 -279507 64045 464379 146325 88501 -99150 -32040 117227 14334
1309 14334 75277 47153 147717 339759 -211869 -498432 -338141 -270076 16986 633936
1299 633936 782253 379444 104870 140196 99978 -304632 -431050 -435070 154467 108757 -99310
1288 -99310 -248050 -96310 511724 215169 365379 65460 -387429 -249193 -477524 -383292
1278 -383292 -214774 -5081 94268 -174653 95749 127951 113007 19969 -303170 -280032 -295835
1267 -295835 -187546 22211 177649 126393 152903 177969 196339 -31374 135553 68188 275434
1256 275434 329882 -16319 88420 -283813 -82984 186223 -134366 69733 469812 696748
1246 696748 693754 415184 371600 122220 299847 168796 44348 7111 20498 53379 -325993
1235 -325993 166093 154732 -218310 -355173 -126811 286516 218864 23124 -292763 63996
1225 63996 -71970 -195590 -263532 -84783 -484614 -288952 188146 306197 -130802 -373323
1215 -373323 -250574 -365343 -372421 -120977 -264012 -422557 -296741 -379480 34607 142975
1205 142975 -89575 86272 -85366 -370816 -181740 -119004 -88626 89190 193865 48474
1195 48474 -39049 -323008 -49556 127505 127157 -19117 314255 -51060 280700 491566 668900
1184 668900 313926 465316 634352 360100 95580 140196 88520 77873 -159035 -119452
1174 -119452 -238757 -467665 -473176 -461697 -2958 14787 -47020 -408087 -364371 -259532 169648
1163 169648 28054 -140271 240551 723339 449973 149943 336439 171220 82726 -50764
1153 -50764 -132957 -69084 31580 -88380 -338160 -132899 -45061 188853 136022 -170452 -128597
1142 -128597 -426227 -211547 127117 -498060 -118871 156333 333025 54158 -486953 -499707
1132 -499707 -652760 -311031 -337142 -200260 -38957 -123974 -120375 -365814 -590857 -208980
1122 -208980 -548016 -438082 -372506 -747126 -173093 -202192 -401651 -431801 -59331 68541
1112 68541 -177095 -84186 -430809 -191141 7599 -307876 -314899 -76058 -76874 -328976 10881
1101 10881 273609 -73593 -513603 -415559 52868 41631 217503 435791 55137 -37624
1091 -37624 -63616 -80188 29105 273734 189867 291146 326377 -45706 -103755 269540 368751
1080 368751 54484 -110095 162675 159997 183587 -20649 -159487 -190857 -99678 -306385 -488143
1069 -488143 -193829 -13971 -143097 101140 21006 -93005 -260204 -324553 -174098 -262644
1059 -262644 -343861 -267317 -172196 39289 167751 -267261 -18118 608151 428766 115250
1049 115250 -342009 -66253 115152 253734 570668 -426049 -401132 51650 -68230 -51324
1039 -51324 283164 -53397 -362419 -98684 -156199 45864 478384 588323 482808 -209560
1029 -209560 -564856 -473824 -499723 -136916 -247355 -198862 -155627 -235153 4860 202244 46935
1018 46935 30104 -709568 -396735 -53619 -577755 -483544 -57110 32464 39008 476741 408567
1007 408567 94373 -217792 110125 279225 258438 135594 -251723 -33035 315131 -40044
997 -40044 178088 -28886 -71179 -223873 -386851 -104413 -191650 -629800 -695032 -261957 -48515
986 -48515 -336254 -373697 -115262 -131843 -270893 -397675 -373898 21255 352600 509137 164689
975 164689 302256 229274 -24453 214125 97101 128497 404178 -277828 -201525 -218764 -250307
964 -250307 165906 347263 140552 51797 -71423 -669930 -496855 -190768 -238028 -392128
954 -392128 180823 351058 79118 -921 217689 7797 -320845 -14219 259098 463755
944 463755 -191774 -819140 -637493 -308045 -580915 -240407 -319555 -219144 -65693 -28125
934 -28125 -317612 40863 463566 -91524 54269 99262 -18640 -341046 -236379 -26290
924 -26290 156583 -23751 -514477 -55804 135106 -74266 266913 253144 328440 -19867
914 -19867 221543 290075 -81547 227437 165893 -412299 -251330 -214677 -492936 -483873 105635
903 105635 399271 -21706 -66533 359319 346151 210072 166617 -9270 -159122 168745
893 168745 133917 -133914 -69319 238852 421077 -28097 -183141 210109 132990 333079
883 333079 482195 563341 -64501 -148358 -8432 156950 274967 60821 -6542 151169
873 151169 118271 70532 -3802 279246 76953 -48540 37315 -63283 115603 -18248 -33476
862 -33476 -220469 -248157 -524253 -186556 56718 49593 23191 41554 96851 227213 5090
851 5090 157708 38019 -50850 19885 -84197 -72437 -418315 -7347 -99191 -37182 -26051
840 -26051 188170 349171 474212 545386 310505 -110051 -28896 -291092 -388671 -309357 -320517
829 -320517 -440225 -491638 -307768 -323093 -190321 -183938 -88599 -271648 -191513 -399213 -8803
818 -8803 93011 316589 340959 141221 176188 209959 272696 267526 30649 -137905 -67898
807 -67898 33893 550935 240155 -19540 47760 -168994 40985 25318 -193466 123807
797 123807 391347 4388 270845 460307 -188790 -414424 145708 -17511 50621 91173
787 91173 161059 -28604 74006 -25893 -451077 -132766 401702 -81471 212763 46181
777 46181 182442 240450 -247519 -198447 -356670 2872 67976 213129 -244908 192234 -164353
766 -164353 -147131 -117286 -284472 -23275 -507856 -471027 -123314 -13332 -241709 -66810
756 -66810 185566 348509 379236 -39037 -31033 218309 212707 281784 -67663 -243011 -165031
745 -165031 34763 89274 486008 301915 175093 42074 -20517 -170455 -150892 -138149 -159830
734 -159830 247487 208772 -117804 148063 -130661 59603 390121 684208 578628 309750
724 309750 -84771 -323278 -47033 123825 59955 70795 -100551 -128265 -25243 -395877
714 -395877 -37406 -81792 -189466 73881 509813 90710 -16026 -82794 -312794 -385953
704 -385953 -326452 -152161 -306898 -45046 -53732 -269191 -113500 -107749 463004 448419 35765
693 35765 -38643 279065 173794 -31085 -242743 -40457 -502007 -170039 -62788 -108041
683 -108041 -279926 -237803 85101 293450 505461 235719 -92142 122314 -93645 -162040
673 -162040 -129208 -154481 -178154 -25823 111547 165187 156910 528721 22529 -208903 -23573
662 -23573 18943 86572 334048 56988 -129732 80199 -468308 -468384 -306138 -51590 229429
651 229429 -69935 -144404 -325524 -243395 -380766 -468794 -113299 -58896 -161242 -429924 -85754
640 -85754 -194306 -562815 -662938 -329714 -135763 -399391 -628551 -378526 -276980 8125
630 8125 -353722 -86052 273806 189858 102194 473854 447538 155257 -116478 198400 109553
619 109553 -110288 -32618 83691 26892 -367151 -162765 -179201 -145762 -230439 -187886 156554
608 156554 58551 308684 144816 52821 155390 -16371 190567 506267 86462 87580 -306917
597 -306917 -672130 -474133 51289 -18585 252067 -14835 17431 -182910 -209911 327455
587 327455 -18805 26852 159375 -253181 3061 97152 -60864 -332526 -125730 -138630
577 -138630 -243082 -416012 -531588 -142850 -220277 64423 144654 427552 232691 231144 258239
566 258239 241022 85613 177852 237032 -63746 166909 387188 -54790 -53945 -399010 -334339
555 -334339 -131931 93617 -2075 210310 189649 258072 295897 379619 210663 248545 283045
544 283045 -183056 -593128 -426568 -114238 -281027 -283971 -218869 -160383 -76867 12296 -91031
533 -91031 172946 163075 147709 -35449 -97762 -20545 182486 121576 482722 543070 304831
522 304831 100681 -280678 335535 608272 390212 128541 -110445 288923 -384418 -233700
512 -233700 41280 346532 277104 318501 121889 -424376 -329552 -763122 -547917 100939
502 100939 4374 -211219 274964 403575 63871 -15853 -59297 -31798 273132 144736 -239417
491 -239417 173844 214668 140686 244305 -81410 71424 119069 153892 -61422 -73615 -237765
480 -237765 -103870 -124252 -166513 -131959 256655 -121593 -216566 -658921 -531926 -488705 -52875
469 -52875 -115519 -99618 57504 -65119 116066 -65233 9316 -277165 -545959 -242255 -11554
458 -11554 306487 279397 188344 273289 37061 64596 551088 301661 14424 25075 -102717
447 -102717 19746 232085 126812 122690 288956 -241024 3554 -71507 -117658 -285931 -98468
436 -98468 -203616 -29793 -97215 -412231 -313206 -585240 -208951 -371196 -527135 -130616
426 -130616 36751 -356146 -485499 -239122 -100718 157260 -209144 -369555 -205299 -262284
416 -262284 -135482 169301 141373 50672 -29670 -46027 -203019 -174486 145524 216824 420100
405 420100 302770 123262 634866 459926 570282 178319 215861 356326 175226 -4355
395 -4355 -319604 -515503 -434200 -123499 -258188 -242255 120272 -85163 -261486 -214477 29205
384 29205 4798 315862 335872 137067 65140 -109062 -258855 -75258 -16873 36608 360652
373 360652 121627 258078 471792 203990 -434 55085 186780 81529 60556 133489
363 133489 -250213 -316942 -219316 -186143 -30155 211619 351007 728349 726175 131387 -92784
352 -92784 37473 166301 -55871 -354657 -293928 99331 124260 362410 179274 90545 383738
341 383738 466851 421954 99305 127029 -125310 4683 35994 140016 219723 268157 582695
330 582695 452486 207284 85765 185514 226234 -16753 90619 58211 -277471 53552
320 53552 480798 503068 310487 -137590 77581 271376 275635 87082 -170646 296560 82365
309 82365 -64099 118822 181117 378229 244380 250727 106988 -21445 -470675 131560 81440
298 81440 -211641 72232 -107792 -163174 -332272 -198356 -143299 -205812 -26910 108088 -24899
287 -24899 207123 212910 -10471 -189137 -471547 -69069 -120653 -63504 208811 53091 146038
276 146038 205936 230426 431311 274418 214345 286063 81786 200108 296340 297355 135818
265 135818 337117 223197 -138321 -87289 -381313 -281339 43187 410038 261148 -36507
255 -36507 -245050 14318 26817 -1531 -46013 73733 -1505 -187591 -362836 32308 134025
244 134025 -70854 -51667 216540 477531 381268 267068 166808 24968 178817 147869
234 147869 -45108 251784 363006 240344 110632 -38250 33351 -60668 -192654 -244813
224 -244813 -131745 -26495 -106276 175144 -100772 -19890 -71031 84938 187350 -52012
214 -52012 -23385 209365 135201 -20961 19357 190673 -158007 54424 -84398 -604615 -484310
203 -484310 -231442 -87454 -43297 -195489 127020 265955 393981 5041 -271960 -64450
193 -64450 211866 -54901 82823 407115 195221 92712 150025 244892 -246088 -193216 15901
182 15901 59572 153855 340346 655562 599971 810628 399925 -60822 -185632 165848 446749
171 446749 206019 -343736 130976 15214 -143029 103745 51689 -8221 58164 4400 218776
160 218776 -67269 -305955 -90512 -47288 157904 164797 185933 -81731 29239 1301 -82322
149 -82322 281576 220489 -30267 89674 -13962 171523 -98101 -163671 -131406 -203037 -145747
138 -145747 198781 111317 413161 587035 321370 367233 403266 210633 35385 36107 51935
127 51935 -96834 -351102 -252278 -54594 -155545 348291 585758 349851 196959 139195
117 139195 -21678 96084 -5578 293208 348976 366838 18603 285411 293576 -27939 -1603
106 -1603 -156264 -180236 -232607 -130363 40948 -185729 -4529 279870 228562 42074 -264963
95 -264963 -161032 7922 134519 -115664 -120319 369660 575623 169535 -298991 -296147 -310933
84 -310933 -335506 -512659 -75599 -132409 -148797 -360076 -271860 -75677 -47604 257519 45195
73 45195 -420416 -353544 16977 59213 -75215 -276167 27847 -22494 -161330 -458106 19133
62 19133 172307 207055 -46084 65013 177246 124777 -110872 288292 412969 363806 80052
51 80052 -144758 225890 99082 -78307 -31881 59051 -47900 -155186 31688 -8265 101421
40 101421 127018 319070 329676 271418 105907 -24435 72650 2402 316371 215196 238150
29 238150 96199 38844 -63005 81010 147324 -39588 251878 113307 -5569 240459
19 240459 155779 -235258 36063 130578 -168127 -182188 -40863 -64699 -21508 93123 -114442
8 -114442 -187751 -22171 118892 -175023 -89725 11226 -58370 24941
0 24941
$$ Imaginary data points
##PAGE= N=2
##DATA TABLE= (X++(I..I)), XYDATA
16383 -2512014 -2283490 -1924200 -1934281 -2178134 -1936603 -2024888 -2267942 -2164552 -2112273 -2018454
16373 -2018454 -1763195 -1621918 -1739743 -1965540 -2105876 -1992771 -1616008 -1668123 -1397598 -1281741
16363 -1281741 -1610182 -1607568 -1625847 -1335534 -1170677 -1256755 -1212440 -1240443 -1325758 -1362347 -1305511
16352 -1305511 -1218725 -1372080 -1517976 -1433557 -1380908 -1320643 -1107888 -1143079 -1132533 -1135422 -1039371
16341 -1039371 -1116375 -1087559 -550387 -774840 -730986 -1085529 -936139 -601628 -643818 -778260
16331 -778260 -1071949 -874823 -422464 -422488 -684052 -707663 -561952 -547031 -282662 -267473 -480178
16320 -480178 -352800 -297214 -219610 -365799 -184559 -162655 -272733 -410048 -281894 -15873
16310 -15873 -133833 -274820 -101405 -203152 -100861 74637 182737 141933 135236 127995 -290241
16299 -290241 -83309 -105814 60951 263198 -189764 21613 173851 329165 534888 276799
16289 276799 223242 -171445 -382208 -262875 -138622 332543 514186 459159 490727 481858
16279 481858 171888 2638 36403 337193 422397 323307 545874 503515 394355 456775
16269 456775 593638 733400 479372 566229 644640 396801 564943 514619 606990 751108
16259 751108 685099 515908 559207 512156 823176 1126617 1207065 992948 617915 674326
16249 674326 726938 1105286 1167806 802273 717419 1015432 669338 478161 685318 1059923
16239 1059923 1154011 864370 1031721 1354670 1390486 1371185 1631975 1409562 1222089 1231542
16229 1231542 971762 980814 605151 823776 1423407 1198623 1110409 1107942 931460 1281727
16219 1281727 1286159 1035488 1402928 1404461 1316296 1480574 1283818 1321700 1375688 1358988 1298269
16208 1298269 1442665 1794113 1786004 1433847 1288415 1599364 1629489 1516475 1512196 1344956
16198 1344956 1303128 1338045 1557297 1196082 943230 1105661 1283645 1317817 1371704 1469648
16188 1469648 1460665 1628523 1857777 1763352 1577183 1637885 987879 1135018 1572198 1259218
16178 1259218 1494598 1746511 1569485 1604278 1560597 1742289 1693421 1497615 1349863 1615822
16168 1615822 1429292 1596076 1837104 1806338 1958842 2152788 2070172 2037470 1654450 1455177
16158 1455177 1768390 1636575 1770517 1799001 1593200 1695934 1665392 1643918 1764914 1695729
16148 1695729 1686947 1630448 1999631 1980331 1688939 1761460 1913393 1806833 1796049 1399764
16138 1399764 1567870 1636970 1674437 1700206 1573656 1824979 1990054 1768068 1752670 2107491
16128 2107491 2246149 1932046 1706900 2009580 2121972 1905987 1984299 1997456 1613982 1813128
16118 1813128 1771815 1540989 1440444 1802695 2069696 1659364 1973036 1969491 1954088 2072216
16108 2072216 1847732 1863814 2277385 2320030 2027525 2063363 2170116 2629777 2329736 2261089
16098 2261089 1784404 1761812 1636090 1540321 1659660 1615877 1854253 1733868 1534942 1817629
16088 1817629 2114850 1932735 2048233 2015311 2106551 2073692 1412507 1477970 1927281 1978014
16078 1978014 1929330 2078728 2123622 1985741 2117816 1911060 1916756 2015862 1845282 2207586
16068 2207586 1922345 2165061 2637396 2261276 2202397 2085438 1992102 1851249 1581597 1474078
16058 1474078 1384030 942363 1397733 1754977 1787519 2043069 2349074 2200020 1691480 1675224
16048 1675224 1704525 1678476 1784657 1610960 1796472 1702276 1680024 1645467 1597547 1978815
16038 1978815 2415285 2281348 2018932 2169594 2099270 2382370 2219265 2258055 2399438 2281842
16028 2281842 2263585 2350935 2401291 2094760 1854715 2161064 2430634 2525524 2075240 1906333
16018 1906333 1929987 1870356 2255901 1973106 2210103 1865256 2164455 2265711 2640523 2734841
16008 2734841 2460829 2343466 2340511 2089737 1789337 1799214 1667444 2125065 1812271 1597753
15998 1597753 1838123 2408051 2360977 2597539 2310118 2129462 1937213 2045065 2218413 1992401
15988 1992401 1936077 2048329 2020222 1770664 1851582 1691490 1162308 1660102 2000408 1977404
15978 1977404 2051898 1898736 1837686 1838641 1786758 1792270 2185553 2098086 2200913 2153737 1836152
15967 1836152 1624538 1808276 1987144 2003308 2045503 1693254 1563419 1975702 2062770 1798533
15957 1798533 1681520 1997950 2426753 2220175 2160464 1967684 1883493 2084186 2041651 2178593
15947 2178593 1843451 1939859 2071557 2122662 2033661 1974390 1950716 1999631 2152589 1840894
15937 1840894 1745978 1752746 1710518 1924133 1568133 1696418 1693765 1759820 1810164 1997564 1917565
15926 1917565 1735808 2105290 2220883 2189088 2155957 2109050 1854528 2006526 1863707 1834679
15916 1834679 1875579 1814293 2013311 2287157 1985710 1948229 1482260 1680556 2041951 1870062
15906 1870062 1890237 1800990 2017883 2133734 1745554 1542280 1393050 1641471 2088179 2086328
15896 2086328 2127754 2264960 1869720 2304856 2244177 2345148 2333252 2212737 2272300 2695934
15886 2695934 2412276 1766795 1904500 1882758 2155703 2029643 2015208 2009125 2186112 1999406
15876 1999406 1893170 1978375 1982108 2060975 2073330 1881705 1867557 1548916 1822678 1777479 1683492
15865 1683492 1551572 1750601 2206541 2349712 2154246 2115332 2530766 2197058 2206970 2292356
15855 2292356 2349207 2719535 2416444 2340790 2430579 2228994 1954549 2035440 2094129 2079839
15845 2079839 2092761 1911428 1487621 1806803 2251934 2245725 1928800 1769246 1793008 1920018
15835 1920018 1838227 1422460 1465630 1741537 1969241 1930089 1999584 1799531 1814708 1907297
15825 1907297 2036764 2013317 2137259 2367013 2587842 2109292 2136815 2257881 2050589 1792201
15815 1792201 2066382 1935320 1810090 1905996 1842386 1868570 2074322 1892585 1970597 2188775
15805 2188775 1650867 1584886 1783415 2157095 2304645 2140379 2321228 2221986 1927264 2411100
15795 2411100 2469396 2282721 2203107 1810672 1816597 2011979 1906502 2351464 2478276 2067347
15785 2067347 1939662 2402842 2570421 2075288 1894711 1989878 1861920 2053204 1745500 1675403
15775 1675403 2035430 2271741 2094600 2264014 1996061 1602861 1396541 1449266 1314218 1763355
15765 1763355 1866865 1807509 2046599 1973968 1661449 2254848 1965317 1673928 1936210 2032085
15755 2032085 2149564 2092695 2077552 1678116 1796553 1835462 1582799 1517862 1839282 2234871
15745 2234871 2289051 2052292 2199762 1683349 1659955 1986005 2290465 2321490 2158618 1927169
15735 1927169 2172001 1970843 1562200 1899002 1937373 1815020 1869523 2044100 1842522 1599116
15725 1599116 1982646 1981852 1994024 2345632 2302838 1902361 2432549 2195149 2431603 2076990
15715 2076990 2020955 2444888 1973576 1637936 2116236 1874459 1633663 2076222 1674298 1492376
15705 1492376 1825621 1998501 2264296 2268478 2567002 2730724 2487713 2307632 1669022 1926996
15695 1926996 2077974 2064678 2333160 2314601 2047345 1776242 2105496 2339978 2275034 2303974
15685 2303974 2269806 2110660 1661422 1857724 1903478 2101051 2106289 2191049 2405031 2355539
15675 2355539 2155029 1928535 1932377 2047377 2088051 2032786 1930038 2113944 1696381 1711907
15665 1711907 1698499 1365059 1703315 1818429 1890036 1916583 2113925 2197976 2635168 2444528
15655 2444528 2065355 2139717 2214530 2359838 2126342 1884244 1957601 2307790 2246782 2274001
15645 2274001 2574802 2613653 2419780 1839068 1633847 1579042 1982377 2122063 2331571 2583864
15635 2583864 2571859 2589620 2428008 2594239 2518890 2460712 2649056 2434576 2141219 1916660
15625 1916660 1965028 2040969 2224483 2115392 2212058 2200660 1939067 2114819 2315459 2209297
15615 2209297 1996385 1761227 1698080 1956740 1707222 1437958 1813518 2292210 2512291 2359694
15605 2359694 1698665 1569413 1802930 1933739 1841241 1930034 1741818 2043345 2093310 2127170
15595 2127170 1968558 2239387 1759629 2001966 2301744 2910013 2624403 2380391 2297761 2077759
15585 2077759 2054998 2118761 1876299 2181213 2249814 2123882 2449768 2253491 1951958 2180407
15575 2180407 2512205 1999525 1921518 2062146 2244776 2037622 2116389 2019099 2062074 2258320
15565 2258320 2051321 2084401 2331318 2400283 2403494 2331993 2086058 1951452 2333468 2111165
15555 2111165 1881058 2012870 2419840 2283121 2302956 1956527 2099165 2164997 2351362 2279215
15545 2279215 2210275 1883662 2413713 2801110 2426802 2015648 2214061 2351558 1947739 1780692
15535 1780692 1930875 2073272 2054233 2193334 2577887 2688331 2709798 2466487 2292255 2745206
15525 2745206 2388430 1982428 1964321 2430298 2580474 2381792 2492487 2127792 2306951 2159246
15515 2159246 1947830 1870117 1955895 1557349 1591110 1544388 1576195 1552873 1488233 1905567 2132179
15504 2132179 2352388 2377509 2063996 2313069 2350268 2199559 2399490 1998588 2210155 2134849
15494 2134849 2330774 2384620 2052571 1905250 1729726 1977416 2377154 2212396 1621928 1842557
15484 1842557 1991697 1906679 2081703 1787945 1917887 2224196 2300061 2338714 2422480 1943597
15474 1943597 1883886 1975072 1865344 1870457 1691276 1829966 2038808 2015049 2303250 2371819
15464 2371819 2262983 1993881 2044886 1959148 1928831 2028175 1855491 1879351 1914312 1510447
15454 1510447 1978872 2107240 2190959 2209638 1703250 1980099 1929937 1711521 1491953 1974144
15444 1974144 2377153 2111033 2133288 1929886 2260611 2098493 2237904 1963615 2033754 1996335
15434 1996335 1833534 2209115 2480061 2807354 2743775 2346305 2154997 2096460 2341385 2188988
15424 2188988 2160229 2283172 2359132 2667061 2806635 2656378 2852743 2347118 2221998 2407767
15414 2407767 1950980 2207196 2591119 2588303 2305313 2112491 1987142 2366333 2283946 2157327
15404 2157327 2387932 1994451 1861796 2381892 2641281 2435436 2087329 1950962 1761774
15395 1761774 1714597 1821507 1805239 2327396 2725488 2739771 2495065 2247610 2294141 2311700
15385 2311700 2292200 2058817 2097873 1993785 2407192 2551440 2183214 2118520 2439786 2653585
15375 2653585 2725314 2385579 1941922 1546414 1930821 2067864 2119497 2216780 2356636 2277715
15365 2277715 2132611 2241968 2384207 2165297 2112066 2078514 2019194 2358585 2619160 2430948
15355 2430948 2119652 2069699 1990038 1711832 2077528 2303916 2265661 1737546 1563326 1814158
15345 1814158 1984268 1620179 1816597 1904541 1582683 1820956 2088987 2089936 2068465 2016725
15335 2016725 1902856 1916326 2601651 2073628 1714663 2073813 2178878 2412459 1791799 1842409
15325 1842409 2086866 2350979 2203028 2053171 2361825 2507961 1981523 2193178 2327000
15316 2327000 2030180 2121393 1966006 1647000 1640696 1773496 2032636 2187713 1960805 2365348
15306 2365348 2420592 2229658 2337968 2406985 2230677 2500776 2529269 2241067 2258888 1941854
15296 1941854 1904431 2007180 2211640 2424861 2782899 2665304 2316276 2094189 2363129 2455586
15286 2455586 2487543 2153828 2070333 1989155 2152789 2279904 1850162 1833132 2142174 1635267
15276 1635267 1850133 1746071 1532974 2004503 2092784 1808530 1921849 2255702 2263626 2133251
15266 2133251 2151869 2248028 1947021 1747893 1866767 1817663 2144209 2121544 1804621 1888936
15256 1888936 1744786 2008008 2278228 1778381 1795631 1957619 2145506 2846026 2915970 2611275
15246 2611275 2475398 2000786 1875011 2248330 2104514 1752024 1344303 1695111 2035602
15237 2035602 2102275 2140949 2004575 2186297 2210901 2147625 2125755 2286675 2350223 2361228 2598900
15226 2598900 2433132 2145611 2096138 2454205 2385760 2102619 2209716 2485383 2688312 2511231
15216 2511231 2442268 2406913 2293061 1949283 1956082 1532832 1712526 2334032 2069227 1958979
15206 1958979 2458522 2462478 2281071 2399057 2061143 2292766 1927909 1649573 1905906 2352600
15196 2352600 2154153 2350634 2090430 2098491 2152892 2217089 2360606 2129842 2407145 2280689
15186 2280689 2500491 2363557 2279191 2004671 1906409 1811785 1520432 1514947 1603866 2061315
15176 2061315 1832126 2230326 2481262 2334390 2551162 2393817 2218455 2359042 2415397 2527630
15166 2527630 2124481 2296438 2029015 2294636 2660373 2258273 2157483 2052983 2345011
15157 2345011 2025168 2083341 2207426 2332718 2300434 2185214 2289200 2030134 2481994 2329160
15147 2329160 2218828 2357444 2132044 2211304 2122050 2108111 2024657 2136138 2185754 1886304
15137 1886304 1621062 2382476 2320986 2152280 2207130 1997256 2049316 2219681 2335624 2244002
15127 2244002 2140639 2495724 2356224 2271821 2403487 2341804 2570553 2246150 2007481 2196922
15117 2196922 2222969 2273864 2118537 2100428 2183826 2075926 2139517 2070323 1930669 1748827
15107 1748827 2096502 2423783 2325817 1975652 1907384 1786020 2067893 1940066 1788802 2009783
15097 2009783 2189109 1930946 1986151 2266113 1912341 2000318 1975071 2184659 2342164 1996786
15087 1996786 2113880 2092351 2190262 2346640 2297469 2078125 2172276 2191348 2040891 2137563
15077 2137563 2169275 2105139 1795943 2036343 2129936 2280148 2369760 2435207 2207555 1923478
15067 1923478 1795508 2122029 1963607 1912830 1816016 1705963 1704934 1817420 1952086 1803584
15057 1803584 2004810 2596448 2449790 2447474 2104834 2523138 2709206 2151689 2245288 2216517
15047 2216517 2104772 2179062 2057636 1827043 1550996 1893422 2205393 2250401 2238301 1972013
15037 1972013 2171433 2531131 2435691 2033616 2085404 2099796 2014344 2010004 2087202 2077346 2165396
15026 2165396 2166432 2417504 2174385 2037501 1842212 2146100 2298964 2156741 2150594 2503473
15016 2503473 2312335 2119189 2118452 2299966 2103178 2209634 2034643 1788777 1909495 2156126
15006 2156126 2169363 2065920 2394808 2054287 1903749 2262118 2292053 2112814 2443247 2490238
14996 2490238 2074998 2336202 2728168 2710546 2759326 2555841 2145387 2115349 2653967 2341029
14986 2341029 2338420 2348974 1884607 2248950 1956904 2061049 2486575 2199199 1837684 1967613
14976 1967613 2400125 2443860 2503955 2172816 1971206 1855890 1751021 2018214 2049128 2396194
14966 2396194 2101255 1739139 2027821 2126974 2418497 2422803 2531791 2456524 2378009 2061929
14956 2061929 2262591 2485096 2442216 2150092 2350454 2391248 2121477 1981037 2105760 2302295
14946 2302295 2514619 2340261 1722390 1977018 2270208 2428581 2455617 2576092 2547472 2305190
14936 2305190 2103485 2170881 2326033 2313251 2322283 2330973 2216143 2440457 2496012 2154216 2074735
14925 2074735 2209389 2331099 2196730 2178965 2293245 1767147 1773189 2144443 1917383 1916074
14915 1916074 1867303 1782264 2036674 2135634 1957664 2171624 2472157 2599798 2259824 1775212
14905 1775212 1869427 2134083 2340769 2687759 2440601 2290421 2462992 2273919 2585501 1998644
14895 1998644 2109097 2201647 1962691 2366708 2555276 2548517 2423382 2340905 1879849 2026805
14885 2026805 2158995 1964187 2198045 1962100 2301035 2138200 2196617 2521414 2725338 2511956
14875 2511956 2269053 2334237 2403191 2234233 2295288 2059379 1746404 2198880 2416337 2687008
14865 2687008 2214949 2049746 2162384 2264168 2260383 2643052 2512802 2302633 2192407 2263469
14855 2263469 2884992 2820447 2415902 2255576 2424545 2457169 2507426 2205136 2484645 2645877
14845 2645877 2546470 2592939 2137590 2088171 2211811 2646633 2610769 2044591 1424022 1692041
14835 1692041 1905059 2236257 2692074 2964326 2825219 3120989 2896745 2163377 2039179
14826 2039179 2220171 2356048 2428730 2350022 2212325 2370414 2585771 2253445 2138183 2142811
14816 2142811 1880009 1776646 2586041 2589628 2516452 2537687 2821563 2777309 2344316 2091415
14806 2091415 1906062 2413436 2230992 1884830 2057130 2300049 2359007 2748611 2557173 2405553
14796 2405553 2297291 2520199 2622541 2703327 2560549 2406951 2498397 2335381 2116310 1748093
14786 1748093 2139076 2340731 2477293 2708915 2430302 2405550 2207705 2033030 1993889 2215741
14776 2215741 2238806 2311731 2233795 2291074 2355928 2575430 2383585 2234417 2001043 1959692
14766 1959692 1988160 2146901 2279820 1899141 2057936 2156634 1998664 2699399 2351971 2251422
14756 2251422 2227322 2036625 1773449 2141748 2324781 2154409 2483050 2311500 2150198 2268961
14746 2268961 2509674 2645930 2743181 2527005 2760396 2739503 2502889 2317535 2554243 2494647
14736 2494647 2266623 2194797 2301718 2036642 2017712 2281800 2240193 2001890 2266045 2481126
14726 2481126 2109399 1947362 2138976 2525296 2228904 1950631 2034861 2157084 2406634 2433179
14716 2433179 2322280 2482812 2614825 2410711 2703084 2616061 2353358 2257637 2056195 1892559
14706 1892559 2034132 2191643 2247168 2426801 2433545 2388056 2117953 1992064 2280729 2665878
14696 2665878 2277793 2218963 2222177 2255245 2492303 2235040 2425791 2332203 2133555 2164332
14686 2164332 1888905 1988654 1920530 1974516 2595007 2689166 2622767 2628794 2808672 2347508 1854513
14675 1854513 2170551 2459784 1844433 2058118 2334763 2354205 2379386 2240309 2550544 2623615
14665 2623615 2456019 2482882 2512106 2466604 2537607 2468242 2511307 2563601 2221098 2280713 2540319
14654 2540319 2756855 2436302 2496102 2695791 2345555 2277694 2188009 2472190 2514602 2349363
14644 2349363 1966177 1790317 2237017 2553042 2176640 2206351 2102056 2439357 2020864 1981412
14634 1981412 2397645 2273223 2827446 2317924 1967902 1484024 1881317 2204203 1980133
14625 1980133 2447222 2361582 2494267 2211846 1918879 1721100 2175187 2325663 2395068 2678811
14615 2678811 2659936 2495354 2084088 2288307 2495726 2652001 2668271 2718376 2541778 2348552
14605 2348552 2361290 2614977 2588198 2652309 2518038 2324049 2063032 2360380 2284536 2091746
14595 2091746 2292171 2426430 2158733 2475806 2906757 2662170 2870777 2790504 2582496 2239899
14585 2239899 2252493 2211425 1959690 1985739 2306385 2408003 2318965 2388280 2447137 2810231
14575 2810231 2424861 2155060 2171449 2011114 2360611 2509634 2378422 1833670 2197870 2454840
14565 2454840 2262039 1898700 2234339 2238072 2423476 2481156 2602672 2672424 2408035 2241014
14555 2241014 2603969 2364685 2338400 2033961 2363107 2691227 2234360 2342901 2442071 2449876
14545 2449876 2062981 2228505 2125820 2709236 2259982 2208516 2569558 2591601 2150458 2057799
14535 2057799 2490103 2591357 2636441 2050168 2293805 2641037 2447155 2057986 1690170 2174775
14525 2174775 2315581 2351647 2305013 2176164 2113977 2241948 2742064 2670932 2631905 2600343
14515 2600343 2176313 2184709 2566362 2346105 2289939 2867968 2990691 2709167 3005640 3046676
14505 3046676 2622351 2538623 2612405 2723516 2285719 2169269 2340960 2232248 2436872 2345988
14495 2345988 2125177 2307534 2065122 2214343 2333006 2126109 2257793 2501286 2677966
14486 2677966 2378614 2702652 2943201 2809362 2480953 2295675 2354544 2496422 2006155 1888811
14476 1888811 2240739 2170611 2426333 2589494 2126407 2122130 2585173 2142839 2092631 2242953
14466 2242953 2154768 2354010 2316414 2317067 2415060 1901668 1996883 2246905 2430107 2495105 2487853
14455 2487853 2387887 2203090 2083527 2140854 2018697 1937576 1851728 2177953 2685633 2730957
14445 2730957 2222785 2288695 2271096 2342712 2390629 2218176 2024632 1864796 1978561 2081602
14435 2081602 2293748 2082493 2151019 2831500 2881731 2592480 2571526 2269669 2176308 1977786
14425 1977786 2243570 2597713 2499297 2307674 2230045 2265142 2183779 2131902 2066213 2120552 2631692
14414 2631692 2464731 2262136 2325930 2170895 1950639 2398226 2608717 2441249 2295976 2417377
14404 2417377 2402018 2455719 2165736 1958139 2165624 2906708 2940019 2364830 2316538 2434824
14394 2434824 2377526 2053047 2665895 2457737 2473073 1995864 1698708 2198635 2482497 2577910
14384 2577910 2633466 2240064 2116054 2340400 2123393 2265993 2346406 2361671 2571150 2613450
14374 2613450 2352684 2571869 2953488 2499704 1910816 1843608 2116785 2654798 2696656 2916176
14364 2916176 2821150 2718951 2202503 1919779 2324969 2185477 1923829 2167482 2319862 2369067
14354 2369067 2413410 2504660 2162710 1735067 1985731 2234751 2529225 2380095 2565846 2792782
14344 2792782 2596862 2667625 2267535 2465946 2563793 2493400 2461574 2543391 2240808 2484510
14334 2484510 2339212 2315143 2413205 2736303 3160103 2724400 2486412 2444909 2626277 2404570
14324 2404570 2117211 2277213 2157293 2425173 2729360 2571566 2652550 2526677 2364829 2424241
14314 2424241 2498224 2106085 2298648 2292320 2405108 2234685 2129770 2258099 2073346 2638446
14304 2638446 2400773 2695594 2913082 2304718 2245035 2337603 2587220 2432359 2062437 2217710
14294 2217710 2319988 2308996 2524893 2217565 2405125 2745797 2959285 2702128 2771574 2371726
14284 2371726 2263647 2517684 2683060 2162747 2270278 2343310 2614072 2535503 2303047 2256528
14274 2256528 2230529 1925565 1928519 2118897 2112202 2354715 2293736 2037587 2139576 1711241
14264 1711241 1887942 2625531 2448036 2340997 2402115 2112258 2313746 2176493 2239586 2278112
14254 2278112 1918660 2297347 2567946 2869603 2758988 2431755 2136698 2205283 2048218 2239767
14244 2239767 2273473 2537274 2792574 2195704 2051608 2163727 2504056 2507107 2074562 2234386
14234 2234386 2163650 2313586 2197346 2527799 2815437 3100256 2903708 2332614 2412364 2641608
14224 2641608 2649825 2689134 2279556 2128011 2406734 2433035 2553711 2658431 2332137 2300323
14214 2300323 2223331 1948388 2504740 2682627 2663553 2586730 2410513 2566328 2650725 2941754
14204 2941754 2660042 2300537 2442627 2323860 2005709 2535018 2565547 2696008 2476177 2343845
14194 2343845 2284409 2467032 2700904 2375961 2700239 2561508 2389186 2749251 2413230 2137935
14184 2137935 2427589 2253361 2405213 2535691 2747384 2697873 2179723 2394256 2201611 2147081
14174 2147081 2120785 2300440 2177172 2101604 2296177 1969451 1754790 1995987 1948835 2346447
14164 2346447 2510411 2554577 2459743 2610035 2794197 2599060 2667770 2666899 2319324 1999150
14154 1999150 2091109 2054204 2015416 2024146 2150847 1838539 1883397 2136937 2538543 2583875 2124416
14143 2124416 2234835 2921301 2760065 2641835 2123451 2037674 2138887 2207103 2572505 2677844
14133 2677844 2733058 2807885 2522915 2421284 2576864 2192520 2407203 2514208 2508681 2374657
14123 2374657 2517068 2622855 2500496 2369905 2063169 1985644 1893818 2591255 2578837 2501320
14113 2501320 2738541 2555889 2124244 2173476 2206790 2054887 1998153 1993549 2137704 2470965
14103 2470965 1965265 2038449 2195139 2479769 2377820 2385217 2157963 2455267 3140089 2602194
14093 2602194 2445327 2435580 2577036 2773147 2517733 2537756 2280670 2393923 2519523 2836681
14083 2836681 2633909 2164093 2469606 2714966 2880583 2888296 2523414 2203445 2157616 2203446
14073 2203446 2598647 2632549 2404526 1913371 2033370 2262718 2364656 2517559 2336280 2144341
14063 2144341 2366546 2694384 2684764 2466875 2267755 2230286 2621588 2369123 2107769 2322421
14053 2322421 2794591 2609853 2755680 3167813 2483531 2232778 2512181 2439422 2440820 2232884
14043 2232884 2542280 2737230 2718775 2400422 2674828 2948869 2501983 2285407 2084901 2089022
14033 2089022 2047774 2412480 2319639 2218124 2342792 2341923 2260051 2730690 2951021 2881897 3271880
14022 3271880 2630448 2434972 2337669 2491934 2458992 2756280 2551591 2387170 2201503 2109005
14012 2109005 2351728 2559337 2709492 2442074 2216421 2141908 2638763 2828030 2578928 2327922
14002 2327922 1977815 2400000 2570503 2420603 2400044 2250050 2162469 2427115 2390107 2341175
13992 2341175 2375686 2422522 2840719 2621348 2542928 2405092 2316119 2735809 2747388 2530197
$$ [...]
##END NTUPLES=NMR SPECTRUM
##END=
