##TITLE=1H_CA-9139-2-4
 CDCl3
 8 sc, 
 17.4.2023
##JCAMPDX= 6.0         $$ Bruker NMR JCAMP-DX V2.0
##DATA TYPE= NMR SPECTRUM
##DATA CLASS= NTUPLES
##ORIGIN= UXNMR, Bruker Analytische Messtechnik GmbH
##OWNER= root
$$ XWIN-NMR		Version 3.5
$$ Mon Apr 17 16:02:05 2023 Russian Standard Time (UT+4h)  she@DPX200
##.OBSERVE FREQUENCY= 200.13135
##.OBSERVE NUCLEUS= ^1H
##.ACQUISITION MODE= SIMULTANEOUS
##.ACQUISITION SCHEME= undefined
##.AVERAGES= 8
##.DIGITISER RES= 18
##SPECTROMETER/DATA SYSTEM= spect
##.PULSE SEQUENCE= zg30
##.SOLVENT NAME= CDCl3
##.SHIFT REFERENCE= (INTERNAL, CDCl3, 0, 15.7557)
##AUDIT TRAIL= $$ (NUMBER, WHEN, WHO, WHERE, WHAT)
$$ ##TITLE= Audit trail, XWIN-NMR		Version 3.5
$$ ##JCAMPDX= 5.01
$$ ##ORIGIN= Bruker BioSpin GmbH
$$ ##OWNER= she
$$ F:/spectra/data/she/nmr/H-F/1/pdata/1/auditp.txt
$$ ##AUDIT TRAIL=  $$ (NUMBER, WHEN, WHO, WHERE, WHAT)
(   1,<2023-04-17 16:00:47.59 +0400>,<she>,<DPX200>,
      <created by zg, POWCHK disabled, PULCHK disabled
       configuration hash MD5:
       00 E9 B6 7A A2 85 ED C7 34 08 36 98 17 FE 4E 26
       data hash MD5: 16K
       7F 71 7E 39 80 08 AA 11 2A 50 0F A2 EE 09 9A C0>)
(   2,<2023-04-17 16:00:50.93 +0400>,<she>,<DPX200>,
      <Start of raw data processing
       efp BC_mod = 2 LB = 0.24 FT_mod = 6 PKNL = 1 PHC0 = -19991.88 PHC1 = 13.60081 SI = 16K 
       data hash MD5: 16K
       E1 F5 10 B9 98 E0 AB CE C6 27 BA AC 32 8E CF 7B>)
(   3,<2023-04-17 16:01:08.25 +0400>,<she>,<DPX200>,
      <pk PHC0 = 0.9748449 PHC1 = 1.2 
       data hash MD5: 16K
       BB 0C F5 75 D6 BB 57 71 C5 70 1E 3C FB 99 96 C8>)
(   4,<2023-04-17 16:01:11.68 +0400>,<she>,<DPX200>,
      <abs ABSG = 5 
       data hash MD5: 16K
       EE FD 56 60 FB DC 76 B0 7F F7 5D 94 F3 24 F6 43>)
$$ ##END=
$$ 
$$ hash MD5
$$ 43 A8 5E B9 0E F1 64 7D AF 72 B0 63 33 C6 6E 7D
##$RELAX= 
##$RELAX= 
##$RELAX= 
##$RELAX= 
##$RELAX= 
##$RELAX= 
$$ Bruker specific parameters
$$ --------------------------
##$DU= <F:/spectra>
##$EXPNO= 1
##$NAME= <H-F>
##$PROCNO= 1
##$TYPE= <nmr>
##$USER= <she>
##$AMP= (0..31)
100 100 100 100 100 100 100 100 100 100 100 100 100 100 100 100 100 100 
100 100 100 100 100 100 100 100 100 100 100 100 100 100 
##$AQSEQ= 0
##$AQ_mod= 1
##$AUNM= <au_zg>
##$AUTOPOS= <>
##$BF1= 200.13
##$BF2= 200.13
##$BF3= 200.13
##$BF4= 200.13
##$BF5= 200.13
##$BF6= 200.13
##$BF7= 200.13
##$BF8= 200.13
##$BYTORDA= 1
##$CFDGTYP= 0
##$CFRGTYP= 5
##$CHEMSTR= <none>
##$CNST= (0..31)
1 1 145 1 1 1 1 1 1 1 1 1 1 1 1 1 1 1 1 1 1 1 1 1 1 1 1 1 1 1 1 1 
##$CPDPRG= <>
##$CPDPRG1= <>
##$CPDPRG2= <>
##$CPDPRG3= <>
##$CPDPRG4= <mlev>
##$CPDPRG5= <mlev>
##$CPDPRG6= <mlev>
##$CPDPRG7= <mlev>
##$CPDPRG8= <mlev>
##$CPDPRGB= <>
##$CPDPRGT= <>
##$D= (0..31)
0 1.2 0 0 0 0 0 0 0 0.06 0 0.03 0 0 0 0 0.0002 0 0 0 0 0 0 0 0 0 0 0 0 
0 0 0 
##$DATE= 1681732847
##$DBL= (0..7)
120 120 120 120 120 120 120 120 
##$DBP= (0..7)
150 150 150 150 150 150 150 150 
##$DBP07= 0
##$DBPNAM0= <>
##$DBPNAM1= <>
##$DBPNAM2= <>
##$DBPNAM3= <>
##$DBPNAM4= <>
$$ [...]
##$SUBNAM3= <"">
##$SUBNAM4= <"">
##$SUBNAM5= <"">
##$SUBNAM6= <"">
##$SUBNAM7= <"">
##$SUBNAM8= <"">
##$SUBNAM9= <"">
##$SW= 18.05172834244
##$SWIBOX= (0..15)
0 0 2 0 0 0 0 0 0 0 0 0 0 0 0 0 
##$SW_h= 3612.71676300578
##$TD= 16384
##$TD0= 1
##$TE= 0
##$TE2= 300
##$TE3= 300
##$TEG= 300
##$TL= (0..7)
0 120 120 120 120 120 120 120 
##$TP= (0..7)
150 150 150 150 150 150 150 150 
##$TP07= 0
##$TPNAME0= <>
##$TPNAME1= <>
##$TPNAME2= <>
##$TPNAME3= <>
##$TPNAME4= <>
##$TPNAME5= <>
##$TPNAME6= <>
##$TPNAME7= <>
##$TPOAL= (0..7)
0.5 0.5 0.5 0.5 0.5 0.5 0.5 0.5 
##$TPOFFS= (0..7)
0 0 0 0 0 0 0 0 
##$TUNHIN= 0
##$TUNHOUT= 0
##$TUNXOUT= 0
##$USERA1= <user>
##$USERA2= <user>
##$USERA3= <user>
##$USERA4= <user>
##$USERA5= <user>
##$V9= 5
##$VALIST= <valist>
##$VCLIST= <CCCCCCCCCCCCCCC>
##$VD= 0
##$VDLIST= <DDDDDDDDDDDDDDD>
##$VPLIST= <PPPPPPPPPPPPPPP>
##$VTLIST= <TTTTTTTTTTTTTTT>
##$WBST= 1024
##$WBSW= 4
##$XGAIN= (0..3)
0 0 0 0 
##$XL= 0
##$YL= 0
##$YMAX_a= 117368
##$YMIN_a= -73887
##$ZGOPTNS= <>
##$ZL1= 120
##$ZL2= 120
##$ZL3= 120
##$ZL4= 120
##$ABSF1= 15.94962
##$ABSF2= -2.102233
##$ABSG= 5
##$ABSL= 3
##$ALPHA= 0
##$AQORDER= 0
##$ASSFAC= 0
##$ASSFACI= 0
##$ASSFACX= 0
##$ASSWID= 0
##$AUNMP= <proc_1d>
##$AZFE= 0.1
##$AZFW= 0.1
##$BCFW= 0
##$BC_mod= 2
##$BYTORDP= 0
##$COROFFS= 0
##$CY= -3
##$DATMOD= 1
##$DC= 0
##$DFILT= <>
##$DTYPP= 0
##$F1P= 0
##$F2P= 0
##$FCOR= 1
##$FTSIZE= 16384
##$FT_mod= 6
##$GAMMA= 0
##$GB= 0
##$INTBC= 1
##$INTSCL= 3.70164e-10
##$ISEN= 128
##$LB= 0.24
##$LEV0= 0
##$LPBIN= 0
##$MAXI= 10000
##$MC2= 0
##$MEAN= 0
##$ME_mod= 0
##$MI= 1.114404
##$NCOEF= 0
##$NC_proc= -8
##$NLEV= 6
##$NOISF1= 3.799351
##$NOISF2= 2.8
##$NSP= 0
##$NTH_PI= 0
##$NZP= 0
##$OFFSET= 15.7557
##$PC= 1
##$PHC0= -19990.91
##$PHC1= 14.80081
##$PH_mod= 1
##$PKNL= yes
##$PPARMOD= 0
##$PSCAL= 0
##$PSIGN= 0
##$REVERSE= no
##$SF= 200.1300031695
##$SI= 16384
##$SIGF1= 3
##$SIGF2= 2
##$SINO= 5.538805
##$SIOLD= 16384
##$SREGLST= <1H.CDCl3>
##$SSB= 0
##$STSI= 16384
##$STSR= 0
##$SW_p= 3612.71676300578
##$SYMM= 0
##$S_DEV= 0
##$TDeff= 16384
##$TDoff= 0
##$TI= <>
##$TILT= no
##$TM1= 0
##$TM2= 0
##$TOPLEV= 0
##$USERP1= <user>
##$USERP2= <user>
##$USERP3= <user>
##$USERP4= <user>
##$USERP5= <user>
##$WDW= 1
##$XDIM= 16384
##$YMAX_p= 353987492
##$YMIN_p= -1198752
$$ End of Bruker specific parameters
$$ ---------------------------------
##NTUPLES= NMR SPECTRUM
##VAR_NAME=  FREQUENCY,     SPECTRUM/REAL,   SPECTRUM/IMAG
##SYMBOL=    X,             R,               I
##VAR_TYPE=  INDEPENDENT,   DEPENDENT,       DEPENDENT
##VAR_FORM=  AFFN,          ASDF,            ASDF
##VAR_DIM=   16384,         16384,           16384
##UNITS=     HZ,            ARBITRARY UNITS, ARBITRARY UNITS
##FACTOR=    0.220516191357247, 1,           1
##FIRST=     3153.18831323, 0,               0
##LAST=      -459.528449775776, 0,           0
##MIN=       -459.528449775776, -1198752,    0
##MAX=       3153.18831323, 353987492,       0
$$ Real data points
##PAGE= N=1
##DATA TABLE= (X++(R..R)), XYDATA
$$ [...]
5756h3050Q2936O2863k9722K3704Q7323j7797k7198j6173j94560J10986r2345
5745i3033K9563Q4447k8139J12043o3066k5994n129r9823J89754j5751j45707
5734f0835M5804M7990N3100l2737k0516Q7629L7103M4806n5213K4750K9669l382
5722A98168j87724o3366j7524K3151j7284P3557L302j5703P4121k5893Q8707j1877
5710A21635o5726p2124m2875j7762L1647J09334p865m3209m593m1908J08548J40673
5698B15775Q2532j6089j11814o2563j0439J52338l1324K8002o5899l3795P5093
5687B21817j47067R0077n8462j06942J66429J02565M78K03n8101K9277M389m3283
5675B01380p169m7786j11957M117R3847j0312L6685j00266p4116R9974N7850K627
$$ plain form
5756 -83050 -114 62749 33027 56731 144054 126257 99059 82886 -111674 -688 -93033
5745 -93033 -63470 20977 -7162 104881 41815 15821 10692 -89131 100623 84872 -60835
5734 -60835 -15031 32959 86059 53322 32806 120435 157538 202344 147131 171881 201550 198168
5722 198168 10444 -52922 -70446 -47295 -64579 8978 12280 -3423 70698 44805 133512 121635
5710 121635 55909 -16215 -59090 -76852 -45205 64129 56264 13055 8462 -33446 75102 215775
5698 215775 298307 282218 170404 107841 97402 249740 218416 246418 180519 146724 221817
5687 221817 74750 164827 106365 -577 165852 268417 268895 269098 210997 240274 244663 201380
5675 201380 194211 146425 34468 38585 132432 122120 158805 58539 -15577 84397 142247 144874
5663A44874Q8882k0974n0180P0535P6815j4921n4840r8266J15703O0108K9720
5652C47456Q4705j21766K5986M8891p4240o0853J9326J9015m6920M7311M1647
5641C30558L8815j33009q670M1652j1720p878l01682J11913N2305J43147P6270
5630C31701j70679q6285m4786J0502N2824j6810Q0062m3j13456N1931K1042L0148
5618A46151L0949Q4300J6348l0762o4757Q4672j86173l7908Q512j3140J84242
5607B22434L4246j42975l7490P169m0515k761M8363m1219n4824J57605q2748o3270
5595D015l6430K5126o6084l176N626J68246J9627j9829p2809R6062K4082o5386
5583G9070k9763K9729j33079N893P2505N7389J78590m3390r103j47627J23320
$$ plain form
5663 144874 233756 212782 162602 233137 309952 295031 240191 141925 257628 317736 347456
5652 347456 432161 310395 336381 385272 311032 250179 269505 288520 241600 288911 330558
5641 330558 369373 236364 227694 269346 257626 249748 -51934 59979 112284 255431 331701
5630 331701 161022 74737 29951 40453 93277 76467 156529 156486 43030 94961 116003 146151
5618 146151 177100 261400 277748 246986 182229 266901 80728 42820 51332 38192 222434
5607 222434 256680 113705 76215 83384 42869 40108 88471 47252 -7572 150033 67285 4015
5595 4015 -32415 -7289 -73373 -76549 -70923 97323 116950 97121 24312 120374 144456 79070
5583 79070 49307 79036 -54043 -48150 24355 81744 260334 216944 207841 60214 183534
5572A83534O9820j35966L4804O544q2223K9896o5963m3175p3863Q0917j3655O936
5560b394J01714K4470p0012M6381l4411k9315L3466m8777k2970L1387M2142o5519
5548F162O0785R3950J4794j8032N117l9293n4017q5003K5905o8156p071M7908
5536a6951P0313J56575p262r549Q524N9281j49708J1511O252j35426j0494J36746
5524A19812K0456j87552K09308J77654m1478J4166j17856N6122J37075l8255m838
5513C44614r093N7423q2252J74q4476j19204J28748M3608n7003q4601J41997J7621
5501B97556K3830K6274m8108l2882o548j06231P5819j1123J2459n5751n4948R2098
5489B12445q379j15437Q9278O5587l5352K2893P6939J5310j08331P1455l3111
$$ plain form
5572 183534 253354 117388 152192 158736 76513 106409 40446 -2729 -76592 4325 -9330 -2394
5560 -2394 99320 123790 53778 100159 65748 36433 69899 21122 -1848 29539 71681 6162
5548 6162 66947 160897 175691 157659 162776 123483 69466 -15537 10368 -57788 -64859 -16951
5536 -16951 53362 209937 202675 193126 201650 260931 111223 122734 128986 -6440 -16934 119812
5524 119812 140268 -47284 162024 339678 298200 312366 194510 250632 387707 349452 344614
5513 344614 335521 392944 310692 310866 226390 107186 235934 279542 222539 137938 279935 297556
5501 297556 321386 347660 299552 266670 260122 153891 229710 218587 231046 175295 120347 212445
5489 212445 204066 88629 177907 243494 208142 231035 307974 323284 214953 286408 253297
5478B53297j29309l9804K23123M9735K02754l1940J5673J07061J3832K7120o4584
5467F26958P2503j03714j72448r7440q4459K7837J5593r991L086R3553j20601
5456B50877K3152J36182m0013J0952K3816K7911k670o7677r512j48709j05045
5445I9264Q6806N5626N8625J24534p1736L2135O3449K32135q7315n9242j0055
5434E24226m3096J03797j42759r8772j28285J36966R603o1306j4883L2819j04160
5423B14150k2482M0825p1560M6173J08859n1340m2247m4661J86672p1150P9187
5412C72426J15440j02443k095j01509n1028m695M9533P8833K3277j4140j36667
5401B26932R5936n6794K6251J10528p8491r7560L8048J01562l5182P0572m6692
$$ plain form
5478 253297 123988 84184 307307 357042 559796 527856 543529 650590 664422 691542 626958
5467 626958 699461 595747 423299 325859 241400 269237 284830 274839 277925 371478 250877
5456 250877 274029 410211 370198 381150 404966 432877 430207 362530 353018 204309 99264
5445 99264 186070 241696 300321 424855 353119 385254 448703 680838 593523 534281 524226
5434 524226 481130 584927 442168 343396 215111 352077 361680 300374 285491 318310 214150
5423 214150 191668 232493 160933 207106 315965 264625 222378 177717 364389 293239 372426
5412 372426 487866 385423 383328 281819 230791 226096 275629 354462 377739 363599 226932
5401 226932 322868 266074 292325 402853 324362 226802 264850 366412 331230 401802 355110
5390C55110L4284q8809o0351j5197N4883J18937K707l1652l9732p5582O6020r6226
5378B24392l6076O235P4435j4387M4706L2938L405M0192j55866J5250K6964L7643
5366B99831Q1306l4769J02598O7193o9148j51725j45322k7757J08507K3345l942
5355B50117N6888q1960K4649l5393K8096O9042n4181N1995J0254o9982o9076J61103
5343C41552m1638J4250Q0425j79415N0832J32802n4668j23956p493r091N6974
5332B60574O4642J28802J5858o9139n1403J1483K9489l2814n087J8448r5444J56887
5320D32296p699j02668K5863L8968P8908J9495k7000N1944J01526k7862r8508
5309D85263K2895M5630L0795n4834j29134p7176J26261O2836N4071J67390J4528
$$ plain form
5390 355110 389394 300585 240234 225037 279920 398857 401564 369912 330180 254598 320618 224392
5378 224392 188316 194551 268986 254599 299305 332243 335648 375840 219974 235224 262188 299831
5366 299831 381137 346368 448966 516159 447011 295286 149964 122207 230714 254059 250117
5355 250117 307005 225045 249694 214301 242397 311439 257258 309253 319507 249525 180449 341552
5343 341552 299914 314164 394589 215174 266006 398808 344140 220184 212691 203600 260574
5332 260574 325216 454018 469876 400737 349334 360817 390306 357492 352405 370853 275409 432296
5320 432296 424597 321929 347792 386760 465668 485163 458163 510107 611633 583771 485263
5309 485263 508158 553788 584583 529749 400615 323439 449700 512536 566607 733997 748525
5298G48525r7804k114k7945j41389N2240P2786k7154l1848R5686N8540M3938l1844
5286G11617j26013O4915J47652M2046j17660n7135R185p6242J90490J95567r1613
5275H92809K0395Q0900j52720l7101J5078M643J9158L3968J1850N4805m1833J6699
5263I18651M5365l132j3043n3261K1023K2530L8753j07430O7422M1933M3089M6544
5251A068444n4802N0803M9595p8575L4478O4150L9611O6754J7386k5392n6715
5240A175737O956l7826Q1289N4927J11281J19800J47739J68854Q2364R2148K78506
5229B281775J90025K23586J77928R646m21870k49296k77591j41238J2422l30743
5219A474644P2244o8165j26767j03594o8815o8230r2952r1382P1002q3510l0999
$$ plain form
5298 748525 650721 648607 620662 479273 531513 604299 577145 545297 640983 699523 743461 711617
5286 711617 585604 650519 798171 840217 722557 665422 674607 598365 788855 984422 892809
5275 892809 913204 994104 841384 804283 819361 824004 843162 877130 888980 943785 901952 918651
5263 918651 964016 960884 947841 894580 915603 938133 976886 869456 936878 978811 1021900 1068444
5251 1068444 1013642 1064445 1114040 1035465 1069943 1134093 1173704 1240458 1257844 1232452 1175737
5240 1175737 1182693 1144867 1226156 1281083 1392364 1512164 1659903 1828757 1911121 2003269 2281775
5229 2281775 2471800 2695386 2873314 2882960 2461090 2211794 1934203 1792965 1805387 1474644
5219 1474644 1546888 1478723 1351956 1248362 1179547 1111317 1018365 926983 997985 914475 883476
5208H83476J15842M1416q5788j32388M409J15211J36071J6180l2117r7202J18894
5197A084004l8180o8554M6110J19736q1422n5400j8827k4219k9269N7710n8339
5186I33350j28970K9617m5640L0835j382Q7653J46041M0895j70013k0646J09155
5175A010895p9689j61885J37139J4842j32563j08575J90481L8992j23899L5239
5165H20977Q4828r2389L606q0846J05843Q3929M5798L2054O6232o5673n5069J30452
5153A079742L3148N4057P0992Q789k09064J96505M9259L9203J57181P0949j10347
5142A440414J01192J54812J89876L907Q3677K18731K42460N6468J57874J35930
5132B785341j17317k41707l73481k32001j67056j89708Q759j49712L2184K3752
$$ plain form
5208 883476 999318 1040734 954946 822558 826967 942178 1078249 1094429 1062312 965110 1084004
5197 1084004 1045824 977270 1023380 1143116 1061694 1006294 987467 963248 933979 991689 933350
5186 933350 804380 833997 788357 819192 817810 905463 1051504 1092399 922386 901740 1010895
5175 1010895 931206 769321 906460 921302 788739 680164 870645 909637 785738 820977
5165 820977 905805 813416 817022 736176 842019 925948 971746 1003800 1070032 1004359 949290 1079742
5153 1079742 1112890 1166947 1237939 1246728 1037664 1234169 1283428 1322631 1479812 1550761 1440414
5142 1440414 1541606 1696418 1886294 1890201 1973878 2192609 2435069 2491537 2649411 2785341
5132 2785341 2668024 2426317 2052836 1820835 1653779 1464071 1472830 1323118 1355302 1379054
5122A379054l2532r842o6703p6915M0380R6725j64415J53512o3306p6734M8707
5111A227931J4275p823Q717l0965Q2780n479k2692n435k6601J00770J00496j09188
5099A326786Q7282j0618k07272N1210j8413J41071J7127j0605J77978M0133p7664
5088A517015n833N0139l1210R6800j01973l3587p6843R7785Q7743m4662Q2648
5077A638022K2887J10887j8785p7386R6456j06802J3924P4355P1552J01732P262
5066A934104J06976N1055m3479j8361J33453J27922o2957J1432K0283K21741o339
5055B475830j1447J08157o7554P1341K03262M4099P8341K37217l446N8173J57861
5044C351834J17690P9258K7308J32297J18333q0415J96075J17467J67667k599
$$ plain form
5122 1379054 1346522 1336680 1269977 1193062 1233442 1330167 1165752 1319264 1255958 1179224 1227931
5111 1227931 1242206 1234383 1243100 1212135 1294915 1289436 1266744 1261309 1234708 1335478 1435974 1326786
5099 1326786 1414068 1403450 1196178 1247388 1228975 1370046 1387173 1376568 1554546 1594679 1517015
5088 1517015 1511182 1561321 1530111 1626911 1524938 1491351 1414508 1512293 1600036 1555374 1638022
5077 1638022 1660909 1771796 1753011 1675625 1772081 1665279 1679203 1753558 1825110 1926842 1934104
5066 1934104 2041080 2092135 2048656 2030295 2163748 2291670 2228713 2240145 2260428 2482169 2475830
5055 2475830 2464383 2572540 2504986 2576327 2779589 2823688 2902029 3139246 3135800 3193973 3351834
5044 3351834 3469524 3548782 3576090 3708387 3826720 3746305 3942380 4059847 4227514 4224915
5034D224915N8381K08778J74431J46530k2478J69592J16428J00366K01687M8422
5024E427052J13978K06613J78993J48032K16415J08527J93388K62803J41547K75990
5014G273338Q9700K42832L60504K59689L00884K07342L81340N47751M40494M43300
5004A0547174L75129M14255N40686M34356M04492L31209P32698O88723N87501
4995A5056223N81597Q36553R54065R98416J118724J059031J018364J088679J228977
4986B3940629J166954J081997J008714Q66509N61341K07068J54426J74280J62899
4977B9324817J63067L17874K93014L24785L90678M93104O26224N96289P27013
4968C3256865P35188P46472Q07120R82718R47393J188178J201809J306409J337296
$$ plain form
5034 4224915 4283296 4492074 4666505 4813035 4790557 4960149 5076577 5176943 5378630 5427052
5024 5427052 5541030 5747643 5926636 6074668 6291083 6399610 6592998 6855801 6997348 7273338
5014 7273338 7363038 7605870 7966374 8226063 8526947 8734289 9115629 9663380 10103874 10547174
5004 10547174 10922303 11336558 11877244 12311600 12716092 13047301 13779999 14468722 15056223
4995 15056223 15637820 16474373 17428438 18426854 19545578 20604609 21622973 22711652 23940629
4986 23940629 25107583 26189580 27198294 28064803 28626144 28833212 28987638 29161918 29324817
4977 29324817 29487884 29805758 30098772 30423557 30814235 31307339 31933563 32529852 33256865
4968 33256865 33992053 34738525 35545645 36528363 37475756 38663934 39865743 41172152 42509448
4959D2509448J369619J463121J541276J670302J528390J417875R71817P25547
4951E3197395K57912n51625j043679j497381j706630j789439j893721j822573
4943D3150259j509939j408578j355087j056002r98994j088718j039437r49483
4935C3744021r29595r87585p47774p26444n53854l41004l27558l38641k84256
4926B8507310q8051l8810j58200l65260k78505n69270o57269p22323j056377j285810
4916B3287435j446110j411872j338955j212209j094370j126038q54744q02257
4908A4000880p56384o16606o60799n47731n45448m97637m67311l23380n19591
4899I065993l86625m63769l62719j26229k66791k43079l13752k04153k86294k11605
$$ plain form
4959 42509448 43879067 45342188 46883464 48553766 50082156 51500031 52471848 53197395
4951 53197395 53455307 52903682 51860003 50362622 48655992 46866553 44972832 43150259
4943 43150259 41640320 40231742 38876655 37820653 36821659 35732941 34693504 33744021
4935 33744021 32814426 31826841 31079067 30352623 29798769 29457765 29130207 28791566 28507310
4926 28507310 28419259 28380449 28222249 27856989 27578484 27009214 26351945 25629622 24573245 23287435
4916 23287435 21841325 20429453 19090498 17878289 16783919 15657881 14803137 14000880
4908 14000880 13244496 12627890 11967091 11419360 10873912 10376275 9908964 9585584 9065993
4899 9065993 8679368 8215599 7852880 7726651 7459860 7216781 6903029 6698876 6412582 6200977
4889F200977q2489k81588k45419j36150j66848r3246K6510j89284j40976j43850
4879D747637l9161p4770k95070k23503K3605J87m1171p5106j57132j70553j92894
4868C502069P4310k1538j19260q1784O0476O8243l0392p7736k09461n2651j6887
4857C095389o8723o7696o7974j39572O8025j06060k17135O3033J76461m5541j77975
4846B512232k6991K1836j15283j55088j2361O8150j4337K8180K3277k9898k3505
4835B276212j5005K816j9225P2400L0367J2428o3751L3831Q7003j49715n6740
4824B210621P3292j26012m4271j25117l2099N5918J00884L2473K9193q0454P8181
4813B172609N6455M126P5249n7197r4330P6771j3764J6287j13737j53267j10512
$$ plain form
4889 6200977 6118488 5836900 5591481 5455331 5288483 5195237 5221747 5032463 4891487 4747637
4879 4747637 4708476 4633706 4338636 4115133 4138738 4138925 4097754 4022648 3865516 3694963 3502069
4868 3502069 3576379 3554841 3435581 3353797 3414273 3482516 3452124 3374388 3164927 3112276 3095389
4857 3095389 3026666 2958970 2890996 2751424 2819449 2713389 2496254 2559287 2735748 2690207 2512232
4846 2512232 2485241 2507077 2391794 2236706 2224345 2292495 2278158 2306338 2329615 2299717 2276212
4835 2276212 2261207 2264023 2244798 2317198 2347565 2359993 2296242 2330073 2417076 2267361 2210621
4824 2210621 2283913 2157901 2113630 1988513 1956414 2012332 2113216 2145689 2174882 2094428 2172609
4813 2172609 2229064 2233190 2308439 2251242 2156912 2233683 2219919 2236206 2122469 1969202 1858690
4802A858690j38470j0632o7858K4073j3179R7437N0187R5639l1606r360J58016
4791B012937l6535J582K6677p2665Q206J7346l3201J0078j08540n7885K1144N060
4779A794204K8841o7735J21869J48873q2428k7886j5293J0926J8166J41123O1658
4768B132318N5385P2752r7446J744j25867l032N8914r8137M5244j51851q5644
4757A804380J35514l9175J3345J23981o5642n4372J16749J00715m6575l0636l459
4746B054825m2534J34201K6921L8991l3602p057J86719J61973l6304n2605J10774
4735B542302P3289J07757k9293J42644J72511L66734M5533n953J80614J52569
4725C748707P561P2422K06792J41977L9632J07510K11253J86461J03367J60005
$$ plain form
4802 1858690 1720220 1709588 1641730 1665803 1652624 1750061 1800248 1895887 1864281 1854921 2012937
4791 2012937 1976402 1977984 2004661 1931996 1940202 1957548 1924347 1934425 1825885 1768000 1789144 1794204
4779 1794204 1823045 1755310 1877179 2026052 1943624 1915738 1900445 1911371 1929537 2070660 2132318
4768 2132318 2187703 2260455 2163009 2164753 2038886 2035854 2094768 1996631 2041875 1890024 1804380
4757 1804380 1939894 1900719 1914064 2038045 1972403 1918031 2034780 2135495 2088920 2058284 2054825
4746 2054825 2012291 2146492 2173413 2212404 2178802 2171745 2358464 2520437 2484133 2431528 2542302
4735 2542302 2615591 2723348 2694055 2836699 3009210 3375944 3421477 3415524 3596138 3748707
4725 3748707 3756268 3828690 4035482 4177459 4217091 4324601 4535854 4722315 4825682 4985687
4715D985687J00141j07671K96134J96695K52224J42692J3523L7323K03022K9892
4705F149662K24117L42094O6905Q8702K35155M6865O2608J83271J43149J89400
4695G731928J96890L54379P4186K02833L31581K81571L74935M22479M38824L57970
4685A0767576K10576J54745J82570K52501J86136K27643L04056J35349J66504
4676A2587656L37717N00138N26153M95681N74813P71647P10836R04159O95731
4667A8104531R00378Q75450R30946R48786J005659J229904J394142J257709J434223
4658B8081728J505132J401995J743562K019833J779999J953689J965659K183590
4650D2635187K742264L669183M517155N512982O564081P808293R518589J1347419
$$ plain form
4715 4985687 5085828 4978157 5274291 5470986 5723210 5865902 5879425 5916748 6119770 6149662
4705 6149662 6373779 6715873 6782778 6871480 7106635 7153500 7216108 7399379 7542528 7731928
4695 7731928 7928818 8283197 8357383 8560216 8891797 9173368 9548303 9970782 10409606 10767576
4685 10767576 10978152 11132897 11315467 11567968 11754104 11981747 12285803 12421152 12587656
4676 12587656 12925373 13425511 13951664 14447345 15022158 15793805 16504641 17408800 18104531
4667 18104531 19004909 19880359 20811305 21760091 22765750 23995654 25389796 26647505 28081728
4658 28081728 29586860 30988855 32732417 34752250 36532249 38485938 40451597 42635187
4650 42635187 45377451 49046634 53563789 59076771 65640852 73449145 82967734 94315153
4642I4315153J4121443J6904137J8554707J6899318J5564910J7639026J8555724
4635B12554418J3594938n84409k1730272l3316597l1609231k5987820j9678913
4628I3242114j4406110j0758323q551632o925148n448799m365359l457176k812149
4620C6517418k347059k222691k204802k212489k094372j819472j545021j415962
4612B0655550r14655q14960p67155p10723o90862o29602o60869o01141o16387
4603A4249196o36092p69702o18659m84871o75051p00524o39169m84701l97772
4594H842655k85338k97787k38628l39059k59312l59097k24179j45038k63427j58880
4584F271910m3166j57551m7968n5357j24798l902m6981j89538j43226j04692k84082
$$ plain form
4642 94315153 108436596 125340733 143895440 160794758 176359668 193998694 212554418
4635 212554418 226149356 225564947 203834675 170518078 138908847 112921027 93242114
4628 93242114 78836004 68077681 59526049 52600901 47152102 42786743 39329567 36517418
4620 36517418 34170359 31947668 29742866 27530377 25436005 23616533 22071512 20655550
4612 20655550 19740895 18925935 18158780 17448057 16757195 16127593 15466724 14865583 14249196
4603 14249196 13613104 12843402 12224743 11739872 11064821 10364297 9725128 9240427 8842655
4594 8842655 8557317 8259530 8020902 7681843 7422531 7063434 6839255 6694217 6430790 6271910
4584 6271910 6228744 6071193 6023225 5967868 5843070 5839168 5792187 5602649 5459423 5354731 5070649
4573E070649j45028k24226j93863p736j25520R878j89712j75118l8610n4236k21606
4562C704872J3876J4276j69741p8229R417o2538j24848k9605r1915j60113j39962
4551B885490J5610n5711K1743j51910p3231K2557Q630o1824J2258q9787j82374
4540B351451m6431k6492J8971N1871O0460R0943o621m1722j38447L4069j543R3659
4528B440168j40662j16052K7789j13811q4795L3688m342k6217j26906j64302L2361
4517A756919m742K4897k3169p540J0517j2576p1071j61777m6468j29141l6007
4506A299842j5485J03218J38844n0652o2943J0674p3061o7440K9597J70359l3021
4495A449932n1891N1511Q426J37679K8689m6292p2847j8861p5030n7276O5495
$$ plain form
4573 5070649 4925621 4701395 4507532 4499796 4374276 4384154 4194442 4019324 3980714 3926478 3704872
4562 3704872 3718748 3733024 3563283 3485054 3494471 3431933 3307085 3277480 3185565 3025452 2885490
4551 2885490 2901100 2845389 2867132 2715222 2641991 2664548 2673178 2611354 2623612 2533825 2351451
4540 2351451 2305020 2278528 2297499 2349370 2409830 2500773 2494152 2452430 2313983 2348052 2346509 2440168
4528 2440168 2299506 2183454 2211243 2097432 2012637 2046325 2041983 2015766 1888860 1724558 1756919
4517 1756919 1752177 1777074 1753905 1746365 1756882 1744306 1673235 1511458 1464990 1335849 1299842
4506 1299842 1284357 1387575 1526419 1475767 1412824 1423498 1350437 1282997 1312594 1482953 1449932
4495 1449932 1398041 1449552 1457978 1595657 1624346 1578054 1505207 1486346 1411316 1354040 1419535
4484A419535n5445p2779M4672O6182n4826j2156k4028J5407m5620Q831Q1147O832
4472A377752N2849L6407j22858j12373j08010j20252o5618K0267l9802j68844
4462G49518Q092N0181n5297l4556m1414m7507J01142M0558M0291q1614N4161k7927
4450G55628p0393L3358J21144l3903j02501j19437K5052l8974M0768q210q2857
4439E19675J77349O2686J43298l5067m4358J19853J8122Q5606k5523j52566m5590
4428H23485N1892M6458L6345K2719J39160J2617r7080K1773j20344L6408J85944
4417A159377N0341k5828m1584M6025J00311K1268l0972j20192j69927l1931O0356
4406A017244l0099p4906k7523l2725J8182J07554K3587k05078Q502m1286j8190
$$ plain form
4484 1419535 1364090 1291311 1335983 1402165 1347339 1335183 1311155 1326562 1280942 1289773 1370920 1377752
4472 1377752 1430601 1467008 1344150 1231777 1123767 1003515 937897 958164 918362 749518
4462 749518 757610 807791 752494 717938 676524 629017 730159 770717 811008 729394 783555 755628
4450 755628 685235 718593 839737 805834 703333 583896 608948 569974 610742 602532 519675
4439 519675 697024 759710 903008 867941 823583 943436 961558 1047164 1021641 869075 823485
4428 823485 875377 921835 958180 980899 1120059 1132676 1035596 1057369 937025 973433 1159377
4417 1159377 1209718 1183890 1142306 1188331 1288642 1309910 1278938 1158746 988819 956888 1017244
4406 1017244 987145 912239 884716 851991 870173 977727 1001314 796236 804738 763452 745262
4395G45262L5880j34876q1518P8638J34053k1707q6457j26330M4011j0293O5937
4384F42600Q8605j22062P2591m0469o7339O4297j8311j28300J9635P0399O0541
4373F42187J59666n3893Q3847K0972O0415R535j08282Q2056r3010p709J7359r2528
4361G20615K1061O4033O6709r1093l4804q2365N3317O47K8942J67674l4286L947
4349H84397P5158M6813J3187l9460M8969O1726j4889m1950L4509K0683K905l4792
4337A057256r8585L5101K0905P3537J21535N0698L1714J24384J76784J59397J30271
4326A882997j26343j06004k64544l9475M4323l73237l3525j27177N0199j09577
4316G97637k0000L3123N8780M5119M1589O4296j82441p6542l2838j43917n137
$$ plain form
4395 745262 781142 646266 564748 643386 777439 755732 669275 542945 586956 576663 642600
4384 642600 731205 609143 681734 641265 573926 638223 619912 491612 511247 581646 642187
4373 642187 801853 747960 831807 852779 913194 922729 814447 896503 803493 795784 813143 720615
4361 720615 741676 805709 872418 781325 746521 664156 717473 718120 747062 914736 880450 884397
4349 884397 959555 1006368 1019555 980095 1029064 1090790 1075901 1033951 1068460 1089143 1092048 1057256
4337 1057256 958671 993772 1014677 1088214 1209749 1260447 1292161 1416545 1593329 1752726 1882997
4326 1882997 1756654 1650650 1386106 1346631 1390954 1017717 984192 857015 907214 797637
4316 797637 777637 810760 869540 914659 956248 1020544 838103 761561 728723 584806 579669
4305E79669P2342J3918K05188J834k23826j04028J95835n8388M4870J848r0265
4294F38997j8544R911O9516k09183M7424O3243O566L5981l7658j6175J37195n424
4282G21849K8303L0080N3687n3012l4266J19725k0733o3986N4205k3922m0728
4271G71202J28276J27512j3410j59861N4641k6583K0721J16875q7794R3336M0738
4260A065653j03132P0953M0889O2486j03748M1571j3669j7624O720J08534J13859
4249A272492n5405J00872K8333j6808m9587j45957Q6623j5780J48833L8012M3833
4238A435461K7864k2554K6000Q3549Np061J32163K0850p8042J16923p4076M0309
4226A701391J07978q3815Q4799j9509o505J60439j3835m8995j7838O7780o3310
$$ plain form
4305 579669 652011 665929 871117 872951 649125 545097 740932 682544 727414 729262 638997
4294 638997 620453 630364 699880 490697 538121 601364 607930 643911 606253 590078 727273 721849
4282 721849 750152 780232 833919 780907 746641 866366 845633 781647 835852 811930 771202
4271 771202 899478 1026990 1013580 853719 908360 881777 902498 1019373 931579 1024915 1065653
4260 1065653 962521 1033474 1074363 1136849 1033101 1074672 1061003 1043379 1050099 1158633 1272492
4249 1272492 1217087 1317959 1346292 1329484 1279897 1133940 1220563 1204783 1353616 1391628 1435461
4238 1435461 1463325 1440771 1466771 1550320 1550325 1543264 1675427 1696277 1618235 1735158 1661082 1701391
4226 1701391 1809369 1725554 1810353 1790844 1784339 1944778 1930943 1881948 1864110 1931890 1868580
4215A868580k509K0282Q4782N8896N6699J52474J17748n4999q6390J15239J07711
4204B438513J4665K8062J61811L1223J3028L9215R0890l3639j3932j7810J37562
4193B889588J82185L3431m9475K19603R2523K46434o4444P1963J96572J48206
4183C966586J12819J58028J70695J29708P4423K06772J22420K37291J42670M46400
4173E767812L68220K00946L84008L21739L76959L59976M01517K40244J46114R9862
4163H667397K68610K14097J86724R6511L93758O41553M55402M85727O67453O08901
4153A2686133O31889M96939K72946J49457j22653j13185l8845k8971J8299K29480
4143A4181489L92473M36570N00968M25694N38754M23483M11853Q2960j76131n19081
$$ plain form
4215 1868580 1866071 1886353 1971135 2030031 2086730 2239204 2356952 2301953 2215563 2330802 2438513
4204 2438513 2453178 2481240 2643051 2674274 2687302 2726517 2817407 2783768 2769836 2752026 2889588
4193 2889588 3071773 3105204 3055729 3275332 3367855 3614289 3549845 3621808 3818380 3966586
4183 3966586 4079405 4237433 4408128 4537836 4612259 4819031 4941451 5178742 5321412 5767812
4173 5767812 6136032 6336978 6720986 7042725 7419684 7779660 8181177 8421421 8567535 8667397
4163 8667397 8936007 9150104 9336828 9433339 9827097 10468650 10924052 11409779 12077232 12686133
4153 12686133 13318022 13814961 14087907 14237364 14114711 14001526 13962681 13933710 13952009 14181489
4143 14181489 14573962 15010532 15511500 15937194 16475948 16899431 17311284 17394244 17218113 16699032
4133A6699032o09724n84953l86042l11105j74314m6289J24018K30238L22311K73221
4123A5536393Q1605k57929j54774k60752o34075n14760n75793m49620m25697k89943
4113A2054655J346J7046o5654K14727N0231J1170r8557o6376k9194k03308k30518
4102A1655568j35714L7364l4373J2371J92261K60361K63207M02952L37721N10589
4092A3502307M97709L45086N31439M04890N32778L84708K63397L21611N82462
4083A7366387N19185M14856N66237O79420P88418R09837P78860Q91493Q07521
4074B3722214O97398P47384P48606N70522L50993M32481O68694Q38632O81491
4065B9458415O21172Q85900J182963Q76387K85056q33083j257226j121132r54740
$$ plain form
4133 16699032 16089308 15504355 15118313 14807208 14632894 14586605 14710623 14940861 15263172 15536393
4123 15536393 15617998 15360069 15205295 14944543 14310468 13795708 13219915 12770295 12344598 12054655
4113 12054655 12056001 12073047 12007393 12222120 12272351 12283521 12184964 12118588 12089394 11886086 11655568
4102 11655568 11519854 11557218 11522845 11535216 11727477 11987838 12251045 12653997 12991718 13502307
4092 13502307 14000016 14345102 14876541 15281431 15814209 16198917 16462314 16783925 17366387
4083 17366387 17885572 18300428 18866665 19546085 20334503 21244340 22023200 22914693 23722214
4074 23722214 24419612 25166996 25915602 26486124 26837117 27269598 27938292 28776924 29458415
4065 29458415 30079587 30965487 32148450 33024837 33309893 32476810 31219584 30098452 29143712
4056B9143712j055459r76251r09051o95738n92047m30271m21334j75376o0370
4047B3827815k93092k04176l15263n25552p64115q83283j053135j039439q91668
4038A7858092p87652p25021n90344m36302l94254m70031m50837m69829n01953
4029A3031869m54593n73214p46905m95880m22002m53864m83201m61173m35260
4020H505777m47815k70332j27042j70090k36501l11365k38208j90402j60943j07137
4010F245942j79684j73103k96785n0812o0196j34764j17667l396P064r1469j08721
3999E036409m8961J01109J50933n129o8760k6592R025J51425Q0813j965J47304
3988E525611J5124j24669P2358J60804K52593J66650j99J25106L3110J18646J62495
$$ plain form
4056 29143712 28088253 27112002 26202951 25507213 24915166 24484895 24063561 23888185 23827815
4047 23827815 23534723 23330547 23015284 22489732 21725617 20842334 19789199 18749760 17858092
4038 17858092 17070440 16345419 15755075 15318773 14924519 14454488 14003651 13533822 13031869
4029 13031869 12577276 12004062 11257157 10761277 10339275 9885411 9402210 8941037 8505777
4020 8505777 8057962 7787630 7660588 7490498 7253997 6942632 6704424 6514022 6353079 6245942
4010 6245942 6066258 5893155 5596370 5545558 5485362 5350598 5232931 5229535 5236599 5145130 5036409
3999 5036409 4987448 5088557 5239490 5234361 5165601 5139009 5148034 5299459 5380272 5378307 5525611
3988 5525611 5540735 5416066 5488424 5649228 5901821 6068471 6068272 6193378 6226488 6345134 6507629
3977F507629J89065O4241n4497P2545P2298J76636j0670J76591J69845m2386J51170
3966G472467K50551L37787K50682J08542K61899J85273K91385K24683K66267L19475
3956I969011J02258K26446J58887N8689J72904L08542K64509L82209L39242L71825
3946A2354522K78501M90797N58079L55824N54399O01983Q45294P98185R67923
3937A7805507J093416J279037J336924J444694J642814J443660J449608J421298
3929B8916958J142337Q67816L23765K25702k08610j32908J2057m1889K15765O92359
3919C2013352Q14413Q81697J065647J139956J170590R19111R53843P31311O59933
3910D0349853N99471M84645L54372O10557Q32502J000658J260844J696081J904426
$$ plain form
3977 6507629 6696694 6760935 6706438 6778983 6851281 7027917 7017247 7193838 7363683 7321297 7472467
3966 7472467 7723018 8060805 8311487 8420029 8681928 8867201 9158586 9383269 9649536 9969011
3956 9969011 10071269 10297715 10456602 10515291 10688195 10996737 11261246 11643455 11982697 12354522
3946 12354522 12633023 13123820 13681899 14037723 14592122 15194105 16039399 16837584 17805507
3937 17805507 18898923 20177960 21514884 22959578 24602392 26046052 27495660 28916958
3929 28916958 30059295 30927111 31250876 31476578 31267968 31135060 31147117 31105228 31320993 32013352
3919 32013352 32827765 33709462 34775109 35915065 37085655 38004766 38958609 39689920 40349853
3910 40349853 40949324 41433969 41788341 42398898 43231400 44232058 45492902 47188983 49093409
3901D9093409K295753K286428K169136J760735J121329L32458j307384k388203
3893E5363661l153774l386891k965205k372079j949965j373169j000120n59560
3885C8602898m97190l96558n21293n94746o20946p81898r45725j321788j277030
3876C1645724j125425j256064j099775p91138n02269m96680j48803j19791Q90
3867B6106669N0776k34820l98279p64493j006816j448590j410635j526047j352017
3858A8015748j481285j304071j030154q93383r04120p04117n89892n12725n35016
3849A0060985m45638k90217l52596l34173j09075m7085k33108j61850j0711j88085
3839G888447j25018j18931j52449j56540k16409j45798j77098j61880j93501k09292
$$ plain form
3901 49093409 51389162 53675590 55844726 57605461 58726790 59059248 57751864 55363661
3893 55363661 52209887 48822996 45857791 43485712 41535747 40162578 39162458 38602898
3885 38602898 38105708 37709150 37187857 36593111 35972165 35190267 34244542 32922754 31645724
3876 31645724 30520299 29264235 28164460 27373322 26871053 26374373 26225570 26105779 26106669
3867 26106669 26157445 25922625 25524346 24759853 23753037 22304447 20893812 19367765 18015748
3858 18015748 16534463 15230392 14200238 13306855 12402735 11698618 11108726 10596001 10060985
3849 10060985 9615347 9325130 8972534 8638361 8529286 8482201 8249093 8087243 8076532 7888447
3839 7888447 7763429 7644498 7492049 7335509 7119100 6973302 6796204 6634324 6440823 6231531
3829F231531j10601l01502j19744K9049k4599k9079j18919j68352q8659k46580
3819E052545r9363Q2662o50k48293o2312J3472j14534l0368j34726j2742J6225
3808D461916j2900q8598n8780J42799l5277j95867p808L8466j20971p9949k599
3797D040432P3750m7443r1338J15204k9757O5997o471p2208l8516J00774l1668
3786D078756J49284K1265J71598j28347j6725J52851J687j574J4455M7934K0579
3775D511763J0401K04940k092P5791J62566k4165k2376J25056J14038J08450J9615
3764E283987j45078K9586j327M9466m121J48696K5413J02787M4055N5882J20659
3753E710005O5086R1976J26230Q1678J44455l4765J06582J5918K16186P0232M4706
$$ plain form
3829 6231531 6120930 5819428 5699684 5728733 5704134 5675055 5556136 5387784 5299125 5052545
3819 5052545 4953182 5035844 5035194 4786901 4724589 4738061 4623527 4593159 4458433 4445691 4461916
3808 4461916 4449016 4360418 4301638 4444437 4409160 4213293 4205485 4243951 4122980 4043031 4040432
3797 4040432 4114182 4066739 3975401 4090605 4060848 4126845 4120374 4048166 4009650 4110424 4078756
3786 4078756 4228040 4249305 4420903 4292556 4275831 4428682 4430369 4428795 4443250 4491184 4511763
3775 4511763 4522164 4727104 4725012 4800803 4963369 4939204 4916828 5041884 5155922 5264372 5283987
3764 5283987 5138909 5168495 5167168 5216634 5212513 5361209 5386622 5489409 5533464 5589346 5710005
3753 5710005 5775091 5867067 5993297 6074975 6219430 6184665 6291247 6307165 6523351 6593583 6638289
3742F638289j953J17685K74110O0560K8916N4689N9119J7351L24922K66742J32185
3731G972615j81000J61543L60394J58759K98088L08300J58813J53015J55609L92064
3721I938200L74837L47055L46715L95182M85225M42575L96491N32784O57687N71351
3711A4488102P48355Q95408R48472J184687J227788J314559J548531J664126J911547
3702B5931575K081149K034718K122516K013794K003848J801769J606531J281373
3694D0877273Q67280P27005K09793Q621j52953k61345k95218l57863k01368j60456
3684D1260769J42489k9160j3264j39509l32373n67139p78360j034994j418384
3675C7090075j550422j881879j881481j878723j959428j776214j563883j417180
$$ plain form
3742 6638289 6636336 6754021 7028131 7088691 7117607 7172296 7231415 7248766 7573688 7840430 7972615
3731 7972615 7791615 7953158 8313552 8472311 8770399 9078699 9237512 9390527 9546136 9938200
3721 9938200 10313037 10660092 11006807 11401989 11887214 12329789 12726280 13259064 13916751 14488102
3711 14488102 15236457 16131865 17080337 18265024 19492812 20807371 22355902 24020028 25931575
3702 25931575 28012724 30047442 32169958 34183752 36187600 37989369 39595900 40877273
3694 40877273 41744553 42471558 42681351 42689972 42537019 42275674 41980456 41622593 41421225 41260769
3684 41260769 41403258 41374098 41360834 41221325 40888952 40321813 39543453 38508459 37090075
3675 37090075 35539653 33657774 31776293 29897570 27938142 26161928 24598045 23180865
3667B3180865j370609r79606q02931q95367n63969o25194l81063l34566l46929
3658A6880631l30803k06519j27388r4132n7297j42117J8916K23618J99199r340
3648A6354768J13527L01626K24922K41281K54126L52772L22299M35032N22076
3639A9122429M61133M85752O52733P61899O84344P16620Q31687R86948J116694
3630B5820239J165750J388881J534663J738810J821877K041387K421218K582326
3622D0515151K799988K886414K968103L230661L207888K976646K672646K319693
3614F3577190K102889J740786J047521Q24289K17635k33289l55925n16396l68781
3605F8035919l74489m05342m20871m01592m93631p04855r14752j582111j901600
$$ plain form
3667 23180865 21810256 20830650 20027719 19132352 18568383 17943189 17562126 17227560 16880631
3658 16880631 16549828 16343309 16215921 16121789 16064492 15922375 15941291 16164909 16364108 16354768
3648 16354768 16468295 16769921 16994843 17236124 17490250 17843022 18165321 18600353 19122429
3639 19122429 19583562 20069314 20722047 21483946 22168290 22884910 23716597 24703545 25820239
3630 25820239 26985989 28374870 29909533 31648343 33470220 35511607 37932825 40515151
3622 40515151 43315139 46201553 49169656 52400317 55608205 58584851 61257497 63577190
3614 63577190 65680079 67420865 68468386 69292675 69510310 69277021 68921096 68404700 68035919
3605 68035919 67661430 67256088 66835217 66433625 65939994 65235139 64320387 62738276 60836676
3596F0836676k201877k678789k934402l189677l203769l192130l057986k935759
3588C7442287k642407k342671k147603j946363j804433j501003j373888j000239
3580B2683680r31758j076396q92746p26504p46983p57041m57997m30144l62391
3571A6301720l64817l06529l71523k81265k17400j04114l38904k04169l6952q0169
3561A3995878k16868p0172o2631k9705R8556k694j35042R9383J21355o1892L3774
3550A3769942J37617O2423J95811L50984K17546J67388K91198L06707N78989N09256
3540A6587861K66284N30760O27260M29312M46556M39244L71282L51992L68764
3531B0419315J95514R2828o726k32762k27812k62545l15365n05518m12462m39527
$$ plain form
3596 60836676 58634799 55956010 53021608 49831931 46628162 43436032 40378046 37442287
3588 37442287 34799880 32457209 30309606 28363243 26558810 25057807 23683919 22683680
3580 22683680 21751922 20675526 19782780 19056276 18309293 17552252 17094255 16664111 16301720
3571 16301720 15936903 15630374 15258851 14977586 14760186 14656072 14317168 14112999 14076047 13995878
3561 13995878 13779010 13708838 13646207 13616502 13715058 13712364 13577322 13676705 13798060 13736168 13769942
3550 13769942 13907559 13969982 14165793 14516777 14734323 14901711 15192909 15499616 16078605 16587861
3540 16587861 16854145 17384905 18012165 18441477 18888033 19327277 19698559 20050551 20419315
3531 20419315 20614829 20707657 20700931 20468169 20240357 19977812 19662447 19156929 18744467 18304940
3521A8304940l10623j21543k38435O5962O0026J09534M6313K80988L61308K87819
3511A8846289M47460L82475M63883M27269O56698M68298O39709M96019P07312
3502B3535412P91399P96241R83390J106849R25802J042579J448089J601723J559890
3493C3791374J890170K343303K581854K726989L041536L317382L829558L825731
3485E7347897L772284L942161L541286L198179K921444K327455J668223J056421
3477G9775350K33661k57891q69331j308786j999169k014895k009549j689900j382491
3468F8476999j331498q01864l38715K332M52933P30943P51742R24790R43426Q17272
3458G0628360P49335N47701J92903p5876k26725n10348q15331j083983j386352
$$ plain form
3521 18304940 17994317 17872774 17634339 17700301 17760327 17869861 17916174 18197162 18558470 18846289
3511 18846289 19293749 19676224 20140107 20567376 21224074 21692372 22332081 22828100 23535412
3502 23535412 24326811 25123052 26106442 27213291 28139093 29181672 30629761 32231484 33791374
3493 33791374 35681544 38024847 40606701 43333690 46375226 49692608 53522166 57347897
3485 57347897 61120181 65062342 68603628 71801807 74723251 77050706 78718929 79775350
3477 79775350 80009011 79751120 78881789 77573003 75573834 73558939 71549390 69859490 68476999
3468 68476999 67145501 66343637 66004922 66007254 66460187 67191130 67942872 68867662 69811088 70628360
3458 70628360 71377695 71925396 72118299 72042423 71815698 71305350 70490019 69406036 68019684
3449F8019684j434454j452327j353568j170687q87934q30269k44022L6842M04774
3440F1088039Q91660J381504J872172K331600K800175L313750L897226M193367
3432H1769493M532420M750120M743189M525340M092806L559135K866223J981048
3424A12819774J035876K30702l63917q73198j452521j453344j524782j353962
3416A07064628r47551o77638m54787K1110K34544L64903M37862J36691J89867
3407A06369629k64068n81148j120127j676224k325457k777985l176924l771914
3399I0675782l886353m171908m446826m182715m167356l982476l869919l360560
3391E8607669l199440k910720k714977k373296j913174j744312j500060j346471
$$ plain form
3449 68019684 66585230 65132903 63779335 62608648 61720714 60890445 60646423 60683265 61088039
3440 61088039 61979699 63361203 65233375 67564975 70365150 73678900 77576126 81769493
3432 81769493 86301913 91052033 95795222 100320562 104413368 107972503 110838726 112819774
3424 112819774 113855650 114086352 113722435 112849237 111396716 109943372 108418590 107064628
3416 107064628 106117077 105439439 104984652 105005762 105240306 105605209 106043071 106179762 106369629
3407 106369629 106105561 105524413 104404286 102728062 100402605 97624620 94447696 90675782
3399 90675782 86789429 82617521 78170695 73987980 69820624 65838148 61968229 58607669
3391 58607669 55408229 52497509 49782532 47409236 45496062 43751750 42251690 40905219
3383D0905219j214955j121561q61727p23450n00305n70149l11655j69807j82448
3374C5249162k7777K900Q3587J79265K80595K54348L08734L63846P22625P47685
3364C8164970J077570R41177J036658J035835J075278J224649J193417J199443
3356D6948997J151434J105293J116722Q84350P39957R94793P73301P30885Q89253
3347E5334985R14708R11382R11976R81120J114679J405939J667506J953889K296556
3338F7492740K343152K855247L240884L366555L510413L425140L465660L235590
3330I2935381K739196K480276K019407J699851J246808N97316L22363M53304n04
3321A04493398L09911P25152P22570P39193Q88907Q23663N29689K99200J18927
$$ plain form
3383 40905219 39690264 38568703 37706976 36983526 36483221 35913072 35601417 35431610 35249162
3374 35249162 35221385 35224285 35307872 35487137 35767732 36022080 36330814 36694660 37417285 38164970
3364 38164970 39242540 40183717 41220375 42256210 43331488 44556137 45749554 46948997
3356 46948997 48100431 49205724 50322446 51206796 51946753 52941546 53714847 54445732 55334985
3347 55334985 56249693 57161075 58073051 59054171 60168850 61574789 63242295 65196184 67492740
3338 67492740 69835892 72691139 75932023 79298578 82808991 86234131 89699791 92935381
3330 92935381 95674577 98154853 100174260 101874111 103120919 103718235 104040598 104493902 104493398
3321 104493398 104803309 105528461 106251031 106990224 107879131 108702794 109232483 109531683 109650610
3312A09650610m20561p94487r11711j156864q41089o98003n49010r4467N6540
3303A04240958L99630M94309M10514M01940M49615M21375L38014L14662N87486
3294A08058503P30526R05597J193465J417802J432637J525053J320535P58520
3286A17342638K98783j51435p55346j416304j934926k497757k691375k876517
3278A05317761l058521k843913k868454k585827k559348k465180k337260k206744
3270H4392514k401270k612079k699300k894949l082282l247555l194603l380456
3262F0880020l205343l154437l049652k912386k819842k579787k170749k038924
3254C8948900j909161j707482j417619j267836j177927j138668r70359q36160
$$ plain form
3312 109650610 109230049 108435562 107523851 106366987 105525898 104827895 104278885 104184418 104240958
3303 104240958 104640588 105134897 105545411 105947351 106396966 106818341 107156355 107471017 108058503
3294 108058503 108789029 109694626 110888091 112305893 113738530 115263583 116584118 117342638
3286 117342638 117641421 117489986 116734640 115318336 113383410 110885653 108194278 105317761
3278 105317761 102259240 99415327 96546873 93961046 91401698 88936518 86599258 84392514
3270 84392514 81991244 79379165 76679865 73784916 70702634 67455079 64260476 60880020
3262 60880020 57674677 54520240 51470588 48558202 45738360 43158573 40987824 38948900
3254 38948900 37039739 35332257 33914638 32646802 31468875 30330207 29359848 28523688
3246B8523688p83927p63260m56736l36417m31893j71457k08161k36018j10553
3237B5025266j88830L47713J53358L95291L56749L23024K47797M12804L07936
3228B7381108J35180J58068j80120j45012k64059j52436k85279l49582l31415
3219B5966453k62631k78238j92644k07129k56533k04086J5970l14167k65451j59690
3209B3841854l06160k70973l65018n51369m60795l88333k33818j1316k87964p0960
3199B0895148M8885J44621J39892Q1426L30896L28063L83843K35009L56299M39241
3189B3383323M37296K93898M21305O60443O47883R42216Q35071J074445J232305
3180B9928185J402908J543541J753140J883053J845023J900860J835596J860869
$$ plain form
3246 28523688 27739761 26976501 26519765 26183348 25751455 25579998 25371837 25135819 25025266
3237 25025266 24836436 25184149 25337507 25732798 26089547 26412571 26660368 27073172 27381108
3228 27381108 27516288 27674356 27494236 27349224 27085165 26932729 26647450 26297868 25966453
3219 25966453 25703822 25425584 25232940 25025811 24769278 24565192 24581162 24266995 24001544 23841854
3209 23841854 23535694 23264721 22899703 22348334 21887539 21499206 21265388 21254072 20966108 20895148
3199 20895148 20944033 21088654 21228546 21309972 21640868 21968931 22352774 22587783 22944082 23383323
3189 23383323 23820619 24114517 24535822 25196265 25844148 26786364 27621435 28695880 29928185
3180 29928185 31331093 32874634 34627774 36510827 38355850 40256710 42092306 43953175
3172D3953175J697442J561570J567320J608709J510275J164596R09017O96929
3164E4669033M09521J51098J27304p3742q5403q7813k54893n04940o06234n61678
3154E3182253q82806j019096j121040j028997j188690j168906q21324p26504n23171
3145D4701719j03239M04308N63804R45884J380737J790068K307211K770145L070403
3136E7831040L510676M015702M062215M342136M611264M457279L956360L582870
3128I0369542K742071J863636Q36040m29547j678228k803238l903550m720683
3120H2276043n140123n436425n566578n501136n132195m591138m197929l804003
3112D2906516l466048k770741k364926k164746j829856j709131j554578j279775
$$ plain form
3172 43953175 45650617 47212187 48779507 50388216 51898491 53063087 53972104 54669033
3164 54669033 55078554 55229652 55356956 55283214 55197811 55109998 54855105 54350165 53743931 53182253
3154 53182253 52299447 51280351 50159311 49130314 47941624 46772718 45951394 45224890 44701719
3145 44701719 44598480 45002788 45566592 46512476 47893213 49683281 51990492 54760637 57831040
3136 57831040 61341716 65357418 69419633 73761769 78373033 82830312 86786672 90369542
3128 90369542 93111613 94975249 95811289 95381742 93703514 90900276 86996726 82276043
3120 82276043 77135920 71699495 66132917 60631781 55499586 50908448 46710519 42906516
3112 42906516 39440468 36669727 34304801 32140055 30310199 28601068 27046490 25766715
3104B5766715j182167j022846q04841q87350p23741o74031o80551o71533q23773
3095A8295882p77557o78588n64255n55358o61269m59003l72654n70108n32303
3086A3124787k69653m22761n79915k30548l95443l49130k26585l65168k94031
3077I991553j34012n7669j78210M3266p9090r8068N9501j99990j39560K4382l9921
3066I192182m8567j00813q5058j26863J9230k50296j77895p5170j64954j61864
3056H019932r2262k06121j08532r7440k3005M9651j11047J30588Q1028r2673p2294
3045G477825n5694L6228n8774j08304n1314j23040m8706j48721Q5675j30587j14539
3034F760049L0780J31835J41847p0003m5193M3194l5694J14167O2074o6364j02038
$$ plain form
3104 25766715 24584548 23561702 22756861 21869511 21145770 20471739 19791188 19119655 18295882
3095 18295882 17518325 16839737 16275482 15720124 15058855 14599852 14227198 13657090 13124787
3086 13124787 12855134 12432373 11852458 11621910 11226467 10877337 10650752 10285584 9991553
3077 9991553 9857541 9799872 9621662 9664928 9585838 9487770 9547271 9347281 9207721 9232103 9192182
3066 9192182 9143615 9042802 8957744 8830881 8850111 8599815 8421920 8346750 8181796 8019932
3056 8019932 7927670 7721549 7613017 7515577 7492572 7542223 7431176 7561764 7642792 7550119 7477825
3045 7477825 7422131 7458359 7399585 7291281 7239967 7116927 7068221 6919500 7005175 6874588 6760049
3034 6760049 6790829 6922664 7064511 6994508 6949315 6992509 6956815 7070982 7133056 7066692 6964654
3023F964654J4035m5151M4534p612O3392M6832j12183k7806L0764M6779j5123
3012G003115J19943J59468L26792R8529P029K4826J75589K23892J22399J96180
3002H457762J34730P779N0272P3133K42040K46407J3679j7554K72876J19735M1814
2991I642673m1956J42700J83028J64695J46519J22363J44703K47217J48400K29969
2981A1130311K26369K58790K49733K07281J38306J42253L59189K93267L61739
2972A3367238L61510K15841L50105N21424M82631M62205M84797N51836N26862
2963A7324449N41635M70525N68894N42378M39277M48728M82682L80204M27517
2954B1626289N87758N78874P10329O82565O64804Q89032Q58545J069043J022032
$$ plain form
3023 6964654 6978689 6933538 6978072 6970460 7033852 7080684 6968501 6940695 6971459 7018238 7003115
3012 7003115 7123058 7282526 7609318 7707847 7714876 7739702 7915291 8139183 8261582 8457762
3002 8457762 8592492 8600271 8650543 8723676 8965716 9212123 9225802 9208248 9481124 9600859 9642673
2991 9642673 9600717 9743417 9926445 10091140 10237659 10360022 10504725 10751942 10900342 11130311
2981 11130311 11356680 11615470 11865203 12072484 12210790 12353043 12712232 13005499 13367238
2972 13367238 13728748 13944589 14294694 14816118 15298749 15760954 16245751 16797587 17324449
2963 17324449 17866084 18336609 18905503 19447881 19887158 20335886 20818568 21198772 21626289
2954 21626289 22214047 22792921 23503250 24185815 24850619 25739651 26598196 27667239 28689271
2945B8689271J001011J164310J259227J328642J295043J358956J398106J515117
2937C9009683J799669J742030J864009J932123K166355K188328K246266K656136
2929E5604599K721497K872110L173426L517398M244912N228390O088658O959824
2921I0410814Q063993R440749J0813519J2668414J4710204J6480251J6810880
2914A79398824J6483867J6280630J6018252J2854364M411474p796811j9333363
2907B18317237k4492503k3684927j9793576j5275978j1291047q315225o086618
2900A09377363m448442l028277k118597j374267p28268j91286L56046P63624J322818
2891I9930714J785444K300656L014782L690014M677539N568513O881696Q213453
$$ plain form
2945 28689271 29690282 30854592 32113819 33442461 34737504 36096460 37494566 39009683
2937 39009683 40809352 42551382 44415391 46347514 48513869 50702197 52948463 55604599
2929 55604599 58326096 61198206 64371632 67889030 72133942 77362332 83450990 90410814
2921 90410814 98474807 107915556 118729075 131397489 146107693 162587944 179398824
2914 179398824 195882691 212163321 228181573 241035937 245447411 237650600 218317237
2907 218317237 193824734 170139807 150346231 135070253 123779206 115463981 109377363
2900 109377363 104928921 101900644 99782047 98407780 97679512 97488226 97844272 98607896 99930714
2891 99930714 101716158 104016814 107031596 110721610 115399149 120967662 127849358 136062811
2883A36062811R776454J1645532J3553031J5981976J8375914K0676010K2729641
2876B48801369K3467310K2655429K1623973J9446452J4120729L872230j0413024
2869C43574468k4529878l3137071l5303340l2567016k7716012k2753100j8636968
2862A48931083j5242300j2585163j0684265q761804p715981o718785n855579n368146
2854G5999060m907748m674986m264574l721685l279361k870267k605158k220305
2846D7454976j942190j866157j745281j578433j628418j469854j475651j434338
2838C4314654j421280j619703j419689j400522j451634j218413j105288j053736
2830B3624389j034399r72046p06944r23212p40885n89495o13667m20270n00694
$$ plain form
2883 136062811 145839265 157484797 171037828 187019804 205395718 226071728 248801369
2876 248801369 272268679 294924108 316548081 335994533 350115262 353987492 343574468
2869 343574468 319044590 285907519 250604179 218037163 190321151 167568051 148931083
2862 148931083 133688783 121103620 110419355 101657551 93941570 87222785 81367206 75999060
2854 75999060 71091312 66416326 62151752 58430067 55150706 52280439 49675281 47454976
2846 47454976 45512786 43646629 41901348 40322915 38694497 37224643 35748992 34314654
2838 34314654 32893374 31273671 29853982 28453460 27001826 25783413 24678125 23624389
2830 23624389 22589990 21617944 20911000 19987788 19246903 18657408 18043741 17623471 17122777
2821A7122777m32953m48261k86351k30908l19840j38641k44154j87469l78033
2812A4456167l51284k89189k87384l70668l68292k93568l53914k32390k17881
2803A1691597l35386j93962l61781j85485j26193k62400q5451l46699k75744j41997
2793I376499l95805k85145k14371j83891j53600j44512l69422k39889n5295r8900
2783G235669j98960j86180j55004n0568N7161j89453j30779n3758o8496j19861
2773F139771j5908R4264R1587j58047k09079j4084o7913j50749l2723j87478j1973
2762E477668k11093j39254M7751N232j01052k93411j54594q8261j0586j42734
2752D389666k1050k6409j65851k04037m109K2353k36718j76170o2327J060j53779
$$ plain form
2821 17122777 16689824 16241563 15955212 15724304 15404464 15265823 15021669 14834200 14456167
2812 14456167 14104883 13815694 13528310 13157642 12789350 12495782 12141868 11909478 11691597
2803 11691597 11356211 11162249 10800468 10614983 10488790 10226390 10140939 9794240 9518496 9376499
2793 9376499 8980694 8695549 8481178 8297287 8143687 7999175 7629753 7389864 7334569 7235669
2783 7235669 7036709 6850529 6695525 6644957 6702118 6512665 6381886 6328128 6259632 6139771
2773 6139771 6123863 6218127 6309714 6151667 5942588 5928504 5860591 5709842 5677119 5489641 5477668
2762 5477668 5266575 5127321 5175072 5180304 5079252 4785841 4631247 4542986 4532400 4389666
2752 4389666 4368616 4342207 4176356 3972319 3968210 3990563 3753845 3577675 3515348 3516408 3362629
2741C362629j81424k31670r975J228L827K2862r108n6844J59344P5689p9260j59780
2729B897518n5923J0507q6737j69837m0136j3880j62744j88790j64569P629J8011
2718B051049j2083r7853J4202J56229l3946k2050n2916N1421J03844r8402j04419
2707A955076m1922J9424j9112o9949J2895K5865j52452r8294j57828M5262J3701
2696A532666j23248J2158r724J05316J19240k21950M892O8530j76587j18471P667
2685A200489n4395m5066J28815j8473r3513j1443K6684J00196N5665M8516R670
2674A347145K8364k2100j0229o9602j10617K3264P3516k02k0226j5153L8635k9981
2662A232814p181J62596O8802j77902L5422L3771m1958M5275k2913o9404K6426
$$ plain form
2741 3362629 3181205 2949535 2939560 2940788 2944615 2967477 2958369 2901525 3060869 3136558 3057298 2897518
2729 2897518 2841595 2852102 2765365 2595528 2555392 2541512 2378768 2189978 2025409 2033038 2051049
2718 2051049 2038966 1941113 1955315 2111544 2077598 2055548 2002632 2054053 2157897 2059495 1955076
2707 1955076 1913154 1932578 1913466 1843517 1856412 1882277 1729825 1631531 1473703 1518965 1532666
2696 1532666 1409418 1421576 1411852 1517168 1636408 1414458 1419350 1487880 1311293 1192822 1200489
2685 1200489 1146094 1101028 1229843 1211370 1117857 1106414 1133098 1233294 1288959 1337475 1347145
2674 1347145 1375509 1353409 1343180 1273578 1162961 1186225 1259741 1259539 1239313 1224160 1262795 1232814
2662 1232814 1225633 1388229 1457031 1279129 1314551 1348322 1306364 1351639 1328726 1259322 1285748
2651A285748j46523n0057L5665M0995r1141L2870L7895Q7753k5976J2928J17760
2640A337917K0370R5416M699K2619J9531j07274k4669J03967N3508J8889N4160
2629A599133J99681J54454N6979q0365j03377j45397L958j44352j43777l1296
2619A365641k3862j71246L4537M1084j11380r4312j95141m4794O2670K8151Q7046
2608I78394O6203j0408N419n1918J01499K9163k9718J62728p2024M616j0860R1243
2596A264337M0335K55017J41208n4O1474K13278J39277r5328j5443L9787N9079
2585B102967j19650q4807j79917j71987j64189j76916L6949j29507O1959r1738
2575A083164q9947j28924n3991j25668r377N1278m1630q4348j63982M4161J10518
$$ plain form
2651 1285748 1139225 1089168 1124833 1165828 1074687 1107557 1145452 1233205 1207229 1220157 1337917
2640 1337917 1358287 1453703 1458402 1481021 1500552 1393278 1368609 1472576 1526084 1544973 1599133
2629 1599133 1798814 1953268 2010247 1929882 1826505 1681108 1685066 1540714 1396937 1365641
2619 1365641 1341779 1170533 1205070 1246154 1134774 1040462 845321 800527 863197 891348 978394
2608 978394 1044597 1034189 1039608 987690 1089189 1118352 1088634 1251362 1179338 1183954 1173094 1264337
2596 1264337 1304672 1559689 1700897 1700843 1762317 1975595 2114872 2019544 2004101 2043888 2102967
2585 2102967 1983317 1898510 1718593 1546606 1382417 1205501 1242450 1112943 1174902 1083164
2575 1083164 993217 864293 810302 684634 675257 726535 684905 600557 436575 480736 591254
2564E91254j3477j67250N3068m9651K6162O6094K3565M2599j42536l7341r43m2654
2552C48890M1950m755N9130r3394q8980M8066L9239j45431N1304Q1448K0670L9238
2540C97375r2338K5097L0538j27576O1433l8707M66K10438Q3199j04334r8259
2529C47332m7274J16535l798J7270m3287N5263j8545r4741K6916L4493n6115p974
2517C26075j15772N9510J51049J43215o9861j79537J55019m1955m7996J12009
2507D91756p4914j83970J07059P6605r1200K13p6153Q5909m4097p7826J3895n1619
2495A75658L4950J10821n2454O0651j7749n6512J10979j14011L2135J0494M4452
2484C39414p4475K7803J2772m7114Q3632J3705K3412j06627l8072J98144J08078
$$ plain form
2564 591254 577777 410527 463595 413944 440106 506200 529765 572364 429828 392487 391544 348890
2552 348890 390840 386085 445215 351821 262841 310907 350146 204715 256019 337467 358137 397375
2540 397375 305037 330134 360672 233096 294529 255822 256288 466726 549925 445591 347332
2529 347332 300058 416593 412795 430065 386778 442041 423496 328755 355671 390164 334049 326075
2517 326075 210303 269813 420862 564077 494216 314679 469698 427743 379747 491756
2507 491756 416842 232872 339931 416536 325336 325549 249396 335305 291208 213382 227277 175658
2495 175658 210608 321429 268975 329626 311877 255365 366344 252333 284468 294962 339414
2484 339414 264939 292742 305514 258400 342032 355737 379149 272522 234450 432594 540672
2473E40672K0154o0244j08850p2428j10958N4135j00674K9628p6157N9829n217
2462A69890Q3651l1428p5082Q8588j7776J88395j06658l5615j09937P7742J11163
2451C42933l1193k5435n2081Q6129M5916m9071N5512M2999J12993j74289L2734
2440C87147j29284L7404Q988p8352l0211J6045k2496o1727M8970O7954m1823O6719
2428B69334k3760l5393r3932o8647L8370Q160R7494n8793j2190J13225J636m2560
2416A92944j14569P6854P2813j08512O3769p528l3613K1869P7368K3723R775J0224
2404B85117L0124n314J1477O2942k2558r6326P9103j64548R4194j0526K3654j729
2392B85610j06861m8451Q7578j4681p9889P4762N3318N2391m5832q7611j7572
$$ plain form
2473 540672 560826 500582 391732 319304 208346 262481 161807 191435 115278 175107 169890
2462 169890 253541 222113 147031 235619 217843 406238 299580 263965 154028 231770 342933
2451 342933 311740 286305 234224 320353 366269 317198 372710 415709 528702 354413 387147
2440 387147 257863 295267 304255 225903 195692 211737 189241 127514 176484 244438 202615 269334
2428 269334 245574 210181 116249 47602 85972 94132 191626 132833 120643 233868 235504 192944
2416 192944 78375 155229 228042 119530 183299 175771 142158 164027 241395 265118 274893 285117
2404 285117 315241 309927 321404 384346 361788 265462 344565 180017 274211 263685 287339 285610
2392 285610 178749 130298 217876 203195 123306 198068 251386 303777 257945 170334 152762
2381A52762J972J58556p7604j6497p6590K7242J3834J0377R9701m6476m147m7496
2369A95634k3255M5149Q7299o9540M14j31003M5362N8066J20539j05996k9701
2358A92968M3756L9645m435q341l6769P3503K5502j76514r2694J59589M4395o0019
2346B00586n6291j14909O6971J70020k1772L0909l0603k4966k878j28005o3980
2335B5082r0309J13455L6121m0571k074O6758L3415n354P3719K2102j15174L7953
2323A55123l3109k0985q102J11090r7972m0698k6075m3827Q0799O8481k4200l6389
2311H4136N3720k4884N3694J40802j783j56740J4740P1657r0657j3402n9106N4298
2299A26475J19819Q8875n0346p5562m3853n0834k4993r6665N305J70571r0402
$$ plain form
2381 152762 154734 313290 235686 219189 142599 169841 183675 194052 293753 247277 243130 195634
2369 195634 172379 217528 304827 235287 235701 104698 150060 208126 328665 222669 192968
2358 192968 236724 276369 271934 263593 226824 300327 325829 149315 56621 216210 260605 200586
2346 200586 144295 29386 96357 266377 244605 275514 244911 219945 217067 89062 25082
2335 25082 -65227 48228 84349 43778 41704 108462 141877 136523 210242 232344 117170 155123
2323 155123 122014 101029 92927 204017 106045 65347 39272 -4555 76244 144725 120525 84136
2311 84136 137856 112972 166666 307468 305685 148945 163685 235342 144685 131283 72177 126475
2299 126475 246294 335169 284823 209261 165408 114574 89581 -7084 -1779 168792 78390
2288G8390O2909N613o7715O2092n7930J69326r3005j12945N6832J71416l7541
2277B37442j30460J10360j03738r4456K324R0362J44850j10045p5958R0679P106
2266A68466p6198l4742N1976J44809L9502r8130m9442j9050O052O2753m5428J30125
2254B80693n9062j00661j7863m7325K5331P0071O7949m6126j00289O4433J29105
2243B66256j3390l1710o9028J21255m8486l5742j04783L483M2359k9307N2069
2232A52976j25630r6638J17639R5184r6917K6005J72936m7740K0060M7860j13180
2221A52555R1625O1959l0272j90532J36521K1527K4019k6222N2189K78p4986O419
2209B25080m9525r1629J40253m0793J20068L5592M2425K9919l6945j12126J02797
$$ plain form
2288 78390 141299 146912 79197 141289 83359 252685 159680 46735 103567 274983 237442
2277 237442 106982 217342 113604 19148 21472 111834 256684 146639 70681 161360 168466
2266 168466 92268 57526 109502 254311 293813 195683 146241 127191 133243 195996 150568 280693
2254 280693 221631 120970 103107 55782 81113 151184 219133 173007 72718 137151 266256
2243 266256 252866 221156 152128 273383 224897 189155 84372 87855 130214 100907 152976
2232 152976 27346 -69292 48347 143531 46614 72619 245555 197815 217875 265735 152555
2221 152555 244180 306139 275867 85335 221856 243383 267402 241180 293369 293647 218661 225080
2209 225080 175555 83926 224179 183386 303454 339046 381471 411390 374445 262319 365116
2198C65116J44029P72p2469j43968l7047P2905N9359J4684J6586N8845J50442
2187F29254j16060L5771L5021J159Q107k4768j3399J63300P6120n429K3071R3159
2175I05306l4730J1474n3981l3238L6218J40262m9823m949j02483R0878J08246
2164A013180J9952J17859L6614j04088J54563M9908j5387L7127J85231p3239o3383
2153A358337p7173l3458r9503n9856J83383n051R7922P0731J99698M3480P8846
2142A757356J21855l3388M3870J9249J52241J15800m1988J35348m5576j35K31342
2131B455974j55523k4513O6070J18932J28534m2262O1615K22477K04680K41453
2121C277437J11686R9412K46448J37790J81232K43379J11249J87031K67637J46677
$$ plain form
2198 365116 509145 509917 437448 293480 256433 329338 388697 403381 419967 478812 629254
2187 629254 513194 548965 583986 585145 593252 568484 555085 718385 794505 789076 812147 905306
2175 905306 870576 882050 828069 794831 831049 971311 921488 916539 814056 904934 1013180
2164 1013180 1033132 1150991 1187605 1083517 1238080 1287988 1272601 1309728 1494959 1421720 1358337
2153 1358337 1281164 1247706 1148203 1088347 1271730 1266679 1364601 1435332 1635030 1678510 1757356
2142 1757356 1879211 1845823 1889693 1908942 2061183 2176983 2134995 2270343 2224767 2224632 2455974
2131 2455974 2300451 2275938 2342008 2460940 2589474 2547212 2608827 2831304 3035984 3277437
2121 3277437 3389123 3488535 3734983 3872773 4054005 4297384 4408633 4595664 4863301 5009978
2111E009978L29185L75241L15489L96635M74956M23904N40039N70412N15353K96485
2101I247677O60848P35437Q09433Q54875J120548J392063J869876K197507K939605
2092B1827869L825146M869265L964550K862894L827435N447638N218142K596998
2084E4439937n006382j0300807q457116o554765m613884l081125k042122j713234
2076A2670502j182440j173085q20399o11105m02299k15950l55894o58053o35484
2067F615793p74351n74871m76461l82039m8430j62628j96976k66629j26262k12800
2057C394346m8799j18208j33773k45979j53153N9360j25285j27920k57996k37001
2047B005592n9277j48264j50611J5683J246q2040q6940m9220l5856j13886q4734
$$ plain form
2111 5009978 5339163 5714404 6029893 6426528 6901484 7325388 7865427 8435839 8951192 9247677
2101 9247677 9908525 10643962 11453395 12308270 13428818 14820881 16690757 18888264 21827869
2092 21827869 25653015 30522280 34486830 37349724 41177159 46624797 51842939 54439937
2084 54439937 49433555 39132748 30675632 24120867 19506983 16425858 14383736 12670502
2076 12670502 11488062 10314977 9494578 8883473 8481174 8265224 7909330 7251277 6615793
2067 6615793 5841442 5266571 4790110 4408071 4359641 4197013 4000037 3733408 3607146 3394346
2057 3394346 3345547 3227339 3093566 2847587 2694434 2753794 2628509 2500589 2242593 2005592
2047 2005592 1946315 1798051 1647440 1663123 1664369 1582329 1495389 1446169 1410313 1296427 1211693
2036A211693j4021J70731K690l3032r3386o2329N2141P458J6610n8051j30507
2025A069997j23463p227r984j39864P2302k7609O0449k1838l5150k58r6733K5036
2013G65658P9768N4553j86970K0168j34136j59587o4179J72196L8055M3269p6400
2002E52395j14116o4024M9508O6937P2701O3355j01924o2689j11512L7123J05765
1991D93519m2622q6414J62380l0849K7426K710j37801L9719J03796K8694j65557
1980C95001m2521p5602J5882J74042p7870j95423J44602J996p4532L5320M69L8592
1968C39956J20344m4553k7969r0818m677j2024j7380R3662k5734j19147j28608
1957H3052J00293k3992k7320o5469P0755L1084K9705L6869n3830j17404n8138
$$ plain form
2036 1211693 1197672 1368403 1371093 1338061 1244675 1182346 1234487 1241945 1258555 1200504 1069997
2025 1069997 946534 939307 929323 789459 861761 834152 894601 872763 837613 837355 740622 765658
2013 765658 845426 899979 713009 733177 599041 439454 375275 547471 585526 628795 552395
2002 552395 438279 374255 423763 490700 563401 626756 524832 462143 350631 387754 493519
1991 493519 450897 364483 526863 496014 523440 526150 388349 428068 531864 560558 395001
1980 395001 352480 276878 292760 466802 388932 193509 338111 340107 265575 300895 301364 339956
1968 339956 460300 415747 387778 296960 292283 280259 262879 356541 330807 211660 83052
1957 83052 183345 159353 132033 66564 137319 168403 198108 234977 181147 63743 5605
1946E605J35233M6644N0025J21264j06824k26235o472L2298m8141J16547J84079
1935C04023k1797N2214p5028J5363R8619j4625n5697j62016Q8455J7432j17793
1924A29150o3874k9270O0322L9496j5939M6279o9788Q8982k6616j41412K862j11148
1912i0956K9234l2836k4280P1093O393R8939J5587k6466o3415O1757p1860m0269
1900f7079Q6272l9629K4314N8827k5658j38969J67439l0635m9878J11886k0553
1889G6337n2260n1071R2012r6665k5761R3019K12572j03029P0147m0655j60777
1878A3869K4936L9579J21071M3003j35253n3202m1667M302N6664k8950O2528p5453
1866C1427R3434p2774j21177J0069J35626j3825j7751K8555O690O0017n0153N523
$$ plain form
1946 5605 140838 187482 237507 358771 251947 25712 19240 51538 3397 119944 304023
1935 304023 282226 334440 259412 274775 373394 358769 303072 141056 229511 246943 129150
1924 129150 65276 36006 96328 135824 119885 166164 96376 185358 158742 17330 20192 -90956
1912 -90956 -61722 -94558 -118838 -47745 -41352 57587 73174 46708 -16707 45050 -26810 -67079
1900 -67079 19193 -20436 3878 62705 37047 -101922 65517 34882 -14996 96890 76337
1889 76337 24077 -26994 65018 -31647 -57408 35611 248183 145154 215301 174646 13869
1878 13869 38805 78384 199455 242458 107205 54003 12336 16638 73302 44352 106880 31427
1866 31427 124861 52087 -69090 -59021 76605 62780 45029 73584 80274 140291 90138 95661
1854I5661l1152k3936m2981K6084Q260L6001L5470J50106N3498j58153o0228m6468
1842D2162M662k7841O771N3906o1731N5033j8398k1018j637R8726O9795K382n6224
1829A46588j3414O9235m5226K3402j08930k292K1031J3234J06428N5965r160J06651
1817C63512q1859J6925O2206j6856j52075m7670p6577j57406J132P6759N86j0469
1805b1792N8885p3530O8993K2873j2199Q0796O3492P247L888o1121M0408J05673
1793B83613j20277l2646l4573j07439N7092N943o4244R4612j15376R9151j04495
1782c8639j07068k6219J08842J07512p194L016k4607j5398n1787M0661J17017
1771A06136j55388K9303r0957j31806Q9635J69369j5708m5690M9578O9258M7828
$$ plain form
1854 95661 64509 40573 -2408 23676 31936 67937 103407 253513 307011 148858 88630 42162
1842 42162 46824 18983 25754 79660 17929 72962 54564 33546 31909 130635 200430 202812 146588
1829 146588 133174 202409 157183 180585 71655 69363 90394 103628 210056 266021 256861 363512
1817 363512 281653 298578 360784 343928 191853 144183 67606 -89800 -88668 -11909 -11323 -21792
1805 -21792 37093 -36437 32556 55429 43230 124026 187518 194765 198653 137532 177940 283613
1793 283613 163336 130690 96117 -11322 45770 51713 -12531 82081 -33295 65856 -38639
1782 -38639 -145707 -171926 -63084 44428 37234 40250 15643 245 -51542 -10881 106136
1771 106136 -49252 -19949 -110906 -242712 -153077 16292 584 -45106 4472 73730 121558
1760A21558j77800n1456N9757L6215m6921n4040R856J79656n8312M1259L4321
1749I4093n1411q6963L9866k4320P6864J6245n7885m1399J05424R4276j22498
1738D2292p3756L8465M4416P3278Q3339Q2060j18162j53102P152L1845l1345l3401
1726f919J3801k8132l2148N4538j07788J817J40868n01L6807m0485N433J07928
1714A45219j46373J17971q2982K2231R0084n3974j26239r2636n6236J77883R7148
1703I2096r0697n7788j5639J03000J66022k4712j09163j4453j28660k8895R5808
1692a3081Q4037m7146L709p2855j14614J08927N0935M7011P1257j50074l3567
1681f5461O4591Q7251o6414K3621J0274j3399M2109j1839K3377o204k0872J05897
$$ plain form
1760 121558 -56242 -107698 -47941 -11726 -58647 -112687 -102831 76825 18513 59772 94093
1749 94093 42682 -44281 -4415 -28735 48129 64374 6489 -34910 70514 164790 42292
1738 42292 -31464 7001 51417 124695 208034 290094 171932 18830 25982 57827 26482 -6919
1726 -6919 6882 -21250 -53398 1140 -106648 -104831 36037 35536 72343 31858 37291 145219
1714 145219 -1154 116817 33835 56066 146150 92176 -34063 -126699 -182935 -5052 92096
1703 92096 1399 -56389 -72028 30972 196994 172282 63119 48666 -79994 -108889 -13081
1692 -13081 70956 23810 27519 -45336 -159950 -51023 -88 46923 118180 -31894 -65461
1681 -65461 -870 86381 19967 43588 53862 40463 82572 70733 94110 87906 67034 172931
1669A72931p7433j09700J79758M513k6782m6617r2175o6345l6922J44253M4908
1658I0389L3464j53255L361j1666J88536K1525j46350j6646K6596n2881q20O116
1646a1631p2530p218l8622r0345j1502J40783Q732M2769P3974n6212k6463J00426
1634E2161N8838K4023j46972p9635J9033L6781Q8073p8559o1656J3299K2434l7302
1622h9482J4556J0734K9226K9621j5398M7805Q94n3130J8078P3323j2212Q6683
1610A40698m9394n8008q1475j0695K01564j73596J8617Q7237L1435J13268j03529
1599A16122N0284o6678j03353n0494n5223J33615P8649l2540r6077J4084n8401
1588g0012j39481Q441J05637L6934J29124m8249l3343l922P6835J4023j3981L6741
$$ plain form
1669 172931 95498 -14202 165556 170069 143287 96670 4495 -61850 -98772 45481 90389
1658 90389 123853 -29402 -26041 -37707 150829 172354 26004 9358 35954 -16927 -17747 -11631
1646 -11631 -84161 -91379 -130001 -220346 -231848 -91065 -82333 -39564 34410 -21802 -48265 52161
1634 52161 110999 135022 -11950 -91585 -72552 -35771 52302 -26257 -87913 -74614 -52180 -89482
1622 -89482 -74926 -64192 -34966 -5345 -20743 27062 27956 -25174 -7096 66227 54015 140698
1610 140698 91304 33296 -48179 -58874 142690 -30906 -12289 74948 106383 219651 116122
1599 116122 166406 99728 -3625 -54119 -109342 24273 102922 70382 -25695 -11611 -70012
1588 -70012 -209493 -201052 -95415 -58481 70643 22394 -10949 -14871 61964 75987 62006 98747
1576I8747n7117k2241j26077N5297m4919j4270O1474J00386J38580l6010m1959
1565A11891k310r946N7922m4286j04511M5728p2789k7773J2523K164K9969J02015
1553A00597l4224j20646p3161L1768j04308O5151J51330l4849R2584p0364l56
1542C522r5575j9923N2076j26501m8293K52058K0675q7738J07562J7024n8162
1531A6725l4883K2941Q8448j0047o8703r2146R0237J3844o2984n5780M6857J4893
1519c0598Q5427P7642o4356k1596l9481n349j09982J23125O0004p592Q8707j16802
1507C9149o8900k0306J0487r2045J86070l1629k3345k7204j2325K8179n8592N9476
1495a0985J23901J3230O285o5386o9890n019q7601l4468p3217L4266n432l461
$$ plain form
1576 98747 41630 19389 -106688 -51391 -96310 -110580 -49106 51280 189860 153850 111891
1565 111891 109581 99635 157557 113271 8760 54488 -18301 -46074 -33551 -31387 -1418 100597
1553 100597 66373 -54273 -127434 -95666 -199974 -134823 16507 -18342 74242 3878 3522
1542 3522 -92053 -111976 -59900 -186401 -234694 17364 38039 -49699 57863 74887 16725
1531 16725 -18158 4783 93231 83184 14481 -77665 12572 26416 -36568 -92348 -45491 -30598
1519 -30598 54829 132471 68115 46519 7038 1689 -108293 14832 74836 67244 155951 39149
1507 39149 -29751 -50057 -39570 -131615 54455 22826 -519 -27723 -40048 -11869 -70461 -10985
1495 -10985 112916 126146 132431 67045 -2845 -7864 -95465 -129933 -203150 -168884 -174316 -177777
1483a77777M6216J58594p2838l7104j32382J01109O8730l6479K3922j4319P6199
1472C871L3836n0912n0888p0585Q8013O7306q1508m4684m2774l6205K4104K44565
1460H4139O4059j44992o51k3415j43731k1979L7907O7749r0269R9014l8482M8614
1448f2037K3416K6663J5904K3464R3136k2856n2457P570J2202j0924N9290K5453
1436A38824j5662j05101m1165M2129n41j04222M1125J8107j7822j07373L2841
1425a18860n003m9785J26097J11231o5649o3029p1638J50106J2115M8156j9151
1414E4590n5761q4871P0407J03378j06704p0669J29605M4693q9411L2803J2134
1403D0194q3222P0566L3998r6509j1392O6502j4520o436j4483J16107J7246j85454
$$ plain form
1483 -177777 -131561 27033 -45805 -82909 -215291 -114182 -45452 -81931 -58009 -72328 3871
1472 3871 37707 -13205 -64093 -134678 -46665 20641 -60867 -105551 -148325 -184530 -160426 84139
1460 84139 148198 3206 2555 -20860 -164591 -186570 -148663 -80914 -171183 -72169 -110651 -62037
1448 -62037 -38621 -11958 3946 27410 120546 97690 45233 52803 65005 54081 113371 138824
1436 138824 123162 18061 -23104 19025 18484 -85738 -44613 -26506 -44328 -151701 -118860
1425 -118860 -123863 -173648 -47551 63680 -1969 -64998 -136636 13470 25585 73741 54590
1414 54590 -1171 -86042 -15635 87743 -18961 -89630 39975 84668 -4743 28060 40194
1403 40194 -43028 27538 61536 -34973 -46365 20137 5617 -819 -15302 100805 118051 -67403
1391f7403q9023n7103J63396P5201M4374k1625j20344M4780J11545j7693k1837
1380D4268O1178q289j33014r6766J25519l1788m7902k5999K1224O457P6499J81603
1368A72990j12611O2058q2887k8309O4322k6966l2993L0740O2172l9302k0629
1357D8585k6958p9765Q3928R0978p7440J1910R5608j33709m4815p0279K8659J02421
1345B9123N0466q8126o4242J00171l7840j99716N9087L1300J41458K1000j67103
1334a24422m443Q8681R452Q5820p7336k3537J38584r0794m3467K8928Q6296J2840
1322H6602q7721j64152J15700J46245p815r5373L5479J0299l3408J12753j53432
1311c4823j74830J58175p524M2769k8241m821Q7155O6373K2268j63126L271r9308
$$ plain form
1391 -67403 -156426 -213529 -50133 25068 69442 47817 -72527 -27747 83798 66105 44268
1380 44268 105446 97157 -35857 -132623 -7104 -38892 -86794 -112793 -91569 -85112 -8613 172990
1368 172990 60379 122437 39550 11241 75563 48597 15604 46344 108516 69214 48585
1357 48585 21627 -58138 25790 116768 39328 51238 146846 13137 -31678 -101957 -73298 29123
1345 29123 79589 -8537 -72779 27392 -10448 -210164 -151077 -119777 21681 42681 -124422
1334 -124422 -128865 -40184 -30732 55088 -22248 -45785 92799 2005 -41462 -12534 73762 86602
1322 86602 -1119 -165271 -49571 96674 88859 -6514 28965 39264 5856 118609 -34823
1311 -34823 -209653 -51478 -59002 -16233 -44474 -49295 37860 104233 126501 -36625 -33354 -132662
1299a32662k5429J08312q1040O3666N6394l8752n6150p204q0395J16561k8319
1288a05018j1271K6103O2648J8092j12469J7054Q3880j4142m6106O1974M0762
1277B1507m2598r6676N3580J62268j2132j025o7421J8588N7712m9148j2366n2137
1265a9848L4004O291N6418r1420K3868J24994l7931q2794q2816M4364Q8860p1534
1253g544r2226O8401J00377j01523j6847m0468J57964n4268J8629Q191l9529k7857
1241b6700j2057n7948o0248r7439J30872Q01L1100O3112J591L7418r0854o2319
1229a42671R4380J22738o5674J20137k8598m6549K9130p7631p4523l6438o2534
1218a68233P7284J00321m4364q0540L5154p2735R589M9184k4535K0137J18595
$$ plain form
1299 -132662 -158091 -49779 -130819 -67153 -10759 -49511 -105661 -112865 -193260 -76699 -105018
1288 -105018 -116289 -90186 -27538 -9446 -121915 -104861 -20981 -35123 -81229 -19255 21507
1277 21507 -21091 -117767 -64187 98081 85949 84924 17503 36091 93803 44655 32289 -19848
1265 -19848 14156 20447 76865 -14555 9313 134307 96376 13582 -69234 -24870 63990 -7544
1253 -7544 -99770 -31369 69008 -32515 -49362 -89830 68134 13866 32495 40686 1157 -26700
1241 -26700 -38757 -96705 -156953 -254392 -123520 -122719 -91619 -28507 -26916 10502 -80352 -142671
1229 -142671 -48291 74447 8773 128910 100312 53763 82893 5262 -69261 -105699 -168233
1218 -168233 -90949 9372 -34992 -115532 -80378 -153113 -143524 -94340 -118875 -98738 19857
1207A9857j6477O2464J38424j30966l2601p3898l481l0185p704Q6861J7794J72351
1195B02439j82145j78834J11905M5597l122n600M155K7723m3065n1131j66136
1184b38214L6884J42967J88041m9401j9307j01581R5914O0491j14229R5551j30632
1173c3516K1748O78p4439m138J3805L8650q93J11397m1776K0626j16249J5526
1161d8581K45516N1382o7519j8960k3435m1374j5381j1778m1099l7838q0671J4375
1149g5363O1934o6863o3769k1517m0256J23325J34669M3162O2295m2829o1053
1138E3735R3402l5077j32680n4263O9186p3498J1703M9942j27294O6741m2779
1127a20882J0095R594J11935l3607M338o9768J24691M8316k03N2531l3886K2124
$$ plain form
1207 19857 3380 65844 204268 73302 40701 -33197 -36678 -66863 -74567 12294 30088 202439
1195 202439 20294 -158540 -46635 -1038 -4160 -9760 -5605 22118 -20947 -72078 -238214
1184 -238214 -201330 -58363 129678 80277 60970 -40611 55303 115794 1565 97116 -33516
1173 -33516 -11768 -11090 -85529 -89667 -75862 -37212 -38105 73292 31516 52142 -64107 -48581
1161 -48581 196935 248317 180798 161838 138403 97029 81648 69870 28771 -9067 -89738 -75363
1149 -75363 -13429 -80292 -144061 -165578 -205834 -82509 52160 95322 157617 114788 53735
1138 53735 147137 112060 -20620 -74883 -5697 -79195 -67492 -17550 -144844 -78103 -120882
1127 -120882 -110787 -101193 10742 -22865 -18527 -88295 36396 84712 84509 137040 103154 125278
1115A25278l1099j40908m9971j1885k0125L9519p2304j4947l4711J51790J4206
1104d5157K3927q7958J03840L5571J8455J4224n459R0771k46167r074k5742k9614
1092a62383J48717P634Q996J04396l5674o0483j31865n2721l5189Q6668O263P7995
1080c7646M8661M3197k4917j03931L1391K7889m6374R262j30991K9523J73480
1069A9544J39001k3504O6595r3577q0469N840o3612l4134N4006J3866O1033l2540
1057C2049o6005n6310N3135Q6571K6843k5875O7554K4403l2027j04990p7869m957
1045g7478m3630J21230n9226r4563J5272J35398O7876M9750M428L4101o8409r5164
1033a0415j46566J5334R5966k5543M741J6921N4814M7827M6806J8902k54689J69828
$$ plain form
1115 125278 94179 -46729 -96700 -108585 -128710 -89191 -161495 -176442 -211153 -59363 -45157
1104 -45157 -21230 -109188 -5348 30223 48678 62902 57443 148214 -97953 -107027 -132769 -162383
1092 -162383 -13666 -6032 2964 107360 71686 11203 -120662 -173383 -208572 -121904 -115641 -37646
1080 -37646 11015 54212 29295 -74636 -43245 -15356 -61730 -52468 -183459 -153936 19544
1069 19544 158545 135041 201636 108059 27590 33430 -30182 -64316 -10310 3556 64589 32049
1057 32049 -33956 -90266 -37131 49440 76283 50408 117962 142365 110338 5348 -72521 -77478
1045 -77478 -121108 122 -59104 -153667 -138395 -2997 64879 114629 119057 153158 84749 -10415
1033 -10415 -156981 -141647 -45681 -71224 -66483 -49562 5252 53079 99885 118787 -135902 33926
1021C3926K7377n4249P0718K826K4083j67545O814J27925n2570j42086o873j3276
1009a42930m7032J31339j2708P2038K329q6679p3493Q10j05100J2559J37712p8162
997a89317M3639P6023M0923K2499K5566j38816N2244J09937Q062m389r1011k7045
985g1685p1518L2275j20212J44806J58863q1006j53702J12032k7640J5259O3320
974G92j8989j5844N301j23281P1734R3998j5053k4051r8985J5392K1982J5047
962g1957J02003m6089l2790N8481P7823j0128j12395N4104R7058J0454p3842q5820
950c3098o4150m083N5979K4394K4590J8353J072j508j8419k8902k3092N5015j09178
937a03027J69983K4480P6601j52561q8236O5741j34702Q5699Q729K863L1038K7473
$$ plain form
1021 33926 61303 7054 77772 80598 104681 -62864 -56050 71875 19305 -122781 -129654 -142930
1009 -142930 -189962 -58623 -71331 707 3036 -83643 -157136 -156326 -261426 -248867 -111155 -189317
997 -189317 -145678 -69655 -28732 -6233 19333 -119483 -67239 42698 50760 46371 -44640 -71685
985 -71685 -143203 -110928 -231140 -86334 72529 -8477 -162179 -50147 -77787 -62528 792
974 792 -18197 -34041 -28740 -152021 -80287 13711 -1342 -25393 -124378 -108986 -87004 -71957
962 -71957 30046 -16043 -48833 9648 87471 77343 -35052 19052 116110 126564 52722 -33098
950 -33098 -97248 -101331 -45352 -20958 3632 21985 23057 21549 3130 -25772 -48864 6151 -103027
937 -103027 66956 91436 168037 15476 -72760 -7019 -141721 -56022 -47293 -44430 -13392 14081
925A4081J2340j54404K3968J17063N7079q2651K8343j08328O912q247r9009L3762
913a59091L5608j4784L2989M5106K1715q6419J19810O3576l959M0905K0650j56895
901d0789K0673J19284M7507j08350k2563m1250o3449l5601Q0926l2938K9264J30706
889H3420n1589J1978J8321R1649r5090m0834J15119k3540K5347m0978j41206k7822
877g5225O0147P0387k1838r0608j23066k4211J65006J24726j03516N251J359Q0702
865F9114k4665Q104o3741p6238R996Q3234l8716j32467P2535J31799o3686m3178
853f7909j8116l2434m98n5435J0689K49329R2377n7076j12779j02788n0798M7083
841i8355J6986q5593J14938j14261N2190L0126m437P4169K7238J01035J0112m204
$$ plain form
925 14081 26421 -127983 -104015 13048 70127 -12524 15819 -92509 -85597 -93844 -192853 -159091
913 -159091 -123483 -138267 -105278 -60172 -38457 -124876 -5066 58510 54551 95456 116106 -40789
901 -40789 -20116 99168 146675 38325 15762 -25488 -88937 -124538 -43612 -76550 -47286 83420
889 83420 31831 43809 62130 153779 58689 17855 132974 109434 134781 93803 -47403 -75225
877 -75225 -15078 55309 33471 -57137 -180203 -204414 -39408 85318 -18198 -12947 -11588 69114
865 69114 44449 52553 -11188 -87426 -77430 5804 -32912 -165379 -92844 38955 -24731 -67909
853 -67909 -86025 -118459 -118957 -174392 -163703 85626 178003 120927 8148 -94640 -145438 -98355
841 -98355 -81369 -166962 -52024 -166285 -114095 -83969 -88406 -14237 13001 114036 124148 119944
829A19944k8594j28686q2308R326K4644J56672r0914l3397O0967K2213p2446M9682
817G103J16169n5403m0069N7533r2766q4831R0820N9449J9065n0295j9145J67558
805A75188k4558m3869J4487q8626k2292q2658o1784J06706J639J5398P2332Q7554
793A49517o8974M9666J11230j4727n2752j34974j6684J27452j11915k2219P3906
782H9526j7249p5406Q279K8238M7851n5853n2205J06771L816q2054Q4604M4899
770A31217q736N9301j19233l9266j5052N5703j9216l1138O4439l4335l3059N578
758A6203R819r4931M0101J18393K8992N0659l8950j12772N0364m6280l5221N6851
746D3228P8852o4579j02284J6955q5347J9461N9036P7141q0517J8079N5610N9077
$$ plain form
829 119944 91350 -37336 -119644 -110318 -85674 70998 -19916 -53313 7654 29867 -42579 7103
817 7103 123272 67869 27800 85333 -7433 -92264 -1444 58005 77070 26775 7630 175188
805 175188 150630 106761 121248 32622 10330 -72328 -134112 -27406 -25767 -10369 61963 149517
793 149517 80543 130209 241439 226712 173960 38986 22302 149754 37839 15620 89526
782 89526 72277 -3129 5150 33388 81239 25386 -26819 79952 83768 1714 86318 131217
770 131217 122481 181782 62549 23283 8231 63934 44718 13580 78019 43684 10625 16203
758 16203 26022 -68909 -28808 89585 118577 169236 130286 17514 67878 21598 -13623 43228
746 43228 122080 57501 -44783 -27828 -113175 -93714 -34678 42463 -38054 -19975 35635 94712
734I4712q7157j3524p859P6683o1392j5638q6642K2224J44026j23929J05287L7320
722H4111l7011j11530L9278R5925q4412J2768j7384J38678j31481k3726O3494
711B8710q993o9154K6101k2521N0231m9290P7997m0234R3650n919j02732J7078
699e076l4442L9308j0207P055J11137o7558m6523J04228o4964l3620j17783J41963
687B3518n238R974k18403k3219K08235R0040o4145j17815M0171n2997J8013P2214
675a9652r0432k2568J73911J0757r4166q315n7624R7012Q3031J7650k6566M799
663F7837o7021K6634K1741j00283j386k1945O8190j2801m0655J18378P8466j03806
651C3349j34985L281O7005J8291K8798j6129Q066j6448j6410j1567Q2065J6164
$$ plain form
734 94712 7555 -5969 -13828 62855 1463 -14175 -100817 -78593 65433 -58496 46791 84111
722 84111 47100 -64430 -25152 70773 -13639 -871 -18255 120423 -11058 -34784 28710
711 28710 19717 -49437 -23336 -45857 4374 -44916 33081 -7153 86497 80578 -22154 -5076
699 -5076 -39518 -210 -10417 -3362 107775 40217 -6306 97922 32958 -662 -118445 23518
687 23518 18280 28254 -190149 -213368 -5133 84907 20762 -97053 -56882 -109879 -91866 -19652
675 -19652 -110084 -132652 41259 52016 -42150 -50465 -108089 -11077 71954 89604 63038 67837
663 67837 816 27450 49191 -51092 -52478 -74423 -6233 -19034 -59689 58689 137155 33349
651 33349 -101636 -98355 -31350 -13059 15739 -390 7676 -8772 -25182 -36749 45316 61480
639F1480R9733p0756j04492m7330l315J09744k7425J018J1883J10658j19781J8322
627C9739M7887p1651N6840o0119J4294k1607n0164J3892q4162K0244k2204r44
615a17955J03651k2934o76J10358k00136P8236N1126q349q5724J5675q3562J8568
603a41722N1131O9987k144M1431J8219j00504j19559O7365M5097m2699L3827l0283
591a09854K0673n2198p9207R1026p4691q1653J06561J66113O5713P566O4075n9491
579F4633j6364j07237J48577J1630N455j18570R422k1529l0487O0715J3518J4534
567C4297j08735O5959N3851j0700O4062L7377J01479j06633j43196N660N1392
556D4813O0473j94045l3879M7935j7501N4105J47353O3817l6711j03846k1227
$$ plain form
639 61480 161213 90457 -14035 -61365 -64680 45064 17639 18657 30540 141198 21417 39739
627 39739 87626 15975 72815 12696 26990 5383 -44781 -30889 -115051 -94807 -117011 -117955
615 -117955 -14304 -37238 -37914 72444 -127692 -49456 1670 -6679 -92403 -76728 -160290 -141722
603 -141722 -90591 -20604 -22748 18683 36902 -63602 -183161 -115796 -70699 -113398 -79571 -109854
591 -109854 -89181 -141379 -220586 -129560 -204251 -285904 -179343 -13230 52483 60049 124124 64633
579 64633 48269 -58968 89609 101239 106694 -11876 -2454 -23983 -54470 6245 19763 34297
567 34297 -74438 -8479 45372 34672 98734 136111 237590 130957 -12239 -6579 44813
556 44813 105286 -88759 -122638 -74703 -92204 -38099 109254 173071 136360 32514 11287
545A1287l2823q7893K7061m5639J49109J0829l3148K3192R3685j9069j28202J1543
533b0068K4300j7274r671K4716K492q6690N708q794K0629j30226J21683N7235
521a5960L880N3328J0058j5047q4446L4527P2886k8072l135M359n8741M2450k8876
508a2789n7495L0196J12658J1663m2231Q656j21587j8502L7057J2193K6236K2845
496H900J8811q0549N2252O8651L5905m7542j12224J27435P7345j88324j8479L4812
484b3007L372N6666P5708j22760k3041l054p1073M6976J1476L1554l295L0020
472I542Q059N2662M5436l5446j75016j1692Q4548J8352P3757j787m2888M1200
460F6727j3451J1974k7752J08677q0915j05549k7712J39320l5506j22910N0351
$$ plain form
545 11287 -21536 -109429 -82368 -128007 21102 31931 -1217 21975 115660 96591 -31611 -20068
533 -20068 4232 -13042 -22713 2003 4495 -82195 -76487 -85281 -64652 -194878 -73195 -15960
521 -15960 -12080 41248 51306 36259 -48187 -13660 59226 31154 28019 32378 -26363 16087 -12789
508 -12789 -70284 -40088 72570 84233 42002 50658 -70929 -89431 -52374 -40181 -13945 8900
496 8900 27711 -52838 -586 68065 103970 56428 -55796 71639 148984 -39340 -57819 -23007
484 -23007 -19635 37031 112739 -10021 -33062 -36116 -107189 -60213 -48737 -17183 -20478 9542
472 9542 17601 70263 115699 80253 -94763 -106455 -21907 -3555 70202 68415 25527 66727
460 66727 53276 65250 37498 146175 65260 -40289 -68001 71319 35813 -87097 -36746
449c6746l0777L0790K7954J2765L1413L6239o8284q8725r4823J65307J43851p0615
437E8349j61768J15573P5081m1417p091J38520k7813o4512J2394N2872P0310j27915
425I2583r7369L4045P954n3398O2001j89571k16128J06788m1474K02191P6929
414a5449J27131M9685p2212k12473J14044j24m9663M9049J6144j26736J13395
403g209J03841j31119M9515Q2183O1751j51268j25540J2540m9456K721J55720
392C679J8504n3858j22485j0661n2594J38179K13366m9191l3205M6879k1298J4816
380I2131n7691M9328p229o8946j15697M8148P0676m6993J57981r5845k556P7449
368A00756o7501q824p5216M6964N844k7517q189j31597k2576J99201J27151j11434
$$ plain form
449 -36746 -67523 -36733 -8779 3986 35399 71638 3354 -85371 -180194 -14887 128964 58349
437 58349 -103419 12154 87235 45818 38727 177247 149434 84922 97316 150188 220498 92583
425 92583 -4786 29259 37213 -16185 45816 -143755 -359883 -253095 -294569 -92378 -15449
414 -15449 111682 161367 89155 -123318 -9274 -9398 -59061 -10012 6132 -120604 -7209
403 -7209 96632 -34487 15028 97211 158962 7694 -117846 -105306 -154762 -152041 3679
392 3679 22183 -31675 -154160 -164821 -217415 -79236 134130 84939 51734 98613 77315 92131
380 92131 34440 83768 76539 7593 -108104 -59956 10720 -36273 121708 25863 23307 100756
368 100756 33255 24431 -50785 -3821 2023 -25494 -33683 -165280 -187856 11345 138496 27062
356B7062j63875O1348o5005J2622L2063K3438j3953p2849N3963l1032p4979N3315
344a57882P3517J51814o1763q4759R5101L6961j4096j23916K8528J7444j25687
333a64738P8834J20834q2895l8658Q6786O5r0167L6376J02047O0706r0330j19829
321a00969J77161j7037k1160o5628J2150M5651k8197J56564Q2559j11044j84603
310e4553N0702J25604j31707j16705L3020m521k1404m6322m0365Q1494m1065J67504
298A682K2167J5910K5079J2471k2372j28922l8002k2094Q7081L8882N3320k0425
286B4777n7566j1019J0276p6073P8621m5625K7291R1585j02676J05201q0218L3982
274a444n92k4612L7695L5422K746k13664P1988J5125N9382L4829p8680Q8111K3645
$$ plain form
356 27062 -136813 -75465 -140470 -127848 -95785 -72347 -86300 -159149 -105186 -136218 -211197 -157882
344 -157882 -84365 67449 5686 -79073 16028 52989 38893 -85023 -56495 -39051 -164738
333 -164738 -85904 34930 -47965 -86623 163 228 -89939 -53563 48484 109190 18860 -100969
321 -100969 76192 59155 37995 -27633 -15483 30168 1971 158535 241094 130050 -54553
310 -54553 -3851 121753 -9954 -126659 -93639 -98160 -119564 -165886 -206251 -124757 -165822 1682
298 1682 23849 39759 64838 77309 54937 -73985 -111987 -134081 -47000 -8118 45202 24777
286 24777 -32789 -43808 -33532 -109605 -30984 -76609 -49318 42267 -60409 44792 -35426 -1444
274 -1444 -2036 -26648 11047 46469 49215 -164449 -92461 -77336 -17954 16875 -61805 26306 49951
261D9951p9917j52763N1880J04816m5563J38939n5325P2374j17130k3564J3200
250d3102Q6539M8266m822R3502l6902j28748j29092M0101Q3354J72114r0956j43527
238e3273k1334J22073j9441j53610J21174P2535m1439j35543N4722J477l8300
227i0959p139O1777R3931j2455l017p773o4846r5364R7498l7349o0245M8673J01020
214B3752r5418l1002n983N9564Q7182m2261L9900m777n7511P0373m4853j65316
202a66350R4833O2635q7897J24486l8767q2948N31j81179K0915K11530J1623K2738
190g850k6558l966p7245j9201L8215p465L042J2459O573n6050O1769o5066L9534
177a01809M5375L7119o6054k9612L3459J1390L0473o638k8985J03894q6846q1775
$$ plain form
261 49951 -29966 -182729 -130849 -26033 -71596 67343 12018 84392 -32738 -56302 -43102
250 -43102 43437 91703 86881 180383 143481 14733 -114359 -74258 9096 181210 90254 -53273
238 -53273 -74607 47466 28025 -125585 -4411 68124 26685 -108858 -54136 -52659 -90959
227 -90959 -98098 -36321 57610 45155 42138 34365 -30481 -125845 -28347 -65696 -125941 -77268 23752
214 23752 -71666 -102668 -108651 -49087 38095 -4166 35734 30957 -26554 43819 -1034 -166350
202 -166350 -71517 -8882 -96779 27707 -11060 -94008 -93477 -274656 -253741 -42211 -30588 -7850
190 -7850 -34408 -38374 -115619 -134820 -96605 -104070 -101028 -88569 -81996 -138046 -76277 -141343 -101809
177 -101809 -56434 -19315 -85369 -114981 -81522 -70132 -39659 -46297 -75282 28612 -58234 -140009
165a40009J3535L4197j6641J7419J05789m9847k1946L8458J45393n1865j01017
154b6534q8956J20627j9655p50K9382j99404n4906M2501J42200o3993Q5506o6070
142a00052K9836R6780O414j04836k97N606J37587J51817q2835n7981j763o6825
130A3451K4127P9292r3625P825l73m6441k9121O3366O6826m2188m6373r3351m5715
117a42300R466M0156M0010J5053N5171O9124j04523j28429J07197o85K1084j7048
105c5724L6968O8750j3663o8172L2458l2256l3128j3718l28O0833p8443n391J0699
92g1115o4313N203j5259Q5263Q0671M6728P1989p9678j01029J3064l9786O4322
80c940j01966m9688j637M1976R2245j13168j07704J41458j6190J6323J44669L1365
$$ plain form
165 -140009 -126474 -92277 -108918 -91499 14290 -35557 -57503 -19045 126348 74483 -26534
154 -26534 -115490 5137 -14518 -15268 14114 -185290 -240196 -197695 -55495 -119488 -33982 -100052
142 -100052 -70216 26564 32978 -71858 -72155 -66549 71038 222855 140020 82039 80276 13451
130 13451 37578 116870 23245 31070 30697 -15744 -44865 18501 85327 43139 -3234 -96585 -142300
117 -142300 -132834 -92678 -52668 -37615 17556 86680 -17843 -146272 -39075 -39760 -18676 -35724
105 -35724 1244 69994 56331 -11841 20617 -11639 -44767 -58485 -58813 2020 -76423 -81814 -71115
92 -71115 -135428 -130225 -145484 -60221 20450 67178 139167 59489 -41540 -28476 -68262 -3940
80 -3940 -105906 -155594 -157231 -115255 -23010 -136178 -243882 -102424 -118614 -102291 42378 73743
68G3743j16029M6725l9460r2497j4901O2239K1886K5824m0651M409r1260l5892
56a95864R9626K3443J08971j2385j3657k6872q6971n992k217Q5228O1457m3544
44h777m9288K639k9949L8748K8087k2240r2933q138O2697M6313R8480m3662n135
31A6842j4542N183l3190L746M4511N3947O206n6980r073j38663n0303O2496J7578
18i2242O3373p131K5820q5233p7549M4807J6567r259M2203K151L9523j3394K8123
5b2241n3472N1535N9146q944j30507
0a04483
$$ plain form
68 73743 -42286 4439 -35021 -127518 -142419 -80180 -58294 -32470 -73121 -68712 -159972 -195864
56 -195864 -96238 -72795 36176 23791 10134 -16738 -103709 -109701 -111918 -26690 34767 -8777
44 -8777 -58065 -55426 -85375 -46627 -18540 -40780 -133713 -141851 -79154 -32841 65639 21977 16842
31 16842 2300 7483 -25707 -21961 22550 76497 82703 25723 16650 -122013 -172316 -109820 -92242
18 -92242 -28869 -36000 -10180 -95413 -172962 -128155 -111588 -120847 -78644 -76493 -36970 -50364 -22241
5 -22241 -75713 -24178 34968 26024 -104483
0 -104483
$$ Imaginary data points
##PAGE= N=2
##DATA TABLE= (X++(I..I)), XYDATA
16383b162107J03909Q8994k9791j3979O5289n993l3079N0886M6964K7894k1870
16372a882883Q6705O197J10966k3766n0250m7446O5112J91694j895O378L2170
16361a507018l2260J998O1182L3148N3618j3767l4574O7161L2765O0401L8581
16350a238765n499J7992k5745O5292R0908P5770N0544M1157k1885p0542k3842
16339a044615j0142P0541k672J08392N5433O448m7057Q4119Q4841m6537k7453
16328g68702L8634k1353q841L6578J04319m0498k1471J82324R2302l1387J8055
16317d20040N0584P1023q6631m8678O1755J74930o02n8261m8832K2249O6896k0911
16305b36518J0205R380m2415O9229m4416J31419N5979o8578N4166m7342K1397
$$ plain form
16383 -2162107 -2058198 -1969204 -1998995 -2012974 -1947685 -1953678 -1986757 -1935871 -1888907 -1861013 -1882883
16372 -1882883 -1796178 -1789981 -1679015 -1702781 -1753031 -1800477 -1735365 -1543671 -1545566 -1539188 -1507018
16361 -1507018 -1539278 -1537280 -1476098 -1442950 -1389332 -1403099 -1437673 -1370512 -1337747 -1277346 -1238765
16350 -1238765 -1244264 -1226272 -1252017 -1186725 -1095817 -1020047 -969503 -928346 -950231 -1020773 -1044615
16339 -1044615 -1054757 -984216 -986888 -878496 -823063 -816615 -863672 -779553 -694712 -741249 -768702
16328 -768702 -730068 -751421 -760262 -723684 -619365 -659863 -681334 -499010 -406708 -438095 -420040
16317 -420040 -369456 -298433 -385064 -433742 -371987 -197057 -197659 -255920 -304752 -282503 -215607 -236518
16305 -236518 -226313 -216933 -259348 -190119 -234535 -103116 -47137 -115715 -61549 -108891 -87494
16294h7494P2670M0505n5393J95341m1710j50024R7139j1242k7563J19396R112
16283A60737o7251K02887l4243m3097R6015L3809n139k4785K2835O7813j7534
16272C92047q7006R5584N0762R414J256L4163j6133k1996O4421O4660P4697o2403
16260E99466r306n1707p5536J16032J08045m5800K7813l7797M7256N3112M0509
16249G72087M3027R4316k0818j02661J38179r844l1425m0176L5300Q3704o3718
16238H97971j27179Q7889J02420Q7555l9562j48500O2771J21074P2321K5218p6229
16227A065749m3167N0899R1717P4275q3710j8947O2810n6922J04416p8694J50973
16216A319399L2362j02783J3436m7510L8796N6553O7390l3289j28127J7264J6187
$$ plain form
16294 -87494 -14824 25681 -29712 165629 123919 -26105 71034 59792 32229 151625 160737
16283 160737 93486 296373 262130 219033 315048 348857 343718 318933 341768 409581 392047
16272 392047 305041 400625 451387 460801 462057 496220 480087 458091 522512 587172 661869 599466
16260 599466 590160 538453 462917 578949 686994 641194 669007 631210 678466 731578 772087
16249 772087 815114 909430 888612 785951 924130 914286 882861 842685 877985 961689 897971
16238 897971 770792 858681 961101 1048656 1009094 860594 923365 1044439 1116760 1141978 1065749
16227 1065749 1022582 1073481 1165198 1239473 1155763 1136816 1199626 1142704 1247120 1168426 1319399
16216 1319399 1351761 1248978 1262414 1214904 1253700 1310253 1377643 1344354 1216227 1233491 1249678
16205A249678K1357L544q2883j6229J08653M4022L6146J2353k8700M9568n9792
16194A337717N8055N3082j15016J32885Q4076J16348n4580j33245j4499L8209
16184A503032K3479k6997j37j7603n2818O9118N4382N5653J1906r2425k3247Q7799
16172A592142L2592K6639l165O9184K0595m0607n4360j44717J15753J29983j49418
16161A594621m165k7646N5240L1939j8714M9601j4657K638J4616l4413R225o3123
16149A595162p4186K3424l3418J1415R3560J32631l4604n4620K0736O2848N7769
16138A800717k9319j338P5754o7770m268n0849O3259J159o4667J03013l0819o9522
16126A725350M3308p5519j18912k0771K76434l7443m8881m0589J08354K4578J28371
$$ plain form
16205 1249678 1271035 1274579 1191696 1175467 1284120 1328142 1364288 1376641 1347941 1397509 1337717
16194 1337717 1395772 1448854 1333838 1466723 1550799 1667147 1612567 1479322 1464823 1503032
16184 1503032 1526511 1499514 1499377 1481774 1428956 1498074 1552456 1608109 1620015 1527590 1504343 1592142
16172 1592142 1624734 1651373 1648208 1717392 1737987 1697380 1643020 1498303 1614056 1744039 1594621
16161 1594621 1590456 1562810 1618050 1649989 1631275 1680876 1666219 1668857 1683473 1649060 1658285 1595162
16149 1595162 1520976 1544400 1510982 1522397 1615957 1748588 1713984 1659364 1680100 1742948 1800717
16138 1800717 1771398 1770060 1845814 1778044 1773776 1722927 1786186 1787345 1722678 1825691 1794872 1725350
16126 1725350 1768658 1693139 1574227 1553456 1829890 1792447 1743566 1702977 1811331 1835909 1964280
16115A964280m9282j32385P8550n4598J34439M9155n4056m4763q8048J9892k198
16104A820986j3586L5219J66717j9813q0490r7161K9653M7765l5696j08981R6544
16093A841157M5579q7656k3904l1530O8416l8975o1661J29486L4109o9886l6323
16082A768812j211Q9028R4905o4828J9461p2036j1385L5435r2365R5279Q5902
16071A946997j917o8137j0372N7274J38791O411p5036k2623N3528n9859n2370
16060A912687O2225r465r6396P563m5939K9831K5692R2113M8493l798j37297K0431
16048A906140Q2110O43O6069K6446n3845o1474j56366N8489L2687J05817M4788
16037B051504n1616N0776p3758J9278J53569n3102n2717J4328p5759j16259L5903
$$ plain form
16115 1964280 1914998 1782613 1861163 1806565 1941004 1990159 1936103 1891340 1803292 1823184 1820986
16104 1820986 1807400 1842619 2009336 1989523 1909033 1811872 1841525 1889290 1853594 1744613 1841157
16093 1841157 1886736 1799080 1775176 1743646 1812062 1773087 1711426 1840912 1875021 1805135 1768812
16082 1768812 1767601 1856629 1951534 1886706 1906167 1834131 1822746 1858181 1765816 1861095 1946997
16071 1946997 1945080 1876943 1866571 1923845 2062636 2069047 1994011 1971388 2024916 1965057 1912687
16060 1912687 1974912 1965447 1869051 1876614 1830675 1860506 1886198 1978311 2026804 2023006 1885709 1906140
16048 1906140 1988250 1988893 2054962 2081408 2027563 1966089 1809723 1868212 1900899 2006716 2051504
16037 2051504 1999888 2050664 1976906 1996184 2149753 2096651 2043934 2058262 1982503 1866244 1902147
16026A902147J01602j43289j56451J4523O9726l9366P1264J00035K0078p000j6120
16015A917149j12681Q2510K7274K715J34100r5450j0989J9907K9790o1089k782
16004A930454L5276l7408O2805q284o8968o550J01392j16137n9819J86929j00373
$$ plain form
16026 1902147 2003749 1860460 1704009 1718532 1788258 1748892 1820156 1920191 1940269 1933269 1917149
16015 1917149 1804468 1886978 1914252 1916967 2051067 1955617 1944628 1964535 1994325 1933236 1930454
16004 1930454 1965730 1928322 1991127 1982843 1913875 1907325 2008717 1892580 1832761 2019690 1919317
$$ [...]
##END NTUPLES=NMR SPECTRUM
##END=
