##TITLE=1H_CA-9139-2-3
 CDCl3
 8 sc, 
 17.4.2023
##JCAMPDX= 6.0         $$ Bruker NMR JCAMP-DX V2.0
##DATA TYPE= NMR SPECTRUM
##DATA CLASS= NTUPLES
##ORIGIN= UXNMR, Bruker Analytische Messtechnik GmbH
##OWNER= root
$$ XWIN-NMR		Version 3.5
$$ Mon Apr 17 16:07:44 2023 Russian Standard Time (UT+4h)  she@DPX200
##.OBSERVE FREQUENCY= 200.13135
##.OBSERVE NUCLEUS= ^1H
##.ACQUISITION MODE= SIMULTANEOUS
##.ACQUISITION SCHEME= undefined
##.AVERAGES= 8
##.DIGITISER RES= 18
##SPECTROMETER/DATA SYSTEM= spect
##.PULSE SEQUENCE= zg30
##.SOLVENT NAME= CDCl3
##.SHIFT REFERENCE= (INTERNAL, CDCl3, 0, 15.7899)
##AUDIT TRAIL= $$ (NUMBER, WHEN, WHO, WHERE, WHAT)
$$ ##TITLE= Audit trail, XWIN-NMR		Version 3.5
$$ ##JCAMPDX= 5.01
$$ ##ORIGIN= Bruker BioSpin GmbH
$$ ##OWNER= she
$$ F:/spectra/data/she/nmr/H-F/1/pdata/1/auditp.txt
$$ ##AUDIT TRAIL=  $$ (NUMBER, WHEN, WHO, WHERE, WHAT)
(   1,<2023-04-17 16:06:32.96 +0400>,<she>,<DPX200>,
      <created by zg, POWCHK disabled, PULCHK disabled
       configuration hash MD5:
       00 E9 B6 7A A2 85 ED C7 34 08 36 98 17 FE 4E 26
       data hash MD5: 16K
       B8 43 20 F2 6A F0 45 56 6F 1F EF FA 3A 3A 16 26>)
(   2,<2023-04-17 16:06:35.28 +0400>,<she>,<DPX200>,
      <Start of raw data processing
       efp BC_mod = 2 LB = 0.24 FT_mod = 6 PKNL = 1 PHC0 = -19990.91 PHC1 = 14.80081 SI = 16K 
       data hash MD5: 16K
       45 97 B0 8B 0E D9 EF E3 86 33 1F 29 B8 C9 03 97>)
(   3,<2023-04-17 16:06:53.78 +0400>,<she>,<DPX200>,
      <pk PHC0 = 0.7157498 PHC1 = -0.6 
       data hash MD5: 16K
       C2 BF 2D 6C BA A5 51 5B B1 AC 52 84 D3 A4 14 F7>)
(   4,<2023-04-17 16:06:56.84 +0400>,<she>,<DPX200>,
      <abs ABSG = 5 
       data hash MD5: 16K
       22 00 EB 59 A5 7D 7B 46 49 B7 4F 13 72 BF 8C 5D>)
$$ ##END=
$$ 
$$ hash MD5
$$ 6C AA 7A 95 8F 11 5A 54 43 49 7F 28 81 32 DB 42
##$RELAX= 
##$RELAX= 
##$RELAX= 
##$RELAX= 
##$RELAX= 
##$RELAX= 
$$ Bruker specific parameters
$$ --------------------------
##$DU= <F:/spectra>
##$EXPNO= 1
##$NAME= <H-F>
##$PROCNO= 1
##$TYPE= <nmr>
##$USER= <she>
##$AMP= (0..31)
100 100 100 100 100 100 100 100 100 100 100 100 100 100 100 100 100 100 
100 100 100 100 100 100 100 100 100 100 100 100 100 100 
##$AQSEQ= 0
##$AQ_mod= 1
##$AUNM= <au_zg>
##$AUTOPOS= <>
##$BF1= 200.13
##$BF2= 200.13
##$BF3= 200.13
##$BF4= 200.13
##$BF5= 200.13
##$BF6= 200.13
##$BF7= 200.13
##$BF8= 200.13
##$BYTORDA= 1
##$CFDGTYP= 0
##$CFRGTYP= 5
##$CHEMSTR= <none>
##$CNST= (0..31)
1 1 145 1 1 1 1 1 1 1 1 1 1 1 1 1 1 1 1 1 1 1 1 1 1 1 1 1 1 1 1 1 
##$CPDPRG= <>
##$CPDPRG1= <>
##$CPDPRG2= <>
##$CPDPRG3= <>
##$CPDPRG4= <mlev>
##$CPDPRG5= <mlev>
##$CPDPRG6= <mlev>
##$CPDPRG7= <mlev>
##$CPDPRG8= <mlev>
##$CPDPRGB= <>
##$CPDPRGT= <>
##$D= (0..31)
0 1.2 0 0 0 0 0 0 0 0.06 0 0.03 0 0 0 0 0.0002 0 0 0 0 0 0 0 0 0 0 0 0 
0 0 0 
##$DATE= 1681733192
##$DBL= (0..7)
120 120 120 120 120 120 120 120 
##$DBP= (0..7)
150 150 150 150 150 150 150 150 
##$DBP07= 0
##$DBPNAM0= <>
##$DBPNAM1= <>
##$DBPNAM2= <>
##$DBPNAM3= <>
##$DBPNAM4= <>
$$ [...]
##$SUBNAM3= <"">
##$SUBNAM4= <"">
##$SUBNAM5= <"">
##$SUBNAM6= <"">
##$SUBNAM7= <"">
##$SUBNAM8= <"">
##$SUBNAM9= <"">
##$SW= 18.05172834244
##$SWIBOX= (0..15)
0 0 2 0 0 0 0 0 0 0 0 0 0 0 0 0 
##$SW_h= 3612.71676300578
##$TD= 16384
##$TD0= 1
##$TE= 0
##$TE2= 300
##$TE3= 300
##$TEG= 300
##$TL= (0..7)
0 120 120 120 120 120 120 120 
##$TP= (0..7)
150 150 150 150 150 150 150 150 
##$TP07= 0
##$TPNAME0= <>
##$TPNAME1= <>
##$TPNAME2= <>
##$TPNAME3= <>
##$TPNAME4= <>
##$TPNAME5= <>
##$TPNAME6= <>
##$TPNAME7= <>
##$TPOAL= (0..7)
0.5 0.5 0.5 0.5 0.5 0.5 0.5 0.5 
##$TPOFFS= (0..7)
0 0 0 0 0 0 0 0 
##$TUNHIN= 0
##$TUNHOUT= 0
##$TUNXOUT= 0
##$USERA1= <user>
##$USERA2= <user>
##$USERA3= <user>
##$USERA4= <user>
##$USERA5= <user>
##$V9= 5
##$VALIST= <valist>
##$VCLIST= <CCCCCCCCCCCCCCC>
##$VD= 0
##$VDLIST= <DDDDDDDDDDDDDDD>
##$VPLIST= <PPPPPPPPPPPPPPP>
##$VTLIST= <TTTTTTTTTTTTTTT>
##$WBST= 1024
##$WBSW= 4
##$XGAIN= (0..3)
0 0 0 0 
##$XL= 0
##$YL= 0
##$YMAX_a= 282617
##$YMIN_a= -180109
##$ZGOPTNS= <>
##$ZL1= 120
##$ZL2= 120
##$ZL3= 120
##$ZL4= 120
##$ABSF1= 15.7557
##$ABSF2= -2.296149
##$ABSG= 5
##$ABSL= 3
##$ALPHA= 0
##$AQORDER= 0
##$ASSFAC= 0
##$ASSFACI= 0
##$ASSFACX= 0
##$ASSWID= 0
##$AUNMP= <proc_1d>
##$AZFE= 0.1
##$AZFW= 0.1
##$BCFW= 0
##$BC_mod= 2
##$BYTORDP= 0
##$COROFFS= 0
##$CY= -3
##$DATMOD= 1
##$DC= 0
##$DFILT= <>
##$DTYPP= 0
##$F1P= 0
##$F2P= 0
##$FCOR= 1
##$FTSIZE= 16384
##$FT_mod= 6
##$GAMMA= 0
##$GB= 0
##$INTBC= 1
##$INTSCL= 3.70164e-10
##$ISEN= 128
##$LB= 0.24
##$LEV0= 0
##$LPBIN= 0
##$MAXI= 10000
##$MC2= 0
##$MEAN= 0
##$ME_mod= 0
##$MI= 1.114404
##$NCOEF= 0
##$NC_proc= -7
##$NLEV= 6
##$NOISF1= 3.799351
##$NOISF2= 2.8
##$NSP= 0
##$NTH_PI= 0
##$NZP= 0
##$OFFSET= 15.78986
##$PC= 1
##$PHC0= -19990.2
##$PHC1= 14.20081
##$PH_mod= 1
##$PKNL= yes
##$PPARMOD= 0
##$PSCAL= 0
##$PSIGN= 0
##$REVERSE= no
##$SF= 200.129996333159
##$SI= 16384
##$SIGF1= 3
##$SIGF2= 2
##$SINO= 5.538805
##$SIOLD= 16384
##$SREGLST= <1H.CDCl3>
##$SSB= 0
##$STSI= 16384
##$STSR= 0
##$SW_p= 3612.71676300578
##$SYMM= 0
##$S_DEV= 0
##$TDeff= 16384
##$TDoff= 0
##$TI= <>
##$TILT= no
##$TM1= 0
##$TM2= 0
##$TOPLEV= 0
##$USERP1= <user>
##$USERP2= <user>
##$USERP3= <user>
##$USERP4= <user>
##$USERP5= <user>
##$WDW= 1
##$XDIM= 16384
##$YMAX_p= 533063203
##$YMIN_p= -1869379
$$ End of Bruker specific parameters
$$ ---------------------------------
##NTUPLES= NMR SPECTRUM
##VAR_NAME=  FREQUENCY,     SPECTRUM/REAL,   SPECTRUM/IMAG
##SYMBOL=    X,             R,               I
##VAR_TYPE=  INDEPENDENT,   DEPENDENT,       DEPENDENT
##VAR_FORM=  AFFN,          ASDF,            ASDF
##VAR_DIM=   16384,         16384,           16384
##UNITS=     HZ,            ARBITRARY UNITS, ARBITRARY UNITS
##FACTOR=    0.220516191357247, 1,           1
##FIRST=     3160.02457821712, 0,            0
##LAST=      -452.692184788657, 0,           0
##MIN=       -452.692184788657, -1869379,    0
##MAX=       3160.02457821712, 533063203,    0
$$ Real data points
##PAGE= N=1
##DATA TABLE= (X++(R..R)), XYDATA
$$ [...]
5726A569947J2127L2024p4925P7909n8104n811J6383n5307o0580L7507O9441p5812
5714A484799r664k8141L4654N0742l6506k1376k6313o3445k774L9405N769k0849
5702A406301m0494M7224K8116q3523p8992k4234J3632k2463O2148n796Q202j17254
5690A192867J0325N3617o0464j5720L9308m1971m9169K45K2779K0017M8466J3038
5678A233338J292p3552J4371J0366l4917k9806l1245J2112J6146o3377j3074o553
5666A035101J5135j2993J4332J286l2185J5029O516l8405j2981N009K5716m4657
5654I76903j5372q004O4601K3507j2816M251r032K1111p5428K9406p551M4709
5642A036285q3374l3936j1239J193J2779J9926m9842n327L6519O9553k7758q7845
$$ plain form
5726 1569947 1582074 1614098 1539173 1617082 1558978 1553167 1569550 1514243 1453663 1491170 1560611 1484799
5714 1484799 1475135 1446994 1481648 1532390 1495884 1474508 1448195 1384750 1381976 1421381 1427150 1406301
5702 1406301 1365807 1413031 1441147 1357624 1278632 1254398 1268030 1245567 1307715 1301919 1310121 1192867
5690 1192867 1203192 1256809 1196345 1180625 1219933 1177962 1128793 1129038 1151817 1171834 1220300 1233338
5678 1233338 1234630 1161078 1175449 1185815 1150898 1121092 1089847 1101959 1118105 1054728 1041654 1035101
5666 1035101 1050236 1037243 1051575 1052861 1020676 1035705 1042221 1003816 990835 995844 1021560 976903
5654 976903 961531 953527 1018128 1041635 1028819 1033070 1024038 1045149 969721 999127 991576 1036285
5642 1036285 952911 918975 907736 908929 921708 941634 891792 886465 922984 992537 964779 876934
5630H76934n2679N0369l0977L3866L2710p7839J98K2588K0000l531q2608O7017
5618H56048K3977k8636j2202N2890l5284l6946k2969P94P6860l3858j2353j5495
5606H12826N7360K8165o8401m8228N4836j7828R72M8260k130m9641Q496j5309
5594H09378L8584k296k1361k9344J6494O6657m5546k9163N357M23o4948m4052
5582G00183K5748M3846k7512L2685N5648k4029k3462n3311L7456n4J0233k3517
5570G53914J608M0281j6294o0238k1638L9163J9886o8452N5981K0489j6826k2570
5558G25304p5789R409J8688J8016p773n7562K7836q975p0k3646l7869L0141q509
5545F09201l6266L2318M3451l0539L2606j6728L6492n3940m3897J7108J263J6098
$$ plain form
5630 876934 824255 874624 843647 877513 910223 832384 832582 855170 875170 871639 789031 856048
5618 856048 880025 851389 839187 892077 856793 819847 796878 797672 874532 840674 828321 812826
5606 812826 870186 898351 829950 781722 836558 818730 819702 867962 865832 816191 824687 809378
5594 809378 847962 845666 824305 794961 811455 878112 832566 803403 808760 809183 744235 700183
5582 700183 725931 769777 742265 774950 830598 806569 783107 729796 767252 767198 777431 753914
5570 753914 755522 795803 779509 719271 697633 736796 756682 688230 744211 764700 747874 725304
5558 725304 649515 658924 677612 695628 687855 630293 658129 649154 649084 625438 587569 617710 609201
5545 609201 572935 605253 648704 618165 650771 634043 670535 616595 572698 589806 591069 607167
5533F07167r6799J2993N4932m5748j2624M5290O4022K2363r654j1521J076l4865
5521E96632J865R721r646k4592O2995M56m0565j8866l7773m3022k332P9574K5090
5508E99537o296q401m2752o9487O423O5631r174l7836M7639K3579M8081M5174
5496F62118m6271r5123m5J1700j444K7866m7971O7896o3520l1097M2585m4323
5484D82371L4763n3868J5670n0395n2258N0439J69080L1300j08789J7363J5565
5473E51241L9521n3427L1551N1242j06799o5472o505k5384Q4045p25J4837N1796
5461E65921P0109n1357J3975l402L7300q223l6074K1780r794j3182o0427O0622
5449E87248K2803j360n277k4697J9116J4773J5614k426k5649m0615m7784N4878
$$ plain form
5533 607167 510368 523361 578293 532545 519921 565211 629233 651596 641942 630421 631497 596632
5521 596632 598497 608218 598572 573980 636975 637431 596866 578000 540227 497205 494873 574447 599537
5508 599537 593241 584840 542088 472601 479024 544655 535481 497645 545284 568863 616944 662118
5496 662118 615847 520724 520679 532379 530935 558801 510830 578726 515206 484109 526694 482371
5484 482371 517134 463266 478936 428541 376283 426722 595802 627102 518313 535676 551241
5473 551241 590762 537335 568886 620128 513329 447857 441352 415968 500013 499288 514125 565921
5461 565921 636030 584673 598648 595246 632546 624323 588249 610029 600235 587053 526626 587248
5449 587248 610051 608691 603414 578717 597833 612606 628220 625794 600145 559530 511746 566624
5437E66624K6335Q377r6516O1131L2861M114m5330m0879l9023l5462J1812P4234
5425E28278K5155J5744O7416m8359j9041M0653R8008N8107J0669J4084l4189K323
5413G58848l2884o8463j3035J2602j780k8532M2916o923j09935K3757Q6863q721
5401F54713K8560L5221k656j4164O0204O1940M7663j4247l0833k5987n2017J5582
5389G63979J8812l0922J747N0576Q5075Q5197l6136m7578n6825j00495n6373o911
5377F70146j20002k2987L1954O9454l7583p6602L9302k9042N8237R367k0359q942
5365E62943r862n7504L2951O796K5137l5116n6068N8958p390J8353M0845j7627
5353E62416P1170J8091J0664o1386q5106l34m3371J1305M1146j9285K289O1548
$$ plain form
5437 566624 592959 601336 504820 565951 598812 602926 557596 516717 477694 442232 454044 528278
5425 528278 553433 569177 636593 588234 569193 609846 707854 765961 776630 790714 756525 758848
5413 758848 725964 657501 644466 657068 655288 626756 669672 662749 552814 576571 663434 654713
5401 654713 683273 718494 715838 701674 761878 823818 871481 857234 826401 800414 748397 763979
5389 763979 782791 751869 753616 804192 889267 974464 938328 890750 833925 733430 677057 670146
5377 670146 550144 527157 559111 628565 590982 514380 553682 524640 582877 592244 571885 562943
5365 562943 553081 495577 528528 535324 560461 525345 469277 528235 520845 539198 580043 562416
5353 562416 633586 651677 662341 600955 515849 515515 472144 483449 524595 505310 507599 569147
5341E69147K1301L132r1697M910J6420N1285n899l7926N5574M5075k5780q1341
5329E24201m9512L2717K4812o658J4266L832L1444L0115K3576l4014j1136J0302
5317E93945k6350K8802M4423l7376K9253J046N283J2645o1651L4126N492j4122
5305F15516m1219n50M2778r2331M4993O8412J4054j5875l256N0278Q852j894p2042
5292F17716j9232m561l4126R5949K2693j6852R527m7336k1512l5671O7310M723
5280F38628K0767K7528N9729N4000o9346R905q409J099o2429M392O1419k853K1351
5267G55781j9748M002k6381K0617k8690N9092L3053m6225R457Q687l2757k0701
5255G16187J02142l1764j5162L9080N0232l845j3494l9590M7997M8356K2245L7321
$$ plain form
5341 569147 590448 593580 501883 506793 523213 574498 568599 530673 586247 631322 605542 524201
5329 524201 474689 507406 532218 525560 539826 543658 575102 605217 628793 594779 583643 593945
5317 593945 567595 596397 640820 603444 632697 633743 639026 651671 590020 624146 629638 615516
5305 615516 574297 573747 616525 524194 569187 637599 651653 635778 632522 682800 691652 689758 617716
5292 617716 598484 593923 559797 655746 678439 661587 671114 623778 602266 566595 633905 638628
5280 638628 659395 686923 746652 800652 731306 741211 732802 733901 671472 675864 737283 734430 755781
5267 755781 736033 740035 713654 734271 705581 764673 797726 751501 760958 769645 736888 716187
5255 716187 818329 786565 771403 810483 860715 856870 843376 803786 851783 900139 922384 959705
5243I59705j9929r260q367J8631L9049m2438J9628j7921n0507J18562j4055m0419
5231I52679L4960R7192k2410r4775J9389K7397n928N7516O6185o9916j1510R6306
5219A147085N7215K7325Q196j9340J2009r291P940J8153J7373L0830N5613J8042
5207A371150N7693O0490l6511Q3028P0442J1241M2110J5742m36N8846N6303J0225
5195A800323O6391J5665P7310J1332K5845R76R1585L2543l873J12214K4024Q5122
5183B339457L8641J08017L3225P7481N7575Q3616J40644J09538Q9407R4771J09872
5172C282244J62143K56608K77495K02060J08565J79544J69015J77882K06849L31958
5162E354363L81836L63531N46473N95264M43172K86634K34557N8527j13955o1529
$$ plain form
5243 959705 939776 930516 922149 940780 979829 937391 957019 939098 888591 1007153 993098 952679
5231 952679 987639 1084831 1062421 967646 987035 1014432 1008504 1066020 1132205 1062289 1050779 1147085
5219 1147085 1204300 1231625 1239821 1220481 1232490 1223199 1231139 1249292 1266665 1297495 1353108 1371150
5207 1371150 1428843 1489333 1452822 1535850 1606292 1617533 1659643 1675385 1674949 1733795 1790098 1800323
5195 1800323 1866714 1882379 1959689 1971021 1996866 1997842 2089427 2121970 2118097 2230311 2254335 2339457
5183 2339457 2378098 2486115 2519340 2596821 2654396 2738012 2878656 2988194 3077601 3172372 3282244
5172 3282244 3444387 3700995 3978490 4180550 4289115 4468659 4637674 4815556 5022405 5354363
5162 5354363 5736199 6099730 6646203 7241467 7684639 7971273 8205830 8264357 8150402 8088873
5152H088873l3479j31949k9998l4354J06942J27362J63658K20297K46864L53303
5142I077519L08748M23621L83885L24461M16441M37675M61142M78964N69737P78840
5132A3661033R01417J038953R68902K89192m31238r67323j151854j125770j004450
5123A2178862p38858n17430m42161l46900l34121j82582j18721n4009n316M3926
5113I482690Q6834J01313J19539J50333K52912K08649L46160L81060L65015M11046
5103A1905551M40670K64505J19628p5007l48250l99443l09891k76210n3490O6724
5093A1334787K69238M37538O56026P95615J029490J157042J427354J830451K280099
5084B1217640K774514L647871M879325O813358Q925145Q925271K666522l534975
$$ plain form
5152 8088873 8055394 7923445 7893447 7859093 7966035 8093397 8257055 8477352 8724216 9077519
5142 9077519 9386267 9809888 10193773 10518234 10934675 11372350 11833492 12312456 12882193 13661033
5132 13661033 14562450 15601403 16570305 16859497 16428259 15460936 14309082 13183312 12178862
5123 12178862 11440004 10922574 10480413 10133513 9799392 9616810 9498089 9444080 9438764 9482690
5113 9482690 9569524 9670837 9790376 9940709 10193621 10402270 10748430 11129490 11494505 11905551
5103 11905551 12346221 12610726 12730354 12655347 12307097 11907654 11597763 11321553 11268063 11334787
5093 11334787 11604025 12041563 12697589 13493204 14522694 15679736 17107090 18937541 21217640
5084 21217640 23992154 27640025 32519350 39332708 48257853 57183124 59849646 56314671
5076E6314671o587734q518976p678968o351573m577447l331016k480023j883471
5068A4905463j506225j295270j074708q58791p85150n70142n32570n59445m02793
5059G320369l93137l46582l53487k99482l30267l34604k74733k08811j63846j08854
5049D506566j39866j56443k00020j59190j10768j21227j26708j49348r0893j17025
5039C135078o6215l5562l7669l8266j19043j02584l2025j14657j11085l7456j26811
5028B313705q4588o5214k1315l1756p1811m9615k7067m5067M662o837k7033o1537
5016A826527k2618o0960k3852N3057m5561j6823k8830j4045l7350r8215l5435
5005A495895P0216O2791q3817j05620R0929J2098o2560n087j4919K3991q928j05047
$$ plain form
5076 56314671 49726937 41207961 33528993 27177420 22599973 19268957 16788934 14905463
5068 14905463 13399238 12103968 11029260 10170469 9385319 8815177 8282607 7723162 7320369
5059 7320369 6927232 6580650 6227163 5927681 5597414 5262810 4988077 4779266 4615420 4506566
5049 4506566 4366700 4210257 4010237 3851047 3740279 3619052 3492344 3342996 3252103 3135078
5039 3135078 3068863 3033301 2995632 2957366 2838323 2735739 2703714 2589057 2477972 2440516 2313705
5028 2313705 2229117 2163903 2142588 2110832 2039021 1989406 1962339 1917272 1921934 1915097 1888064 1826527
5016 1826527 1803909 1742949 1719097 1772154 1726593 1709770 1680940 1666895 1629545 1531330 1495895
5005 1495895 1566111 1628902 1545085 1439465 1530394 1542492 1479932 1474845 1459926 1483917 1474989 1369942
4993A369942L1872m1881k1218J0879O5942K335n5185j0312K602j962j4661N7223
4981A395576k4494K8062L773l6883l0841j3162l0044L70O9823m071L4297l5571
4969A356835j07978K7924J4416j7052J8447K9229q6814j0130L7733L2675O3344
4958A358629K3672R4363M3425O6494L0467k1684m163j8768o6824k5318K4231p2031
4946A432493j1935p4874n4886j4772K961j8717L3698p345m4909j3383O411L907
4934A238649l4287n2869M3048J5249k3146j3072p8776j2305N8378Q5170o1082
4923A164957O0320J6093r7146j1676N3401m7777M2312p2381r6908N3821N8255
4912A123271o1350p6008m367P417N4413R1196l9713P612L1848p4812J2733j9199
$$ plain form
4993 1369942 1401814 1359933 1338715 1349594 1415536 1417871 1362686 1352374 1354976 1353014 1338353 1395576
4981 1395576 1371082 1399144 1402917 1366034 1335193 1322031 1291987 1292357 1362180 1358109 1392406 1356835
4969 1356835 1248857 1276781 1291197 1274145 1292592 1321821 1235007 1224877 1262610 1295285 1358629
4958 1358629 1382301 1476664 1520089 1586583 1617050 1595366 1591203 1572435 1505611 1480293 1504524 1432493
4946 1432493 1420558 1345684 1290798 1276026 1278987 1260270 1293968 1286623 1241714 1228331 1234742 1238649
4934 1238649 1204362 1151493 1194541 1209790 1186644 1173572 1094796 1082491 1140869 1226039 1164957
4923 1164957 1225277 1241370 1144224 1132548 1185949 1138172 1180484 1108103 1011195 1065016 1123271
4912 1123271 1061921 985913 981546 988963 1043376 1134572 1094859 1102471 1134319 1059507 1072240 1053041
4900A053041Q6060M8825M6618L6674O3908J0798n5243l2386L3177p3229o8460
4889A149783K6730l4880j0657n366K3350L9706N1452P7163N4955K05L5970K4500
4877A432911M4091N0722N9211K4096n5860j6672m7482o0790j563n7764j3262K3733
4865A381371J7956j2121K913k8727j8208K7032L312k0424L5424P41O49j2263J7523
4852A395178M1227N8977m9993j5110J06465P616M0559L692L1758M8847j0948n4481
4840A603787O9039k0675L5244j2322m0782j9488N5200Q2053K0091L3644n381j5157
4828A785253L0838M2211m7099O786P9216l0224k211k8178L4976J57030K3430O6668
4816B118696m6841J16498J09988o8290P1728M7395o8253m5188j0316Q6320j5139
$$ plain form
4900 1053041 1139101 1187926 1234544 1271218 1335126 1345924 1290681 1258295 1291472 1218243 1149783
4889 1149783 1176513 1141633 1130976 1125610 1148960 1188666 1240118 1317281 1372236 1372441 1408411 1432911
4877 1432911 1477002 1527724 1586935 1611031 1555171 1538499 1491017 1430227 1428664 1370900 1357638 1381371
4865 1381371 1399327 1387206 1390119 1361392 1343184 1370216 1373528 1353104 1388528 1389269 1389918 1377655 1395178
4852 1395178 1436405 1495382 1445389 1430279 1536744 1544360 1584919 1588611 1620369 1669216 1658268 1603787
4840 1603787 1672826 1652151 1687395 1675073 1634291 1614803 1670003 1752056 1772147 1805791 1800410 1785253
4828 1785253 1816091 1858302 1811203 1817989 1897205 1866981 1864770 1836592 1871568 2028598 2052028 2118696
4816 2118696 2071855 2188353 2298341 2230051 2301779 2349174 2280921 2235733 2225417 2311737 2296598
4805B296598M746K5603J7955k484m764K6058O9955L4524n0738P8300O6013N4394
4793B616160N5371K0373O0073O2089j8600J56335O6640P3481O2398O5268J9997
4782C239585J08066J16638m6407J6333j1151l2195p961o7984l2305o858L0499
4771C306260k0562j9378J4306P1282N0121Q6887J8879O8704M9841M4119Q6335
4760C756794J12644J22220Q7395N3882M7399K5012k4504N1299N3725J07440L9714
4749D433020N3132P5171J26413R7348Q9447N1493J32655J2398J12266J07644N2205
4738E343192J08937K10102J50684J77813J38363J39101K36789J46697J87735J57207
4728F996620J35618J60260J36325J33218J59176K30726J43188J61083J75276K46581
$$ plain form
4805 2296598 2301344 2326947 2344902 2342418 2337654 2363712 2433667 2468191 2417453 2495753 2561766 2616160
4793 2616160 2671531 2691904 2751977 2814066 2795466 2951801 3018441 3091922 3154320 3219588 3239585
4782 3239585 3347651 3464289 3417882 3434215 3423064 3390869 3382908 3314924 3282619 3275761 3306260
4771 3306260 3285698 3266320 3280626 3351908 3402029 3488916 3507795 3576499 3626340 3670459 3756794
4760 3756794 3869438 3991658 4079053 4132935 4180334 4205346 4180842 4232141 4285866 4393306 4433020
4749 4433020 4486152 4561323 4687736 4785084 4874531 4926024 5058679 5071077 5183343 5290987 5343192
4738 5343192 5452129 5662231 5812915 5990728 6129091 6268192 6504981 6651678 6839413 6996620
4728 6996620 7132238 7292498 7428823 7562041 7721217 7951943 8095131 8256214 8431490 8678071
4718H678071K70047K01000J81105K96124K89097K13138J92784K24134K05849L15679
4708A1067028L40467K70262L41294M37998M47027M85633N14075N49990N46992
4699A5000766M91838N45537N51402N93640O56578O57357P87939Q03990P95597
4690B0884644Q15485Q83094R06684R95162J154525J211707J349247J549420J827438
4681C1577406J889742K025412K074203K326273K598476L167685L542984L592928
4673E2795109L115813K312836J382133P51223M47122L34775J74231L3797K30429
4664F1577468N52372R50083J159765J239440J230819J262178J538186J879592
4656G1389903K234171K473644K472895K307248K284344K311822K533150K897650
$$ plain form
4718 8678071 8948118 9149118 9330223 9626347 9915444 10128582 10321366 10545500 10751349 11067028
4708 11067028 11407495 11677757 12019051 12457049 12904076 13389709 13903784 14453774 15000766
4699 15000766 15492604 16038141 16589543 17183183 17839761 18497118 19285057 20089047 20884644
4690 20884644 21700129 22583223 23489907 24485069 25639594 26851301 28200548 29749968 31577406
4681 31577406 33467148 35492560 37566763 39893036 42491512 45659197 49202181 52795109
4673 52795109 55910922 58223758 59605891 60357114 60804236 61139011 61313242 61347039 61577468
4664 61577468 62129840 63079923 64239688 65479128 66709947 67972125 69510311 71389903
4656 71389903 73624074 76097718 78570613 80877861 83162205 85474027 88007177 90904827
4648I0904827L398023L830585M202195M733085N088819M965140L767964J251269
4640A22141907j666149l633096m367843m457170m102490l747420l432089k975774
4632I3759876k652718k520637k597676k802942k979698k812262k495268j918061
4624G2980614j501291j182357j174668j127359j054770p38377k94094J57310L71981
4615F6436989L17428K32906R6203q2595o68664j697884k920237l627435l728701
4606E4358010l269962k679192j937806j471284j126670q20185m17391O249N81487
4597D3223256J189051K114017L146995M713452O232581N509793M29007l676192
4589F2881960n794173p317301o806669n683055m282009l356087k521612k137086
$$ plain form
4648 90904827 94302850 98133435 102335630 107068715 112157534 117122674 120890638 122141907
4640 122141907 120475758 116842662 112474819 108017649 103915159 100167739 96735650 93759876
4632 93759876 91107158 88586521 85988845 83185903 80206205 77393943 74898675 72980614
4624 72980614 71479323 70296966 69122298 67994939 66940169 66201792 65907698 66065008 66436989
4615 66436989 66754417 66987323 67083526 67000931 66332267 64634383 61714146 58086711 54358010
4606 54358010 51088048 48408856 46471050 44999766 43873096 43052911 42635520 42641769 43223256
4597 43223256 44412307 46526324 49673319 54386771 60619352 66129145 66558152 62881960
4589 62881960 57087787 49770486 42963817 37280762 32998753 29642666 27121054 24983968
4581B4983968j823530j584531j248241j256718j061843p72151p06579o63976n51450
4572A5314949n16089m48726m44236m94653l52766l71251m77632l61932l56739
4563A1490925l08033k87630l11647k94067k69849k21192r1463p5000q8938j59032
4553I384074j13580k27283l06563k27433k59866k86046k45536l12250j94713j84918
4543G025886j55528j87469j71907m6790j53042k66594j48490j32840j79999o6036
4533E517191m2988q3929l7906o8328j65519l8306m5054l5641r194j06528J3050
4522D896848l7881r4335k0195m1436j4187n2164j5489l1507l0032J1630k5482
4511D545770n0909N5593K2093n0458M4796M7613J4334j3691M1617Q4154M4401
$$ plain form
4581 24983968 23160438 21575907 20327666 19070948 18009105 17236954 16530375 15866399 15314949
4572 15314949 14798860 14350134 13905898 13411245 13058479 12687228 12209596 11847664 11490925
4563 11490925 11182892 10895262 10583615 10289548 10019699 9798507 9707044 9632044 9543106 9384074
4553 9384074 9270494 9043211 8736648 8509215 8249349 7963303 7717767 7405517 7210804 7025886
4543 7025886 6870358 6682889 6510982 6464192 6311150 6044556 5896066 5763226 5583227 5517191
4533 5517191 5474203 5390274 5352368 5284040 5118521 5080215 5035161 4999520 4990326 4883798 4896848
4522 4896848 4858967 4764632 4744437 4703001 4688814 4636650 4621161 4589654 4559622 4571252 4545770
4511 4545770 4494861 4550454 4572547 4522089 4566885 4614498 4628832 4615141 4656758 4740912 4785313
4500D785313O1226O511O3502R8429K4966J08312R9974J23597J10843J11389J49287
4489E743349K27145K09976K09691K92232K82532M26828L86948M19519M12174K60597
4479H870991P3794M0200j23453q6626k31876j89581j06716n0460o81p2768p1986
4468H050838K198N93m0028K156P3804J85003J52006J68699K76210K65485L31802
4457I468766M27476M34615L48399M88658N48824O27603N76448M34724L49971J74361
4447A3879845j53345k63203k24309k62025m19137l57642l73085k70389k15040
4438A1341670l59041l94454m30046m53319m43926l48335k77423j69275k20557
4429H245294r8753r4807j16928j40836l3534L8397J0224L6299L5776J10391J38780
$$ plain form
4500 4785313 4846539 4853050 4916552 5014981 5039947 5148259 5248233 5371830 5482673 5594062 5743349
4489 5743349 5970494 6180470 6390161 6682393 6964925 7391753 7778701 8198220 8610394 8870991
4479 8870991 8944785 8984985 8861532 8774906 8543030 8353449 8246733 8196273 8195592 8122824 8050838
4468 8050838 8053036 8053629 8013601 8015757 8089561 8274564 8426570 8595269 8871479 9136964 9468766
4457 9468766 9896242 10330857 10679256 11167914 11716738 12344341 12920789 13355513 13705484 13879845
4447 13879845 13726500 13463297 13238988 12976963 12557826 12200184 11827099 11556710 11341670
4438 11341670 10982629 10588175 10158129 9704810 9260884 8912549 8635126 8465851 8245294
4429 8245294 8146541 8051734 7934806 7793970 7760436 7798833 7809057 7845356 7881132 7991523 8130303
4418H130303J8194n2946k06236l74957m77647n13019n55890m32549l30826l08539
4408D895888k19781k22653j90039j69111k52466j64860m5341j27090j24992j12483
4398C267072j57116j10969j33120q4428j40872j705p3839j04682j162j05028k4968
4387B329183p3655j15366p2534M6715o5432n8626L7938m6428K133n3761m387j3546
4375A912234J723k1866k4340J2553p1684J9493l8610m9681O2377o7297j7214m12
4363A717276K8543o3197K6201K0546j9581K3120K439p5470r643J0484K2216j12454
4351A570480j1622M4725O836L061l8605N6763L9213l3513o7834L5240q7481l0009
4339A487254O4105n0839q199K8642J4847J6777J4930m6733J952N7196O5089K505
$$ plain form
4418 8130303 8148497 8095551 7889315 7514358 7036711 6523692 5967802 5535253 5204427 4895888
4408 4895888 4676107 4453454 4263415 4094304 3841838 3676978 3631637 3504547 3379555 3267072
4398 3267072 3109956 2998987 2865867 2781439 2640567 2638862 2565023 2460341 2459179 2354151 2329183
4387 2329183 2255528 2140162 2067628 2114343 2048911 1990285 2028223 1981795 1983928 1930167 1925780 1912234
4375 1912234 1913957 1892091 1867751 1880304 1808620 1828113 1789503 1739822 1802199 1734902 1717688 1717276
4363 1717276 1745819 1682622 1708823 1729369 1709788 1732908 1735347 1659877 1650234 1660718 1682934 1570480
4351 1570480 1558858 1603583 1610419 1613480 1574875 1631638 1670851 1637338 1569504 1604744 1517263 1487254
4339 1487254 1551359 1500520 1492321 1520963 1535810 1552587 1567517 1520784 1522736 1579932 1645021 1647526
4327A647526K8523M4207l5166R795k3083k3316n3996q9127O54n389l0054j8088
4315A452486J0940n6943j01939l9895j9582j3432l8907L1382o1552O8939Q263
4304A239760j1024l5430K6686k6335P533n651p0376j7927K3919n6J7056j432n1040
4291A095683P837m036n3881J1095J27O1006J8760K1219m6889n3817k6548j2019
4279A018537M1882j2237o6871l1295k0852m7222N326L1764j2409j6738J4691l5655
4267H68921k849J5132K8152j2977K9497o044p975n923j6005l6909l2878P337J3409
4254H40888o999k1945M0437l2107j8797j7933K0202k671l9972J12806j547Q7363
4242I59725K6182n2462j6204n7945K0003k759O7740O1787J9033J2253L6678R3395
$$ plain form
4327 1647526 1676049 1720256 1685090 1694885 1671802 1648486 1594490 1505363 1506017 1500628 1470574 1452486
4315 1452486 1463426 1406483 1304544 1264649 1245067 1231635 1192728 1224110 1162558 1231497 1239760
4304 1239760 1228736 1193306 1219992 1193657 1201190 1195539 1125163 1107236 1131155 1131099 1148155 1146723 1095683
4291 1095683 1103520 1099484 1045603 1056698 1056825 1117831 1136591 1157810 1110921 1057104 1030556 1018537
4279 1018537 1060419 1048182 981311 950016 929164 881942 887268 919032 906623 889885 904576 868921
4267 868921 866072 881204 909356 896379 925876 919832 911857 905934 889929 853020 820142 827479 840888
4254 840888 833889 811944 852381 820274 801477 783544 803746 801075 761103 873909 872362 959725
4242 959725 985907 933445 917241 859296 879299 876540 944280 1006067 1025100 1037353 1074031 1167426
4230A167426l3105k3705k1699J19o4874m8904M449m4430m5242k0699M7762M2426
4218I59524k4800l7157l1002K6198O0131k5524p1476L4382R194N3696l7718j7514
4206H97934M6321k1417M0443j0492J7958m813M5227M3215m236j3033J5859j918
4194A051048p918n832m1811l6936k9918O1972J933o2305N2220n361L0167Q12N9775
4181A067846P9117r8115L8600N9725O269m5229j0106O2427j6440J2514N2754J4730
4169A224092N1248N8939m1168k0343l026M815L6516J0970R738O0008N4707L3155
4157A479651q15M3538K8212M5543L9386j6923M1079L5871M5974O6036j0486j4217
4145A782849M3795J8176Q8675M3533j9958O8692Q9057J8462j871K5000L5926O553
$$ plain form
4230 1167426 1134321 1110616 1088917 1089036 1024162 975258 979707 935277 890035 869336 917098 959524
4218 959524 934724 897567 866565 892763 952894 927370 855894 890276 899470 953166 915448 897934
4206 897934 944255 922838 963281 952789 970747 965934 1011161 1054376 1050140 1037107 1052966 1051048
4194 1051048 1043130 1037298 995487 958551 928633 990605 992538 930233 982453 977092 1007259 1008071 1067846
4181 1067846 1146963 1048848 1087448 1147173 1153442 1108213 1098107 1160534 1144094 1156608 1209362 1224092
4169 1224092 1275340 1334279 1293111 1272768 1269742 1274557 1311073 1322043 1331781 1391789 1446496 1479651
4157 1479651 1478836 1522374 1550586 1596129 1635515 1618592 1659671 1695542 1741516 1807552 1797066 1782849
4145 1782849 1826644 1844820 1933495 1977028 1957070 2025762 2114819 2133281 2131410 2156410 2192336 2198889
4133B198889J0256M8066O1596k3245J09811O2579J3584M8404O8116N8238M5216
4122B701510R7891P6667k0976J10470K6234L1723R8762N2172Q4894O0874k5965
4111C294256r829J8124N2514J15008K8132Q9568J18058P0259M7182K4008O5139
4100C912419J37178J40610O5580O8271J60139O5801J24639N4650Q7643J46372
4090D963302J13589J81565J10098J37117J80888J85904K05574K19161K68178K34952
4080F800328L46381K36853K30773K07604K27210J98278K56578K34032K77467L93364
4070I408868M78828N04048N98494Q70348Q66540R01526Q24843O77968N39423L05317
4060A5976203J65345R2812J57187L13035N09805P64932J039076J353203J544007
$$ plain form
4133 2198889 2209145 2257211 2318807 2295562 2405373 2467952 2481536 2529940 2598056 2656294 2701510
4122 2701510 2799401 2876068 2855092 2965562 2991796 3023519 3122281 3174453 3259347 3320221 3294256
4111 3294256 3284427 3302551 3355065 3470073 3498205 3587773 3705831 3776090 3823272 3847280 3912419
4100 3912419 4049597 4190207 4255787 4324058 4484197 4549998 4674637 4729287 4816930 4963302
4090 4963302 5076891 5258456 5368554 5505671 5686559 5872463 6078037 6297198 6565376 6800328
4080 6800328 7146709 7383562 7614335 7821939 8049149 8247427 8504005 8738037 9015504 9408868
4070 9408868 9887696 10391744 10990238 11860586 12727126 13628652 14453495 15131463 15670886 15976203
4060 15976203 16141548 16234360 16391547 16704582 17214387 17979319 19018395 20371598 21915605
4051B1915605J818079J779572J432000R46163L11671l30396o72227p40141n96437
4042B5863889k18714J78024O50019J074735J553237J920030J955378J815641J245903
4033C6038142K57706o06966j174994j508933j527091j295978q50186m95655J2936
4024B8848981N01289Q28941J084401J143093Q20703K74655m29251j022266j379037
4015C0671509j469785j297769j092521q50106o59641l48694j78293R3480K12028
4006B5080208J80701O3527k98043m65439o13263q05300q15307o84199o95435o15758
3996B0331692m47494k82129k4656m1170r7295o6248j41532k96350l93478m62525
3986A8078815m26375m29148l64160k89494j96481j82982l1262J47535m1685j94146
$$ plain form
4051 21915605 23733684 25513256 26945256 27891419 28203090 27872694 27200467 26460326 25863889
4042 25863889 25645175 25823199 26473218 27547953 29101190 31021220 32976598 34792239 36038142
4033 36038142 36295848 35688882 34513888 33004955 31477864 30181886 29331700 28836045 28848981
4024 28848981 29350270 30179211 31263612 32406705 33227408 33502063 33072812 32050546 30671509
4015 30671509 29201724 27903955 26811434 25961328 25301687 24952993 24774700 24868180 25080208
4006 25080208 25260909 25324436 25026393 24560954 23947691 23142391 22327084 21642885 20947450 20331692
3996 20331692 19884198 19602069 19577413 19536243 19438948 19372700 19231168 18934818 18541340 18078815
3986 18078815 17652440 17223292 16859132 16569638 16373157 16190175 16158913 16306448 16264763 16070617
3976A6070617l71741m52526n03216n55478n70902n39664m10778m24113k69613
3967A1972586r9535m3540j1909n4191j53281k10645m75062n57356n96558n03185
3957I267324m48724l57800k87196k93688k26425k13443j8298l1806l3063j44651
3947G212230k01311k58180l41650k81545k87360k81101j60977k79337p3389j63240
3937D884140j09045q2968j21275j57059j20896r6410q8965j30243j34243q2839
3927C760197j00482l9718j6944o7086j10571k9629q6953k8520m7958j0930J9718
3916C241124n0050l5154J516k5560l1997m9548k0774m6311K241o5796n6873Q877
3904B871695N1369o8821l8062m1213J4143J3631L053m9756J6245N7582r1333j6898
$$ plain form
3976 16070617 15698876 15246350 14743134 14187656 13616754 13077090 12666312 12242199 11972586
3967 11972586 11873051 11829511 11817602 11763411 11610130 11399485 10924423 10367067 9770509 9267324
3957 9267324 8818600 8460800 8173604 7879916 7653491 7440048 7421750 7389944 7356881 7212230
3947 7212230 7010919 6752739 6411089 6129544 5842184 5561083 5400106 5120769 5047380 4884140
3937 4884140 4775095 4692127 4570852 4413793 4292897 4196487 4107522 3977279 3843036 3760197
3927 3760197 3659715 3619997 3603053 3535967 3425396 3395767 3308814 3280294 3232336 3221406 3241124
3916 3241124 3191074 3155920 3157436 3131876 3099879 3050331 3029557 2983246 2985487 2919691 2862818 2871695
3904 2871695 2923064 2854243 2816181 2774968 2789111 2802742 2805795 2756039 2772284 2829866 2738533 2721635
3892B721635j6380m45l1905j9168l5792J14434O068p1052Q8915J7270m7627J4014
3880B739967P3518j0814L5339R2791l7975L5512j1435J7231O2617M7535L2609
3869C076895k8520K2447J05184O7739l4905j857M9107O7511N5947L7102N5159
3858C471809O2459j1892K1317J5732Q9027J09504J20082L78O1165R3522J7435
3847D050538P5322P0417j185O6084R3039k7675K5634O1052J2333J6547J17887
3836D559993N0145m1383N7177Q5645m7264Q9085J13760M1829j0653p378J02649
3825D993605Q9067l2476P5204J10307O0305M9640M0051J40382R0774R6781J36360
3814E850000Q2029J06367J20262J20805Q3559K19182J75740J67097J79889J93623
$$ plain form
3892 2721635 2705255 2704810 2672905 2653737 2617945 2732379 2738447 2667395 2756310 2773580 2725953 2739967
3880 2739967 2813485 2802671 2838010 2930801 2892826 2928338 2916903 2934134 2996751 3044286 3076895
3869 3076895 3048375 3070822 3176006 3243745 3208840 3206983 3256090 3323601 3379548 3416650 3471809
3858 3471809 3534268 3522376 3543693 3559425 3648452 3757956 3878038 3878416 3939581 4033103 4050538
3847 4050538 4125860 4196277 4195092 4261176 4354215 4326540 4352174 4413226 4425559 4442106 4559993
3836 4559993 4610138 4568755 4625932 4711577 4664313 4753398 4867158 4908987 4898334 4890956 4993605
3825 4993605 5082672 5050196 5125400 5235707 5296012 5345652 5385703 5526085 5616859 5713640 5850000
3814 5850000 5932029 6038396 6158658 6279463 6363022 6582204 6757944 6925041 7104930 7298553
3804G298553K10839K12878K02163J88986J62709K15942L06859K51557K47852J46542
3794I444880J59971J81119J86068Q0403J31139J64698J57303K04741L21037K85043
3784A1316402L89104L58141M28010M71229N73702O24357O51852O02622N19816
3775A5935235M12907K59118J58864J75331J52746J83599K41073J93533K83481
3766A7995887M21472M91019N13119N82643O84028P72530Q86608J014161J155065
3757B4516532J311566J531220J816160K007233K134564K151406K302431K386366
3749D0157478K703373L102140L703956M045214M003469L308051J954323P04878
3741F3682882j10365m87981o00571n08994k6762P48480J602204K463817L099614
$$ plain form
3804 7298553 7509392 7722270 7924433 8113419 8276128 8492070 8798929 9050486 9298338 9444880
3794 9444880 9604851 9785970 9972038 10052441 10183580 10348278 10505581 10710322 11031359 11316402
3784 11316402 11705506 12063647 12491657 12962886 13536588 14160945 14812797 15415419 15935235
3775 15935235 16348142 16607260 16766124 16941455 17094201 17277800 17518873 17712406 17995887
3766 17995887 18417359 18908378 19421497 20004140 20688168 21460698 22347306 23361467 24516532
3757 24516532 25828098 27359318 29175478 31182711 33317275 35468681 37771112 40157478
3749 40157478 42860851 45962991 49666947 53712161 57715630 61023681 62978004 63682882
3741 63682882 63572517 63084536 62483965 61974971 61948209 62696689 64298893 66762710 69862324
3732F9862324L299143L193389K812112K211817J420775Q52464N56054L01676K93679
3723H4803433N23834R67894J684846K542151L602250M705294O105364P223838
3715A12158904P723239O823512L708886j093211n497548p821571q360615p493513
3707A00148083o096198m546294l157373k180589j456241r45200n22871j96105
3699H1047212j86478l96300q51931j495522k433602l262464l742741l697732l220587
3690F1759855k472870j485903o22233k9333L09411M84994K89437j82408r80900
3681E7070050k142651l262095l727249l659955l291999k705131k229754k027260
3673C4023956j873663j823961j707156j612482j476310j189247j013220r01561
$$ plain form
3732 69862324 73161467 76354856 79166968 81378785 82799560 83652024 84208078 84509754 84803433
3723 84803433 85327267 86295161 87980007 90522158 94124408 98829702 104935066 112158904
3715 112158904 119882143 126705655 130414541 129321330 123823782 116002211 107641596 100148083
3707 100148083 94051885 89505591 86348218 84167629 82711388 81766188 81243317 81047212
3699 81047212 80860734 80464434 79612503 78116981 75683379 72420915 68678174 64980442 61759855
3690 61759855 59286985 57801082 57178849 57149516 57458927 57943921 58233358 58050950 57070050
3681 57070050 54927399 51665304 47938055 44278100 40986101 38280970 36051216 34023956
3673 34023956 32150293 30326332 28619176 27006694 25530384 24341137 23327917 22426356
3665B2426356q42185p23704o37190n89710n28919l96811k37771l05597l44160
3656A7820309j43542j88258j44122j12476r0966k23485j92600l76357m54010m36621
3646A5457872m43550m11433l93619k35769k33137k52353r9709j42028j05863n0830
3636A3089581j17826o1074J5300L7932q783q2140j04621k1110O942m4569j39422
3625A2570210n9385l7651p0434M716q2795j40398N3032j1000p9803k4541J9653
3614A2141604L9856O4847J00422N0281p883N0719Q5750Q9949J46366J74992Q4551
3603A3021454J30448J23685J30193J51676J92003J89189J92976J69531K08269
3594A4509424K30688J89041L25706L67176L48885M17564M31652N26542N02663
$$ plain form
3665 22426356 21584171 20860467 20223277 19633567 19104648 18707837 18470066 18164469 17820309
3656 17820309 17676767 17488509 17344387 17231911 17140945 16917460 16724860 16348503 15894493 15457872
3646 15457872 15014322 14602889 14209270 13973501 13740364 13488011 13388302 13246274 13140411 13089581
3636 13089581 12971755 12910681 12925981 12963913 12955130 12872990 12768369 12747259 12754201 12709632 12570210
3625 12570210 12510825 12473174 12402740 12407456 12324661 12184263 12237295 12226295 12146492 12121951 12141604
3614 12141604 12181460 12246307 12346729 12397010 12389127 12439846 12525596 12615545 12761911 12936903 13021454
3603 13021454 13151902 13275587 13405780 13557456 13749459 13938648 14131624 14301155 14509424
3594 14509424 14740112 14929153 15254859 15622035 15970920 16388484 16820136 17346678 17849341
3585A7849341N65764N52561N78489O40791P02715P49943Q12987R31403J019585
3576B4403579J098216J332641J411291J488463J816921K046168K218344K613670
3568C8429293K966859L384697L988604M455271M951894N219376N308308N168829
3560G3873131M786390M022891L212610K182551J198062L20725m02374q95004j099965
3551H7199017j077440o46222o4294M48345Q36771J013075R09172N49725p195p40487
3541H8420467j613983k421343l137910l747467m162572m427342m289672m032228
3533F0587950l743545l361242k923709k485656k124431j820320j445086j147792
3525D1536169p53023m50327k13311l1801j56034l87599q50929j174113j212114
$$ plain form
3585 17849341 18415105 18967666 19546155 20186946 20889661 21639604 22452591 23383994 24403579
3576 24403579 25501795 26834436 28245727 29734190 31551111 33597279 35815623 38429293
3568 38429293 41396152 44780849 48769453 53224724 58176618 63395994 68704302 73873131
3560 73873131 78659521 82682412 85895022 88077573 89275635 89596360 89193986 88298982 87199017
3551 87199017 86121577 85475355 85411061 85859406 86696177 87709252 88618424 89168149 89160954 88420467
3541 88420467 86806484 84385141 81247231 77499764 73337192 68909850 64620178 60587950
3533 60587950 56844405 53483163 50559454 48073798 45949367 44129047 42683961 41536169
3525 41536169 40783146 40332819 40119508 40087707 39931673 39544074 38693145 37519032 36306918
3516C6306918j185790r76123p59539n75883l01255j274J36954J68429P1076J03089
3506C2986602N0238k03700l80691n00330m91509n43458n96769m75069m12090l36614
3496B9096610j70451q3989K15438L01555L03319K50336j7850n20829r30981j121709
3486B7321449j068124r15986q26688n90031l81547l10663j27782l7867j15881
3477B2946880j00325j82590k21120k67433k52301k98354k19249j40215r3746n5099
3467B1116448P2871P6708K14549L66931N13233O28967P51152R12291R43207J045136
3457B6641493R12187P51570P29170O50769M24119K30536J19123P2384o9422j51642
3447C0310287j40062p7639J0009P5515R4265R3535J22575J43803o2887j11534
$$ plain form
3516 36306918 35121128 34145005 33385466 32809583 32508328 32507054 32644008 32812437 32883513 32986602
3506 32986602 33036840 32833140 32452449 31952119 31460610 30917152 30320383 29845314 29433224 29096610
3496 29096610 28926159 28842170 29057608 29359163 29662482 29912818 29894968 29374139 28443158 27321449
3486 27321449 26253325 25337339 24510651 23920620 23539073 23228410 23100628 23062761 22946880
3477 22946880 22846555 22663965 22442845 22175412 21923111 21624757 21405508 21265293 21171547 21116448
3467 21116448 21189319 21266027 21480576 21847507 22360740 22989707 23740859 24653150 25596357 26641493
3457 26641493 27553680 28305250 29034420 29685189 30109308 30339844 30458967 30531351 30461929 30310287
3447 30310287 30170225 30092586 30102595 30178110 30272375 30365910 30488485 30632288 30569401 30457867
3437C0457867k45797m57164n45239o61971p21246p41001p37407o55570o81949
3428B5010523m97407l90645k71649j86063q9352J29694R3057K29695L15923M63899
3418B4807675N77557O41201O78516Q40986Q89778R74764J028660R88176R03930
3409C2331243O87822M08174J93298o0920k95919l61515m76510o71433o74501o07092
3399C0472647o08349n78597l39371k86661j77038j8108j1187P7359J34024L29160
3389B8993879L02765M11771N19757N00838N84536O29040P03596Q60755R10814
3380C4417751Q96103J128968J271189J385419J465036J624937J866749K120533
3372D6176685K360855K708368L077078L489155M170908M672336N443436O269932
$$ plain form
3437 30457867 30212070 29754906 29209667 28547696 27826450 27085449 26348042 25692472 25010523
3428 25010523 24513116 24122471 23850822 23664759 23575407 23705101 23798158 24027853 24343776 24807675
3418 24807675 25385232 26026433 26704949 27545935 28435713 29410477 30439137 31427313 32331243
3409 32331243 33019065 33427239 33620537 33559617 33263698 32902183 32425673 31754240 31079739 30472647
3399 30472647 29864298 29285701 28946330 28659669 28482631 28464523 28453336 28530695 28664719 28993879
3389 28993879 29296644 29708415 30228172 30729010 31313546 31942586 32646182 33506937 34417751
3380 34417751 35313854 36442822 37714011 39099430 40564466 42189403 44056152 46176685
3372 46176685 48537540 51245908 54322986 57812141 61983049 66655385 72098821 78368753
3364G8368753P156777Q178259Q901847R390152R301068Q909509Q086240P102833
3356A45395438O190699N497666M629753L760440K848024J734170P50159O0848
3348A70867197m91781r60245j123133j454267j747218k016441k270754k595726
3340A58207632l101766l709391m455508n117563n678112o303098o778261p013402
3332A16050531p082348o901354o534725o194037n714532n061779m548359m062071
3324F9951326l422333k839265k416026j962377j545660j335976j157288j013759
3316E4258642q16009q21402o97701p37462p13029o09485n52152m97402m80785
3307D8333215l18138k11051j69135j69510j16798N0791M3708J42358K18432L66158
$$ plain form
3364 78368753 85525530 93703789 102605636 111995788 121296856 130206365 138292605 145395438
3356 145395438 151586137 157083803 161713556 165473996 168322020 170056190 170806349 170867197
3348 170867197 170375416 169415171 168292038 166837771 165090553 163074112 160803358 158207632
3340 158207632 155105866 151396475 146940967 141823404 136145292 129842194 123063933 116050531
3332 116050531 108968183 102066829 95532104 89338067 83623535 78561756 74013397 69951326
3324 69951326 66528993 63689728 61273702 59311325 57765665 56429689 55272401 54258642
3316 54258642 53442633 52621231 51923530 51186068 50473039 49863554 49311402 48814000 48333215
3307 48333215 48015077 47804026 47634891 47465381 47348583 47399374 47443082 47585440 47803872 48170030
3297D8170030N02467N68509O91258Q32661R71675J140180J208463J355627J367018
3288E6807888J407210J429679J310288J301597J125713J121209J084998R63935
3280F6552517J122462J177130J269749J513470J719407K103619K590211L148619
3272H1197184L719135M467934N141259O102540P227536Q131988Q881685R591795
3264A34461056J0006515R994409R692130R193209Q496732P469394O326987M964473
3256B00604905L597054K222766J306416Q66173Q95815J227291J704370J957845
3248B14382635K069509K052500J496898Q44005k36696j677152l349602n182147
3240B10399950o841170p971372q649311q990174q783029q295592p634259o950966
$$ plain form
3297 48170030 48672497 49241006 49932264 50764925 51736600 52876780 54085243 55440870 56807888
3288 56807888 58215098 59644777 60955065 62256662 63382375 64503584 65588582 66552517
3280 66552517 67674979 68852109 70121858 71635328 73354735 75458354 78048565 81197184
3272 81197184 84916319 89384253 94525512 100628052 107855588 115987576 124869261 134461056
3264 134461056 144467571 154461980 164154110 173347319 181844051 189313445 195640432 200604905
3256 200604905 204201959 206424725 207731141 208597314 209493129 210720420 212424790 214382635
3248 214382635 216452144 218504644 220001542 220845547 220608851 218931699 215582097 210399950
3240 210399950 203558780 195587408 186938097 177947923 169164894 160869302 153235043 146284077
3232A46284077o218134n544155m834218m214369l690397l145789k773492k367586
3224A13495937k069791j975214j839764j791567j815712j811161j943375k139590
3216I8109763k251200k238933k280944k161800j934559j485501j256590r91532
3208H3508704q10601o67087p07259p59420q72455j157400j548346j768774k057802
3199G3159560k246207k450772k413695k321913k139417k067662j866884j620559
3191E6032451j453270j261791j102463q48322o27504l87779j58201O1736K12705
3182E0467562M82018O42389O26528P56300P10538N88871N48412L98336L67201
3173E5588155J93537k529j43453l10482n05677n96397p25342p34745o48533n61827
$$ plain form
3232 146284077 140065943 134521788 129687570 125473201 121782804 118637015 115863523 113495937
3224 113495937 111426146 109450932 107611168 105819601 104003889 102192728 100249353 98109763
3216 98109763 95858563 93619630 91338686 89176886 87242327 85756826 84500236 83508704
3208 83508704 82698103 82031016 81323757 80564337 79691882 78534482 76986136 75217362 73159560
3199 73159560 70913353 68462581 66048886 63726973 61587556 59519894 57653010 56032451
3191 56032451 54579181 53317390 52214927 51366605 50739101 50351322 50193121 50254857 50467562
3182 50467562 50949580 51591969 52218497 52974797 53685335 54274206 54822618 55220954 55588155
3173 55588155 55781692 55779163 55635710 55325228 54819551 54223154 53497812 52763067 52114534 51552707
3163E1552707n19561m95421m99969l23832l44920l93282m93469n59357o73805
3154D7249091p20104q99874j102696j237555j333030j339028j408106j346398
3146C7862300j380770j294555j247924j241223j174955j001038r31838q10238
3138B8779759o28808n51966m41110m10092l26332l84249k73343j25022r1708J2062
3128B5559191J79156P6275K19982M06904L64748N04749N64764L95960M01861L06355
3118B8979945K70167K88493L60483O14213O86836Q47851R71598R64289J058471
3109C5042346J261836J405321J658444J982617K149691K492401K767738L107297
3101E1867691L593465M050177M359896M624085M906246M912081M822204M776018
$$ plain form
3163 51552707 51033146 50537725 50037756 49713924 49369004 48975722 48482253 47922896 47249091
3154 47249091 46528987 45629113 44526417 43288862 41955832 40616804 39208698 37862300
3146 37862300 36481530 35186975 33939051 32697828 31522873 30521835 29589997 28779759
3138 28779759 28150951 27598985 27157875 26747783 26421451 26037202 25763859 25638837 25547129 25559191
3128 25559191 25738347 25814622 26034604 26441508 26806256 27311005 27875769 28271729 28673590 28979945
3118 28979945 29250112 29538605 29899088 30513301 31200137 32047988 33019586 33983875 35042346
3109 35042346 36304182 37709503 39367947 41350564 43500255 45992656 48760394 51867691
3101 51867691 55461156 59511333 63871229 68495314 73401560 78313641 83135845 87911863
3093H7911863M700545M676527M364243L833204L077375K036183J036223J94262
3085A11830425m07002j008988j690991k315142k973487l331757l681336l950069
3077I2471653m055499m078956l930956l738887l539618l232199k928351k762871
3069F4204316k544041k396868k255905k110876j977188j893970j798249j537754
3061D7689465j342488j088189p73831n07373l45951j67349j3033P454J09938K93477
3051D3862120K89630J76929R0378j98546l83765o91788q81354j024373j252192
3042C9987039j373022j541745j660496j658841j666051j605361j462518j373052
3034B7645953j168046r95621r15591p68391o91334o05381o06186n30147n96340
$$ plain form
3093 87911863 92612408 97288935 101653178 105486382 108563757 110599940 111636163 111830425
3085 111830425 111423423 110414435 108723444 106408302 103434815 100103058 96421722 92471653
3077 92471653 88416154 84337198 80406242 76667355 73127737 69895538 66967187 64204316
3069 64204316 61660275 59263407 57007502 54896626 52919438 51025468 49227219 47689465
3061 47689465 46346977 45258788 44484957 43977584 43631633 43464284 43451251 43458705 43568643 43862120
3051 43862120 44151750 44328679 44419057 44220511 43836746 43144958 42263604 41239231 39987039
3042 39987039 38614017 37072272 35411776 33752935 32086884 30481523 29019005 27645953
3034 27645953 26477907 25482286 24566695 23798304 23106970 22501589 21895403 21365256 20768916
3025B0768916n46966n35570n72209n12361n92602o74894n87120n84604n25826
3016A5636764n40784n04086m25010l07932k72020k88648k90392k82408j66663
3007A2558821k38017k50337k26614k27545k21871j88948j67365j58665j44104
2998A0735355j71951j60879j27308p9266p0372l3024r8521r2709p1669n4645n2390
2987I722621q3009o3156m2013q4253n3230j73984o2074j3231k7324l4112k8600
2976I057635n6349k7348N2865q460o8000p888J2241J5626M6543K5993O6945N6273
2964I166076J30569Q6144J20966P1859M7279J05119N3536O5901n2731O769M4512
2953I845999O9536R7373k2866J0578K3364J4159M7346J06279L6767O7884L8243
$$ plain form
3025 20768916 20221950 19686380 19114171 18601810 18009208 17334314 16747194 16162590 15636764
3016 15636764 15095980 14591894 14166884 13858952 13586932 13298284 13007892 12725484 12558821
3007 12558821 12320804 12070467 11843853 11616308 11394437 11205489 11038124 10879459 10735355
2998 10735355 10563404 10402525 10275217 10195951 10125579 10092555 9994034 9901325 9829656 9775011 9722621
2987 9722621 9639612 9576456 9534443 9450190 9396960 9222976 9160902 9147671 9120347 9086235 9057635
2976 9057635 9001286 8973938 9026803 9018343 8950343 8942455 8954696 8970322 9016865 9042858 9109803 9166076
2964 9166076 9296645 9382789 9503755 9575614 9622893 9728012 9781548 9847449 9794718 9801487 9845999
2953 9845999 9915535 10012908 9990042 10000620 10023984 10038143 10085489 10191768 10228535 10296419 10334662
2942A0334662K2312O6461Q4505Q8127J26485M5386J19879J52056J96333J02899
2932A1339105J74266J47406J09585K19948K91776J89572J78074K14726K28778
2923A3093236K30041K10846K71636L15589M22687L59190M29911L96361L67140
2914A6096637L86291L17066L46568L22243L86296L98191M53774N64965N04621
2905A9776652M39348N00070N60011N89801N34647O23022O22670N61626N37071
2896B4744918N90852N36967N08859N62772O11838O44272O23107O18603O71976
2887C0114164P01565O83150P83390Q54793Q75147R72298J079306J187652J243271
2878C8494736J394513J433877J411781J547890J551356J668252J753622J803469
$$ plain form
2942 10334662 10356974 10423435 10507940 10596067 10722552 10767938 10887817 11039873 11236206 11339105
2932 11339105 11513371 11660777 11770362 11990310 12282086 12471658 12649732 12864458 13093236
2923 13093236 13323277 13534123 13805759 14121348 14544035 14903225 15333136 15729497 16096637
2914 16096637 16482928 16799994 17146562 17468805 17855101 18253292 18707066 19272031 19776652
2905 19776652 20216000 20716070 21276081 21865882 22400529 23023551 23646221 24207847 24744918
2896 24744918 25335770 25872737 26381596 26944368 27556206 28200478 28823585 29442188 30114164
2887 30114164 30815729 31498879 32282269 33137062 34012209 34984507 36063813 37251465 38494736
2878 38494736 39889249 41323126 42734907 44282797 45834153 47502405 49256027 51059496
2870E1059496J924017K061777K118737K353355K439753K463585K686766K847632
2862F9955118K961965L147768L544726M037479M766183N653028O681573P908403
2854A08656243R249871J0668866J2425496J4118849J6028813J8421059K1551613
2847B11120810K5990452L1999447M0272195N0178791N9004430N9795077M3503532
2840E21864734J1198469k2860386m6502044n6210106n4209380m5666748l5205279
2833B72409260k5640283j8098716j2569840q479061n128452k017365J254807M479209
2825B06209559O935370P215923M574540J8818l843025n181229l718010n914M370185
2816B16576217O372110K646579n769278j4200176j9330453k0612779j9041738
$$ plain form
2870 51059496 52983513 55045290 57164027 59517382 61957135 64420720 67107486 69955118
2862 69955118 72917083 76064851 79609577 83647056 88413239 94066267 100747840 108656243
2854 108656243 117906114 128574980 141000476 155119325 171148138 189569197 211120810
2847 211120810 237111262 269110709 309382904 359561695 418566125 478361202 521864734
2840 521864734 533063203 510202817 463700773 407490667 353281287 307614539 272409260
2833 272409260 246768977 228670261 216100421 207621360 202492908 200475543 201730350 206209559
2825 206209559 213144929 220360852 224935392 224954210 221111185 215929956 212211946 212206032 216576217
2816 216576217 222948327 225594906 219825628 205625452 186294999 165682220 146640482
2809A46640482j6213343j3029466j0346648q420274o926049o074439n467198m995936
2801G5167129m395853l972358l512282l183617k928037k583915k422108k250117
2793D9918842k217874k179128k023440j935870j807927j628337j454211j280405
2785C5391650j100182j104224r38228r35619j013980r25438q48632p75206p64600
2776B6985541o72937p02271p01750o43286o40515o42120o45715o34082o87563
2767B1015302o25134o74005o32041n21851n07722n03504n03237m23594l74378
2758A6249836m04528l16533m27425l16970l70874l38079l73019l70743k37155
2749A3094510l51038k51233k53519k37602k90943k90236k81218k34571k82135
$$ plain form
2809 146640482 130427139 117397673 107051025 98630751 91704702 85630263 80163065 75167129
2801 75167129 70771276 66798918 63286636 60103019 57174982 54591067 52168959 49918842
2793 49918842 47700968 45521840 43498400 41562530 39754603 38126266 36672055 35391650
2785 35391650 34291468 33187244 32249016 31313397 30299417 29373979 28525347 27750141 26985541
2776 26985541 26312604 25610333 24908583 24265297 23624782 22982662 22336947 21702865 21015302
2767 21015302 20390168 19716163 19084122 18562271 18054549 17551045 17047808 16624214 16249836
2758 16249836 15845308 15528775 15101350 14784380 14413506 14075427 13702408 13331665 13094510
2749 13094510 12743472 12492239 12238720 12001118 11710175 11419939 11138721 10904150 10622015
2740A0622015k16763k33392k77705k53656k09391k03677k10112k12326k12298
2731H592695j60481j73619k41554j86945j95845j09616j24880j50230j31749j38664
2721F979112j24263m3233p0203p3412j25568p4171q2035n3406l4236l7104o8035
2710F193446n7501j38196l1456r6667j43844j12805j03514k8330L1382j3238j37814
2699E361463n6154J0287O288r2861j17285r4594p1004k4806q4989J2448k0747
2688D828046r8351m5113l5034l8749j17455m2797n1061n7381j12261m7152n6173
2677D126519p8496K5534j123p4473k6620l5308p0187l4358l0213r070R496J2425
2665C814126p7052j37360k5037m1954j07862o6454n2815j77286q8202n4894n0622
$$ plain form
2740 10622015 10405252 10171860 9894155 9640499 9431108 9227431 9017319 8804993 8592695
2731 8592695 8432214 8258595 8017041 7830096 7634251 7524635 7399755 7249525 7117776 6979112
2721 6979112 6854849 6811616 6741413 6668001 6542433 6468262 6386227 6332821 6298585 6261481 6193446
2710 6193446 6135945 5997749 5966293 5869626 5725782 5612977 5509463 5481133 5512515 5499277 5361463
2699 5361463 5305309 5315596 5321884 5229023 5111738 5017144 4946140 4921334 4836345 4848793 4828046
2688 4828046 4729695 4684582 4649548 4610799 4493344 4450547 4399486 4342105 4229844 4182692 4126519
2677 4126519 4048023 4073557 4072434 3997961 3971341 3936033 3865846 3831488 3801275 3792205 3801701 3814126
2665 3814126 3737074 3599714 3574677 3532723 3424861 3358407 3305592 3128306 3040104 2985210 2934588
2654B934588K7559n2691j13500j03064l0310Q7052l1847o6650J6489l3175L3824
2643B668275P3841K1998p8810M1574Q4255k6792r6569p9831k1139l4560j169j1164
2631B539909n2714o806R8679k4268r1282l0834j3179k0507n7889k0102N6055l2428
2619B344634j0839N7371l1839j15756k1999m6065k342P620n1048l3577R757J0179
2607B116096n353N1351L4383M2806J3247K4563l666l2589m1141k0187K963k9081
2595B153392K9566N7387o5115L6987k6357m5715j6156q1650L3759L7478o2207
2584B051369o6688L9395r499N7580J793j5253j2127K0655j2282N3899J529N5425
2572B165796Q2421N0461J0785M0238O9502R4943O3794R0048J65177M8553J93784
$$ plain form
2654 2934588 2962147 2909456 2795956 2692892 2662582 2749634 2717787 2651137 2667626 2634451 2668275
2643 2668275 2742116 2764114 2685304 2726878 2811133 2784341 2687772 2607941 2586802 2552242 2551073 2539909
2631 2539909 2487195 2480389 2579068 2554800 2463518 2432684 2419505 2398998 2341109 2321007 2377062 2344634
2619 2344634 2333795 2391166 2359327 2243571 2221572 2175507 2173165 2180785 2129737 2096160 2105917 2116096
2607 2116096 2110743 2162094 2196477 2239283 2252530 2277093 2273427 2240838 2199697 2179510 2182473 2153392
2595 2153392 2182958 2240345 2175230 2212217 2185860 2140145 2123989 2042339 2076098 2113576 2051369
2584 2051369 1984681 2024076 2014577 2072157 2073950 2058697 2046570 2067225 2054943 2108842 2110371 2165796
2572 2165796 2248217 2298678 2309463 2349701 2419203 2514146 2577940 2667988 2833165 2881718 3075502
2561C075502K11164K52196K30183J79790K42445J4117k12445k47030k49325k69094
2551C227503k78370j21590j40207j04517p573o2943J2194k2883n1734K3245l0465
2540B442660N5938k0881K809j2720j5155K66K0576J0345j6603r79m0865j65873
2528B259518r2279m4892r0471r8557j07838q8453N31k5207n0612j23356k4471
2517A513913k4237n4291L4606o7566n9871o1678P8265k1397m5602o3689o251P9737
2505A301939J5100J6784l9988l4725n4624R092O533j1630k0622k7177l7365O062
2493A129379q5384p2517O2677p3470j5725j1708J3166M2256N782j2173l7009O717
2481I51991L3299j8853K133K8631m5366J5341k6408q864K898p952n37O823k2763
$$ plain form
2561 3075502 3286666 3538862 3769045 3948835 4191280 4205397 3992952 3745922 3496597 3227503
2551 3227503 2949133 2827543 2687336 2582819 2575246 2512303 2524497 2501614 2449880 2473125 2442660
2540 2442660 2498598 2477717 2480526 2467806 2452651 2452917 2473493 2483838 2467235 2466256 2425391 2259518
2528 2259518 2167239 2122347 2031876 1933319 1825481 1737028 1737559 1712352 1661740 1538384 1513913
2517 1513913 1489676 1435385 1469991 1402425 1342554 1280876 1359141 1337744 1292142 1228453 1222202 1301939
2505 1301939 1317039 1333823 1293835 1259110 1204486 1213578 1220111 1208481 1187859 1160682 1123317 1129379
2493 1129379 1043995 971478 1034155 960685 944960 933252 946418 988674 994456 982283 945274 951991
2481 951991 985290 966437 968570 997201 951835 967176 940768 931904 934802 926850 926313 933136 910373
2468I10373J2154R017j9210n9115J9356O0112j5617k7413l1056M855m4869n2686
2456G65901N333L9389j9917K0366L4309j0088j27425M1084L9479M934M0059j3696
2444H19728o2221O6244r833m9921O327Q465P3906j7664l4821k8202o086M0565
2432H06487L6169l4874j5432k431j8709L610j2374j1291j354n126M5376N2123
2420H42174j597J1237o7663j3087n4832M4717j7123k5666J8588K7165j6503n9022
2408F88388j4335j8169J1990l3201K9704k7069k3610K60K5895n5693Q2444J4223
2396F80827n2748m5059k4700R4472R0915o1587n4606P06K7128M0242k6641r8837
2384E70112l196l9746R0967M3663p6397n7150P0357j4390m135P8905N047l5301
$$ plain form
2468 910373 922527 931544 912334 853219 872575 932687 917070 889657 858601 863456 818587 765901
2456 765901 771234 810623 790706 811072 845381 835293 707868 748952 788431 793365 833424 819728
2444 819728 757507 823751 813918 763997 770324 778789 852695 835031 800210 772008 765922 806487
2432 806487 842656 807782 792350 789919 771210 774820 762446 751155 749801 744675 790051 842174
2420 842174 840577 851814 784151 771064 716232 760949 743826 718160 736748 763913 747410 688388
2408 688388 674053 655884 667874 634673 664377 637308 613698 613958 639853 584160 666604 680827
2396 680827 628079 583020 558320 652792 743707 682120 627514 628220 655348 695590 668949 570112
2384 570112 566916 527170 618137 661800 585403 528253 598610 584220 580085 658990 664037 628736
2372F28736l7433J9748m4496l9648P1081O5822J0104r9691p3152K9886N4005p9217
2360E05745l274N4650K5655L693k071m6237k0300n641m3112N9778l7691J4965
2348E06160N4647K3755J0731K6759j6523J3460L183l0172n4650L7398j7787J715
2336E58676J3946N4856L5082n0050n3251J3624O991O4943l0341j0447K8055L1694
2324F63778j8953O3643K2999k8214k6397J5391j10980j6555k6425q944l4596L5198
2312E29945J2302q001m2766p689O1736l5705p634k8109K1130j6734J7794Q358
2300E04627o983j4878l1117l648J2213o9145j5433N5739M0862m9399j3736l9524
2288C69578J8255L7011M0868l2514L7061p7434j569Q0659o8904J7075M77n031
$$ plain form
2372 628736 591303 611051 566555 526907 597988 663810 673914 574223 501071 530957 584962 505745
2360 505745 502471 557121 582776 586469 584398 538161 517861 512220 469108 528886 491195 506160
2348 506160 560807 584562 595293 622052 605529 618989 622172 592000 537350 574748 556961 558676
2336 558676 572622 627478 662560 612510 559259 572883 579874 644817 614476 604029 632084 663778
2324 663778 644825 708468 731467 703253 676856 692247 581267 564712 538287 529343 494747 529945
2312 529945 542247 534246 491480 483791 545527 509822 502188 474079 495209 478475 496269 504627
2300 504627 497644 482766 451649 448001 460214 391069 375636 431375 472237 422838 409102 369578
2288 369578 387833 424844 465712 433198 470259 392825 391256 471915 403011 420086 420563 415532
2276D15532L7429r136O2803n3114j0247n0864k4705L2043n5638j8241M1010N5298
2264D22170J3709j6703K5174O99J4820K7302m7932j8905r6642O8924O3456n5235
2252D00837j8493K0202P033j3602k2102L7737N3066K384n0948q989L322l2396
2240C78051N3910j9449l6824J0998O267k1315k2277j3157N4166k8975L1953l780
2228C89568n4148K6398k5091k9852N2354L1522k139J6866L7994m8118k2030P257
2216C80581J13992K5390q3157k349L1197l0084o0325o478K6904m0709L2288L4296
2204D21546m2097L2919J6048j5830p839k1165j6852K230k1905j7678n942l5519
2192B87916M4444J5414K9258R6147o5606k8845k4023J9519K8282L4528j0321m364
$$ plain form
2276 415532 452961 443825 506628 453514 443267 392403 367698 399741 344103 325862 366872 422170
2264 422170 435879 419176 444350 445049 459869 487171 439239 420334 323692 392616 456072 400837
2252 400837 382344 402546 409579 395977 373875 411612 464678 467062 416114 407125 410447 378051
2240 378051 431961 412512 375688 386686 392953 371638 349361 336204 390370 361395 393348 389568
2228 389568 335420 361818 336727 306875 359229 390751 388612 405478 443472 395354 373324 380581
2216 380581 494573 519963 436806 434457 465654 435570 375245 368767 395671 354962 387250 421546
2204 421546 379449 412368 428416 412586 404747 383582 366730 368960 347055 329377 323435 287916
2192 287916 332360 347774 377032 473179 407573 378728 354705 374224 402506 437034 426713 422349
2180D22349l532K6032j4646q1591l3314N3482k8776O1310L3910O2238j3159K1523
2168E05826l7630j21632M5624N6829k3288M950J8012j2340l9526r534O384O4504
2156D58179L8320r3164L4394J4823j0806N072J6883J1272l009J3774O9935J1655
2144E67328j635k1238n4563l1177O9853k3183K4991L910l786M4179l5174J6874
2132E56379P0383j4622o108J4209k5382N4587J0890m4670M9125J15654l0746q045
2120G41654M1057K2647L7766l9256Q739J5683K6118M9660J8515m0255L2932N6588
2108I71848p0101K5085J0536M6809N7815k0682m2191M2101M5919o611K3607L4585
2096A118720M7174O0101r47K8024O8186k8503M3955Q0435O8893L5284j2288J63610
$$ plain form
2180 422349 418817 444849 430203 348612 315298 368780 340004 401314 435224 497462 484303 505826
2168 505826 468196 346564 392188 449017 425729 430679 448691 436351 396825 387291 393675 458179
2156 458179 496499 403335 437729 452552 441746 446818 463701 474973 471964 485738 555673 567328
2144 567328 565693 544455 489892 458715 528568 505385 530376 534286 530500 574679 539505 556379
2132 556379 626762 612140 606032 620241 594859 649446 660336 615666 664791 780445 749699 741654
2120 741654 782711 805358 843124 803868 812607 828290 854408 904068 922583 882328 915260 971848
2108 971848 901747 926832 937368 984177 1041992 1021310 979119 1021220 1067139 1060528 1084135 1118720
2096 1118720 1165894 1225995 1225048 1253072 1321258 1292755 1336710 1417145 1486038 1521322 1509034 1672644
2084A672644J76237K3967M5963P9795J16451P4476M2045K10483J46457J18538
2074B707056J55301J52044K44412K63720L32229J90577K24023K64592L54292M53527
2064E341773N50082P08944R50114J092796J403566J698261K438139L481499M455371
2055B2120545L460045k86479k263100l579648l730249l009340k385925j586480
2047H739369j236488q76031o87543n80731m31474l05091l14102k09693j93550
2038C904666k44887k54071k69183j31179k29587j61130o7843j67509j09575j12244
2028B157458j35087j21621l1930p5394n2229j11595p6173m0921j2366j12997m0960
2017A346185K9906j20961o1176K2269n6812K0399o853n0708n5880p8643M421j01
$$ plain form
2084 1672644 1848881 1872848 1918811 1998606 2115057 2189533 2231578 2442061 2588518 2707056
2074 2707056 2862357 3014401 3258813 3522533 3854762 4045339 4269362 4533954 4888246 5341773
2064 5341773 5891855 6600799 7550913 8643709 10047275 11745536 14183675 17665174 22120545
2055 22120545 25580590 25294111 23031011 19451363 15721114 12711774 10325849 8739369
2047 8739369 7502881 6626850 5939307 5358576 4927102 4622011 4307909 4098216 3904666
2038 3904666 3659779 3405708 3136525 3005346 2775759 2614629 2546786 2379277 2269702 2157458
2028 2157458 2022371 1900750 1868820 1793426 1741197 1629602 1553429 1512508 1500142 1387145 1346185
2017 1346185 1376091 1255130 1193954 1216223 1159411 1179810 1172957 1122249 1066369 987726 992147 992046
2005I92046k5075o7417m5863j3205j2989J0542q413Q306l0691M186n4520k7317
1993G29590K5454J3203K4833j7899K9847l9767p6301j941J3868j3263o7563J996
1981F22057k6937L8013J7951L8516m8741j6219m5861Q939l4399m9460j9092k055
1969D82712k6958m7609l5901L9982M1321J2554Q1538l8055l8466K9901l4287m5114
1957D21618j0293j4554M4082j3264k4175o1596R5531n6315k4676J49383r566n2566
1945D43609J1502k0638n1903O7441m4053m9120m6635K011k3269P696P8352n3050
1933C21943j652j8285J0185J8911K8804k0061n679l4301j8941q677Q7699k6444
1921C33502k0628J2167j5555K7295j6579j1495K5733p602k196J195o0054J4202
$$ plain form
2005 992046 966971 899554 853691 840486 827497 838039 829626 837932 807241 811427 756907 729590
1993 729590 755044 768247 793080 775181 805028 765261 688960 687019 700887 687624 620061 622057
1981 622057 595120 633133 651084 689600 640859 624640 578779 587718 553319 503859 484767 482712
1969 482712 455754 408145 372244 412226 453547 466101 547639 509584 471118 501019 466732 421618
1957 421618 411325 396771 440853 427589 403414 341818 437349 381034 356358 505741 496175 443609
1945 443609 455111 434473 382570 450011 405958 356838 310203 312214 288945 296641 374993 321943
1933 321943 320291 302006 312191 331102 359906 339845 334166 299865 280924 272247 359946 333502
1921 333502 312874 325041 309486 336781 320202 308707 334440 326838 324642 325837 265783 279985
1909B79985M9021O764l0887j9147N4462k4645r4704J2780J9676l1753L9720K84
1897B61556K8219L262l8443K002k6231j2937j493L0977K7281k8589M2671L1054
1885C19329j2654J5758k8845m003m2092m0182k6241N2330P4188m9059L104j3411
1873B48222k5516L7813K0732k3102L8654l2136m9319m5364K2036K2381K7991J7891
1861B60283J5744l4207N0595J594r211k4392J2053o5650k4504m2910M00N4709
1849A94504N2082K9880j2551p236p7146K1322J6035L3605l1672r16p421K765j6462
1836A96789K6894l320k7532J190L2349J5141p9859N7032J3109p4339M0389L1708
1824B29551j8946L960k1025k0893K5494k1134K0467l8898n6052M4036O1424j8603
$$ plain form
1909 279985 329006 335770 304883 285736 340198 315553 220849 233629 253305 221552 261272 261556
1897 261556 289775 293037 254594 256596 230365 217428 215935 246912 274193 245604 288275 319329
1885 319329 306675 322433 293588 289585 247493 207311 181070 233400 307588 258529 261633 248222
1873 248222 222706 260519 281251 258149 296803 264667 215348 169984 192020 214401 242392 260283
1861 260283 276027 241820 292415 294009 284798 260406 272459 206809 182305 139395 139795 194504
1849 194504 246586 276466 263915 256679 179533 200855 216890 250495 218823 217907 210486 213251 196789
1836 196789 223683 220363 192831 194021 226370 241511 161652 218684 231793 157454 197843 229551
1824 229551 210605 214565 193540 172647 198141 177007 197474 158576 102524 146560 207984 189381
1812A89381O10J7278K9222r7116P801l149K4400k5708M3834j7804k1533J6005
1800A63221p8220N0202J25207l0725k8264l9955K5032J8889L4899l3496L8461
1789B45251M6256M0767l6715O7239M623m0671k981P515n7348k3026m1050l5624
1777A74236O977J3758p768L8162K3574q5223J8508J2999J7302n8377J456M6360
1765B01964o356k4985m8094l1364P9723k3963J8553J5563M6379P3474m7618o9320
1753A83956L7187n2994j4630N33j9085J9428q24k0895L9613J3548n625k6534l6684
1740A16994O9263J1621j0149P3288l22m9735q2265J7385j5116J7706l9569M6156
1728A55257m1434m1966M1182L37r020Q4866K0115k9306L281Q628j807k9233q551
$$ plain form
1812 189381 189991 207269 236491 139375 147176 144027 168427 142719 186553 168749 147216 163221
1800 163221 85001 135203 260410 229685 201421 161466 186498 205387 240286 206790 245251
1789 245251 291507 332274 295559 362798 367421 326750 323769 331284 273936 250910 209860 174236
1777 174236 181213 194971 187203 225365 248939 163716 182224 195223 212525 154148 155604 201964
1765 201964 195608 170623 122529 91165 170888 146925 165478 181041 227420 300894 253276 183956
1753 183956 221143 168149 153519 154052 134967 154395 153571 132676 172289 185837 180212 153678 116994
1740 116994 186257 197878 187729 261017 260695 210960 128695 146080 130964 148670 109101 155257
1728 155257 113823 71857 113039 113376 104356 189222 209337 180031 183312 191940 190133 160900 152349
1715A52349m3726o296L7682P947l8165l5713J10940L618m0054J3131J2680n3221
1703A21172K9819J6424M4181Q370K6230o5742n1106j5030P9368J3576O197Q59
1691B14318m3805J0188K0402j8145j17932P4032J4811k0721K0368K8398n3105
1680A28809K7911K5842L0781n7272l0957n0424o043j2679n300L2442P1803K4682
1668A79595n021k4297R41J2050q498n0113k3300k5895K7264N3075p4948K7932
1656H8785O1521J4374J009P395m8952m8995J6413M1242L8621k4124O7889p2110
1644A43068P930M8432k1029j0660O793n4830K5622l576l5994J7962m9858j5225
1632E8635N261q34P191L4584j7153j0506J0969l4864J3813N9276j04452L6398
$$ plain form
1715 152349 108623 102327 140009 147956 109791 74078 185018 188636 148582 161713 174393 121172
1703 121172 150991 167415 211596 219966 246196 180454 129348 114318 193686 207262 213459 214318
1691 214318 170513 180701 201103 182958 65026 139058 153869 133148 153516 181914 128809
1680 128809 156720 182562 213343 156071 125114 74690 68647 55968 50668 83110 154913 179595
1668 179595 174574 150277 151218 163268 154770 104657 81357 55462 82726 135801 60853 88785
1656 88785 150306 164680 165689 173084 124132 75137 91550 132792 171413 147289 215178 143068
1644 143068 150998 199430 178401 167741 174534 119704 145326 141750 105756 123718 73860 58635
1632 58635 63896 63062 70253 104837 87684 77178 88147 53283 67096 126372 21920 58318
1620E8318M7424L8475J2436r530K981k3308O674J6290k736N29l1006k6630p853
1607H2064J7266L9875o1009L834q3558M6389J3368k5523N3010J3178Q7034m6969
1595A38959q869j751m9919O7969Q681l3323k8366l3331j280k0523l9758J0147
1583H636P6100m1021j7658Q379j471K8013P6390J107J3290p516m6138L9796p6698
1570F1209r209J08705L1130j18200J1278L6287N2063j6749p766n021p3630K1128
1558I1225K7977o8559j7144L2323O648K8416P847K9632o7563k2300L7244J5310
1546A01056J8014j519K3136O32n9847L0554l9196L452O0191j2505M2231M0045
1534B06244q1479l8383Q7633Q756o2522o4222J4322K8021N3425j8612k1039n5311
$$ plain form
1620 58318 105742 144217 156653 147123 150104 126796 133470 149760 147024 147553 116547 89917 82064
1607 82064 99330 139205 78196 82030 -1528 44861 58229 32706 85716 98894 185928 138959
1595 138959 130090 128339 78420 146389 155070 121747 93381 60050 58770 38247 -1511 8636
1583 8636 84736 43715 26057 34436 32965 60978 137368 138475 151765 144249 98111 137907 61209
1570 61209 52000 160705 191835 73635 84913 121200 173263 156514 148748 143727 70097 91225
1558 91225 119202 50643 33499 65822 72470 100886 108733 138365 70802 48502 85746 101056
1546 101056 119070 117551 140687 141319 81472 112026 72830 76282 136473 123968 166199 206244
1534 206244 124765 86382 174015 182771 120249 56027 70349 98370 151795 133183 112144 56833
1522E6833K5677L8690l4752l0459K6808J6197k814J5915j7573L5344L6025n6453
1510A09438r334l284J3017J2017n4301j4536O4618m1761k9103N6098L2543j6757
1498A18655m3108j4430J9000J3515q711R418n3364m7851K9982P4289l3217n6137
1486H041j9618J17031k9310L5432j7238L2939k1912l8722o553P860P417o74m0481
1473C4212m406K832N95q526N0044O907K9790N565O498l3171L464N0826k2575k2104
1459I9951j587M808j3774l7667O163j1467K089n805J06433J7831j54248n9850
1447d7123N0191M8980p878k7604P867O2014l5157j873O148p728j110O8570N964
1434A21261L3725m9394m9503P654O6317R011l550k4635J2656j8939N0147l8921
$$ plain form
1522 56833 82510 121200 86448 55989 82797 98994 96180 112095 94522 129866 165891 109438
1510 109438 100104 96820 109837 121854 67553 53017 117635 75874 46771 102869 135412 118655
1498 118655 75547 61117 80117 93632 84921 94339 40975 -6876 23106 97395 64178 8041
1486 8041 -11577 105454 76144 111576 94338 127277 105365 66643 60090 67950 75367 74693 34212
1473 34212 29806 32638 33233 24707 74751 81658 111448 117013 123511 90340 93804 144630 122055 99951
1459 99951 98364 103172 89398 51731 57894 46427 48516 42711 149144 166975 12727 -47123
1447 -47123 3068 52048 44170 16566 24433 86447 51290 49417 55565 47837 46727 115297 121261
1434 121261 154986 105592 56089 63743 130060 139071 135521 110886 123542 104603 154750 115829
1422A15829n6164j1631L190o7905j5112Q3611P2784l5859O306L1595M5740m3045
1410A29339l0165k9785J1813J9736o1206M2659K9903M577j9110q519J5804j0949
1398I4097R716q4514K8405j8429k1374L1471K1733N1022r442k0009o5037j0793
1386F846N0994j4257j9593j9380M5212L6330M1737k8067M383J4734q0734O171
1374D4376j7044l9306O1855M9400o4910L8785m2350m587K6506K6927M7391q886
1362A18157m5489K0295n6907m5089N3913k3331Q164K7407L485O936k0189K2405
1350F9757j8974q447N606L4890k4182k5747M841L2992o8228J2973P1389j6870
1338G0000j7282J6042j7560m0450O6345j9969j6011K3640N2898j4469m5585j3181
$$ plain form
1422 115829 59665 48034 51224 -16681 -31793 51818 124602 88743 95049 126644 172384 129339
1410 129339 99174 69389 81202 100938 39732 82391 112294 116871 97761 89242 105046 94097
1398 94097 103813 19299 47704 29275 7901 39372 61105 112127 102685 82676 17639 6846
1386 6846 57840 43583 23990 4610 49822 86152 127889 99822 104205 118939 38205 44376
1374 44376 27332 -11974 49881 99281 34371 73156 30806 26219 52725 79652 127043 118157
1362 118157 72668 92963 36056 -9033 44880 21549 29713 57120 60605 67541 47352 69757
1350 69757 50783 42336 47942 82832 58650 32903 37744 70736 2508 15481 86870 70000
1338 70000 52718 68760 51200 10750 77095 57126 41115 64755 117653 103184 57599 44418
1326D4418m7636O456k2572Q0439Q899m3483N098K4068j3285N55l419Q821K9470
1313G7829j1773j8655l0960J2450M0836J0156L3852j1146k0509l0866J4966N8796
1301A24976j7572k1993K5901N3492j7043o9444L2963j8604j9026j4295k0827m3226
1289d698K9385P7975L3268o5579p6079m092j1522M8234J5656r893J7450r07r751
1276C9447M5301j2095J3738J2938k9348j1625m7571l9011K0373M2469n6177j6677
1264c8238Q6658L749j9709r15J2596M6056J6447k0185j6191o2438L1527j2578
1252B6779P7462J1095p2135K206j8237m4255N6648j7721N2206L5646n7897m2463
1240I334K3561J3842K3177J4025N22o9722O9242l0698k4821q49k4501M6802l1257
$$ plain form
1326 44418 -3218 3238 -19334 61105 70004 26521 31619 55687 42402 42957 39538 48359 77829
1313 77829 66056 47401 16441 28891 69727 79883 113735 102589 82080 51214 66180 124976
1301 124976 107404 85411 111312 164804 147761 78317 111280 92676 73650 59355 38528 -4698
1289 -4698 24687 102662 135930 70351 -5728 -9820 -21342 26892 42548 32655 50105 49198 39447
1276 39447 84748 72653 86391 99329 69981 58356 10785 -28226 -7853 34616 -21561 -38238
1264 -38238 48420 52169 32460 31545 44141 90197 106644 86459 70268 7830 39357 26779
1252 26779 104241 115336 43201 45407 27170 -17085 39563 21842 74048 109694 51797 9334
1240 9334 32895 46737 69914 83939 84461 14739 83981 53283 28462 27613 3112 49914 18657
1227A8657j98K397K6348N165J6560k2447K4127j4186L84j4952n4178K8919K912
1214A9508Q1859K5600l7410o7603n5394P5063l2062o9554P7168J8855j06696j1874
1202h2540J03446Q2677k7012r821k229P675q8827r8594Q755J35247j7856K2492
1190C3413J2239Q717K665k3508o7252L1113J4673R485k1843M9684k8837k9424
1178h875j7250k7127M7052k8118L5446M8191p48J8502K7296j1433L084m921o1909
1165A9190q1809j9937l501M3299P1580l827o7124J8551M8009M089K9632l5436
1153B2716L33R455K9164k9542M5179O3911R633n2472p6324O459O015L5831m1114
1140B9244M320j115K7856l8016L4936J6852l1877K8018j5711n5311J1589n2206
$$ plain form
1227 18657 18459 20856 47204 52369 68929 46482 70609 56423 56807 41855 -12323 16596 19508
1214 19508 101367 126967 89557 21954 -33440 41623 9561 -59993 17175 36030 -70666 -82540
1202 -82540 20906 103583 76571 66750 64521 72196 -16631 -115225 -106470 28777 10921 33413
1190 33413 45652 54369 57034 33526 -33726 -2613 12060 21545 -298 49386 20549 -8875
1178 -8875 -26125 -53252 -6200 -34318 1128 49319 48571 67073 94369 82936 86020 81099 19190
1165 19190 -62619 -82556 -86057 -42758 28822 24995 -42129 -23578 24431 28520 58152 22716
1153 22716 23049 32504 61668 32126 77305 141216 150849 98377 22053 28512 34527 70358 29244
1140 29244 33564 32449 60305 22289 57225 74077 42200 70218 54507 -804 10785 -41421
1128d1421K3586j4689L1532M218N3049k1191m3061R692O673J18O5466j4752l1931
1115B7289M0099j2930l8811K841K725n37R158L4569k0482k4663j1362L0023k6547
1102A1372m0662P1521l1297J2812R332M625M1207k7017q489K1233l1399n0052
1090a6814l3206R4696L707M9733L8843n3982j4443J5634o891m6904n722Q18O387
1077C1856J2489N63m3281j0888J0816j1352M8701K6620J8338p9340j8640K6720
1065A2602Q3970p3887l8260L3855J0881j9682o1845J10381k7643n1378K9772j7690
1053h924J5245J3071M519K0748K4550k0967j0734o5954L1413N4647m261M997n9601
1040a251l1106N7673K7067j1911K4535N5203j1533p3567J289m280r2Q079o3809
$$ plain form
1128 -41421 -17835 -32524 -992 3226 56275 35084 -7977 1715 8388 8506 73972 59220 27289
1115 27289 67388 54458 15647 18488 21213 20676 29834 64403 43921 19258 7896 37919 11372
1102 11372 -29290 42231 10934 23746 33078 37703 78910 51893 43404 64637 33238 -16814
1090 -16814 -50020 44676 48383 98116 136959 82977 68534 84168 77277 30373 24651 25469 31856
1077 31856 44345 44908 1627 -9261 1555 -9797 38904 65524 83862 4522 -14118 12602
1065 12602 96572 22685 -15575 18280 29161 9479 -52366 58015 30372 -21006 8766 -8924
1053 -8924 6321 19392 23911 44659 69209 48242 37508 -28446 2967 57614 53353 58350 -1251
1040 -1251 -32357 25316 52383 40472 65007 120210 108677 35110 36399 32119 32027 40106 -23703
1027b3703M8714j9075J1591N2282M2290n3945p4246J1088N8825P154l4380P5929
1015A02524l188j7898q930k376n4985j3841K4799K4854K9638K1508j5706n5836
1003C0563k2712N8591j4616J1266L3606q957m8525o0270N169M5817R698k3122
991A6508j9594L0365l5173o381M147L6811J7840m8722P6125k9035n623J5724K2428
978G5420j4604m9713J8919Q95M011l5394L1999n116l3955N8k5454K5766J9115
965A1947j380m0140j3132O4676m1584K130K6594K138j8406K2308r16N878L5018
952E5131l7707o0919K9416k5121P368K107J4365J8576k3683J8676j5596Q7278
940F9891k8247p3461m8413K4276m3526J7421M8601N0253M1527n4063K4451j6891
$$ plain form
1027 -23703 25011 5936 17527 69809 112099 58154 -16092 -5004 53821 60975 26595 102524
1015 102524 99336 81438 72508 70132 15147 1306 26105 50959 80597 102105 86399 30563
1003 30563 7851 66442 51826 63092 96698 87741 39216 -21054 -15885 29932 39630 16508
991 16508 -3086 27279 -7894 -14275 -10128 26683 44523 -4199 71926 42891 37268 52992 75420
978 75420 60816 11103 30022 30917 34928 -466 31533 26417 -7538 -7480 -32934 -7168 11947
965 11947 10567 -29573 -42705 21971 -19613 -17483 9111 11249 -7157 15151 14235 20113 55131
952 55131 17424 -43495 -14079 -39200 -31832 -29725 -15360 3216 -20467 -1791 -17387 69891
940 69891 41644 -31817 -80230 -55954 -99480 -82059 -33458 16795 58322 4259 28710 11819
928A1819k5284j3400l549j548j507J4111N6837j6876k8572j848L4955m0654m4756
915f0272N5565K2511l0225n0338q849k4873P1553K6671J169M3956l2810q7189
903g3131j3571J4244M4645J7737o825p317O421l366j8317N4847r4733k8511M6578
890f1299K8586O1493k294j7825q909j8266j5842N439K8803J9626q896o719l5017
877c1120n9844R735Q1860K5969M0480j11599l7350N9556o9508L2234R919R223
865d0445L8917K2525l7160M0565J554m8256p795j9493L4064M0984M739J1472M1748
852H3419o5448j4445J2524K2576L57r4791K1773L3179K5473J18k3458k0691K0569
839A155K0775q033k4303m9247j7288J8016J3896n1878K247M9599J8169L5032o746
$$ plain form
928 11819 -13465 -26865 -30414 -31962 -33469 -19358 37479 20603 -7969 -9817 25138 -15516 -60272
915 -60272 -4707 17804 -12421 -62759 -71608 -96481 -24928 1743 2912 46868 14058 -73131
903 -73131 -86702 -72458 -27813 -10076 -16901 -24218 -17797 -21163 -39480 15367 -79366 -107877 -61299
890 -61299 -32713 28780 26486 8661 -248 -18514 -34356 -28917 -114 19512 10616 3897 -31120
877 -31120 -90964 -81229 631 26600 67080 -44519 -81869 -22313 -91821 -59587 -49668 -40445
865 -40445 -1528 20997 -16163 24402 25956 -22300 -30095 -49588 -15524 25460 30199 41671 83419
852 83419 17971 3526 16050 38626 38983 -55808 -34035 -856 24617 24735 1277 -19414 1155
839 1155 21930 13897 -10406 -59653 -76941 -58925 -45029 -96907 -94660 -45061 -26892 8140 1394
826A394R233N950l6823J4954l9858K0996J8795R538m065j4626n8711M1392M5218
813A3387j3749m3989j9056P5271m3100k8150Q5630J2512o3533J0528J3188J3682
801A2621K531n9467L140j765O0107m8386j8201O8231l3904P160L1153l107L274
788B3387l6168o8859N9136K6655M2090k8672o2255N669Q2427j2883Q821l7597
776A751n5647N2710K5979k0730O018n7565q313O7484m089n0804j5785M3748k8170
763d3413L9390k8601o167L8036P598k4572N3753o6286m282O117m0416K7922l981
750d4902l4174k2446P0812L4904O3643J3155j2793p008r1539o679m2370J2631
738f6766P6906O902p6214n4910M1568r050O7440M5546o4872l4543k9521M3459
$$ plain form
826 1394 10627 16577 -20246 -5292 -45150 -24154 -5359 4179 114 -14512 -73223 -31831 13387
813 13387 -362 -44351 -63407 11864 -31236 -59386 26244 38756 -24777 -14249 -1061 12621
801 12621 15152 -44315 -41175 -42940 17167 -31219 -49420 18811 -15093 -7933 23220 20113 23387
788 23387 -12781 -81640 -22504 4151 46241 17569 -44686 -39017 43410 30527 39348 1751
776 1751 -53896 -1186 24793 4063 10081 -47484 -55797 11687 7598 -43206 -58991 -15243 -43413
763 -43413 -4023 -32624 -38791 -755 6843 -17729 36024 -30262 -34544 -28427 -68843 -40921 -44902
750 -44902 -79076 -101522 -30710 4194 67837 80992 68199 61191 -30348 -37027 -79397 -66766
738 -66766 10140 17042 -59172 -114082 -72514 -81564 -14124 31422 -33450 -67993 -97514 -54055
726e4055K7667N557K1403M9659n2781j0508R2376j5287m3594m6562k801o2566
714i1492J6481J1657L6617m6854K5216J9705j5538J5064L5782J3617j8616o1694
702f0055J2666K9384M6215k4702m1912L1635k2928k1590P873o4122P8733L2909
690D106k1519K9435k6020l0147L9530l1310k3338K0217M2807N5403j8568j0896
678B9700l940j4812K3668j589j6737K4842J7410J6142j04339k7046j4554Q6880
666A5625O446N38K540j1786j5090l6593K024R10l556l7051k4137j9905n926O2721
652f3240j4246K7969k7476K743R16q629P1936K6697n5086J7227K6357n134p242
639g208l0852p1638j5494K5282M0893M6842N351l4380m6236K8750K0614M3674
$$ plain form
726 -54055 -26388 -20831 572 50231 -2550 -13058 79318 64031 20437 -26125 -28926 -91492
714 -91492 -75011 -63354 -26737 -73591 -48375 -28670 -44208 -29144 6638 20255 1639 -60055
702 -60055 -47389 -18005 28210 3508 -38404 -6769 -29697 -51287 -43414 -107536 -28803 4106
690 4106 -17413 12022 -13998 -44145 -4615 -35925 -59263 -39046 3761 59164 40596 29700
678 29700 25760 10948 34616 33027 16290 41132 58542 74684 -29655 -56701 -71255 15625
666 15625 22071 22609 25149 13363 -1727 -38320 -36296 -35386 -38942 -75993 -100130 -120035 -125961 -63240
652 -63240 -77486 -49517 -76993 -74250 -73334 -81963 -10027 16670 -38416 -21189 5168 34 -7208
639 -7208 -38060 -109698 -125192 -99910 -59017 -12175 -6824 -41204 -87440 -58690 -38076 5598
627E598N997L3058K780l4458n4191M895k5909Q2852L7333q1705L1063k0129j1002
614b3818l8438N305N0757K5590L4874J1410n1511k2755j6015J5526R652o2217
602f1640L2592m21j1251P3745k5061k1606j1501j8214k2127p5760K5374L330N807
589a06733K8693j6018N994p3226J06826L0274k8052J0981K3150l8297N9826Q397
577A1815o3213j3256l9835j6120K9736R5087n5034m4991L2885p5778l9619O8673
565a09650n1710p152N6943K6174J1104K3135J437n0705J8787J9369k0213n992
553h8473p689N1200N0985K4851k1833l08m433p511j2395k9228K7403n4570J2392
540e9609L6644L5893L1356l6398M2971k2185J9849n3431m192j3702j7576m5752
$$ plain form
627 5598 11595 44653 47433 12975 -41216 -36321 -62230 20622 57955 -23750 7313 -12816 -23818
614 -23818 -62256 -56951 -6194 19396 54270 65680 14169 -8586 -24601 -9075 577 -61640
602 -61640 -29048 -29469 -40720 33025 7964 -13642 -25143 -43357 -65484 -141244 -115870 -112540 -106733
589 -106733 -78040 -94058 -88064 -161290 -54464 -24190 -52242 -41261 -18111 -56408 3418 11815
577 11815 -51398 -64654 -104489 -120609 -90873 4214 -50820 -95811 -62926 -138704 -178323 -109650
565 -109650 -161360 -168512 -111569 -85395 -74291 -51156 -49719 -100424 -81637 -62268 -82481 -88473
553 -88473 -96162 -44962 6023 30874 9041 8733 4300 -3211 -15606 -44834 -17431 -72001 -59609
540 -59609 -22965 12928 44284 7886 50857 28672 48521 -4910 -9102 -22804 -40380 -86132
528h6132J776n657O9311m0324k2139N2297J6717p0250j3193N6110K5106q359k3846
515d8583p1662l559K9286M6119L1199l0023n2853K8007K4268o5032M5606l1582
503i8809j3270M2594k3491L8856J043n5061L5954M6618N7383m6565j9361L3951
491a58r332p1988o9081j5381P3388K9332j1330M1363k5182m1213K5524M8867J995
478b3196O057k282p524L9850k7913M051n564L7669o6575m4745m1868K382J4670
465a14988K8119j8530J1987K1026M6646M6318k388l0604j31043L240Q7491O7959
453A5233J3521j859L653j5254j5903m2101J7571j8304l7782n6446L4157N3920
441d9594K3812m2809Q741n0353j3200M7245k5642m196M3286J7192K9302n088p5764
$$ plain form
528 -86132 -84356 -90013 -20702 -61026 -83165 -30868 -14151 -84401 -97594 -41484 -16378 -24737 -48583
515 -48583 -120245 -123804 -94518 -48399 -17200 -47223 -100076 -72069 -47801 -112833 -67227 -98809
503 -98809 -112079 -69485 -92976 -54120 -53077 -108138 -72184 -25566 31817 -14748 -34109 -158
491 -158 -9490 -81478 -150559 -165940 -92552 -63220 -74550 -33187 -58369 -99582 -74058 -25191 -23196
478 -23196 -17139 -19421 -26945 12905 -15008 -10957 -16521 21148 -45427 -90172 -132040 -129658 -114988
465 -114988 -86869 -105399 -93412 -72386 -25740 20578 18190 -12414 -143457 -140217 -52726 15233
453 15233 28754 26895 30548 15294 -609 -42710 -25139 -43443 -81225 -137671 -103514 -49594
441 -49594 -25782 -68591 -59850 -110203 -123403 -76158 -101800 -105996 -62710 -45518 -16216 -21304 -97068
428i7068N9990k7259R962m6577m3158P6603J111M5174k1086k2748L8931J7946
416h179p976q2409J4480K9591M4503k2629n854M5683j7016k2416M46m0982k0232
403i2990j8517K7672N6587j1623l2331k668O4402m2265k8318J00776M5153m5389
391B0489q1215P7138k7743j4201j2033J1443k7854n34K9812j7392l9217K4634
379e6673k8395m1941R4853K0743k4047j04398J1071Q5927n083M2154j4102m6552
367f6443K0213K5785k4165m560K0053l650J3668m1966q679l2890R5070j9182l6866
354f3612N48p649l0387J4166M2802R069J79m5819K1966j3380m1931k4760L9758
341i9050J9774L6036L1992k7755N581L6057k844r8742l5415J05795k002k6687
$$ plain form
428 -97068 -37078 -64337 -54375 -100952 -144110 -67507 -66396 -21222 -42308 -65056 -26125 -8179
416 -8179 -16155 -98564 -84084 -54493 -9990 -32619 -38473 7210 -9806 -32222 -31776 -72758 -92990
403 -92990 -111507 -83835 -27248 -38871 -71202 -73870 -9468 -51733 -80051 20725 65878 20489
391 20489 -60726 16412 -11331 -25532 -37565 -26122 -53976 -54510 -24698 -42090 -81307 -56673
379 -56673 -85068 -127009 -32156 -11413 -35460 -139858 -128787 -42860 -47943 -5789 -19891 -66443
367 -66443 -46230 -20445 -44610 -49170 -29117 -32767 -19099 -61065 -69744 -102634 -7564 -26746 -63612
354 -63612 -63064 -70713 -101100 -86934 -44132 -35063 -34884 -80703 -58737 -72117 -114048 -138808 -99050
341 -99050 -79276 -43240 -11248 -39003 -33422 2635 -209 -98951 -134366 -28571 -30573 -57260
329e7260k9274k0599M4935J4453N8394l778j5431o3061j5965J6487k1009p734
317i9842K936P088M353K3139J8880L6519J1505n0364o1306r821K2346r858N6449
304d7976p067K5582O4689p305n9512j4743O2880p7292R076J7699n0950M2064M3023
291A68o5544o7213K0076J6882L8844N911j886J2572j9282j9934k7463K7174j5235
278i4930J7873l875M2359r149n2757K1285J7093k878M9833j0735p7391L4737K6612
265d1923j8596j0050l493O2477L9366j9785n6641J0269J5517p525j7578m203p323
252e9488l4139j470P9792k977o8308K0942J3997j191J1259K3840J994k4152k7769
239f7670l7880j7143Q982P1859L8645r49j2951j9482k1351J9242K4414J3479p0554
$$ plain form
329 -57260 -86534 -107133 -62198 -47745 10649 6871 -8560 -71621 -87586 -71099 -92108 -99842
317 -99842 -96906 -89818 -85465 -62326 -43446 -6927 4578 -45786 -107092 -116913 -94567 -104425 -47976
304 -47976 -55043 -29461 35228 27923 -31589 -46332 16548 -60744 -51668 -33969 -84919 -42855 168
291 168 -65376 -132589 -112513 -95631 -56787 -50876 -52762 -40190 -59472 -79406 -106869 -79695 -94930
278 -94930 -77057 -80932 -38573 -47722 -100479 -79194 -62101 -64979 -15146 -25881 -103272 -68535 -41923
265 -41923 -60519 -70569 -74062 -11585 27781 7996 -48645 -38376 -22859 -30384 -47962 -52165 -59488
252 -59488 -93627 -95097 -15305 -18282 -86590 -65648 -51651 -52842 -41583 -17743 -15749 -39901 -67670
239 -67670 -105550 -122693 -113711 -41852 -3207 -4156 -17107 -36589 -57940 -38698 -14284 -805 -71359
226g1359l2098l5350J6826K3437r38K3541m7673l0987K8934R2028j5016l2110
214h0765j3713M0636r2038r094L7707j3706O9289L5468p6188N6000L931k7474
202f9947K3061J1659k5307k130Q8047n6871j27735M7046j505N233M5744l3071
190i5776K8610N6439r1615N450J6581k4946M5933M6229k0043n908q6779K2348
178a03477L0914N019J143k5765K1424p77n377j5013l7377M0151M817J6881N1853
165a5584j9271q306n5613k064J6485K3187k703J1364J4568J3773m6605M335l1917
152i8351j9410m804N2903o253j795M5200L27r4024j6211L433L9720N4035r378
139e4608K68k6836l6953L133L6395M427k9797m8228J1039L7693j2668K090J1164
$$ plain form
226 -71359 -103457 -138807 -121981 -98544 -99482 -75941 -123614 -154601 -125667 -33639 -48655 -80765
214 -80765 -94478 -53842 -145880 -154974 -117267 -130973 -61684 -26216 -102404 -46404 -42473 -69947
202 -69947 -46886 -35227 -60534 -62664 25383 -31488 -159223 -112177 -113682 -108449 -62705 -95776
190 -95776 -67166 -10727 -102342 -96892 -80311 -105257 -59324 -13095 -33138 -39046 -125825 -103477
178 -103477 -72563 -67544 -66401 -92166 -70742 -71519 -76896 -91909 -129286 -89135 -84318 -67437 -15584
165 -15584 -34855 -43161 -98774 -100838 -84353 -61166 -63869 -52505 -37937 -24164 -70769 -66434 -98351
152 -98351 -117761 -122565 -69662 -75915 -77710 -32510 -32183 -126207 -142418 -138985 -99265 -45230 -54608
139 -54608 -54340 -81176 -118129 -114996 -78601 -74174 -103971 -152199 -141160 -103467 -116135 -114045 -102881
126a02881K4652M0681o0069L338K8132K4633l6988l3194J1602j5816K9150R742
114g7018o470j2768O05J3160L4303m657P7255k568l5241o00j4484n5208k2914
101a06605K0976J3667N341l3143K901k6266L4181L68k1538J0119O834K4586l1076
88i9655j3014n771J5402o483j6174M2891j2436J6472l9517m4643N3848p060k6034
75a42174j24L9599o390K9310K1256k9029j773J8024l1882k4610K8493M0791K6308
62c2201m5203j4905M3218l8805O762R445k687P248j073j2493K251K1068k5279
49h2654n2764L5261k7367k031N8844k4586j4875N933j6004j7106O8620r905p906
36h6540J5453Q87n657P452J2849K1269l6201l5581J4459K9018J0638J8460j7426
$$ plain form
126 -102881 -78229 -37548 -97617 -94279 -66147 -41514 -78502 -111696 -100094 -115910 -86760 -77018
114 -77018 -83488 -96256 -95651 -82491 -48188 -52845 24410 21842 -13399 -13999 -28483 -83691 -106605
101 -106605 -85629 -71962 -66621 -99764 -96863 -123129 -88948 -88580 -110118 -99999 -93165 -68579 -99655
88 -99655 -112669 -118440 -103038 -109521 -125695 -82804 -95240 -78768 -118285 -162928 -109080 -116140 -142174
75 -142174 -142298 -102699 -109089 -79779 -58523 -87552 -89325 -71301 -103183 -127793 -99300 -58509 -32201
62 -32201 -77404 -92309 -49091 -87896 -81134 -71689 -74376 -67128 -68201 -80694 -78443 -57375 -82654
49 -82654 -135418 -100157 -127524 -129555 -70711 -95297 -110172 -104239 -120243 -137349 -68729 -78634 -86540
36 -86540 -71087 -70200 -75857 -68405 -55556 -34287 -70488 -106069 -91610 -62592 -51954 -33494 -50920
23e0920M372j2595K2611m2512k3799J8541l3052r041k242n0819N3609J4150k7258
10a38955o893L7092L6591j2514j7490O860l8735k1801M0414K98
0a15133
$$ plain form
23 -50920 -46548 -59143 -36532 -79044 -102843 -84302 -117354 -126395 -128637 -179456 -125847 -111697 -138955
10 -138955 -145848 -108756 -72165 -84679 -102169 -95309 -134044 -155845 -115431 -115133
0 -115133
$$ Imaginary data points
##PAGE= N=2
##DATA TABLE= (X++(I..I)), XYDATA
16383b576909L3021O2857k465K5787K8119O2133L3122j8144O9012L4649J4498
16372b234320J7402N3923n063M2208M4607M0088K3535K7886K9922M5061P5526
16361a839225K7183j6692K3054J224J9409J6835Q4553O761J6312K4537K8802M7852
16349a559395N348J5912M6585L3973J3254N9305M8138j4012J0264Q095L6736M6152
16337a249645J473O3755J7916N4263L6055J4087O6747J9325k0461K2949M3569
16326i29967K3390O9822L6779K2861k4501L6714P7549M956N6248k6548P106K2852
16314f22739K5294P710Q7867L9339K1068j494n884L1775M3398J17K3551K6678
16302c23320N9020p35L2322L5021J6459K6059J3760O760L7326R3728K2384J6414
$$ plain form
16383 -2576909 -2543888 -2481031 -2483496 -2457709 -2429590 -2367457 -2334335 -2352479 -2283467 -2248818 -2234320
16372 -2234320 -2216918 -2162995 -2168058 -2125850 -2081243 -2041155 -2017620 -1989734 -1959812 -1914751 -1839225
16361 -1839225 -1812042 -1828734 -1805680 -1804456 -1785047 -1768212 -1683659 -1676898 -1660586 -1636049 -1607247 -1559395
16349 -1559395 -1554047 -1538135 -1491550 -1457577 -1444323 -1385018 -1336880 -1350892 -1340628 -1332533 -1295797 -1249645
16337 -1249645 -1248172 -1184417 -1166501 -1112238 -1076183 -1062096 -995349 -976024 -996485 -973536 -929967
16326 -929967 -906577 -836755 -799976 -777115 -801616 -764902 -687353 -682397 -626149 -652697 -645591 -622739
16314 -622739 -597445 -589735 -501868 -462529 -441461 -442955 -448839 -417064 -373666 -373549 -349998 -323320
16302 -323320 -264300 -265035 -232713 -197692 -181233 -155174 -141414 -134654 -97328 -3600 18784 35198
16290C5198m6759M510M1985M5008K7402M6723K3372j111O168j8479M9560L9312
16278B52889k0132P0551n678M2186j4255l6127R8168l452O0944Q4157l5967J6201
16266E09485L810L3937k0409J0960M5509K2148j0251Q4723K9700m2260P0319l9054
16254F98617N624O1948M5087L7678l5698n2303j3323N6723M3151L3447J4920j8650
16242H77221J7560L8915l012J5560K1644Q1549L6630j5474K4288j8472J1848M1532
16230A129789k1864O281L3152O6598k1287M92O1044L5576k0235N949K5020l0485
16218A270030J6372O8929L316O797L2074o8754L3939M1541J8108l4483m2255k882
16206A342732N2181J2205M2228K9589n984L786J4527J1767j3717J2084M1527j437
$$ plain form
16290 35198 -11561 -7051 34934 79942 107344 154067 177439 176328 182496 164017 213577 252889
16278 252889 232757 303308 297630 339816 325561 289434 387602 384150 445094 529251 493284 509485
16266 509485 513295 547232 526823 537783 583292 605440 595189 679912 709612 667352 737671 698617
16254 698617 704241 766189 811276 848954 813256 760953 747630 804353 847504 880951 895871 877221
16242 877221 894781 933696 930684 946244 967888 1049437 1086067 1070593 1094881 1076409 1088257 1129789
16230 1129789 1107925 1114206 1147358 1213956 1192669 1193161 1254205 1289781 1269546 1275495 1300515 1270030
16218 1270030 1286402 1355331 1358647 1365444 1397518 1328764 1362703 1404244 1422352 1387869 1345614 1342732
16206 1342732 1394913 1407118 1449346 1478935 1472951 1476737 1491264 1503031 1489314 1501398 1542925 1541488
16194A541488L2502J0180J457m777N5449K6146j9640k584L4404j0785N9353J4579
16182A737772q669L3889n748o7892n295l6923M7420M176k134P4466J5983j5411
16170A771634N1347L5495n341l9626j7052L2320l2459l4546J8714M6962K287K4685
16158A854420j8965J4343J8794L5582M2252R08n1102J4858j671M2042M1582l9981
16146A953062J8660L1208n7451k6764L3849J7844m4481L4168j4671J0816K620
16135A958860k9402N3282M5121q30j7694n6630K0102M1753J0787m4414K5623K5054
16123B031612M5132m8484l042K7712k0418R185p4268M7355J9186L2314n435o5426
16111A995423J4865K9472k2438K5235P5279N3709n2860m1997k6179m3371O3305
$$ plain form
16194 1541488 1573990 1584170 1585627 1580850 1636299 1662445 1642805 1640221 1674625 1663840 1723193 1737772
16182 1737772 1729103 1762992 1757244 1689352 1684057 1647134 1694554 1698730 1696596 1771062 1787045 1771634
16170 1771634 1822981 1858476 1853135 1813509 1796457 1828777 1796318 1761772 1780486 1827448 1829735 1854420
16158 1854420 1835455 1849798 1868592 1904174 1946426 1947334 1896232 1911090 1909419 1951461 1993043 1953062
16146 1953062 1971722 2002930 1945479 1918715 1952564 1970408 1925927 1960095 1945424 1956240 1958860
16135 1958860 1929458 1982740 2027861 2027031 2009337 1952707 1972809 2014562 2025349 1980935 2006558 2031612
16123 2031612 2076744 2028260 2025218 2052930 2032512 2041697 1967429 2014784 2033970 2066284 2060849 1995423
16111 1995423 2010288 2039760 2017322 2042557 2117836 2171545 2118685 2076688 2050509 2007138 2070443
16100B070443J4447n0677l2842O7268L1471k4118n4193k0967Q0160J5332m1693
16089B054631N3381j6059j42m4626K1099K843K4742K2563j02834L0755Q5896L401
16077B135650m0461O1032M7595M9554l7897k1213n6247J5790K5196k8176l8306
16066B112517j8636L3453o593P6961m0652N0665m3965r2037L0721K6398n363q0883
16054B042586P1619Q9846R081K3862n7398m7660K8517j943K246K9704m6803k6570
16042B117087O0228m248L7028J0893Q761J8327l2084m6243j6514l4525Q8588K0645
16030B227943r6711J419J3029M7109J9622m5752M727M832q776n208M40J8020J6716
16017B197410L2708l8745j4337J9675K2721k3699j8243p808K2133k6652J0447
$$ plain form
16100 2070443 2084890 2034213 2001371 2068639 2100110 2075992 2021799 2000832 2080992 2096324 2054631
16089 2054631 2108012 2091953 2091811 2047185 2068284 2071127 2095869 2118432 2015598 2046353 2132249 2135650
16077 2135650 2095189 2156221 2203816 2253370 2215473 2194260 2138013 2153803 2178999 2150823 2112517
16066 2112517 2093881 2127334 2120741 2197702 2157050 2207715 2163750 2071713 2102434 2128832 2123469 2042586
16054 2042586 2114205 2204051 2213132 2236994 2179596 2131936 2160453 2158510 2160756 2190460 2143657 2117087
16042 2117087 2177315 2173067 2210095 2220988 2229749 2248076 2215992 2169749 2153235 2118710 2207298 2227943
16030 2227943 2131232 2132651 2145680 2192789 2212411 2166659 2171386 2176218 2167442 2162234 2162674 2180694 2197410
16017 2197410 2230118 2191373 2177036 2196711 2219432 2195733 2177490 2169682 2191815 2165163 2175610
16006B175610J38927r7778o9959J4783j8261n014J1007J2449R293L2547N8551
15995B262155j05826k7140L1108r283R537Q25L4424m3776q0315K6926P5865K7116
15983B201616J9985n9234L9325m3168L0158Q404L4260P218j16820J5314j8905
15972B118153J4700n4904N0885K2877p187N586N1418K3454J8198k0355k589q6667
15960B133569j0931P5244J4905p735K0276K581k2129m3539j1523j1352M4253n184
15948B178435j0218j1623l7846P1601K5865n0020k0485M3671j1843Q5648j50679
15937B112506j2823P6060O784k5569L5741O1889j2719n3414L7294n4533m1696
15926B129520K1049k6206M7871M7082K0946m0788o7186m9056R6865J3361n3722
$$ plain form
16006 2175610 2314537 2216759 2146800 2161583 2143322 2138308 2149315 2161764 2171057 2203604 2262155
15995 2262155 2156329 2129189 2160297 2151014 2160551 2161376 2195800 2152024 2071709 2098635 2174500 2201616
15983 2201616 2221601 2162367 2201692 2158524 2188682 2197086 2231346 2238564 2121744 2137058 2118153
15972 2118153 2132853 2077949 2128834 2151711 2144524 2150110 2201528 2224982 2243180 2222825 2220236 2133569
15960 2133569 2122638 2197882 2212787 2205052 2225328 2227909 2205780 2162241 2150718 2139366 2183619 2178435
15948 2178435 2168217 2156594 2118748 2190349 2216214 2166194 2145709 2189380 2177537 2263185 2112506
15937 2112506 2099683 2175743 2182527 2156958 2192699 2254588 2241869 2188455 2225749 2171216 2129520
15926 2129520 2150569 2124363 2172234 2219316 2240262 2199474 2132288 2083232 2180097 2193458 2139736
15915B139736m8Q40j312M8131J4555l2647P0647K014j0227j5956j5438k394j3465
15902B184436Q767q181m221K1946k0693o2009L4714L3611K1006J0938r299o809
15890B204206l5450L993J8653k451j5279M8093l0252k6632o606J2506N9317n6764
$$ plain form
15915 2139736 2139688 2140528 2139216 2187347 2201902 2169255 2239902 2241916 2231689 2215733 2200295 2197901 2184436
15902 2184436 2193203 2185022 2180801 2202747 2182054 2120045 2154759 2188370 2209376 2220314 2211015 2204206
15890 2204206 2168756 2172749 2191402 2188951 2173672 2221765 2191513 2164881 2158275 2170781 2230098 2173334
$$ [...]
##END NTUPLES=NMR SPECTRUM
##END=
