##TITLE=1H_CA-9139-2-2
 CDCl3
 8 sc, 
 17.4.2023
##JCAMPDX= 6.0         $$ Bruker NMR JCAMP-DX V2.0
##DATA TYPE= NMR SPECTRUM
##DATA CLASS= NTUPLES
##ORIGIN= UXNMR, Bruker Analytische Messtechnik GmbH
##OWNER= root
$$ XWIN-NMR		Version 3.5
$$ Mon Apr 17 16:14:19 2023 Russian Standard Time (UT+4h)  she@DPX200
##.OBSERVE FREQUENCY= 200.13135
##.OBSERVE NUCLEUS= ^1H
##.ACQUISITION MODE= SIMULTANEOUS
##.ACQUISITION SCHEME= undefined
##.AVERAGES= 8
##.DIGITISER RES= 18
##SPECTROMETER/DATA SYSTEM= spect
##.PULSE SEQUENCE= zg30
##.SOLVENT NAME= CDCl3
##.SHIFT REFERENCE= (INTERNAL, CDCl3, 0, 15.7458)
##AUDIT TRAIL= $$ (NUMBER, WHEN, WHO, WHERE, WHAT)
$$ ##TITLE= Audit trail, XWIN-NMR		Version 3.5
$$ ##JCAMPDX= 5.01
$$ ##ORIGIN= Bruker BioSpin GmbH
$$ ##OWNER= she
$$ F:/spectra/data/she/nmr/H-F/1/pdata/1/auditp.txt
$$ ##AUDIT TRAIL=  $$ (NUMBER, WHEN, WHO, WHERE, WHAT)
(   1,<2023-04-17 16:13:07.81 +0400>,<she>,<DPX200>,
      <created by zg, POWCHK disabled, PULCHK disabled
       configuration hash MD5:
       00 E9 B6 7A A2 85 ED C7 34 08 36 98 17 FE 4E 26
       data hash MD5: 16K
       C3 E7 49 35 9A EA F9 42 9F 86 81 27 3D 20 ED D6>)
(   2,<2023-04-17 16:13:10.96 +0400>,<she>,<DPX200>,
      <Start of raw data processing
       efp BC_mod = 2 LB = 0.24 FT_mod = 6 PKNL = 1 PHC0 = -19990.2 PHC1 = 14.20081 SI = 16K 
       data hash MD5: 16K
       83 03 BF A9 79 E0 DC 74 73 BC F1 D9 1F 2E B0 B3>)
(   3,<2023-04-17 16:13:29.21 +0400>,<she>,<DPX200>,
      <pk PHC0 = 3.702021 PHC1 = -3.8 
       data hash MD5: 16K
       54 28 D4 61 05 2F 6A FF 66 F8 4C 36 B6 6B FE 91>)
(   4,<2023-04-17 16:13:32.71 +0400>,<she>,<DPX200>,
      <abs ABSG = 5 
       data hash MD5: 16K
       24 88 E9 56 66 CF D6 3F E8 FA BB 60 F9 AC 56 E3>)
$$ ##END=
$$ 
$$ hash MD5
$$ 59 7B 50 3A 04 EF 52 01 27 7B 77 7E 71 02 5C 7C
##$RELAX= 
##$RELAX= 
##$RELAX= 
##$RELAX= 
##$RELAX= 
##$RELAX= 
$$ Bruker specific parameters
$$ --------------------------
##$DU= <F:/spectra>
##$EXPNO= 1
##$NAME= <H-F>
##$PROCNO= 1
##$TYPE= <nmr>
##$USER= <she>
##$AMP= (0..31)
100 100 100 100 100 100 100 100 100 100 100 100 100 100 100 100 100 100 
100 100 100 100 100 100 100 100 100 100 100 100 100 100 
##$AQSEQ= 0
##$AQ_mod= 1
##$AUNM= <au_zg>
##$AUTOPOS= <>
##$BF1= 200.13
##$BF2= 200.13
##$BF3= 200.13
##$BF4= 200.13
##$BF5= 200.13
##$BF6= 200.13
##$BF7= 200.13
##$BF8= 200.13
##$BYTORDA= 1
##$CFDGTYP= 0
##$CFRGTYP= 5
##$CHEMSTR= <none>
##$CNST= (0..31)
1 1 145 1 1 1 1 1 1 1 1 1 1 1 1 1 1 1 1 1 1 1 1 1 1 1 1 1 1 1 1 1 
##$CPDPRG= <>
##$CPDPRG1= <>
##$CPDPRG2= <>
##$CPDPRG3= <>
##$CPDPRG4= <mlev>
##$CPDPRG5= <mlev>
##$CPDPRG6= <mlev>
##$CPDPRG7= <mlev>
##$CPDPRG8= <mlev>
##$CPDPRGB= <>
##$CPDPRGT= <>
##$D= (0..31)
0 1.2 0 0 0 0 0 0 0 0.06 0 0.03 0 0 0 0 0.0002 0 0 0 0 0 0 0 0 0 0 0 0 
0 0 0 
##$DATE= 1681733587
##$DBL= (0..7)
120 120 120 120 120 120 120 120 
##$DBP= (0..7)
150 150 150 150 150 150 150 150 
##$DBP07= 0
##$DBPNAM0= <>
##$DBPNAM1= <>
##$DBPNAM2= <>
##$DBPNAM3= <>
##$DBPNAM4= <>
$$ [...]
##$SUBNAM3= <"">
##$SUBNAM4= <"">
##$SUBNAM5= <"">
##$SUBNAM6= <"">
##$SUBNAM7= <"">
##$SUBNAM8= <"">
##$SUBNAM9= <"">
##$SW= 18.05172834244
##$SWIBOX= (0..15)
0 0 2 0 0 0 0 0 0 0 0 0 0 0 0 0 
##$SW_h= 3612.71676300578
##$TD= 16384
##$TD0= 1
##$TE= 0
##$TE2= 300
##$TE3= 300
##$TEG= 300
##$TL= (0..7)
0 120 120 120 120 120 120 120 
##$TP= (0..7)
150 150 150 150 150 150 150 150 
##$TP07= 0
##$TPNAME0= <>
##$TPNAME1= <>
##$TPNAME2= <>
##$TPNAME3= <>
##$TPNAME4= <>
##$TPNAME5= <>
##$TPNAME6= <>
##$TPNAME7= <>
##$TPOAL= (0..7)
0.5 0.5 0.5 0.5 0.5 0.5 0.5 0.5 
##$TPOFFS= (0..7)
0 0 0 0 0 0 0 0 
##$TUNHIN= 0
##$TUNHOUT= 0
##$TUNXOUT= 0
##$USERA1= <user>
##$USERA2= <user>
##$USERA3= <user>
##$USERA4= <user>
##$USERA5= <user>
##$V9= 5
##$VALIST= <valist>
##$VCLIST= <CCCCCCCCCCCCCCC>
##$VD= 0
##$VDLIST= <DDDDDDDDDDDDDDD>
##$VPLIST= <PPPPPPPPPPPPPPP>
##$VTLIST= <TTTTTTTTTTTTTTT>
##$WBST= 1024
##$WBSW= 4
##$XGAIN= (0..3)
0 0 0 0 
##$XL= 0
##$YL= 0
##$YMAX_a= 91015
##$YMIN_a= -59767
##$ZGOPTNS= <>
##$ZL1= 120
##$ZL2= 120
##$ZL3= 120
##$ZL4= 120
##$ABSF1= 15.78986
##$ABSF2= -2.261992
##$ABSG= 5
##$ABSL= 3
##$ALPHA= 0
##$AQORDER= 0
##$ASSFAC= 0
##$ASSFACI= 0
##$ASSFACX= 0
##$ASSWID= 0
##$AUNMP= <proc_1d>
##$AZFE= 0.1
##$AZFW= 0.1
##$BCFW= 0
##$BC_mod= 2
##$BYTORDP= 0
##$COROFFS= 0
##$CY= -3
##$DATMOD= 1
##$DC= 0
##$DFILT= <>
##$DTYPP= 0
##$F1P= 0
##$F2P= 0
##$FCOR= 1
##$FTSIZE= 16384
##$FT_mod= 6
##$GAMMA= 0
##$GB= 0
##$INTBC= 1
##$INTSCL= 3.70164e-10
##$ISEN= 128
##$LB= 0.24
##$LEV0= 0
##$LPBIN= 0
##$MAXI= 10000
##$MC2= 0
##$MEAN= 0
##$ME_mod= 0
##$MI= 1.114404
##$NCOEF= 0
##$NC_proc= -9
##$NLEV= 6
##$NOISF1= 3.799351
##$NOISF2= 2.8
##$NSP= 0
##$NTH_PI= 0
##$NZP= 0
##$OFFSET= 15.74579
##$PC= 1
##$PHC0= -19986.5
##$PHC1= 10.40081
##$PH_mod= 1
##$PKNL= yes
##$PPARMOD= 0
##$PSCAL= 0
##$PSIGN= 0
##$REVERSE= no
##$SF= 200.130005153193
##$SI= 16384
##$SIGF1= 3
##$SIGF2= 2
##$SINO= 5.538805
##$SIOLD= 16384
##$SREGLST= <1H.CDCl3>
##$SSB= 0
##$STSI= 16384
##$STSR= 0
##$SW_p= 3612.71676300578
##$SYMM= 0
##$S_DEV= 0
##$TDeff= 16384
##$TDoff= 0
##$TI= <>
##$TILT= no
##$TM1= 0
##$TM2= 0
##$TOPLEV= 0
##$USERP1= <user>
##$USERP2= <user>
##$USERP3= <user>
##$USERP4= <user>
##$USERP5= <user>
##$WDW= 1
##$XDIM= 16384
##$YMAX_p= 332834234
##$YMIN_p= -1014408
$$ End of Bruker specific parameters
$$ ---------------------------------
##NTUPLES= NMR SPECTRUM
##VAR_NAME=  FREQUENCY,     SPECTRUM/REAL,   SPECTRUM/IMAG
##SYMBOL=    X,             R,               I
##VAR_TYPE=  INDEPENDENT,   DEPENDENT,       DEPENDENT
##VAR_FORM=  AFFN,          ASDF,            ASDF
##VAR_DIM=   16384,         16384,           16384
##UNITS=     HZ,            ARBITRARY UNITS, ARBITRARY UNITS
##FACTOR=    0.220516191357247, 1,           1
##FIRST=     3151.20493935833, 0,            0
##LAST=      -461.511823647449, 0,           0
##MIN=       -461.511823647449, -1014408,    0
##MAX=       3151.20493935833, 332834234,    0
$$ Real data points
##PAGE= N=1
##DATA TABLE= (X++(R..R)), XYDATA
$$ [...]
5707D79977k70940M0976N1947k3253J15337k6413L03359r4857k27223K08952P5270
5696F33132k08740o0520L5836m7130K4502K41502j13528J00780J20810J5331k49211
5685D92764k26218k24159R2250N5811j05971Q8939O6289L1950j54050m5238J73257
5674B45624n0519J07886k06207L5729J60945j4691J67266k67579L6527J32616
5664C47597R4775L5039l9908J49254j02919k3220L67159L0717k03632k02053j00532
5653C52277j93223k9636R2678J79238K75872j48591K6120J16519j15040j67683
5643C88531N9305R855k19849L00106K4739k21999R335K13363J46525j7836m26831
5632B65244o4934J75406j31492l7386J05755L0548Q810K1068J53461J89860j74651
$$ y = [479977, 209037, 250013, 301960, 278707, 394044, 367631, 670990, 576133, 348910, 557862, 633132, 424392, 363872, 399708, 352578, 377080, 618582, 505054, 605834, 726644, 741975, 492764, 266546, 42387, 134637, 190448, 84477, 173416, 239705, 271655, 117605, 72367, 245624, 195105, 302991, 96784, 132513, 293458, 278767, 446033, 178454, 214981, 347597, 442372, 477411, 437503, 586757, 483838, 460618, 827777, 858494, 654862, 452809, 352277, 159054, 129418, 222096, 401334, 677206, 528615, 554735, 671254, 556214, 388531, 447836, 457691, 237842, 537948, 562687, 340688, 350023, 563386, 709911, 692075, 265244, 200310, 375716, 244224, 206838, 312593, 343141, 351951, 373019, 526480, 716340, 541689]
5621E41689P0543K01179k93776j00332j96395j2681O6831L10167J79213r029l0240
5610G27169k36992l9675M1654k50762p9108K60782J85522j03720J34027n1631
5600E87266k41732K4838J15774J95760m6684j04789j20402M1669K25017J83926
5590H60643k04505j68854L7883r2928J3253J2827j87820J79072J85295R4347k5445
5579G03768k6648L183k0799R6642j84629O9550L3307k1222J43580q6263j46272
5568E64197K98559j515p4746J72083j97628P544J8223l07929J09116K00192R94
5557G89090r2532R7796M0441j86257q3445L8006L5324J77509j40081j9875M7173
5546G03149P1294R2249N8804k65709K06045K37282p0517j84548j96963r8257N20894
$$ y = [541689, 612232, 813411, 519635, 419303, 222908, 210227, 277058, 587225, 766438, 757409, 727169, 490177, 450502, 492156, 241394, 162286, 423068, 608590, 504870, 638897, 587266, 345534, 370372, 486146, 681906, 635222, 530433, 410031, 451700, 676717, 860643, 656138, 487284, 525167, 432239, 445492, 458319, 270499, 449571, 634866, 729213, 703768, 677120, 680303, 659504, 756146, 571517, 641067, 674374, 653152, 796732, 710469, 564197, 862756, 861241, 786495, 958578, 760950, 768494, 786717, 478788, 587904, 788096, 789090, 696558, 794354, 834795, 648538, 565093, 603099, 638423, 815932, 675851, 655976, 703149, 774443, 866692, 925496, 659787, 865832, 1103114, 1032597, 848049, 651086, 552829, 1073723]
5535A073723J78287l11081J12108r9685k06195K5069K53204Q2730j03102j34667
5525H70391j7139k12110r1682J70083j1677j82911K95725n295N188Q4942M4399
5514I49914j23076r7129N0283J94300J31425M31914j30494k36854n3570J19607
5504A236320Q2134K1158K2269r7860K8497k19666J61503K33148k27102N3116k73701
5493A019816J6938R315n9839K69377l2789P1273o0121l2285K87380l21783p0077
5482A097205J06763K18711j87423k10507L70566n4243p1290J08606k15645J35022
5472A297765M4545j42725J76214P2764k98305j35934J65469m4806j87268j2842
5462I34877J03029J41500J91309K9395l8888J56607P3290o4663k2734j50171J11662
$$ y = [1073723, 1252010, 940929, 1053037, 953352, 747157, 772226, 1025430, 1108160, 1005058, 870391, 853252, 641142, 549460, 719543, 707866, 524955, 820680, 815385, 820573, 905515, 949914, 826838, 729709, 779992, 974292, 1105717, 1537631, 1407137, 1170283, 1116713, 1236320, 1318454, 1339612, 1361881, 1264021, 1292518, 1072852, 1234355, 1467503, 1240401, 1293517, 1019816, 1036754, 1046069, 986230, 1255607, 1222818, 1294091, 1233970, 1201685, 1489065, 1167282, 1097205, 1203968, 1422679, 1235256, 1024749, 1395315, 1341072, 1269782, 1378388, 1162743, 1297765, 1342310, 1199585, 1375799, 1448563, 1150258, 1014324, 1179793, 1134987, 947719, 934877, 1037906, 1179406, 1370715, 1400110, 1361222, 1517829, 1591119, 1526456, 1503722, 1353551, 1465213]
5451A465213j27480N838K54500L4418J44387O6997N8387o7910N4783J39556Q4370
5440B113059J92394j55294M0519J48108K98240j48918j78779M23186j08436q9621
5430B534458J59339j92566R2307K9555k85724r8498J28165K03926j89390Q5134
5420B466706j60155q2747j74459L9187k1576J91109L76505k41598k21559j74671
5410A996742r9210M995R7940J46355j15876j58880L8226j15656L94671l18276
5400A871031j84430q789J48486k247L04756q9043l47285n5080K23344J67144o7765
5389A960122k7982P0596j39678O9606l7503M3352J17960M4151R1438M9658j01220
5378B140500P1200L4005p2483j89018O311j2136J08827k33480J60837L35688j04422
$$ y = [1465213, 1337733, 1343571, 1598071, 1632489, 1776876, 1843873, 1902260, 1834350, 1889133, 2028689, 2113059, 2305453, 2150159, 2190678, 2338786, 2637026, 2488108, 2309329, 2732515, 2624079, 2534458, 2693797, 2501231, 2593538, 2623093, 2337369, 2238871, 2367036, 2570962, 2381572, 2466706, 2306551, 2223804, 2049345, 2088532, 2066956, 2258065, 2634570, 2392972, 2171413, 1996742, 1897532, 1902527, 2000467, 2146822, 2030946, 1872066, 1910292, 1794636, 2189307, 1871031, 1686601, 1677812, 1826298, 1824051, 2128807, 2039764, 1692479, 1637399, 1860743, 2027887, 1960122, 1932140, 2002736, 1863058, 1932664, 1895161, 1938513, 2056473, 2100624, 2192062, 2241720, 2140500, 2211700, 2245705, 2173222, 1984204, 1990515, 1978379, 2087206, 1853726, 2014563, 2350251, 2245829]
5367B245829J20446J53767K31010k28290k8708J71114j2312L2480N3695Q09J70743
5356B910583j11618m4403K66294J21326l0583J46507Q4273o4105M3289J83527
5346C505090J61371m4813j20742k7213k01347J9311J1580L96158l2285l19229
5336C347881J37251N7510M2635j44917k7206J96998p293J11756j10066j41976
5326C462573K50974J35432K1234M9627J09576L1259J60899q0904K7698K16812
5316D385180J86579j12750k1477K94238M8941k7103k27354j41419J95613j3340
5306D567108p7153P6852j58871N1003L61978j12499m61826K64246N4674o9498
5296D496014r7567j95802k7685K95967M4703J67088J88691j08682k39432M2696
$$ y = [2245829, 2366275, 2520042, 2751052, 2522762, 2494054, 2665168, 2652856, 2685336, 2739031, 2739840, 2910583, 2798965, 2754562, 3020856, 3142182, 3111599, 3258106, 3342379, 3278274, 3321563, 3505090, 3666461, 3621648, 3500906, 3473693, 3272346, 3291657, 3303237, 3699395, 3667110, 3347881, 3485132, 3542642, 3585277, 3440360, 3413154, 3610152, 3602859, 3714615, 3604549, 3462573, 3713547, 3848979, 3870213, 3919840, 4029416, 4060675, 4221574, 4140670, 4168368, 4385180, 4571759, 4459009, 4437532, 4731770, 4780711, 4753608, 4526254, 4384835, 4580448, 4567108, 4489955, 4566807, 4407936, 4458939, 4820917, 4708418, 4246592, 4510838, 4565512, 4496014, 4398447, 4202645, 4174960, 4470927, 4515630, 4682718, 4871409, 4762727, 4523295, 4565991]
5286D565991M235J27231J50828K21566n7478J41676N0481K61311p653J68430r4324
5275E532294K6922j06274k73310k6644Q2501m0624j25391R0019J51069r774k2859
5264E277929l878k6013O5730K30092P7866k12491L14690J31634L33136K56313
5254F445008L38162J14089L47603J18343P3393k16930j52483K23964j07483r8426
5244G085240j75081j33341K01799j7803K00053J99852L99242J02427J76457J35485
5234H174330M63786M87564L99424K06491L36766P31349Q02702O06954Q94986R25875
5224A4030227R21419J261041J403690J704285J325060J354897J52563m61239q35746
5215B0856197j033461j417129j065101p47523p07276n25959J33842P6182p2899
$$ y = [4565991, 4570226, 4697457, 4848285, 5069851, 5012373, 5154049, 5204530, 5465841, 5458188, 5626618, 5532294, 5559216, 5452942, 5179632, 5152988, 5235489, 5194865, 5069474, 5159493, 5310562, 5300788, 5277929, 5274051, 5248038, 5313768, 5543860, 5621726, 5409235, 5723925, 5855559, 6188695, 6445008, 6783170, 6897259, 7244862, 7363205, 7436598, 7219668, 7067185, 7291149, 7183666, 7085240, 6910159, 6776818, 6978617, 6960814, 7160867, 7360719, 7759961, 7862388, 8038845, 8174330, 8638116, 9125680, 9525104, 9731595, 10068361, 10799710, 11602412, 12209366, 13104352, 14030227, 14951646, 16212687, 17616377, 19320662, 20645722, 22000619, 22153182, 21691943, 20856197, 19822736, 18405607, 17340506, 16592983, 15885707, 15359748, 15493590, 15569772, 15496873]
5206A5496873K47913L9751M67277M87974M77962P25305J065144J076225J581615
5197B1666039J819177J407893J895598K223714K733023L196765K795353J620604
5189C9358166l99482k032005l120808l374964l137886k448300j547534j657084
5181B1640103j095782m17927p48139l26807m11367j72223m54287Q9894K51330
5172A8354795J94527M40039N39824N38566O89209Q73085J212529R08600J181865
5163B4933039J266400O47136k62694j168146j186037j530395j708639j197190
5155A9793474r29330p22927m95931l86028k65913R5429K2453m5885q410j42249
5145A6914683J77266L53797K22118L71617O11548N68388K55744K47381K26310
$$ y = [15496873, 15744786, 15784537, 16251814, 16739788, 17217750, 17943055, 19008199, 20084424, 21666039, 23485216, 24893109, 26788707, 29012421, 31745444, 34942209, 37737562, 39358166, 38958684, 36926679, 33805871, 30430907, 27293021, 24844721, 23297187, 21640103, 20544321, 20126394, 19378255, 19051448, 18640081, 18467858, 18013571, 18103465, 18354795, 18549322, 18989361, 19529185, 20067751, 20756960, 21630045, 22842574, 23751174, 24933039, 26199439, 26846575, 26583881, 25415735, 24229698, 22699303, 20990664, 19793474, 18864144, 18141217, 17645286, 17259258, 16993345, 17088774, 17111227, 17065342, 17056932, 16914683, 17091949, 17445746, 17667864, 18039481, 18651029, 19219417, 19475161, 19722542, 19948852]
5136A9948852J82756M62765P03528P42485J262109R24973R83072J461056J612908
5127B8284504J934164K171126K608326L211883M271004N055363O395274O995993
5119F0927637Q144276J0502820J3352172J5648182R933935n227086j3315387j5555852
5111H4410697j4968123j2376143r214749o288257m416165l298273k766734k192414
5103B8889839j897723j659463j420854j211179j558168p77710n96841o30333o36134
5094A8501434n15208p70664q32870n30910l15765j38579k56439j64771l82222
5085A4594006j77958k36037l08449m98422l26732k13500l33113k50169l69726
5076A1879900k61123j02654l94398o4353l5613k64007j98943l22629j44306o0170
$$ y = [19948852, 20131608, 20594373, 21297901, 22040386, 23302495, 24227468, 25210540, 26671596, 28284504, 30218668, 32389794, 34998120, 38210003, 42481007, 47536370, 53931644, 60927637, 69071913, 79574733, 92926905, 108575087, 118509022, 113281936, 99966549, 84410697, 69442574, 57066431, 47851682, 41563425, 37147260, 33848987, 31082253, 28889839, 26992116, 25332653, 23911799, 22700620, 21142452, 20364742, 19767901, 19137568, 18501434, 17986226, 17215562, 16382692, 15851782, 15536017, 15397438, 15140999, 14976228, 14594006, 14416048, 14180011, 13871562, 13373140, 13046408, 12832908, 12499795, 12249626, 11879900, 11618777, 11516123, 11121725, 11057372, 11021759, 10757752, 10558809, 10236180, 10091874, 10031704]
5066A0031704k2096o1882k30653L0744J09826p8802n0772k44176r3641N7737j36950
5055I311039k66981p7251J38936R0376r7521k44837q1776M5042l8386J1303n7788
5044H732156k12148j5660P0475J3867l46415j83114j75260k8304J49189j47729
5034G857057N2747K36715j93870j73689J3420J33008N3864l28685j05912j99320
5024G345335q8822Q6096K71239j9842M8045p2875o6760J52717Q978k42125n5147
5013G366839j3797m04853k90630R8954k01774J914o0666j24805j04586J20843
5003F387439R9182J9668j10367l14762p2257J00615J00530L0169J28782j2228
4993F356771k63690j07458j89062n0186j0600r5456k38339K08368j13510J7833
$$ y = [10031704, 10009608, 9947726, 9717073, 9747817, 9857643, 9778841, 9728069, 9483893, 9390252, 9447989, 9311039, 9044058, 8966807, 9105743, 9196119, 9098598, 8853761, 8771985, 8817027, 8778641, 8789944, 8732156, 8520008, 8504348, 8574823, 8588690, 8242275, 8059161, 7883901, 7855597, 8004786, 7857057, 7909804, 8146519, 7952649, 7778960, 7792380, 7925388, 7979252, 7650567, 7544655, 7345335, 7256513, 7342609, 7613848, 7594006, 7642051, 7569176, 7502416, 7655133, 7664111, 7421986, 7366839, 7353042, 6948189, 6657559, 6756513, 6554739, 6556653, 6495987, 6371182, 6266596, 6387439, 6486621, 6506289, 6395922, 6081160, 6008903, 6109518, 6210048, 6240217, 6368999, 6356771, 6093081, 5985623, 5796561, 5746375, 5735775, 5640319, 5401980, 5610348, 5496838, 5514671]
4983E514671J25296P2198j31101r4095K48483r7475k42827k12397J73667k03085
4973E153335r0431j09253J47419K10551l514N1948j31500o8410N2478o1323k5783
4962E125517o0026K84356j96040j02713P7824L05768o2156l17506j35286p4938
4952D844800l2956P070K56195J53946J51741o5729j29863K29931K19520k39192
4942E395463K42691j99656r3688K67252J57517l5377o2675M05036J32550k69755
4932E939358Q6465M40442p0446R5927K61269J48883K80335N33811K09968J73519
4922H099531M13802L69515K63839J017231R72513L52961J87846k91050p71002
4913A0615186j150442n01389m85379l20136l88701k82394k15258k52381j65993
$$ y = [5514671, 5639967, 5712165, 5581064, 5486969, 5735452, 5637977, 5395150, 5182753, 5356420, 5153335, 5062904, 4953651, 5101070, 5311621, 5308107, 5360055, 5228555, 5160145, 5212623, 5151300, 5125517, 5065491, 5349847, 5153807, 5051094, 5128918, 5434686, 5372530, 5055024, 4919738, 4844800, 4811844, 4818914, 5075109, 5229055, 5380796, 5315067, 5185204, 5415135, 5634655, 5395463, 5638154, 5438498, 5344810, 5612062, 5769579, 5734202, 5671527, 6076563, 6209113, 5939358, 6025823, 6466265, 6395819, 6491746, 6753015, 6901898, 7182233, 7716044, 7926012, 8099531, 8513333, 8882848, 9146687, 10163918, 11136431, 11489392, 11677238, 11386188, 10615186, 9464744, 8963355, 8477976, 8157840, 7769139, 7486745, 7271487, 7019106, 6853113]
4904F853113j07356M6643j73908m7348J31094j74763J34587k2049l20173J89133
4894F508973K17873J08533K7280L8807j13893K32063J90885L42859P8944P5303
4884G707627J85070Q316J7785m65835J84627k8281j41499O7943k25296O7286q1133
4873G296610K00653k0134j08430K54210n9955j63166J86477R4632j21142j39194
4863G420561K31337K82802M87476P2687J07808L07079J48931M76296P28321M54461
4853A0717759j59834P415j97868n92189m20574k68887n9765L479m10756J76244
4843H795024L63319J22970j19026O502m0482j09636N3265j6316l16137o7916J72787
4832H844354J77244k13944P039K66058J97497L56430J90223J24723N1981L07595
$$ y = [6853113, 6745757, 6792400, 6618492, 6571144, 6702238, 6527475, 6662062, 6640013, 6319840, 6508973, 6726846, 6835379, 6862659, 6901466, 6787573, 7019636, 7210521, 7553380, 7632324, 7707627, 7892697, 7901013, 7918798, 7452963, 7637590, 7609309, 7467810, 7535753, 7310457, 7377743, 7296610, 7497263, 7477129, 7368699, 7622909, 7562954, 7399788, 7586265, 7680897, 7559755, 7420561, 7651898, 7934700, 8422176, 8494863, 8602671, 8909750, 9058681, 9534977, 10263298, 10717759, 10557925, 10565340, 10367472, 9775283, 9354709, 9085822, 9026057, 9029536, 8618780, 8795024, 9158343, 9281313, 9162287, 9168789, 9128307, 9018671, 9071936, 9055620, 8739483, 8671567, 8844354, 9021598, 8807654, 8814693, 9080751, 9278248, 9634678, 9824901, 9949624, 10001605, 10309200]
4822A0309200J02011L2410j33846j08145M4813J02324j076j65999j66887j3313
4812A0001492j85779k67944Q8805M1744K0060L3414Q5400k40580j00750Q2227
4802I558089r9388J49448J11739O506j21699K73485O6230j52167M8606L07316
4792A0148165j48426R8181J78120M129J27380L46763l10818p2032L38465J73891
4782A0883818j54526J58853J14419N0859K16829J42312M20381Q7947K25556N75894
4772A2722342M16481K95142L62076L02366O32276N48111P32920Q16715Q10493
4763A7638922N66423O52287M34854L91576O7714J04184k27912j97068o26414m89838
4753A8314728k63375l54664m17363r9022r0400j47367o1934J53168J52632L72835
$$ y = [10309200, 10411211, 10443621, 10309775, 10201630, 10246443, 10348767, 10347691, 10181692, 10014805, 10001492, 9815713, 9547769, 9636574, 9678318, 9698378, 9731792, 9817192, 9576612, 9475862, 9558089, 9458701, 9608149, 9719888, 9726394, 9604695, 9878180, 9944410, 9792243, 9840849, 10148165, 9999739, 10097920, 10276040, 10280169, 10407549, 10754312, 10443494, 10371462, 10709927, 10883818, 10729292, 10888145, 11002564, 11053423, 11270252, 11412564, 11832945, 11920892, 12146448, 12722342, 13138823, 13433965, 13796041, 14098407, 14730683, 15278794, 16011714, 16828429, 17638922, 18205345, 18857632, 19292486, 19684062, 19751776, 19855960, 19628048, 19430980, 18804566, 18314728, 18051353, 17696689, 17279326, 17180304, 17089904, 16942537, 16880603, 17033771, 17186403, 17559238]
4743A7559238L09850L82447Q13918L66702N28761L46475P94596P56292P40789
4734B2599068O69877P61914Q72789P65876Q36006P71410N91657K27727J78326
4725B8274650r0653k24016o97178l93949l48632p16839n50820l53618m69604n75983
4715B3853358p28963m82967n53222l89568m05663m38135k95463m36841k33218
4706A9889318m7881k4588M8818J58461k567K86069J04120L03660L81246O50913
4696B1747569M87181N54042P13799O27067M84978Q2609K14472N7334l35610n43233
4686B4090208r60491q47382o77967j092547r61635o73447q11407n37146n50685
4677A6977501m82020m52513k30999p8026m4592j84091j53939l68102J30597K06994
$$ y = [17559238, 17869088, 18251535, 19065453, 19432155, 19960916, 20307391, 21101987, 21858279, 22599068, 23268945, 24030859, 24903648, 25669524, 26505530, 27276940, 27868597, 28096324, 28274650, 28183997, 27959981, 27262803, 26868854, 26520222, 25803383, 25252563, 24898945, 24429341, 23853358, 23124395, 22641428, 22088206, 21698638, 21292975, 20854840, 20559377, 20122536, 19889318, 19841437, 19816849, 19865667, 20024128, 20021561, 20307630, 20411750, 20715410, 21096656, 21747569, 22234750, 22788792, 23502591, 24129658, 24614636, 24697245, 24911717, 24969051, 24633441, 24090208, 23129717, 22282335, 21604368, 20511821, 19550186, 18876739, 18065332, 17528186, 16977501, 16495481, 16042968, 15811969, 15733943, 15689351, 15505260, 15351321, 14983219, 15113816, 15320810]
4667A5320810k62673J00677j49453j58530q6395j97375k87961j52737j27208N5407
4657A4054562r3651n7757k45872j35190j69051J19497J77185q3492J57312J53561
4647A3877104J35663Q5489K96984L40572N26003L96072L27302Q78207Q22031Q52801
4637A8538228J102687J344913J715239J982558K365237K996920L260990M040111
4629C7346883N441371O119716O365110K356536k993778n708244o689134o439944
4621C5798516n380729m029474l206222k352724j604854j245097j054839r44885
4613A5979692o89102q81192p62146o70186n92713l03082k69606k14527k19855
4604A1377283n47634j35692j84239k5330j91647k33602j81689k16861p9856R7098
$$ y = [15320810, 15058137, 15158814, 15009361, 14850831, 14764436, 14567061, 14279100, 14126363, 13999155, 14054562, 13960911, 13903154, 13657282, 13522092, 13353041, 13472538, 13649723, 13566231, 13723543, 13877104, 14012767, 14098256, 14395240, 14735812, 15261815, 15657887, 15985189, 16863396, 17685427, 18538228, 19640915, 20985828, 22701067, 24683625, 27048862, 30045782, 33306772, 37346883, 42788254, 48907970, 55273080, 57629616, 54635838, 48927594, 42238460, 35798516, 30417787, 26388313, 23182091, 20829367, 19224513, 17979416, 16924577, 15979692, 15290590, 14409398, 13647252, 12977066, 12384353, 12081271, 11811665, 11597138, 11377283, 10829649, 10693957, 10509718, 10484388, 10292741, 10059139, 9877450, 9660589, 9580733, 9677831]
4594I677831o1387L8906l01781k68778j98647j25726o6117m27738J48862j80044
4584H235381k29007k48990l5078K966P8920J1805l51345j49571N1320p4798J27787
4573G419390j3905P6848p3957Q5356j75686J49502J93443j15709j07685l15989
4563G121608j24216r5910n992O6726M9553q7023j8230j8092k30129J31034k054
4552F787275q4348j66974j51847k26187J37129K32511j4044m5477k65072L565
4542F206531J70329m30892l5012n5103k21699J87027n9585K18358j85623k15080
4532E579251j11827l8736K57792j71310r0718J8485l1047R4347j70713j02539
4522E232985r6893q5971Q5822p1271J29875j18385O5764j18004k3923J31324k11068
$$ y = [9677831, 9616444, 9655350, 9353569, 9084791, 8886144, 8760418, 8694301, 8266563, 8415425, 8235381, 8006374, 7757384, 7722306, 7725272, 7804192, 7815997, 7464652, 7315081, 7366401, 7291603, 7419390, 7405485, 7482333, 7408376, 7493732, 7318046, 7467548, 7660991, 7545282, 7437597, 7121608, 6997392, 6901482, 6895490, 6962216, 7011769, 6924746, 6906516, 6888424, 6658295, 6789329, 6787275, 6702927, 6535953, 6384106, 6157919, 6295048, 6527559, 6513515, 6468038, 6202966, 6206531, 6376860, 5945968, 5910956, 5855853, 5634154, 5821181, 5761596, 5979954, 5794331, 5579251, 5467424, 5428688, 5686480, 5515170, 5424452, 5442937, 5411890, 5506237, 5335524, 5232985, 5136092, 5050121, 5135943, 5064672, 5194547, 5076162, 5141926, 5023922, 4999999, 5131323, 4920255]
4511D920255j86022K2613j71628n273P5659n8781J39979l3947M12662J50458j40106
4500E125869l47997j5924o5307j18653Q285J46580L04100j6670J11682J9895k34307
4489D917553K11263J50348R0371j36472p9392r4304k33538Q7421R4670k42670
4479D765250J23180M09268Q9423j67942k93044j01001O3282K8425k86624k44838
4469D385379J0323j03639l1313k89949J35490j28071j48590m3928j48944m05118
4459C231640Q0990J90997K23239N4402k32790J7292m02129P9001r567q9210J69931
4448C313796K39420J03906Q0271k59663K8299P0044j8436K32222M0039q7768j13258
4437C628872M0133m0548n7214j59519j63393k69362N8419J31716q7773L7455j43664
$$ y = [4920255, 4734233, 4756846, 4585218, 4579945, 4655604, 4596823, 4736802, 4702855, 5115517, 5265975, 5125869, 4777872, 4761948, 4696641, 4577988, 4586273, 4732853, 5036953, 5020283, 5131965, 5151860, 4917553, 5128816, 5279164, 5369535, 5233063, 5153671, 5059367, 4825829, 4913250, 5007920, 4765250, 4888430, 5297698, 5387121, 5219179, 4926135, 4825134, 4888416, 4916841, 4630217, 4385379, 4395702, 4292063, 4260750, 3970801, 4106291, 3978220, 3829630, 3785702, 3636758, 3231640, 3312630, 3503627, 3726866, 3781268, 3548478, 3565770, 3163641, 3242642, 3233075, 3143865, 3313796, 3553216, 3657122, 3737393, 3477730, 3506029, 3576073, 3557637, 3789859, 3829898, 3742130, 3628872, 3669005, 3628457, 3571243, 3411724, 3248331, 2978969, 3037388, 3169104, 3081331, 3118786, 2975122]
4426B975122j21951J94358j03184l3208L86547l20973P7207j18764L99431j98821
4416C135764j19372M9646j8764J50582j2825j11462K33606k44465j72913J33735
4406C023532J33944n6529j18176M0094J41766M5518k40009l39708o766L19174
4396B942840Q4695k3958k38112J42881J16878q2831R9256q8522r601R6876m90453
4385B549949L3838Q2668m7114j29630l4100J37338J90183Q9961K25712M6575j4865
4374C130515l22002j40594l83598K78288J54457P3518p142K91656j79048j29860
4364B766190P9693j55224N3888k58992l4622L42661R2453Q0724k5395j48683n5202
4353B737491J0142m15251J4950L98619K63152J07560k29292j22748K029P9442
$$ y = [2975122, 2853171, 3047529, 2944345, 2911137, 3297684, 2976711, 3053918, 2935154, 3334585, 3135764, 3016392, 3066038, 3047274, 3197856, 3185031, 3073569, 3307175, 3062710, 2889797, 3023532, 3157476, 3100947, 2982771, 3022865, 3164631, 3210149, 2970140, 2630432, 2623666, 2942840, 3027535, 3003577, 2765465, 2908346, 3025224, 2942393, 3041649, 2953127, 2943526, 3040402, 2549949, 2583787, 2666455, 2619341, 2489711, 2455611, 2592949, 2783132, 2873093, 3098805, 3145380, 3130515, 2808513, 2667919, 2284321, 2562609, 2717066, 2790584, 2783442, 3075098, 2896050, 2766190, 2845883, 2690659, 2744547, 2485555, 2450933, 2793594, 2886047, 2966771, 2941376, 2792693, 2737491, 2747633, 2332382, 2347332, 2745951, 3009103, 3116663, 2887371, 2764623, 2766652, 2846094]
4343B846094P8695J97593j94333j2925q0779r161O6774J7296J4509P6532k21052
4332B779243j10367K94081K04211J1189l514Q2028p0786o830J48806K9255N8160
4321C415476K29617j85923N9783j0205j77529P6930K52514J20324k18756L43169
4311C905400m6104P8751l2098K21223L07203K02496K10933L25757q4726m8981
4301E039854m9395l46392l80264j03833l49160R059l2309m1519K90145N3276k53463
4290C835999n2727K86763n2484K4108j43118K58103J00925J04058J17950j04488
4280D375089K22314n1723M32784L87690J98302N42068K52333L40772O6845m9778
4270F716696j42785m66377j01532Q9802j05934o93742j34439j6784j62334j99614
$$ y = [2846094, 2924789, 3122382, 2928049, 2915124, 2834345, 2825184, 2891958, 2909254, 2923763, 3000295, 2779243, 2668876, 2962957, 3167168, 3178357, 3174843, 3256871, 3186085, 3179255, 3328061, 3357316, 3415476, 3645093, 3459170, 3518953, 3508748, 3331219, 3408149, 3660663, 3780987, 3562231, 3905400, 3859296, 3938047, 3905949, 4127172, 4434375, 4636871, 4847804, 5173561, 5088835, 5039854, 4990459, 4644067, 4263803, 4159970, 3810810, 3819869, 3787560, 3746041, 4036186, 4089462, 3835999, 3783272, 4070035, 4017551, 4041659, 3898541, 4156644, 4257569, 4361627, 4479577, 4375089, 4597403, 4545680, 4978464, 5366154, 5564456, 6106524, 6358857, 6699629, 6766474, 6716696, 6573911, 6107534, 6006002, 6095804, 5989870, 5296128, 5161689, 5144905, 4982571, 4782957]
4260D782957J29108Q1657Q1342O4329R4756M5826M9808l9237j70518K08662J66608
4249E495298N9664K7479J04005K01491p9256j2716L40469J2182K82841j69901
4239F261556J24661j13793j53197M1477j44994j77948J10157o1355Q1941O4766
4229F033271r2113J83727r4373K8350K39166J99608J53171J17567K27841j02718
4219F893497j5340J27071L49857L18495K28500M99494L15732r0602Q7297L72035
4209I086036m5999j41277J26776O4649O2840l70579K78131J52924K19604L08845
4199I741950K07920K24690M0727M07318M19385J23444K7655K1293J72842R3397
4189A1480621L64357L87008K59638K46283M00074M35675L55689K03218n4856M25344
$$ y = [4782957, 4912065, 4993722, 5075064, 5139393, 5234149, 5279975, 5329783, 5290546, 5120028, 5328690, 5495298, 5554962, 5582441, 5686446, 5887937, 5808681, 5795965, 6136434, 6148616, 6431457, 6261556, 6386217, 6272424, 6119227, 6160704, 6015710, 5837762, 5947919, 5886564, 5968505, 6033271, 5941158, 6124885, 6030512, 6058862, 6298028, 6497636, 6650807, 6768374, 6996215, 6893497, 6878157, 7005228, 7355085, 7673580, 7902080, 8401574, 8717306, 8626704, 8714001, 9086036, 9040037, 8898760, 9025536, 9090185, 9153025, 8782446, 9060577, 9213501, 9433105, 9741950, 9949870, 10174560, 10215287, 10622605, 11041990, 11165434, 11193089, 11214382, 11387224, 11480621, 11844978, 12231986, 12491624, 12737907, 13137981, 13573656, 13929345, 14132563, 14077707, 14503051]
4179A4503051L59742J6607J41983L34871K82033O29736K51313L76830M32630N50275
4169A7879071K12430J87852k30254J1583K47477K2758J19821K13959K50598J95329
4159A9110624M78009Q31011N26418N01333M65021N75378L98702K31673J79811
4150B3297980m1207K28959K54996M27424K72151K89080O98310P23501M57382Q23900
4140B7432476Q20608N23204M39327J83149J6192K17371K3544L86227J24318J34678
4130C0301094K26812L31831P07497L34112K86169M12421P45732P1310l37Q4932
4120C3501573l88689k16428l28312j54166k66860k41164K71668P8240j02731j08945
4110C2044186k8665J41094k39800m28691m53766j75747l39807n11798l69766k43121
$$ y = [14503051, 14862793, 14879400, 15021383, 15356254, 15638287, 16268023, 16519336, 16896166, 17328796, 17879071, 18091501, 18279353, 18049099, 18060682, 18308159, 18330917, 18450738, 18664697, 18915295, 19110624, 19588633, 20419644, 20946062, 21447395, 21912416, 22487794, 22886496, 23118169, 23297980, 23256773, 23485732, 23740728, 24168152, 24440303, 24729383, 25427693, 26151194, 26608576, 27432476, 28253084, 28776288, 29215615, 29398764, 29414956, 29632327, 29655871, 30042098, 30166416, 30301094, 30527906, 30859737, 31567234, 31901346, 32187515, 32599936, 33345668, 33416978, 33416641, 33501573, 33112884, 32896456, 32568144, 32413978, 32147118, 31905954, 32177622, 32255862, 32153131, 32044186, 32015521, 32156615, 31916815, 31488124, 31034358, 30858611, 30518804, 30007006, 29637240, 29394119]
4100B9394119l53921n30617L0778j90102j29891l96736l4237k07674q46483k94528
4090B6440708o04746l72544m0216m20043l92535k13182l10100J22325p9913o7933
4080B4061821L02392j18937P9393P5461K13042J78936m0851j27606j95303l65260
4070B4063088j53707r7519j31003l42190j62893l85279O8568n7266l34649L39174
4060B2806324j54277k28800k5957j11642k31297j46008m6177N20392j57492M3930
4050B2268996k74729q4262J62199j59074l4002k62595K00911Q2577k35199k22117
4040B1442705j6509j87775k11826j97895j05323J3955J12002J40884j6320l6255
4030B0937643J18312j27776l63755k13001k12784r2039l2731k01564j27500j02112
$$ y = [29394119, 29040198, 28509581, 28540359, 28350257, 28220366, 27823630, 27789393, 27581719, 26735236, 26440708, 25835962, 25463418, 25423202, 25003159, 24610624, 24397442, 24087342, 24209667, 24129754, 24061821, 24364213, 24245276, 24324669, 24400130, 24613172, 24792108, 24751257, 24623651, 24428348, 24063088, 23909381, 23811862, 23680859, 23338669, 23175776, 22790497, 22859065, 22801799, 22467150, 22806324, 22652047, 22423247, 22397290, 22285648, 22054351, 21908343, 21862166, 22382558, 22225066, 22268996, 21994267, 21910005, 22072204, 21913130, 21879128, 21616533, 21817444, 21900021, 21664822, 21442705, 21426196, 21238421, 21026595, 20828700, 20723377, 20737332, 20849334, 20990218, 20973898, 20937643, 21055955, 20928179, 20564424, 20351423, 20138639, 20046600, 20013869, 19812305, 19684805, 19582693]
4020A9582693J34899k68982J4321M7747J44899J84497J78586j79066R3452j8706
4010A9914340j41528K86719M6609J56195q6677K9479K75499K36024K84092k1722
4000B0979030j25328J43094k05500k13691J4280l7508l12599N9966J5241j1351
3990B0305634l12739J00278J31981L31426j5042O42975O55663J07262K08768K35291
3980B2391497N86169N85040L75429J41617L36471M53825L2289K13338O86350M04029
3970B6206054L94590M30147L26950J81070L27090J56583l4304K9318j9408r5088
3960B7903002l71878l29268M1284n69809m27986l19184k25874k22823k94844l80847
3950B4801773r0221J04989P3878L5237M5990L60952J92149J54727K54015N34414
$$ y = [19582693, 19717592, 19448610, 19462931, 19510678, 19655577, 19840074, 20018660, 19839594, 19933046, 19914340, 19772812, 20059531, 20106140, 20262335, 20175658, 20205137, 20480636, 20716660, 21000752, 20979030, 20853702, 20996796, 20791296, 20577605, 20591885, 20554377, 20241778, 20301744, 20316985, 20305634, 19992895, 20093173, 20225154, 20556580, 20541538, 21184513, 21840176, 21947438, 22156206, 22391497, 22977666, 23562706, 23938135, 24079752, 24416223, 24870048, 24902337, 25115675, 25802025, 26206054, 26600644, 27030791, 27357741, 27538811, 27865901, 28022484, 27988180, 28017498, 27998090, 27903002, 27531124, 27201856, 27243140, 26673331, 26245345, 25926161, 25700287, 25477464, 25182620, 24801773, 24711552, 24816541, 24890419, 24925656, 24971646, 25332598, 25524747, 25679474, 25933489, 26467903]
3940B6467903N20485L36289K78803M71113L72366M62506J48606N9356N4855L91665
3930B9563947j2689o5360j41071l35471k99980k38308l07478m63363n71070n03610
3920B6625547n14732l76957k66810m20490k7732k7330j06270J2865O9533k9227
3910B4938397J17079k30282L13738K62359K2679o5191O44457M46776K23526M53513
3900B7127051M94314J15159J80711L3819K44894P3390o201j56610l79435j87756
3890B7539336k16770m80190n94239l42334m0294O4792m7548j07231n1733k10874
3880B5512915k01757o96j92188R2754L6646j08176P0068Q6772L20336L64614o5964
3869B5915324N58132L00712R9297L61918K09343J75684K76667l6149K27762L48389
$$ y = [26467903, 26988388, 27324677, 27603480, 28074593, 28446959, 28909465, 29058071, 29117427, 29172282, 29563947, 29551258, 29485898, 29344827, 29009356, 28709376, 28471068, 28163590, 27700227, 27129157, 26625547, 26110815, 25733858, 25467048, 25046558, 25018826, 24991496, 24885226, 24898091, 24967624, 24938397, 25055476, 24825194, 25138932, 25401291, 25423970, 25358779, 26003236, 26450012, 26673538, 27127051, 27621365, 27736524, 27917235, 27951054, 28195948, 28269338, 28263137, 28106527, 27727092, 27539336, 27322566, 26842376, 26248137, 25905803, 25865509, 25930301, 25882753, 25775522, 25723789, 25512915, 25311158, 25310462, 25118274, 25211028, 25247674, 25139498, 25209566, 25296338, 25616674, 25981288, 25915324, 26473456, 26774168, 26873465, 27235383, 27444726, 27620410, 27897077, 27860928, 28088690, 28437079]
3859B8437079K0402Q9741K13294K61634L44764l8952J9980L06517j08360K54721
3849B9800820K21739j16554n215K81981L18665J25342L70391N17125N42411K05076
3839C2261781O14990L17343K87742J86318J14288M46504K55693J79152L50734
3830C5014545L01715M26202L65724L99166M07244M20547P28593R92664J105056
3821D0161456Q05615P24785J171287J156690J213479J216193J433878J506962
3813D9390345J177958J389086J433313J356703J322979J070077P83901N73266
3805E8497628L92363N85773N69659M9605j0959J68338L51612N00299M31238O05429
3795F2140985M56466M94010L39242O2080q1713o20097o40359o63041j497542j417295
$$ y = [28437079, 28457481, 28547222, 28760516, 29022150, 29366914, 29327962, 29347942, 29654459, 29546099, 29800820, 30022559, 29906005, 29900790, 30182771, 30501436, 30626778, 30997169, 31514294, 32056705, 32261781, 32876771, 33194114, 33481856, 33668174, 33782462, 34228966, 34484659, 34663811, 35014545, 35316260, 35742462, 36108186, 36507352, 36914596, 37335143, 38063736, 39056400, 40161456, 40967071, 41691856, 42863143, 44019833, 45233312, 46449505, 47883383, 49390345, 50568303, 51957389, 53390702, 54747405, 56070384, 57140461, 57924362, 58497628, 58889991, 59475764, 60045423, 60095028, 60084069, 60252407, 60604019, 61104318, 61535556, 62140985, 62597451, 63091461, 63430703, 63492783, 63411070, 62790973, 62150614, 61487573, 59990031, 58572736]
3785E8572736j678673j815022j697928j621803j329125j405196j343357j312192
3777D6369440j097229r81947j071031j017812j203540q95475j113756j370695
3769C7617955j125344r27579q27732r70115r66523o60911n67283n99603m12122
3760C0560743m06592m80800k22931k74965l37735l22371j58385j24501k23252
3751B8009211k92652j4457o6791J19139j37471j0464k17144n6433J3402J18266
3741B7464606K45803L53047m6479r0546L14391Q0402n2911J49434J53164K41246
3731B8812157J84426l61547K94582J26195r9801J12169J56296k91871K24620K57331
3721B9414557O9886J11232k39328J06724K95509n6127M04710K89289J80213J26777
$$ y = [58572736, 56894063, 55079041, 53381113, 51759310, 50430185, 49024989, 47681632, 46369440, 45272211, 44290264, 43219233, 42201421, 40997881, 40102406, 38988650, 37617955, 36492611, 35565032, 34737300, 33767185, 32800662, 32139751, 31572468, 30972865, 30560743, 30154151, 29673351, 29450420, 29175455, 28837720, 28515349, 28356964, 28232463, 28009211, 27716559, 27702102, 27635311, 27754450, 27616979, 27606515, 27389371, 27332938, 27346340, 27464606, 27710409, 28063456, 28016977, 27926431, 28240822, 28321224, 28268313, 28417747, 28570911, 28812157, 28996583, 28635036, 28929618, 29055813, 28956012, 29068181, 29224477, 28932606, 29157226, 29414557, 29484443, 29595675, 29356347, 29463071, 29758580, 29702453, 30107163, 30396452, 30576665, 30703442]
3711C0703442J19792L87157J86122J78668L44723O43938L87452L19929Q15000
3702C4086223M52496O47723K84094M65258P37596O34773N88234N80472M30333
3693C8907202M77517L81789M29151L43696L05205J19321K60402p8407K94134J15479
3683D1555489j03416J66040J73532N3639J93635M96111N9524L09777P43505M67310
3673D4115146M44704Q35784P31508P73038R01249R53324O30588P85280O86988
3664E0857609P89119M67372N64679K23956K66128r9191q3860P2029N5534r6939
3654E3016436K1243J96597K15252N07237L34436O27055Q85268R16394R36880J426455
3644E9083253J292169J194376J635435K065663J933695J772288J849894K182613
$$ y = [30703442, 30823234, 31210391, 31396513, 31575181, 31919904, 32563842, 32951294, 33271223, 34086223, 34538719, 35186442, 35470536, 35935794, 36673390, 37308163, 37896397, 38476869, 38907202, 39384719, 39766508, 40195659, 40539355, 40844560, 40963881, 41224283, 41145876, 41440010, 41555489, 41452073, 41618113, 41791645, 41845284, 42038919, 42535030, 42594554, 42904331, 43647836, 44115146, 44559850, 45395634, 46127142, 46900180, 47801429, 48754753, 49385341, 50170621, 50857609, 51646728, 52114100, 52678779, 52902735, 53168863, 53069672, 52985812, 53057841, 53113375, 53016436, 53037679, 53234276, 53449528, 53956765, 54291201, 54918256, 55803524, 56719918, 57656798, 59083253, 60375422, 61569798, 63205233, 65270896, 67204591, 68976879, 70826773, 73009386]
3636G3009386J991860J680190J572992J362108J082114J069834P98171P71673
3628H3338328J167875J089056J399074J234514J655747K116017K339665K397846
3620I6738122K213591J933511J997466J685941J628374J222117P63677M18910
3612A08601709J50900m171J36795k78024l08006L1494j54031j52851q3018m49132
3602A07491665n62318j116462j500667j021224j141310j730927j742379j644311
3594I7032067j742381j436237j699042j828688j466242j422961j229352j513191
3586H4693973j983591j233613j011986j400160r19156j051063r49301p24643q95509
3577G4524951n35753m32359p52642p14319q35075j179188q19571q81726q58532
$$ y = [73009386, 75001246, 76681436, 78254428, 79616536, 80698650, 81768484, 82566655, 83338328, 84506203, 85595259, 86994333, 88228847, 89884594, 92000611, 94340276, 96738122, 98951713, 100885224, 102882690, 104568631, 106197005, 107419122, 108182799, 108601709, 108752609, 108748438, 108885233, 108607209, 108299203, 108330697, 108176666, 108023815, 107940797, 107491665, 106929347, 105812885, 104312218, 103290994, 102149684, 100418757, 98676378, 97032067, 95289686, 93853449, 92154407, 90325719, 88859477, 87436516, 86207164, 84693973, 82710382, 81476769, 80464783, 79064623, 78145467, 77094404, 76145103, 75420460, 74524951, 73989198, 73556839, 72804197, 72089878, 71254803, 70075615, 69256044, 68374318, 67515786]
3568F7515786j138917j215803j081197j359606j099664j040323j262781r43804
3560E8373691p30425q74090j054566p59301p18838n99713o97781n97025l96373
3551E1945579j92819l27134j58803j10782K426k67556j01415o7523l4017k15210
3541E0472746m25916j76979l56912n43031o55998p22980n24283n35217n54843
3532D5976587m75806o98777k57860k49733l77659j88648o147l28496O6556L00169
3522D3760186K54452O8103j04867L69779m9293J61266j2878j33678j17408r5342
3512D4100320J25561N61282K33202l35939J11086J14763k68388K40029n319j55297
3502D4721300l56843o49279j49399j07551k44696n43705n5735l7947j16937j73623
$$ y = [67515786, 66376869, 65161066, 64079869, 62720263, 61620599, 60580276, 59317495, 58373691, 57643266, 56769176, 55714610, 54955309, 54236471, 53636758, 52938977, 52341952, 51945579, 51752760, 51425626, 51266823, 51156041, 51158467, 50890911, 50789496, 50721973, 50687956, 50472746, 50046830, 49869851, 49512939, 48969908, 48313910, 47590930, 47066647, 46531430, 45976587, 45500781, 44802004, 44544144, 44294411, 43916752, 43728104, 43721957, 43393461, 43460017, 43760186, 44014638, 44082741, 43977874, 44347653, 44298360, 44459626, 44446748, 44313070, 44195662, 44100320, 44225881, 44787163, 45020365, 44684426, 44795512, 44910275, 44641887, 44881916, 44876597, 44721300, 44364457, 43715178, 43565779, 43458228, 43213532, 42669827, 42614092, 42576145, 42459208, 42285585]
3492D2285585j6644k17968p1577l4499J5788j25216k96250J92221o423m8693r2731
3481D1583593J6364L54566j68922m35940J39365K97503j51164m57966N4373j05129
3471D1126643m96662n51597j87460j95465n76696n7986l68743l61491o8227Q5108
3461C8347424j78364o9209p4300N3242n197K23205N45699K12646L12379P82802
3451D0150327J182810J308403Q53271R73464J348683J089231J067136J016125
3443D8989450P09497Q00603P28928N19313K76191M81390L17622J02524L4306r0314
3433E2869510l07163j16418j75166k4104J61512n19986k04066k69254l8325l52360
3423E1024180j20018k05643M0442j79825m16159J32N7922m03569k54800o6971
$$ y = [42285585, 42268941, 42050973, 41979396, 41944897, 41960685, 41835469, 41539219, 41731440, 41725017, 41676324, 41583593, 41599957, 41954523, 41785601, 41349661, 41489026, 41786529, 41635365, 41177399, 41231772, 41126643, 40629981, 40078384, 39890924, 39695459, 39118763, 39060777, 38692034, 38330543, 38262316, 38347424, 38169060, 38099851, 38025551, 38078793, 38073596, 38296801, 38842500, 39055146, 39367525, 40150327, 41333137, 42641540, 43494811, 44468275, 45816958, 46906189, 47973325, 48989450, 49698947, 50499550, 51228478, 51747791, 52023982, 52505372, 52822994, 52925518, 52959824, 52869510, 52562347, 52445929, 52270763, 52246659, 52408171, 51888185, 51684119, 51414865, 51376540, 51024180, 50904162, 50698519, 50738961, 50559136, 50142977, 50143109, 50201031, 49797462, 49542662, 49475691]
3413D9475691q4826k05M3159J1210M14664M26348P1167K56199L82140L86328L40737
3402E1722612M09455L46671K87281M37372O50456L37798L43171L98333P34702
3393E5667851P65091R16090R25453J202332R99377J352266J196686J173716J365116
3384F5563978J060490J108978J329654J375556J610007J401896J857508J835641
3376G7143708J451806K050489K039997J924976J968277K098677J911557J935744
3368I2525231J787950J862482K346373K376821K009260J993851K090730K103104
3360A09095802J864821J986043J630649J523049J687320J410549J184856J535277
3352A21918366J441893J022886Q77144O95041O02775N67696P05369N22394K91200
$$ y = [49475691, 49390865, 49390660, 49433819, 49445029, 49859693, 50286041, 50357208, 50613407, 50995547, 51381875, 51722612, 52132067, 52478738, 52766019, 53203391, 53853847, 54191645, 54534816, 54933149, 55667851, 56432942, 57349032, 58274485, 59476817, 60476194, 61828460, 63025146, 64198862, 65563978, 66624468, 67733446, 69063100, 70438656, 72048663, 73450559, 75308067, 77143708, 78595514, 80646003, 82686000, 84610976, 86579253, 88677930, 90589487, 92525231, 94313181, 96175663, 98522036, 100898857, 102908117, 104901968, 106992698, 109095802, 110960623, 112946666, 114577315, 116100364, 117787684, 119198233, 120383089, 121918366, 123360259, 124383145, 125260289, 125955330, 126558105, 127125801, 127831170, 128353564, 128644764]
3343A28644764L88963L92122P28096Q84967J046402J020772R09300J309309J675721
3334A37000416J595375J506967J647331J250649J049015R17275N85916K27524
3326A45780468M1003j56955p29052m14014o03953p37007p35189m49273p07439
3317A41288589p99694p69519j109078r34495j377784j892861j971791j903287
3309A30530080k638245k335973k312708k218060k187616j918385j673584j317903
3301A13927606r72464r52462j236699j152931n36399q44094q63828n71995r35235
3292A05861499q38708o39887m22071n48282k87369o5587n86875m14806m32331
3283A01625583m18597p10134m78447n19151n98495n92284o47147l63039k66736
$$ y = [128644764, 129033727, 129425849, 130153945, 131038912, 132085314, 133106086, 134015386, 135324695, 137000416, 138595791, 140102758, 141750089, 143000738, 144049753, 144967028, 145552944, 145780468, 145821471, 145664516, 144935464, 144521450, 143917497, 143180490, 142445301, 141996028, 141288589, 140488895, 139719376, 138610298, 137675803, 136298019, 134405158, 132433367, 130530080, 127891835, 125555862, 123243154, 121025094, 118837478, 116919093, 115245509, 113927606, 112955142, 112002680, 110765981, 109613050, 109076651, 108232557, 107368729, 106796734, 105861499, 105022791, 104382904, 103960833, 103412551, 103125182, 103059595, 102472720, 102057914, 101625583, 101206986, 100496852, 100018405, 99499254, 98900759, 98308475, 97661328, 97298289, 97031553]
3274I7031553l99721j13269p0152m47089n11207m13099o9778j83026j28378n49754
3264I4146080k35431J06686k13242l25472l08058j26096j62867r3784k39464k71595
3254I2276757o95168l53932l86590m65125L7437j8055k82991M7543K53987K04774
3244I0618637j2768M59590M48425J037083J101157J112470J413283J527123J664953
3235I9369953J647586J282795O63690j431q80944j834815k799520l075862l719493
3226I0651959l388620k891681k398364k475531j630959j479365j211494p78502
3218G4397443q39020n36908l40943k73153J95397N0276J63538k13589O9894N81984
3208G3254919L13248O16365L34088M55209M16464O85931O10451N30176O98383
$$ y = [97031553, 96631832, 96518563, 96448411, 96001322, 95490115, 95077016, 95007238, 94824212, 94695834, 94146080, 93910649, 94017335, 93804093, 93478621, 93170563, 93044467, 92881600, 92787816, 92548352, 92276757, 91581589, 91227657, 90841067, 90375942, 90413379, 90395324, 90112333, 90159876, 90413863, 90618637, 90605869, 91065459, 91513884, 92550967, 93652124, 94764594, 96177877, 97705000, 99369953, 101017539, 102300334, 102964024, 102962593, 102081649, 100246834, 97447314, 94371452, 90651959, 87263339, 84371658, 81973294, 79497763, 77866804, 76387439, 75175945, 74397443, 73558423, 73021515, 72680572, 72407419, 72602816, 72653092, 72816630, 72603041, 72672935, 73254919, 73568167, 74184532, 74518620, 74973829, 75390293, 76076224, 76686675, 77216851, 77915234]
3199G7915234Q24642P45030N93718P96723N79904O97733J147552J101686O17709
3190H5019931J172391J133836P10009J328256J232707J185853J040736J041117
3182I3864836P37846P79202O15443M92805N5678J42635J52279l21128p62570o81677
3172I5075349j168384j349063j451629j592707j432683j636835j653464j770243
3164H3020341k026747j846345j758109k103243k010492j640876j458493j713930
3156F8462106j341432j568910j424413j240795j233718q00414p59772r07328o17302
3147E8568022j040222q92510q97469m39104p93379r64135o12130o10614r03635
3138E1414824p65708r14428m72385j032710p99837o87703o97685o08606j001605
$$ y = [77915234, 78739876, 79484906, 80078624, 80875347, 81455251, 82152984, 83300536, 84402222, 85019931, 86192322, 87326158, 88036167, 89364423, 90597130, 91782983, 92823719, 93864836, 94602682, 95381884, 95997327, 96490132, 96545810, 96688445, 96840724, 96519596, 95757026, 95075349, 93906965, 92557902, 91106273, 89513566, 88080883, 86444048, 84790584, 83020341, 80993594, 79147249, 77389140, 75285897, 73275405, 71634529, 70176036, 68462106, 67120674, 65551764, 64127351, 62886556, 61652838, 60852424, 60092652, 59185324, 58568022, 57527800, 56635290, 55737821, 55298717, 54505338, 53541203, 52929073, 52318459, 51414824, 50649116, 49734688, 49262303, 48229593, 47429756, 46742053, 46044368, 45435762, 44434157]
3129D4434157o83003l33021m01027p78352k91183l07281k80373r2538N4742j79743
3119D1142378o6823j52866j04027k11386J10034j77471J7534q0469J40063J66246
3109D0783213j08985m9199L34090p5422P9874J84849j42169q3325k02202k24948
3099D0495776j42182l54751m13237l11811m17678m02282m02662l07507m54487
3090C7289179m84146n96036k92106p67204o60012n52384p44811j014825n86062
3081C1591593o54605r31115m95944n82608m37818o06649m91816j81840m59585
3072B6749613l17645o10660m66257l24218n63835m31743m30883l95567n97121
3063B2611684k23771m46965j06423m50770j19893o417l49110j14887k29965M5090
$$ y = [44434157, 43751154, 43418133, 43017106, 42238754, 41947571, 41640290, 41359917, 41267379, 41322121, 41142378, 41075555, 40922689, 40818662, 40607276, 40717310, 40539839, 40557373, 40476904, 40616967, 40783213, 40674228, 40625029, 40959119, 40883697, 40963571, 41148420, 41006251, 40922926, 40720724, 40495776, 40353594, 39998843, 39585606, 39273795, 38856117, 38453835, 38051173, 37743666, 37289179, 36805033, 36208997, 35916891, 35149687, 34489675, 33937291, 33192480, 32177655, 31591593, 30936988, 30005873, 29509929, 28927321, 28489503, 27882854, 27391038, 27209198, 26749613, 26431968, 25821308, 25355051, 25030833, 24466998, 24035255, 23604372, 23208805, 22611684, 22387913, 21940948, 21834525, 21383755, 21263862, 21257445, 20908335, 20793448, 20563483, 20608573]
3053B0608573j81327n43059j1051k85765j59614j36040j39527k08354M9267j60863
3043A8832240k00962L50291j8820l3738P8067R7434J03120K7097J18350J18608
3033A9471687j9108K43353J73054k98866k08125j8604j46231o7012Q4753j12201
3023A9102700K33258j8011j29328J28535l7938L07434J12552J92774L4012O20844
3013B0546832M17829k41937J51355L17459J67639J89912J08368L95942Q1733L04193
3003B2439325K64746O51302P62743O62095N90200M93707N28259N53364Q90582
2994B7836323R06427R19525P17395O90131Q97872O94688M76217P56558L96478
2985C4291614L49547R610O01482M55986r5021K78799K16164N20180K99116J93277
$$ y = [20608573, 20427246, 19884187, 19873136, 19587371, 19427757, 19291717, 19152190, 18943836, 18993103, 18832240, 18631278, 18981569, 18962749, 18929011, 19007078, 19104512, 19207632, 19234729, 19353079, 19471687, 19452579, 19695932, 19868986, 19570120, 19361995, 19343391, 19197160, 19130148, 19214901, 19102700, 19335958, 19317947, 19188619, 19317154, 19279216, 19586650, 19699202, 19891976, 19925988, 20546832, 20964661, 20722724, 20874079, 21191538, 21359177, 21549089, 21657457, 22053399, 22135132, 22439325, 22704071, 23355373, 24118116, 24780211, 25370411, 25864118, 26392377, 26945741, 27836323, 28742750, 29662275, 30379670, 31069801, 31967673, 32662361, 33138578, 33895136, 34291614, 34641161, 34650771, 35252253, 35708239, 35613218, 35892017, 36108181, 36628361, 36927477, 37120754]
2975C7120754M82004N55321N94483O18866Q44046J147414J285426J042288J138835
2966D4829437J459791J221049J454787J644326J447614J833605K522374K324143
2958E8737126K541872K587275L033656K988007L146769K981009K781402K699948
2950H1497064K575558K633889L324484L845543M498677M520562L061541J078140
2942A07035458o75035q54425m77738P52134J935304L353264M278427N074400N860232
2933A26282021O239494P486755Q728133Q888633P814219N954574M103559L402523
2925A78899911L772718M660592M782020M088485K763264J802869J652824K039567
2917B04462250K582303L765524N190967O731906Q875105J0373509J2318200J4264587
$$ y = [37120754, 37602758, 38158079, 38752562, 39371428, 40215474, 41362888, 42648314, 43690602, 44829437, 46289228, 47510277, 48965064, 50609390, 52057004, 53890609, 56412983, 58737126, 61278998, 63866273, 66899929, 69887936, 73034705, 76015714, 78797116, 81497064, 84072622, 86706511, 90030995, 93876538, 98375215, 102895777, 105957318, 107035458, 106360423, 105505998, 105028260, 105780394, 107715698, 111068962, 115347389, 120421789, 126282021, 132521515, 140008270, 148736403, 157625036, 165439255, 171393829, 175497388, 178899911, 182672629, 187333221, 192115241, 196203726, 198966990, 200769859, 202422683, 204462250, 207044553, 210810077, 216001044, 222732950, 231608055, 241981564, 254299764, 268564351]
2909B68564351J5414362J3917381J1717781R130934P196241N088241J804943k318841
2901C30515393o590324j0651547j2778063j3027504j2721268j1430268r720291
2894B53596128r012867q655336q435629p835937o937996n653104m794082l309985
2886A98961192k279463n26685Q87209J643164K229378J077937j558232l711885
2878A96722615m245257m667392l832695k440403k016478r71635p22169j517585
2870A76309001j991651k770281k991144k975886l118236l377781m053017m687600
2862A50343405m042225l561531l389432k867539k788139k681207k360700k679834
2854A25972798k975226l277823l587284l939545m430993m128174l841223l920504
$$ y = [268564351, 283978713, 297896094, 309613875, 318744809, 325941050, 331029291, 332834234, 330515393, 323925069, 313273522, 300495459, 287467955, 274746687, 263316419, 253596128, 244583261, 235927925, 227492296, 219656359, 212718363, 207065259, 202271177, 198961192, 196681729, 196155044, 197042253, 198685417, 200914795, 201992732, 200434500, 196722615, 192477358, 187809966, 183977271, 181536868, 179520390, 178548755, 177826586, 176309001, 174317350, 171547069, 168555925, 165580039, 162461803, 159084022, 155031005, 150343405, 146301180, 142739649, 139350217, 136482678, 133694539, 131013332, 128652632, 125972798, 122997572, 119719749, 116132465, 112192920, 107761927, 103633753, 99792530, 95872026]
2846I5872026l821651m111881l643169l705219l240204l013983l035710k755360
2838F8544849k277245k252360k131366j955714j770029j762422j760025j659485
2830E2976203j505945j492467j439413j399805r64392j102588j081448q30390
2822D3159755n32428p18190j001694p40610p98034r47850j059394j198875j201326
2813C4961354j180049j100110j008561j074479o79272o94759p98891q96873r96129
2804B6532231o63064o43576n03080o52331o21669n62997n59961m43016m15308
2795B1467229l12600m79816o17078o59696l65312l68887l54710l24647l28422
2786A7656061m22472m16077k26457j20099p12134p75909k34048J51768j41072
$$ y = [95872026, 92050375, 87938494, 84295325, 80590106, 77349902, 74335919, 71300209, 68544849, 66267604, 64015244, 61883878, 59928164, 58158135, 56395713, 54635688, 52976203, 51470258, 49977791, 48538378, 47138573, 46174181, 45071593, 43990145, 43159755, 42627327, 41909137, 40907443, 40166833, 39368799, 38420949, 37361555, 36162680, 34961354, 33781305, 32681195, 31672634, 30598155, 29918883, 29224124, 28425233, 27528360, 26532231, 25869167, 25225591, 24722511, 24070180, 23448511, 22885514, 22325553, 21882537, 21467229, 21154629, 20674813, 20057735, 19398039, 19032727, 18663840, 18309130, 17984483, 17656061, 17233589, 16817512, 16591055, 16470956, 15758822, 14982913, 14748865, 14900633, 14759561]
2777A4759561k87691k73844l16936l04988k26428l47291l56j60025k15686l90615
2767A2235701n22576l36582j77864j17052J51859o5267k97834m19840k39190K9356
2757A0240711k33207k53875k24493K07372J46554l65156j90230k3530l40796l39685
2747H623665o7723o2054l5020k64268l98500K37407k97280P1208j74823j87067
2737G445545J47317p9311r7846J15748K14321l73760k99786k17763O8358j78585
2727F744238k13359o742N4672n2602K724o3990l57117j81061k18183J4989m545
2716E719024j49734j18968j44753J39215l4080L7233K11156r441R5884q8168r6766
2705E560602r796j72849k28409j6899J15020k0112R4731J9174r8549j64175M4970
$$ y = [14759561, 14471870, 14198026, 13881090, 13576102, 13349674, 13002383, 13002027, 12842002, 12626316, 12235701, 11713125, 11376543, 11198679, 11081627, 11233486, 11168219, 10870385, 10450545, 10211355, 10240711, 10007504, 9753629, 9529136, 9736508, 9883062, 9517906, 9327676, 9304146, 8963350, 8623665, 8555942, 8493888, 8458868, 8194600, 7796100, 8033507, 7736227, 7807435, 7632612, 7445545, 7592862, 7513551, 7415705, 7531453, 7745774, 7372014, 7072228, 6854465, 6922823, 6744238, 6530879, 6524137, 6578809, 6526207, 6528931, 6464941, 6107824, 5926763, 5708580, 5723569, 5719024, 5569290, 5450322, 5305569, 5444784, 5410704, 5447937, 5659093, 5649652, 5745536, 5657368, 5560602, 5550806, 5377957, 5149548, 5132649, 5247669, 5227557, 5322288, 5341462, 5242913, 5078738, 5123708]
2694E123708j15708j35440Q9040J15287j87760J6037J98574k45079l7826l1791
2684D789042l70989K5525J84926o6142K45066J81811j63039p5094j72935k9094
2674D549077l4921N229L46339q0904j95780J0349J54286P2765J33827j74854J94
2663D785607J6806r4579r491J97239j33678j8359J65570p9526j79287K16275N1121
2652D917698P4906K85943O42j25581J95358K66054j3466J57058J13965K2229N9768
2641E954574L62477J19159K2001K17027K25179j30202p3544K87568M7914n5648
2631F976505K3849m819O8110J7048J8521L46220K50241j9203K5404K39548L9698
2620G981122J19954Q3063K95447P8875K07964L45155j28581K07914J11366K72333
$$ y = [5123708, 5008000, 4872560, 4961600, 5076887, 4889127, 4905164, 5103738, 4858659, 4820833, 4789042, 4418053, 4443578, 4628504, 4562362, 4807428, 4989239, 4826200, 4751106, 4578171, 4549077, 4514156, 4519385, 4865724, 4784820, 4589040, 4599389, 4753675, 4826440, 4960267, 4785413, 4785607, 4802413, 4707834, 4698343, 4895582, 4761904, 4743545, 4909115, 4829589, 4650302, 4866577, 4917698, 4992604, 5278547, 5279189, 5153608, 5348966, 5615020, 5601554, 5758612, 5872577, 5894806, 5954574, 6317051, 6436210, 6458211, 6675238, 6900417, 6770215, 6696671, 6984239, 7032153, 6976505, 7000354, 6995535, 7063645, 7080693, 7099214, 7445434, 7695675, 7676472, 7701876, 7941424, 7981122, 8101076, 8184139, 8479586, 8558461, 8766425, 9111580, 8982999, 9190913, 9302279, 9574612]
2610I574612P511J03361J49117K34949o8176p0718o0622K43733J99143p6801j13328
2599A0122781n3071j69666J14582J87733M6672l86269j28236J10192J41692Q340
2589I994750k07570n3310J25838p943K83915K45498m49209r489K84574K59273
2579A0466327K34292L73772K61903L33883L08790N9798o5569Q1773k70663m16962
2569A1367344k43076k92479k33473m317l15635k83222j12015j75283k37975l30394
2559I139475J69094q1724j30392O3708J52450k67860o22786J5402l102j36638
2549H297627j27015J00559K06674o7615j32135J80102K20539P5187N13279K26699
2539I493901j45720k85847k49341j09126k92094l94578l94216j85781l76529l06814
$$ y = [9574612, 9582123, 9685484, 9834601, 10069550, 10001374, 9930656, 9870034, 10113767, 10312910, 10236109, 10122781, 10069710, 9900044, 10014626, 10202359, 10249031, 9862762, 9734526, 9844718, 9986410, 9994750, 9787180, 9733870, 9859708, 9851765, 10135680, 10381178, 9931969, 9922480, 10207054, 10466327, 10700619, 11074391, 11336294, 11670177, 11978967, 12038765, 11973196, 12054969, 11784306, 11367344, 11124268, 10831789, 10598316, 10593999, 10278364, 9995142, 9883127, 9707844, 9469869, 9139475, 9308569, 9226845, 9096453, 9160161, 9312611, 9044751, 8421965, 8437367, 8434265, 8297627, 8170612, 8271171, 8477845, 8410230, 8278095, 8458197, 8678736, 8753923, 9267202, 9493901, 9348181, 9062334, 8812993, 8703867, 8411773, 8017195, 7622979, 7437198, 7060669, 6753855]
2529F753855k23678l44848l44539Q6430J7390M8589o5834l39401j57586k76533
2519E153845k07857K21202l5601J06146k18956j22579m52296k59154J42044J75133
2509D501927o1104J3023j70296k36814K05657m2565p0363R1343k50917l07788
2499C672103k28465J53925P2009k15512j09077j15357j31392j93695j64133k05341
2489B535065j04569J07184R5237k36120r5853j40504J71751n0869j05056n0588
2479B125678K6623k03093r9578R5566R3651q9157M1664o1370j39395J64594L0295
2468A985478n68486J17306M03877O1129j91507k47319K7527j38610j73917j85405
2458A090073M45483J48052j16830j40675j92841J4543J78009J56369K671l61706
$$ y = [6753855, 6530177, 6185329, 5840790, 5927220, 5944610, 5993199, 5927365, 5587964, 5430378, 5153845, 4945988, 5167190, 5131589, 5237735, 5018779, 4896200, 4443904, 4184750, 4326794, 4501927, 4440823, 4453846, 4283550, 4046736, 4252393, 4209828, 4139465, 4230808, 3979891, 3672103, 3443638, 3597563, 3669572, 3454060, 3344983, 3229626, 3098234, 2904539, 2740406, 2535065, 2430496, 2537680, 2632917, 2396797, 2300944, 2160440, 2332191, 2281322, 2176266, 2125678, 2152301, 1949208, 1849630, 1945196, 2038847, 1949690, 1991354, 1929984, 1790589, 1955183, 1985478, 1416992, 1534298, 1938175, 1999304, 1807797, 1560478, 1588005, 1449395, 1275478, 1090073, 1535556, 1683608, 1566778, 1426103, 1233262, 1247805, 1425814, 1582183, 1584854, 1223148]
2448A223148j97460J70032K23019Q6605q9799j32325M7908K10164j53323J53786
2438A541755j56096l66290j80J29870J92416K2731j60335R6972J7262j50428J48438
2427A316115J98734k82222n6704l53792j1190J37572n380K89679k14299J13984
2417A132497N387L8912o3867K5369j84946q4483L03484J285J64656J8834p2325
2406A284803j93772j34544p1311K31175j4645q3841k40158L9691J92018L906j00743
2395I12579j27243Q4537J56112J63531M7929j73171o2239j23711m8862K97421
2385A126883o2096o6860J86924k15564p8889k02911M0553K36337j20237k8661
2375H15479J15461j2029j12200K86488J5953K5895k74910k31117j48028N23539
$$ y = [1223148, 1025688, 1195720, 1418739, 1505344, 1415545, 1283220, 1331128, 1541292, 1387969, 1541755, 1385659, 1019369, 1019189, 1149059, 1341475, 1364206, 1203871, 1300843, 1318105, 1167677, 1316115, 1514849, 1232627, 1175923, 822131, 810941, 948513, 943133, 1232812, 1018513, 1132497, 1137884, 1176796, 1112929, 1138298, 953352, 868869, 1172353, 1173638, 1338294, 1357128, 1284803, 1091031, 956487, 885176, 1116351, 1101706, 1017865, 777707, 817398, 1009416, 1013322, 912579, 785336, 869873, 1025985, 1189516, 1237445, 1064274, 1002035, 878324, 829462, 1126883, 1064787, 997927, 1184851, 969287, 890398, 687487, 728040, 964377, 844140, 815479, 930940, 918911, 806711, 1093199, 1109152, 1135047, 860137, 629020, 480992, 1004531]
2365A004531R262j65853L0097N4054J69690n0716R1876J09759r834j09403j01919
2354A031544j63079j9443k05356J59898J10221j1759n02742l069L33656j42725
2344E87146L5912R3708K47310l05195k9312J53734K00761j76816q5225J65521
2334H87544n7758j1245k53910o472l1637J8625N3948J33409k9898l7994q9548
2323E75064O1511j52525q042J39160m643J43149J4838J24145k22718N6364k14447
2312E11856j28163l8752K51811N448n1736K91687j26275Q2657J10377j64932k22344
2301E21634j89190J35545M9661O6526j86095J65044N6564j43876j72096J06094
2291D09811l2955O7819J16865j53328R0061K0827J94491l2071q6207J70809N5775
$$ y = [1004531, 1013793, 847940, 878037, 932091, 1101781, 1051065, 1142941, 1252700, 1242866, 1133463, 1031544, 868465, 849022, 643666, 803564, 913785, 902026, 399284, 396215, 729871, 587146, 623058, 716766, 964076, 658881, 629569, 783303, 984064, 807248, 722023, 887544, 829786, 818541, 564631, 558159, 526522, 545147, 599095, 732504, 702606, 664612, 575064, 636575, 484050, 476008, 615168, 610525, 753674, 768512, 892657, 669939, 726303, 511856, 383693, 344941, 596752, 602200, 550464, 842151, 715876, 798533, 908910, 743978, 521634, 332444, 467989, 517650, 584176, 398081, 563125, 619689, 475813, 303717, 409811, 376856, 444675, 561540, 408212, 498273, 519100, 713591, 681520, 595313, 766122, 821897]
2280H21897k04241J15686j97699k08386K00288q9235L3563K27088O7116O8837
2270H34914M8890m7217j51605J265m3287K24043K31151j87542J65209j20162M8193
2259A003852K2581k36315K0678n226J36204m2585J32306k34544o7181K43550J80616
2248A153936l46143j86424j0682K85903Q1152m2017j46283k18211J47202K51028
2238I69461j37538j44930K08631j73420l7168J38518K54330p7368J9402p202k93295
2227G19421k9638L60923o1960q0911n0378j80270M02562l59202j76863L87006
2217I30690K10885j61483j73999N6541o2606r7504l0774M2326J53364r72L0764
2206H97232o7273K50264k26015K1728M773p3874P4605K0861N1276j66045J25284
$$ y = [821897, 617656, 733342, 535643, 327257, 527545, 438310, 471873, 698961, 766077, 834914, 883804, 836587, 684982, 686247, 642960, 867003, 1098154, 910612, 1075821, 955659, 1003852, 1026433, 790118, 810796, 805570, 941774, 899189, 1031495, 796951, 729770, 973320, 1153936, 807793, 621369, 610687, 896590, 977742, 935725, 789442, 571231, 718433, 969461, 831923, 686993, 895624, 722204, 685036, 823554, 1077884, 1000516, 1019918, 1012716, 719421, 689783, 1050706, 988746, 907835, 857457, 677187, 1079749, 720547, 543684, 930690, 1141575, 980092, 806093, 862634, 800028, 702524, 671750, 714076, 867440, 866468, 897232, 829959, 1080223, 854208, 875936, 880709, 806835, 881440, 902301, 953577, 787532, 912816]
2195I12816J3045P8588K87035P730j95551j55805L6470J97508J07409k67056K28392
2184A250581J30306j33157M8252K56435R5271J5003J06578j69285K23075R6449
2174A919508k47468k41762K43622P1625J82834j07433j55768J51216K09086L11532
2164B336992p6903j41962k64798K51747M22962k21505l0047L15966L22815j37576
2154B777691k93928K01966K72936J99773J88450j61181j40350J67861n4598J97266
2144C355886J62426j04074R1346q2221l1282n9675L14267J20935r0780m73K72408
2133C948763K585k6991R2253L9418K01488L80659L65722L41721L6663K04594M36407
2122F023282J71603O8718L93370M73065P19938K99212P05210M22570N96451O59514
$$ y = [912816, 925861, 1004449, 1291484, 1299214, 1103663, 947858, 984328, 1181836, 1289245, 1022189, 1250581, 1380887, 1247730, 1295982, 1552417, 1647688, 1662691, 1769269, 1599984, 1823059, 1919508, 1672040, 1430278, 1673900, 1745525, 1928359, 1820926, 1665158, 1816374, 2025460, 2336992, 2260089, 2118127, 1853329, 2105076, 2528038, 2306533, 2276486, 2592452, 2915267, 2777691, 2483763, 2685729, 2958665, 3158438, 3346888, 3185707, 3045357, 3213218, 3158620, 3355886, 3518312, 3414238, 3505584, 3423363, 3392081, 3332406, 3646673, 3767608, 3676828, 3676355, 3948763, 3951348, 3924357, 4016610, 4056028, 4257516, 4638175, 5003897, 5345618, 5382281, 5586875, 6023282, 6194885, 6263603, 6656973, 7130038, 7849976, 8149188, 8854398, 9276968, 9873419, 10532933]
2112A0532933Q41397Q55659R89985J162441J267298J033851J184698J066525J605166
2103B0539953K105901L293284L509855M661006N256786O510736P782684J1242437
2095F4902642J4966549J6903718N966144j1428739j4856664j4609344j2773296
2088D9071010j0359326o441999m548847l173639k664108j822775j557435j201062
2080A7301819r45101p26997r87349j316080j144661o02302p59970l89800q63463
2071I566096p77334k19894k21036l61962m76574k46591k41692r4604r1294j66047
2061F669068m27699l37098l70550k05189j74594k93065J62162j58921k81400l16633
2051D266081Q5599p8496m5862k02079p8501k25764l72118J55720R4916k96299
$$ y = [10532933, 11374330, 12229989, 13219974, 14382415, 15649713, 16683564, 17868262, 18934787, 20539953, 22645854, 25939138, 29448993, 34109999, 39366785, 45877521, 53660205, 64902642, 79869191, 96772909, 102739053, 91310314, 76453650, 61844306, 49071010, 38711684, 32269685, 27720838, 24547199, 21883091, 20060316, 18502881, 17301819, 16356718, 15629721, 14642372, 13326292, 12181631, 11579329, 10819359, 10429559, 9566096, 8788762, 8568868, 8347832, 7985870, 7509296, 7262705, 7021013, 6926409, 6835115, 6669068, 6241369, 5904271, 5533721, 5328532, 5153938, 4860873, 5023035, 4864114, 4582714, 4266081, 4351680, 4273184, 4227322, 4025243, 3946742, 3720978, 3348860, 3504580, 3599496, 3303197]
2041C303197m4463k20882J34156q2400k65046M7198q4030l56k64309O2770Q5894
2030B671729N1608j35379j79244r2507J48739j28742o1712j21481J59484O0218
2020B372713j91228N8934j17178q3744j22724q0179j15673j03781j66583j20143
2010A330414J28074J43042K7269k17992q2902k36942J04182N0931j34714N2981
2000A164343K81238R2670j96717j28471j08604j53502J31778j20569j40794k1465
1990G99907Q6790j65620K4356K93501J90796k64444k55826k1000K05147m9733
1980H43874j52995J39685j27958k5498P804k8106J49986K47976R6989k80939l68671
1969E02147K22477P9988l9583R5255o6508N4256k22321J9064k01245K8369j9226
$$ y = [3303197, 3258734, 3037852, 3172008, 3089608, 2824562, 2871760, 2787730, 2787374, 2523065, 2585835, 2671729, 2723337, 2587958, 2408714, 2316207, 2464946, 2336204, 2274492, 2153011, 2312495, 2372713, 2181485, 2240419, 2123241, 2039497, 1916773, 1836594, 1720921, 1617140, 1450557, 1330414, 1458488, 1601530, 1628799, 1410807, 1327905, 1090963, 1195145, 1246076, 1111362, 1164343, 1445581, 1538251, 1341534, 1213063, 1104459, 950957, 1082735, 962166, 821372, 799907, 886697, 721077, 745433, 1038934, 1229730, 965286, 709460, 688460, 893607, 843874, 690879, 830564, 702606, 677108, 684912, 656806, 806792, 1054768, 1151757, 870818, 502147, 724624, 804612, 765029, 860284, 793776, 848032, 625711, 644775, 443530, 471899, 452673]
1958D52673J02654p0334L53731J96403k64490j42438O1932k00548r9409L06771
1948F96945K28431L4037N1629o7283l27247r3420j48117o1360J85616l1602k04006
1937B63623K79349k46092R6692J35302K0671L11178J1649k77000j33564N9423
1927E21231p8312j13578R2236M1218p3660l00087J04713J71166K8145J15560k29585
1916B79047O8775J12621k4839K04307j50365k47331r8353K02522J86573j43968
1906C88989M7403o3959q0234L66666j33378j27118k3967j46579J22728K4688n6826
1895C18413l8469J48027m3793j07765J28809j00655M9918l8466N7619j2774L0725
1884C91589l29075k1299K44890j60635k07079M45661J69460k32127j56685K14713
$$ y = [452673, 555327, 484993, 838724, 1035127, 770637, 628199, 690131, 489583, 390174, 696945, 925376, 959413, 1011042, 943759, 616512, 523092, 374975, 313615, 499231, 467629, 263623, 542972, 296880, 393572, 528874, 549545, 860723, 872372, 595372, 461808, 521231, 442919, 329341, 421577, 462795, 389135, 89048, 193761, 364927, 393072, 508632, 279047, 347822, 460443, 435604, 639911, 489546, 242215, 143862, 346384, 532957, 388989, 436392, 372433, 292199, 658865, 525487, 398369, 374402, 227823, 350551, 375239, 318413, 279944, 427971, 384178, 276413, 405222, 304567, 354485, 316019, 373638, 360864, 391589, 62514, 41215, 286105, 125470, -81609, 364052, 533512, 301385, 144700, 359413]
1874C59413n9462M6772M059l83500J50989N8638j85990J76503K83383l27898Q3615
1863B06522K01620Q5452M4371R3747j53942r1473Q0010L0069j50418o8203M700
1852B82455q6723j04139k9832M7300o5560q8804p716K35200R9070J66093j46474
1841C00870j42010K66811J71295R41o8149P0588k02069n1529O2097p7731L5925
1830C67039K02598j16104j3794L46928r3939N5481R5896M368P5947K8855j18639
1819H34636k34654k49456p835j77013j89933L39100R1770J70322j28294N5191
1809E03834j53092r3797N8930k11137j52993J19555L1216J43745j23816k60101
1799a37656L79413l6622k50731J29568K33242P2139J27463J39905j45201k58836
$$ y = [359413, 299951, 346723, 350782, -32718, 118271, 176909, -9081, 167422, 450805, 122907, 206522, 408142, 493594, 537965, 631712, 477770, 386297, 466307, 496376, 345958, 277755, 282455, 195732, 91593, 61761, 109061, 43501, -45303, -53019, 182181, 281251, 447344, 300870, 158860, 425671, 596966, 597907, 529758, 600346, 398277, 346748, 408845, 331114, 367039, 569637, 453533, 439739, 786667, 692728, 748209, 844105, 848473, 924420, 953275, 834636, 599982, 350526, 342691, 165678, -24255, 314845, 406615, 576937, 448643, 503834, 350742, 256945, 315875, 104738, -48255, 71300, 102516, 246261, 122445, -137656, 241757, 205135, -45596, 83972, 317214, 389353, 516816, 656721, 511520, 252684]
1789B52684O2656j04426J7093Q7774N8741P6319k42100j15518L6167k8250O3142
1778A64282p9616l41114R5074K32623J07119k3632J4144J56843K4279k2674o1570
1767B65758k36571p1780Q3856N6947M2008J11353j35528o8101n6229O3380J27197
1756A82290p1713J98139k9343j26744n5738O0743J35437l13749n2683K92317j09920
1745A09036J13923J24164k10661j34226p5434K00662J07001j35344Q6986J37211
1735C23318r1786r850J19986Q2156j50952k4387p816j47089K66797p6118j45267
1724A38992J29098l7663J42270q9807P3206R7275k36191j03999Q6505m5438j38803
1713A5445K80593k9295J96150j8363Q4702j98729j84637j64747M2121M4368R3562
$$ y = [252684, 315340, 210914, 228007, 315781, 374522, 450841, 208741, 93223, 129390, 101140, 164282, 84666, -256448, -161374, 71249, 178368, 154736, 168880, 325723, 350002, 327328, 265758, 29187, -42593, 41263, 98210, 140218, 251571, 116043, 47942, -8287, 55093, 182290, 110577, 308716, 279373, 152629, 96891, 157634, 293071, -20678, -73361, 218956, 109036, 222959, 347123, 136462, 2236, -73198, 127464, 234465, 99121, 186107, 323318, 231532, 221682, 341668, 423824, 272872, 248485, 240669, 93580, 360377, 284259, 138992, 268090, 230427, 372697, 282890, 356096, 453371, 217180, 113181, 199686, 154248, 15445, 296038, 266743, 462893, 444530, 529232, 330503, 145866, -18881, 23240, 67608, 161170]
1702A61170M5002j02Q7477m4826n6642J46598o3711Q7440P9637m74903M38M01345
1690C68923J4740k76625J16795J9554K585k62222k21372J71765J69907o6150r0207
1679e2307r2556L08471j28221O3040R1949q2250j09546j29216L11737K9554q099
1668B02556L5137q687j38642m848J71004J26482m359k38146j5444m0203M8471
1657A33321K21000q7116N1969J23199j67495j1935k03094r0948l3299j29320L6519
1646a57199J64805j17779J37606O5265J10723j49534K44938j35424k16776k3339
1636g6714J25278J30033p6755J0612l01012K42555K37933O2314k49399K05912
1626C10757n6269r5987O3921M8135j31409J13268J2533J84961k4778o9829j39587
$$ y = [161170, 206172, 206070, 293547, 248721, 192079, 338677, 274966, 362406, 442043, -32860, -32422, 368923, 383663, 107038, 223833, 243387, 245972, -16250, -237622, -65857, 104050, 37900, -52307, -144863, 163608, 35387, 98427, 190376, 108126, -1420, -130636, 181101, 210655, 202556, 237693, 229006, 90364, 85516, 256520, 383002, 378643, 140497, 125053, 84850, 133321, 354321, 267205, 319174, 442373, 274878, 262943, 59849, -31099, -64398, -193718, -157199, 7606, -110173, 27433, 92698, 203421, 53887, 298825, 163401, -53375, -76714, 48564, 178597, 101842, 112454, -188558, 53997, 291930, 354244, 104845, 310757, 254488, 158501, 222422, 270557, 139148, 252416, 264949, 449910, 425132, 355303, 215716]
1615B15716k6500K09700k03039R1912l1343k20870R8726p0508l5963O8535j06098
1604i732j55533N6535O2168J01231J53847k01615J19828R9125o6382n5398J55609
1593B59683k7125j94994r8373j3874J65895l7375k49654J4636P4268j03689M9102
1582a61500J60290J24439J28694L0811l04146l6021K44383o1447j35355J47947
1572A38095J48595L5557j39771j71833j38464M4369J51455M6087k6396L382L5253
1561A26329Q6793k061j12937j15746J35975J6054j98876K40928o9167L1311K03292
1550C41895p1751n7109J49759k14566J46030J0154j47331o6444j18731Q7571L3012
1539I2489J5984K2493k15338p3890K63790m4382r2838J09280m7095j67810O1608
$$ y = [215716, 189216, 398916, 195877, 287789, 256446, 35576, 134302, 63794, 27831, 96366, -9732, -165265, -108730, -46562, 54669, 208516, 6901, 126729, 225854, 159472, 104074, 259683, 232558, 37564, -60809, -74683, 91212, 53837, -195817, -181181, -106913, -210602, -161500, -1210, 123229, 251923, 282734, -21412, -57433, 186950, 125503, -9852, 138095, 286690, 322247, 182476, 10643, -127821, -83452, 68003, 114090, 87694, 91076, 126329, 213122, 211061, 98124, -17622, 118353, 134407, -64469, 176459, 107292, 138603, 341895, 270144, 213035, 362794, 148228, 294258, 304412, 157081, 90637, -28094, 59477, 92489, 108473, 130966, -84372, -158262, 105528, 61146, -31692, 77588, 30493, -137317, -75709]
1528g5709L81516p558K0902p4309l1323j42988k34186K9495J98963Q692K7397
1517A00892N7160k48010k3604L42796J55150j86812K75556j75115j95078K05176
1507C08111j43299l39366o4961L84432K01781J8478n4037k44840J5890j86525
1497a04336m9757J93832J74156j53232j83349N5408R2981k60127K0674J14016
1487i9734J22731M6149L06991k3995j16261r2337n0758J37709j18676N2478o9364
1476I4933j78409J24690P9027J93233k23507j48140M30017L9479l54066j33970
1466g6713n4046M3050L87849j35130o4330j12662N4311L0267J25406J17441k90243
1455B5200j87818J70558J83677j37578r7150M314J2307p2385r1169n8224O3441
$$ y = [-75709, 305807, 298249, 319151, 244842, 213519, 70531, -163655, -134160, 64803, 73495, 100892, 158052, -89958, -113562, 229234, 384384, 197572, 473128, 298013, 102935, 308111, 164812, -174554, -239515, 144917, 346698, 365176, 311139, 66299, 82189, -104336, -154093, 39739, 213895, 60663, -122686, -67278, 25703, -234424, -213750, -99734, 22997, 69146, 376137, 352142, 235881, 143544, 92786, 230495, 111819, 164297, 94933, -83476, 41214, 120241, 313474, 89967, -58173, 371844, 411323, 57257, -76713, -130759, -87709, 300140, 165010, 100680, -11982, 42329, 72596, 198002, 315443, 25200, -162618, 7940, 191617, 54039, -43111, -38797, -26490, -98875, -190044, -248268, -184827]
1444a84827J27129R3395P407P4305J46480j91482j35441K38905m7343j46613p4750
1433i2835O8116p5816n9993M5370P7697j93079K06736J87355j12589R9447J6492
1422A66901O8253k39532Q29K22903j62395q9377J80502K124j63138j77445N7331
1411a33044N3439n5979M0490J40395j31537R8897J23827J40787j21608J17059
1401B72726o2470j87431o8798M20113J22785m70326q2540K83047k2756O1015m8816
1390B16549k80507O9907P3585K4373p38l8611M00435j0061k03585L7898k84231
1379E014J67061N9672j91405N1664J5833o1685K25j25511J68683K08806P3798
1368C72155j82839j24608J09801M2514k98574j59616l2105J53439K64272j9815
$$ y = [-184827, -57698, 35697, 43104, 117409, 263889, 72407, -63034, 175871, 128528, -18085, -92835, -24719, -100535, -160528, -115158, -37461, -230540, -23804, 163551, 50962, 150409, 166901, 235154, -4378, -3549, 219354, 56959, -32418, 148084, 150208, -12930, -190375, -133044, -79605, -135584, -95094, 45301, -86236, 12661, 136488, 277275, 155667, 272726, 210256, 22825, -45973, 374140, 496925, 26599, -55941, 227106, 204350, 265365, 216549, -63958, 5949, 79534, 103907, 103169, 64558, 464993, 454932, 251347, 289245, 5014, 172075, 231747, 40342, 92006, 107839, 46154, 46379, -79132, 89551, 298357, 372155, 189316, 64708, 174509, 217023, -81551, -241167, -273272, -119833, 144439, 124624]
1358A24624O1099M9582n8795K72044m2566j05100m0296j00325K2206k13038j37566
1347a68131J01438O10879o5859l36639k85021R6685K663k25521L1498K72014L57093
1336C91099J12801j26317o4549r2489k73449K78l9971l569J45616j90545J86695
1325D5600L80656l20115K73261J25716k81408j00891k7482j11275K2441O803j81288
1314a67982m7281Q1512L4509r9000l6043J80194n3953r9105J36481L5839K91665
1303B56836j70441j31834J05109k35897K21786l4647R0811k49814j32867J0723
1293b70235N7904K00749J29821j9444J92326k00430n7111J57509j15201j1872
1283F4016N4750j56423O5288m0345m0441J69763j75103K06K19106o3534j1963
$$ y = [124624, 185723, 235305, 176510, 448554, 405988, 300888, 260592, 160267, 182473, -30565, -168131, -66693, 544186, 478327, 141688, -143333, -46648, -43985, -269506, -238008, 34006, 391099, 503900, 377583, 313034, 220545, -52904, -52626, -92597, -96166, 49450, -141095, 45600, 426256, 106141, 379402, 505118, 223710, 122819, 95337, -15938, 6503, 13306, -167982, -215263, -133751, -99242, -198242, -234285, -54091, -108044, -207149, -70668, -34829, 256836, 86395, -45439, 59670, -176227, 45559, 10912, 101723, -148091, -280958, -270235, -212331, -11582, 118239, 98795, 291121, 90691, 33580, 191089, 75888, 64016, 118766, -37657, 27631, -12714, -53155, 116608, -58495, -58289, 160817, 97283, 85320]
1272H5320J112q0509j08915q6866P9070n4264n7574J33985M881J17132j53074
1261a19702R8994q8522j30552L38552l6569n1203k6841J17483J74361o2169k45589
1250c1757J25132Q8842j86445K04381J33702j92451r7948N9229L27567l37722
1240I2530n0470J23874J30107m01818k76738J24740K46230L6744L4930m16302
1230c56173j16874L41255J48503R3988R4439k44166j05286k00488j96228P6497
1220d64533M30743N2579k23341R1829m7828r0109k3918L14252p3209j74326Q3247
1209a24614J09730o3488p5160j91882k69267J14926M85343P3535k16576k32687
1199c90140J0057J82224J82016k6973K0710r5391Q8560K59440r4004J405K18189
$$ y = [85320, 86432, 5923, -102992, -189858, -110788, -165052, -222626, -88641, -83760, 33372, -119702, -20708, -109230, -239782, 98770, 62201, 10998, -15843, 101640, 276001, 213832, -31757, 93375, 182217, -4228, 200153, 333855, 141404, 43456, 102685, 430252, 92530, 42060, 165934, 296041, -105777, -382515, -257775, -11545, 25199, 60129, -356173, -473047, -131792, 16711, 110699, 205138, -39028, -144314, -344802, -541030, -464533, -33790, 18789, -204552, -112723, -160551, -250660, -274578, 39674, -33535, -207861, -124614, -14884, -78372, -153532, -345414, -614681, -499755, -14412, 59123, -157453, -390140, -380083, -197859, -15843, -42816, -22106, -117497, -28937, 230503, 136499, 137904, 356093]
1188C56093o7528l16918M4401K55447P4409m86507Q1915O3689J24951m6271N8396
1177A42077l2519l4391K4781j29574k03064K5609Q8803J99744P4671j95756L2950
1166f669L4307R5810j55749K58068j8549l1696N7869n1030k25625j15613K90473
1155A31596O4020M8966r9207j79743k33169K10224k43471j56972M76300J62808
1145A81352n2276j28183Q2069j66582L21121j51519o0703o978J7472n9614N8744
1134C4903J27511k12027K40739K56607j09169l35944K7972K0243o328l7392p6511
1123f9396J56681k40669L50078J63866l90147p2672K52684J82667J70120k76269
1113B26943J14574L4076k43434j04866j82857j68255K41829J45268k13935J52112
$$ y = [356093, 288565, -28353, 16048, 271495, 345904, -140603, -58688, 5001, 129952, 83681, 142077, 109558, 75167, 99948, -29626, -232690, -207081, -118278, 81466, 156137, -39619, -6669, 27638, 123448, -32301, 225767, 207218, 175522, 233391, 182361, -43264, -158877, 131596, 195616, 244582, 145375, -34368, -267537, -57313, -300784, -457756, 18544, 181352, 129076, 893, 82962, -83620, 237501, 85982, 25279, 18301, 35773, -23841, 34903, 162414, -49613, 191126, 447733, 338564, 2620, 30592, 50835, 44507, 7115, -69396, 87285, -153384, 196694, 360560, -29587, -102259, 150425, 333092, 503212, 226943, 341517, 375593, 132159, 27293, -155564, -323819, -81990, 63278, -150657, 1455]
1103A455K38293k67068L3457K05706k7405J37471p676j27995P1813J45744r9244
1092C04551j46306j27626K06843r4296k44208p0743K3591M72697j9486j90106
1082A14911j51706j32884J20446K12020J38532j90358j97046j1013J00878K0797
1072B4577j73430J87659J38650N8203k19734J23101j16611j95806K20475N151
1062E2235K53275j21925n8361j73j78144j85475J94102J00969J10814k68644J24423
1051B3096M8414J40870J86604j2115j3132l68183l22098O5768K73415J82604r2209
1040A13034J29272l6920j19889J46238j83987K7460J71032J20369j62762j26433
1030G7414l6037k24564j18040j12894L98975j12570j16978J71793J34859P2539
$$ y = [1455, 239748, -27320, 6137, 211843, 184438, 321909, 314233, 186238, 258051, 403795, 304551, 158245, 30619, 237462, 143166, -101042, -171785, -148194, 324503, 305017, 114911, -36795, -169679, -49233, 162787, 301319, 110961, -86085, -97098, 3780, 24577, -148853, 38806, 177456, 235659, 15925, 139026, 22415, -173391, 47084, 52235, 305510, 183585, 125224, 125051, -53093, -238568, -44466, 56503, 167317, -101327, 23096, 71510, 212380, 398984, 386869, 373737, 5554, -316544, -250776, 22639, 205243, 113034, 242306, 205386, 85497, 231735, 47748, 75208, 246240, 366609, 203847, 77414, 41377, -183187, -301227, -414121, -15146, -127716, -244694, -72901, 61958, 134497]
1020A34497j69871l01072L48884j9930j32141n91J03756K106J20069J08295J13233
1009C07235r1618p9319M1536l8994j1774P6350q8802q2856l2622j14738J73334
998E7732k02623N92L7690J44127n1428l3592q8712K1340j03759Q0263J36175j52709
986a54904J9088o1075J70941J16825p9236j53567L5739k1325k16648O1245M5851
975b37066k73641K00463q9283J03373K33779k23240L27565j03775j34010l63935
965e59770K85030l6707K19389R8395j98761P9271Q5171O3300Q5227r0508n6931
954b6894k0909j02616R2687J20491j22667P4904J29892k36982J0783J26285k43074
943a98100J10460J18538l41660K01076J7371q1070K28192Q3619N7224j49643j67023
$$ y = [134497, -35374, -336446, 12438, -7492, -139633, -140224, -36468, -34362, 85707, 194002, 307235, 215617, 136298, 177834, 138840, 127066, 203416, 114614, 31758, -864, -115602, 57732, -144891, -144299, -106609, 37518, -13910, -47502, -136214, -114874, -218633, -138370, -2195, -154904, -135816, -196891, -25950, 90875, 11639, -141928, -106189, -127514, -344162, -282917, -237066, -510707, -310244, -399527, -296154, -62375, -285615, 41950, -61825, -195835, -559770, -274740, -311447, -92058, 6337, -192424, -113153, -27982, 35318, 120545, 30037, -26894, -47803, -150419, -57732, 62759, -59908, 14996, 144888, -92094, -81311, 44974, -198100, -87640, 30898, -310762, -109686, -92315, -173385, 54807, 138426, 195650, 46007, -121016]
932a21016q326p2484K60633j33616j83601L4307J1460L37713m3827J56676j58490
921G9429M3873K60036k38478l0926K0267k1267j57429K52665k28203j32795r2641
910b45469M621K79771j93271Q127j2987J1241n5632o1238O3832k5945R9011K51658
898A23719M5665O8499j5661j13975J3909L0580p4892j08994n1586m4500P1352
887e5884j90190j07999l4737L25883Q6173k16205J29434J75102k0142N5434J12329
876B59198j87077J07465j41293k05270K04529j66524J4165J47720L25461k13611
866A44763o5836j49219J52458J04307J1969k34641j77535K22770L1177J24029
856A64242O3723R5604Q8388O0910m54448j13153j62406J85262J16061N5713K87130
$$ y = [-121016, -129342, -201826, 58807, -74809, -258410, -224103, -212643, 125070, 81243, 237919, 79429, 123302, 383338, 144860, 113934, 134201, 112934, -44495, 208170, -20033, -152828, -245469, -240848, 38923, -154348, -146221, -159208, -147967, -203599, -264837, -201005, -226950, -127939, 123719, 169384, 237883, 222222, 108247, 122156, 152736, 77844, -31150, -82736, -127236, -55884, -246074, -354073, -388810, -62927, 23246, -192959, -63525, 111577, 91435, 146869, 259198, 72121, 179586, 38293, -166977, 37552, -128972, -114807, 32913, 358374, 144763, 78927, -70292, 82166, 186473, 198442, -36199, -213734, 9036, 40213, 164242, 227965, 323569, 411957, 472867, 18419, -94734, -257140, -71878, 44183, 99896, 387026]
845C87026l11918k34835N3082q9913L72812j6974J29722k08430r428j68830Q527
834h9159p3442J57034J06102k76889K81155k39180O5572k4699J14293j55166j02095
823b36474J8437K27345J71423j00343J0947j00439J02108O8441j47414k09005
813a94974K74111m9661Q0799m6035J33250L04835k20383l9559m56591m1375K46930
802h653j05281R0224o1339j57223J00699N8172K22090j56779j47853j76332o419
791c48694R5318k23157J58065O3785J07712J64497j03700R1385q6265j1455j70766
780b63275l3369J60090J3811j43064j07183N6360K37989J45728r0961k23632Q3918
769a63588j95861J99889Q1293R5121J88909N9843k93037l0344J08750j86640o8270
$$ y = [387026, 75108, -159727, -106645, -196558, 176254, 159280, 289002, 80572, 71144, -97686, -89159, -162601, -5567, 100535, -176354, 104801, -134379, -68807, -93506, 20787, -134379, -236474, -218037, 9308, 180731, 80388, 91335, -9104, 93004, 161445, 14031, -194974, 79137, 29476, 110275, 64240, 197490, 502325, 281942, 242383, -214208, -255583, -8653, -113934, -23710, -85049, -242272, -141573, -83401, 138689, -18090, -165943, -342275, -348694, -253376, -476533, -318468, -254683, -146971, 17526, -86174, 5211, -81054, -92509, -263275, -296644, -136554, -122743, -265807, -372990, -316630, -78641, 67087, -23874, -247506, -163588, -359449, -159560, -78267, 16854, 205763, 265606, -27431, -57775, 50975, -135665, -203935]
758b03935j97205K02199J56706N6758j96451K11112Q546q170P0872o7566K5051
747E7917l57339J55291L07377p3529j94911M7471L3035r3799J40336m463K7526
736D4912o0626O0761L03333k64057l74209N0979K93329K91799o8462k43281o2138
725b7660k2661j0186j01108j21315N05981Q3257j96183N5695n5060j74422N7045
714f617o7098q5595n9119L17873k694j00564k12785j1274J27433P3312j84656
703b11784J64089j7414P2498n2766j95303P8790p2374j58902j20358J73552K81873
692e8099l5473j19505J47980j85357P5670P5938l50234J58127P6347k2860J08809
681a28657M824q1619K40295Q5222o7152K83582n5921j4636k81986R500J84993
$$ y = [-203935, -401140, -198941, -42235, 14523, -181928, 29184, 37730, 29560, 100432, 32866, 57917, -299422, -144131, 163246, 89717, -105194, -57723, -24688, -118487, 21849, 17386, 44912, -15714, 45047, 348380, 84323, -289886, -238907, 54422, 346221, 277759, 34478, -27660, -50321, -60507, -161615, -282930, 223051, 306308, 110125, 165820, 110760, -63662, -6617, -73715, -159310, -218429, 99444, 96750, -3814, -216599, -227873, -100440, -27128, -211784, -47695, -65109, 7389, -45377, -240680, -161890, -234264, -393166, -513524, -339972, -58099, -93572, -213077, -65097, -250454, -174784, -98846, -449080, -290953, -214606, -237466, -128657, -123833, -205452, 34843, 120065, 52913, 336495, 280574, 265938, -16048, -6548, 178445]
670A78445o0556l9046Q8475Q0605k25957J5785K59632k74873q0299o4827j51399
659b74015O4789R3733k2922l0851R1268J73474q7814J3447k1480k13899k65597
648d79867L1577K52526K8610k56846K79134J1868j15856K76290k43026M165j78624
637c90049j2531L14217r1383M2187L9860J964k31988K28725J61521m8738k69741
626b55956K11424O5377j21368l9016J17472p2387j14039O3498J68346J58992n01914
615c19571N8364R4732l7059k2659J69187j43597P3314P3242j16858L1412l7890
604a77383j06204J95769K2519K50296L0250j29988k4544j25919P5093k40055p3234
593c03400Q9040K49477L7002J9555j69771p5220J72694K4364r41l3240j10604
$$ y = [178445, 117889, 78843, 167318, 247923, 21966, 37751, 297383, 22510, -57789, -122616, -274015, -209226, -115493, -138415, -169266, -77998, 95476, 7662, 21109, -371, -214270, -479867, -448290, -195764, -167154, -424000, -144866, -132998, -248854, 27436, -215590, -211425, -390049, -402580, -88363, -179746, -137559, -97699, -95735, -327723, -98998, 62523, 13785, -255956, -44532, 20845, -100523, -139539, -22067, -94454, -208493, -144995, 23351, 182343, -319571, -261207, -166475, -203534, -226193, -57006, -200603, -127289, -54047, -170905, -139493, -177383, -283587, -87818, -65299, 184997, 215247, 85259, 60715, -65204, 9889, -230166, -303400, -214360, 35117, 72119, 91674, -78097, -153317, 19377, 43741, 42800, 9560, -101044]
582a01044q1726J83839J52489j32022l58909K88L06115k1251P5430N793j56467
571a27465m7071P4111J76511m5173J1073j93782L3212J03391j65151k52807L349
560d29802J01477J43440K70705l29243j03747J71783l70375K44533K35069r7622
550a63782O3225j9134j89701J28079K46538J10898n8016j03882j0079l49135r6955
539d41944q5834K00605K53325j5330o4628K11432j05627k43189K34256L63689
529C06755N4463n4209k51815q4280k77622P651J92841k16323j5271K45039Q3921
518h850j25306M7031j30211J13476J03580j4559j28449K12288J65609m04661p5437
507b45489K30532j12991j65572j60232n4110K34723J55993j69185P3894k6777
$$ y = [-101044, -182770, 1069, 153558, 21536, -337373, -337085, -30970, -52221, 23209, 29002, -127465, -174536, -100425, 76086, 30913, 41986, -151796, -118584, -15193, -180344, -433151, -429802, -328325, -184885, 85820, -243423, -347170, -175387, -545762, -301229, -66160, -163782, -100557, -119691, -309392, -181313, 65225, 176123, 118107, 14225, 4146, -344989, -441944, -527778, -327173, -73848, -89178, -153806, 57626, -48001, -291190, -56934, 306755, 361218, 307009, 55194, -29086, -306708, -299057, -106216, -322539, -337810, -92771, -8850, -134156, -87125, -217336, -103860, -280, -14839, -143288, 69000, 234609, -170052, -245489, -14957, -127948, -293520, -453752, -507862, -273139, -117146, -286331, -212437, -239214]
497b39214K71697J31067k85213j32066k5772R6470J30425j97227l8474O5666j4059
486b36700o3749J43279J35632K9519J73323j71630j56157p0696J21029q6437K26958
475D4371N9634k84634L9285k7601r496K49743J14846k90804k23410P5908o0018
464c12176O2248r9019J24573L20078L7159l78122k93217R2510L42675l0852M1306
453i2837k00930K68498R6516k86788L10476j04334j05812m07374j22501K79181
443c65905k9590o8637J02792J5604J3591r4166r0414Q1728K21358q1951K76324
432a9266M2423n6195J47948k55669j4064J16719k60793J42749R8412j22488J95685
421A5461K672K4427M121j31974m9424j34088J04867Q1039k15945j11192K14K46601
$$ y = [-239214, 32483, 163550, -121663, -253729, -279501, -183031, -52606, -249833, -288307, -222641, -236700, -300449, -157170, -21538, 7981, 181304, 9674, -146483, -217179, -96150, -182587, 44371, 104005, -180629, -141344, -168945, -178441, 71302, 186148, -104656, -328066, -252158, -312176, -249928, -348947, -224374, 95704, 132863, -245259, -538476, -445966, -103291, -134143, -92837, -293767, -25269, 71247, -215541, 94935, -9399, -115211, -522585, -645086, -365905, -395495, -464132, -361340, -345736, -332145, -426311, -516725, -434997, -213639, -295590, -19266, 23157, -33038, 114910, -140759, -154823, -38104, -298897, -156148, -57736, -180224, 15461, 18133, 42560, 46681, -85293, -134717, -268805, -163938, -82899, -298844, -410036, -409822, -163221]
409a63221J00157r2262J50401O8863R5500l46108m7746L65301p6090k66985J03532
398a08658J57362R9133l30890j34657J97642l4215J01347j4754L8100j8521m074
387e2185j76907K20635L56698j36182Q7803j26242m3230k33841j92898J11084
377a85265p9737m0893K4067J56583j02509J31622K4650m5153j09187M2857K16176
366C3211q1791j14733N6548q7004J52164K55904k20416k02497J06895j29564j42293
355c73576L60744k2547O4998N5489k09515L42604j59787k33439n3041L75290k95733
344a48513M2485Q2605J06894J36989k707j87006k16670r1837r2300J4953j19145
333d74252J07645L01031K41137J9765k66937j47549j60480j48056K63088M0156
$$ y = [-163221, -63064, -155326, -4925, 63938, 159438, -186670, -234416, 130885, 54795, -212190, -108658, 48704, 147837, -183053, -317710, -120068, -154283, -52936, -67690, -29590, -48111, -52185, -229092, -8457, 348241, 212059, 299862, 173620, 130390, -103451, -296349, -185265, -265002, -305895, -281828, -125245, -227754, -96132, -71482, -116635, -225822, -182965, 33211, -48580, -163313, -106765, -193769, -41605, 214299, -6117, -208614, -101719, -231283, -373576, -12832, -35379, 29619, 85108, -124407, 218197, 58410, -175029, -228070, 147220, -148513, -106028, -23423, 83471, 220460, 217753, 30747, -185923, -277760, -370060, -355107, -474252, -366607, -65576, 175561, 195326, -71611, -219160, -379640, -527696, -264608, -224452]
323b24452P3487l8431r045K46101L33103j03742j53830J88121p8700k61099j77032
312b05519N522l7414M5347K19224n7359J70771j75555J2872n9042o5455r9759
301b46367L16270J08158j88600q9055q6627m3736J03459O7448O9720Q104K8078
290D6852K492j34382L7331r1302n9272J01974j2479J77235J4133k8028J1361m2928
278B2987j54277n8391l54823J63457K65265k8575J85512k5628M8095k3843k288
267C7491j18830m622j34213J32750J60722p1927q3213j89366k74608m181K40530
256c09467K91510p7140m19947P7370J05215J09586Q7922J66463k8191k32682O8885
245a60476q2403r9784l942J35437Q9644j51047J05360J278n2823K5560J31179
$$ y = [-224452, -150965, -189396, -198441, 47660, 380763, 277021, 123191, 311312, 232612, -28487, -205519, -199997, -237411, -192064, 27160, -30199, 140572, -34983, -22111, -81153, -146608, -246367, 69903, 178061, -10539, -99594, -186221, -229957, -126498, -59050, 10670, 18774, 46852, 49344, -85038, -47707, -139009, -198281, -96307, -108786, 68449, 82582, 54554, 65915, 22987, -131290, -189681, -544504, -381047, -115782, -144357, 41155, 15527, 63622, 39779, 37491, -81339, -85961, -220174, -87424, 73298, 1371, -81842, -271208, -545816, -549997, -309467, -17957, -95097, -515044, -437674, -332459, -222873, -134951, 31512, 3321, -229361, -160476, -242879, -342663, -346605, -211168, -121524, -272571, -167211, -165933, -218756, -193196, -62017]
234f2017J08708l4441o7677m8805J45260j85840j17986M7858o2048j67523J80313
223b64198J84410M7636P7029R7603j12550K4118j44173q0280L078r145l8336L2434
211a82374j0340K58905L059m0349j46950o9352J68415R0962k9386L3500j81096
200a05006P8071J86869j19230k39003P8114K55762j38426j55452M9396j07291
190b16196k86759O5764K10689J07189N0407R9105M9716p2756L9129L8812l4061
179E1039N0196p3973j03346j83145J19515k3360R230L06068j13767l87626M8319
168c00850j26250O5986n280J48229M1633K23779k6641j59861j88772k6652J70354
157a84325m9649j17180q7634L24002P3475k10344J15199N1940L2285j61136k70089
$$ y = [-62017, 46691, 12250, -55427, -104232, 41028, -144812, -262798, -214940, -276988, -444511, -264198, -79788, -32152, 44877, 142480, 29930, 54048, -90125, -170405, -167327, -176472, -214808, -182374, -192714, 66191, 69250, 28901, -118049, -187401, -18986, 71976, 42590, 76090, -105006, -26935, 159934, 40704, -198299, -120185, 135577, -2849, -158301, -108905, -216196, -502955, -437191, -226502, -119313, -68906, 30199, 79915, 7159, 46288, 85100, 51039, 101235, 27262, -76084, -259229, -139714, -163074, -153844, 152224, 38457, -349169, -300850, -427100, -361114, -366394, -218165, -176532, 47247, 20606, -139255, -328027, -354679, -184325, -233974, -351154, -438788, -114786, -41311, -251655, -136456, -84516, -52231, -213367, -483456]
146d83456P2159J89321m7814K4515Q0376j5900M4796J74223k638m5672k86619
135b96709k7508K33576r8839j82568J58298j00878P3285R3066J74048J35248m75351
124c14332K4521J28758J07177q6067q4275L8155P0901J57312j07393k33263J07395
113a91111J67206O4703p6641j48064l0263L1682q428K74699k67727Q6646P1799
102b5499Q6866m121j96261K40426j3513j28188L4965j78274q96o085Q3368j2306
90a19518k59305R9575J91975O3546k12371j23288K4362M6002J13439K15109r3171
79e3645k19541Q9944J41073q0457n1399j21628j42172K44720r2214K230r9223
68c82312N3913J56572j99910k8128K16219J00637j11446L5187k7636J8369Q4756
$$ y = [-483456, -411297, -221976, -269790, -245275, -164899, -180799, -136003, 38220, 35582, -10090, -296709, -324217, -90641, -189480, -372048, -213750, -314628, -241343, -148277, 25771, 161019, -314332, -289811, -161053, -53876, -139943, -224218, -186063, -115162, 42150, -65243, -298506, -191111, -23905, 40798, -35843, -183907, -214170, -182488, -190916, 83783, -183944, -97298, -25499, 61367, 57246, -139015, 101411, 87898, -40290, -5325, -183599, -184495, -190580, -107212, -119518, -378823, -279248, -87273, -23727, -236098, -359386, -335024, -289022, -175583, 39526, -53645, -273186, -183242, -42169, -122626, -174025, -295653, -437825, -193105, -285319, -283089, -382312, -328399, -171827, -371737, -399865, -183646, -83009, -194455, -159268, -186904, -168535, -83779]
57h3779M1566L4013n7645P7072r3495J2163j07839J2685J57250J9974l5939k41654
45b65628p1946L4123J01216j32576J43801J37513k24816p8524J95891J83k2829
34a83592j50313O2454K38896N7698o7502p8105l0422P4580R2088j88378r0585
23b63181k46328J09136K02900j4167q716o7656L3500j599Q3251M2734j55773j10733
11c96632J16331J84919m4825Q4702p2273J8089M5562J7913o4792k22599J09543
0b24062
$$ y = [-83779, -42213, -8200, -65845, 11227, -82268, -70105, -177944, -165259, -8009, 11965, -23974, -265628, -337574, -303451, -202235, -334811, -191010, -53497, -278313, -356837, -160946, -160763, -183592, -333905, -271451, -32555, 25143, -42359, -120464, -150886, -76306, 15782, -172596, -263181, -509509, -400373, -197473, -211640, -220356, -288012, -254512, -256111, -172860, -130126, -285899, -396632, -280301, -95382, -140207, -55505, -127778, -109689, -64127, -46214, -111006, -333605, -224062]
$$ Imaginary data points
##PAGE= N=2
##DATA TABLE= (X++(I..I)), XYDATA
16383c478154j55877L04107P3429k8384Q294J26687N9923j08083j288o4808K27571
16372c036583J37264J28943M9066l7936Q260j24109R7880m3759K03531O307m4115
16361b655251n1819M8331l7877J07902N2963K8986J07935J84860Q9919j46305
16351b270356M9417J5882J36070J29171j07431J01769P2336J17999j41470J8636
16341a877977K01741Q6213o6153m7802J70702r1102q4331j6432J73042j96440
16331a748539L57553M0806j1134k9795J59712J37234J38689j3965Q4680j94283
16321a079042N9534J09596r776k09247K26639o0031K09698K55595q1820j62400
16311g41254k52368K12297K82318P211p7553Q9687J65277R498K40451q5971j24281
$$ y = [-3478154, -3634031, -3329924, -3256495, -3284879, -3276585, -3149898, -3089975, -3198058, -3199346, -3264154, -3036583, -2899319, -2770376, -2721310, -2759246, -2750986, -2875095, -2777215, -2820974, -2617443, -2611136, -2655251, -2707070, -2658739, -2696616, -2588714, -2535751, -2506765, -2398830, -2213970, -2124051, -2270356, -2220939, -2205057, -2068987, -1939816, -2047247, -1945478, -1873142, -1755143, -1896613, -1877977, -1676236, -1590023, -1656176, -1703978, -1533276, -1624378, -1708709, -1725141, -1552099, -1748539, -1390986, -1350180, -1361314, -1391109, -1231397, -1094163, -955474, -969439, -884759, -1079042, -1019508, -909912, -919688, -1128935, -902296, -962327, -752629, -497034, -578854, -741254, -993622, -781325, -499007, -491796, -569349, -479662, -314385, -304887, -64436, -150407, -274688]
16300b74688k12258Q8418M07172j18802J38594r2839j57113j28441M2908J72584
16290a34465K00608J13167M6173K09851o5501k63024p7368k0612L02834P6278
16280C87941q5372J8798J67580m1841J41272R0587j43840K6530O9031q4670P983
$$ y = [-274688, -486946, -398528, 8644, -110158, 28436, -64403, -221516, -349957, -307049, -134465, 66143, 179310, 225483, 435334, 369833, 106809, 29441, 8829, 311663, 387941, 302569, 321367, 488947, 447106, 588378, 678965, 535125, 561655, 630686, 546016, 553999]
$$ [...]
##END NTUPLES=NMR SPECTRUM
##END=
