##TITLE=1H_CA-9139-1
 CDCl3
 8 sc, 
 14.4.2023
##JCAMPDX= 6.0         $$ Bruker NMR JCAMP-DX V2.0
##DATA TYPE= NMR SPECTRUM
##DATA CLASS= NTUPLES
##ORIGIN= UXNMR, Bruker Analytische Messtechnik GmbH
##OWNER= root
$$ XWIN-NMR		Version 3.5
$$ Fri Apr 14 14:46:02 2023 Russian Standard Time (UT+4h)  she@DPX200
##.OBSERVE FREQUENCY= 200.13135
##.OBSERVE NUCLEUS= ^1H
##.ACQUISITION MODE= SIMULTANEOUS
##.ACQUISITION SCHEME= undefined
##.AVERAGES= 8
##.DIGITISER RES= 18
##SPECTROMETER/DATA SYSTEM= spect
##.PULSE SEQUENCE= zg30
##.SOLVENT NAME= CDCl3
##.SHIFT REFERENCE= (INTERNAL, CDCl3, 0, 15.8758)
##AUDIT TRAIL= $$ (NUMBER, WHEN, WHO, WHERE, WHAT)
$$ ##TITLE= Audit trail, XWIN-NMR		Version 3.5
$$ ##JCAMPDX= 5.01
$$ ##ORIGIN= Bruker BioSpin GmbH
$$ ##OWNER= she
$$ F:/spectra/data/she/nmr/H-F/1/pdata/1/auditp.txt
$$ ##AUDIT TRAIL=  $$ (NUMBER, WHEN, WHO, WHERE, WHAT)
(   1,<2023-04-14 14:43:36.78 +0400>,<she>,<DPX200>,
      <created by zg, POWCHK disabled, PULCHK disabled
       configuration hash MD5:
       00 E9 B6 7A A2 85 ED C7 34 08 36 98 17 FE 4E 26
       data hash MD5: 16K
       9F 48 56 BA 0F 20 0F 5F F2 42 2E 5D 94 F2 85 D3>)
(   2,<2023-04-14 14:43:40.53 +0400>,<she>,<DPX200>,
      <Start of raw data processing
       efp BC_mod = 2 LB = 0.24 FT_mod = 6 PKNL = 1 PHC0 = -19831.49 PHC1 = 12.40081 SI = 16K 
       data hash MD5: 16K
       B5 52 DC 40 AE 0F 56 63 AD 58 50 C9 A8 84 5C 54>)
(   3,<2023-04-14 14:44:06.45 +0400>,<she>,<DPX200>,
      <pk PHC0 = -160.0349 PHC1 = 1.6 
       data hash MD5: 16K
       1E 3F 94 F6 F9 24 BD 7C A5 64 89 17 7F 43 3D 18>)
(   4,<2023-04-14 14:44:09.78 +0400>,<she>,<DPX200>,
      <abs ABSG = 5 
       data hash MD5: 16K
       CE 64 2E 5B BB BC B9 6C 10 2B D4 16 1B 30 07 8B>)
$$ ##END=
$$ 
$$ hash MD5
$$ 00 20 BA BE C9 8A 66 6D 24 83 D4 91 12 2D 18 A2
##$RELAX= 
##$RELAX= 
##$RELAX= 
##$RELAX= 
##$RELAX= 
##$RELAX= 
$$ Bruker specific parameters
$$ --------------------------
##$DU= <F:/spectra>
##$EXPNO= 1
##$NAME= <H-F>
##$PROCNO= 1
##$TYPE= <nmr>
##$USER= <she>
##$AMP= (0..31)
100 100 100 100 100 100 100 100 100 100 100 100 100 100 100 100 100 100 
100 100 100 100 100 100 100 100 100 100 100 100 100 100 
##$AQSEQ= 0
##$AQ_mod= 1
##$AUNM= <au_zg>
##$AUTOPOS= <>
##$BF1= 200.13
##$BF2= 200.13
##$BF3= 200.13
##$BF4= 200.13
##$BF5= 200.13
##$BF6= 200.13
##$BF7= 200.13
##$BF8= 200.13
##$BYTORDA= 1
##$CFDGTYP= 0
##$CFRGTYP= 5
##$CHEMSTR= <none>
##$CNST= (0..31)
1 1 145 1 1 1 1 1 1 1 1 1 1 1 1 1 1 1 1 1 1 1 1 1 1 1 1 1 1 1 1 1 
##$CPDPRG= <>
##$CPDPRG1= <>
##$CPDPRG2= <>
##$CPDPRG3= <>
##$CPDPRG4= <mlev>
##$CPDPRG5= <mlev>
##$CPDPRG6= <mlev>
##$CPDPRG7= <mlev>
##$CPDPRG8= <mlev>
##$CPDPRGB= <>
##$CPDPRGT= <>
##$D= (0..31)
0 1.2 0 0 0 0 0 0 0 0.06 0 0.03 0 0 0 0 0.0002 0 0 0 0 0 0 0 0 0 0 0 0 
0 0 0 
##$DATE= 1681469016
##$DBL= (0..7)
120 120 120 120 120 120 120 120 
##$DBP= (0..7)
150 150 150 150 150 150 150 150 
##$DBP07= 0
##$DBPNAM0= <>
##$DBPNAM1= <>
##$DBPNAM2= <>
##$DBPNAM3= <>
##$DBPNAM4= <>
$$ [...]
##$SUBNAM3= <"">
##$SUBNAM4= <"">
##$SUBNAM5= <"">
##$SUBNAM6= <"">
##$SUBNAM7= <"">
##$SUBNAM8= <"">
##$SUBNAM9= <"">
##$SW= 18.05172834244
##$SWIBOX= (0..15)
0 0 2 0 0 0 0 0 0 0 0 0 0 0 0 0 
##$SW_h= 3612.71676300578
##$TD= 16384
##$TD0= 1
##$TE= 0
##$TE2= 300
##$TE3= 300
##$TEG= 300
##$TL= (0..7)
0 120 120 120 120 120 120 120 
##$TP= (0..7)
150 150 150 150 150 150 150 150 
##$TP07= 0
##$TPNAME0= <>
##$TPNAME1= <>
##$TPNAME2= <>
##$TPNAME3= <>
##$TPNAME4= <>
##$TPNAME5= <>
##$TPNAME6= <>
##$TPNAME7= <>
##$TPOAL= (0..7)
0.5 0.5 0.5 0.5 0.5 0.5 0.5 0.5 
##$TPOFFS= (0..7)
0 0 0 0 0 0 0 0 
##$TUNHIN= 0
##$TUNHOUT= 0
##$TUNXOUT= 0
##$USERA1= <user>
##$USERA2= <user>
##$USERA3= <user>
##$USERA4= <user>
##$USERA5= <user>
##$V9= 5
##$VALIST= <valist>
##$VCLIST= <CCCCCCCCCCCCCCC>
##$VD= 0
##$VDLIST= <DDDDDDDDDDDDDDD>
##$VPLIST= <PPPPPPPPPPPPPPP>
##$VTLIST= <TTTTTTTTTTTTTTT>
##$WBST= 1024
##$WBSW= 4
##$XGAIN= (0..3)
0 0 0 0 
##$XL= 0
##$YL= 0
##$YMAX_a= 639729
##$YMIN_a= -390041
##$ZGOPTNS= <>
##$ZL1= 120
##$ZL2= 120
##$ZL3= 120
##$ZL4= 120
##$ABSF1= 15.74027
##$ABSF2= -2.31158
##$ABSG= 5
##$ABSL= 3
##$ALPHA= 0
##$AQORDER= 0
##$ASSFAC= 0
##$ASSFACI= 0
##$ASSFACX= 0
##$ASSWID= 0
##$AUNMP= <proc_1d>
##$AZFE= 0.1
##$AZFW= 0.1
##$BCFW= 0
##$BC_mod= 2
##$BYTORDP= 0
##$COROFFS= 0
##$CY= -3
##$DATMOD= 1
##$DC= 0
##$DFILT= <>
##$DTYPP= 0
##$F1P= 0
##$F2P= 0
##$FCOR= 1
##$FTSIZE= 16384
##$FT_mod= 6
##$GAMMA= 0
##$GB= 0
##$INTBC= 1
##$INTSCL= 3.70164e-10
##$ISEN= 128
##$LB= 0.24
##$LEV0= 0
##$LPBIN= 0
##$MAXI= 10000
##$MC2= 0
##$MEAN= 0
##$ME_mod= 0
##$MI= 1.114404
##$NCOEF= 0
##$NC_proc= -6
##$NLEV= 6
##$NOISF1= 3.799351
##$NOISF2= 2.8
##$NSP= 0
##$NTH_PI= 0
##$NZP= 0
##$OFFSET= 15.8758
##$PC= 1
##$PHC0= -19991.53
##$PHC1= 14.00081
##$PH_mod= 1
##$PKNL= yes
##$PPARMOD= 0
##$PSCAL= 0
##$PSIGN= 0
##$REVERSE= no
##$SF= 200.12997913373
##$SI= 16384
##$SIGF1= 3
##$SIGF2= 2
##$SINO= 5.538805
##$SIOLD= 16384
##$SREGLST= <1H.CDCl3>
##$SSB= 0
##$STSI= 16384
##$STSR= 0
##$SW_p= 3612.71676300578
##$SYMM= 0
##$S_DEV= 0
##$TDeff= 16384
##$TDoff= 0
##$TI= <>
##$TILT= no
##$TM1= 0
##$TM2= 0
##$TOPLEV= 0
##$USERP1= <user>
##$USERP2= <user>
##$USERP3= <user>
##$USERP4= <user>
##$USERP5= <user>
##$WDW= 1
##$XDIM= 16384
##$YMAX_p= 450027023
##$YMIN_p= -190821
$$ End of Bruker specific parameters
$$ ---------------------------------
##NTUPLES= NMR SPECTRUM
##VAR_NAME=  FREQUENCY,     SPECTRUM/REAL,   SPECTRUM/IMAG
##SYMBOL=    X,             R,               I
##VAR_TYPE=  INDEPENDENT,   DEPENDENT,       DEPENDENT
##VAR_FORM=  AFFN,          ASDF,            ASDF
##VAR_DIM=   16384,         16384,           16384
##UNITS=     HZ,            ARBITRARY UNITS, ARBITRARY UNITS
##FACTOR=    0.220516191357247, 1,           1
##FIRST=     3177.22354929882, 0,            0
##LAST=      -435.493213706962, 0,           0
##MIN=       -435.493213706962, -190821,     0
##MAX=       3177.22354929882, 450027023,    0
$$ Real data points
##PAGE= N=1
##DATA TABLE= (X++(R..R)), XYDATA
$$ [...]
7941 658 27372 -3086 -13750 15613 -2068 -23476 1822 17835 11123 -1931 -4342 -25485 -21779
7928 -21779 -19466 -16970 -31523 -31687 2309 10843 -13522 -43039 -19940 -20112 -5508 8073 -912
7915 -912 19997 32143 16009 2025 -7867 10285 -4313 -44130 -16987 18854 40076 38764 25302
7902 25302 58740 50132 39505 25681 -2861 -44937 -46134 -13237 -32372 -8802 11084 -25228
7890 -25228 -43109 -19372 -23357 -48301 -19108 -21962 -2856 -18551 -43168 -25814 -47525 -37233
7878 -37233 -13285 11067 1930 5795 20176 26610 -2762 -22819 -35826 1228 -6817 -9504 -34623
7865 -34623 -25754 -1477 16311 4677 11909 -25737 -31560 -38528 1954 5576 -27114 -26978 -41588
7852 -41588 -45001 -36388 7604 -17570 -14930 -15005 -7757 -29843 3066 13027 -1446 -12911 -19217 2778
7838 2778 20650 27677 17069 -29708 -20163 -28002 -11982 10014 21248 -6754 -12756 -22211 -19984
7825 -19984 -14855 -18331 -63918 -42006 -25008 6139 -22195 -32146 -47388 -1156 10756 6145 12286
7812 12286 4368 -26168 -25490 6099 -9399 16552 15715 -23501 32787 -75942 -190821 41093
7800 41093 8549 11374 18859 12264 11374 -8224 -32043 4834 -6686 -19630 -12667 -29329 -29414 -21665
7786 -21665 -26909 15989 20918 -15323 -3084 -186 -7295 -16186 -20694 -33301 -23566 -3992 8453
7773 8453 -20213 -38493 12009 14627 22113 -28751 -46534 -38232 -25808 -7647 -3777 6446 -7603
7760 -7603 3308 25719 3803 -19260 -13401 -23391 -29121 -37321 -39790 -35329 -33478 -23789 -9137 -11239
7746 -11239 -3586 -8332 6057 32035 6724 5978 -11098 -42537 -46659 -30342 1663 -14764 -18973
7733 -18973 -18591 7687 -17524 -30181 -23901 -27154 -48305 -34152 -45385 -15702 4393 7446 9542
7720 9542 -4440 -41387 -22419 -284 -5180 -6716 6096 -8543 13530 21631 -10850 -13052 -20292
7707 -20292 -20852 -43975 -13084 -19587 -39762 -31578 -38253 -36237 -24395 -42240 -47029 1658 22767
7694 22767 10014 -31796 -11557 1270 -15830 -21319 -34498 -13087 -36664 -55225 16560 14877
7682 14877 -4737 -15241 -39691 -29885 -10457 -36335 -45758 -867 -10992 -9620 -14144 -41144 -31821
7669 -31821 -20526 -31635 -32244 -24935 -40055 -30637 -2040 -13453 -24270 -32045 -9320 316 -11057
7656 -11057 -8354 -31745 -53499 -59440 -58295 -35088 674 -26647 -14252 -72 -6962 -15876 -22116
7643 -22116 -4301 -6683 3873 -37393 -26781 -26675 -31013 -30678 -15618 -12002 4617 10630 10910 -15452
7629 -15452 -8350 -4356 -8599 21180 -2966 -3351 15402 -6044 -18094 -15419 -15118 -10033 -32977 -36232
7615 -36232 -15444 -4796 -4122 -11534 -22745 38897 49856 24864 45432 -12911 -27639 -15770
7603 -15770 152 -9504 -11523 -27217 -7174 -4202 -29794 -16171 -15843 -16437 21671 19841 11894 7386
7589 7386 21924 3998 8582 999 -3277 13203 534 1160 -26945 -7829 -12099 -15837 -33559
7576 -33559 -9370 -35346 -3486 11446 9423 34264 6915 8692 21714 25528 22511 9501 -17162
7563 -17162 4147 27789 23013 20429 29924 44584 7053 10270 54115 41389 61368 79629 64602
7550 64602 43684 38326 40863 47183 46748 39715 52005 78274 80533 50589 52742 64560 53018
7537 53018 57612 65420 75438 45665 33952 49161 48763 68280 44816 23876 2025 30735 48902
7524 48902 48579 65143 27616 14451 44060 31449 33708 3078 20599 32145 17341 20071 31042
7511 31042 35676 32492 15642 -23946 -38152 -7539 16534 5759 4473 24114 16128 11909 -13262
7498 -13262 -1160 -2012 8986 -21372 -28972 -42719 -39895 -30600 -32029 4139 9747 6225 6969 -2194
7484 -2194 -19957 11196 13438 -21220 -23254 -681 32274 16945 41376 18544 -19449 -2023
7472 -2023 18310 37502 14769 12125 16489 21657 16429 27509 25080 28694 21722 63478 67109 30605
7458 30605 -2553 -394 -2263 3710 4547 13054 30195 13484 -10570 15152 -12970 -1128 12391
7445 12391 35670 61432 63669 48051 44739 48282 66943 22814 31921 30213 26532 31390 11477
7432 11477 51846 60726 57357 80234 61073 59509 73210 66818 40939 39968 34445 8401 -7927
7419 -7927 12197 28999 31945 40179 15552 7132 18982 35141 2318 17031 2863 -7100 39449
7406 39449 32591 30705 28348 15524 37816 35864 44409 51439 70382 58929 31123 12095 37694
7393 37694 27602 20588 1837 43205 64213 59182 48257 21140 39556 36705 72628 69185 33793
7380 33793 55585 62682 41208 43591 29656 43983 51459 43805 44641 21262 7438 25583 51428
7367 51428 31688 22465 26314 47686 35230 50916 40136 12210 55184 84367 64380 30010
7355 30010 21519 25865 57711 43366 -3317 -35098 -31999 -2588 9570 -5336 -16528 -35252
7343 -35252 -17947 1429 13965 -27948 18218 34623 445 -12525 21074 26371 10802 6744
7331 6744 -18380 -2028 28950 60635 58276 69205 47514 16356 -6179 6255 1505 43357
7319 43357 44936 54727 33789 14317 -32778 -46168 -58044 -15987 4636 -2462 -6037 -19975 -9608
7306 -9608 42839 30856 3922 10553 9684 21127 21746 20986 14865 13210 5440 37805 20784 16941
7292 16941 -7814 -44848 3139 13957 -1111 31605 1110 -19585 -35256 -11030 -4059 23017
7280 23017 38629 34682 17745 31191 7301 22057 -5175 -31250 7221 25437 34675 37328
7268 37328 61247 39156 37811 21006 50602 39799 18157 54594 54298 18740 1543 11366 37492
7255 37492 29663 27328 31010 34295 16045 26240 22520 33354 -4481 4637 25850 6601 1790
7242 1790 -6161 13975 13402 30849 10372 20739 40783 65043 45769 31163 14708 5364 7329
7229 7329 13952 13354 23401 37300 15541 28973 43573 2063 -13122 9648 41136 54179 52798
7216 52798 25091 24209 15199 42780 40658 27883 632 12574 14138 13945 46161 37166 14756
7203 14756 17831 10097 -13300 9536 9841 1353 931 25330 37576 35427 20828 7549 -5875
7190 -5875 33946 39909 18025 21402 19654 30686 16937 21709 13252 40626 34451 25550 -2552
7177 -2552 10816 47992 42948 29922 4748 13180 -3300 17387 30410 30941 13881 2081 -6062
7164 -6062 1073 7456 43499 28914 38519 48344 63141 85873 74226 75396 48860 60586 68964
7151 68964 58019 65226 15525 11104 23925 24096 38516 27257 26952 21836 34012 14334 39958
7138 39958 42301 15748 -4304 31931 30321 10657 35184 56571 92595 33661 30001 35539 24614
7125 24614 54352 75962 53867 67779 64276 48131 15185 20596 31892 35280 36238 48272 44180
7112 44180 24587 34018 37769 21007 15152 55059 65837 44402 45443 55308 63959 24444 18216
7099 18216 37620 39219 27428 -11780 -14644 -21165 -2235 43936 35037 27595 25234 2471 30970
7086 30970 42408 39880 47223 62485 67735 82707 72781 49961 13611 17115 68390 43635 46067
7073 46067 43002 50486 25012 18505 44147 37266 59228 39425 31182 34928 64615 97803 81894
7060 81894 77879 70028 50374 63003 60509 60670 45230 36228 25140 23660 46494 72953 40613
7047 40613 21307 26259 27430 35084 37030 13273 9044 2571 29731 53296 51740 49531 31463
7034 31463 52051 40261 55549 73988 59521 71462 70616 55385 63379 32669 28380 47124 43186
7021 43186 38929 15754 33800 36518 29373 46103 69680 74283 41732 18832 29963 45835 70832
7008 70832 32530 38103 54262 48928 37456 58890 67950 87528 78569 29475 48955 60606 75370
6995 75370 71545 59707 51242 64958 56120 56964 61474 31741 61461 55076 40582 47997 21647
6982 21647 37045 44336 79026 79150 54850 74207 58410 62250 68302 71036 44527 27610 68365
6969 68365 27225 5696 14958 49840 55326 40811 43005 68399 81638 76229 69216 51070 50431
6956 50431 60071 71118 93729 91107 62169 84730 37395 24827 40882 71253 83118 69263
6944 69263 61400 51384 66948 59881 49907 63153 116592 79166 104883 116729 108619 74861 57633
6931 57633 71442 49732 59237 48610 33171 40328 52282 44277 27879 56209 68194 51773
6919 51773 63721 56675 70979 68377 59795 79399 96667 95614 91114 102837 90478 100507 97180
6906 97180 96214 95454 80349 77561 75728 76082 56347 68787 99449 108579 59155 53289 76183 78120
6892 78120 75852 70040 70787 83128 82641 57395 47903 70289 69638 66689 67931 94868 94395 60936
6878 60936 73935 62679 61721 100315 111887 98599 115360 79032 91830 107186 107134 84666 100364
6865 100364 122766 95420 94707 107938 113773 105953 69246 56876 80423 78278 80926 92325 90840
6852 90840 99475 56818 90339 115780 107172 94313 74436 85330 89041 85518 88408 92084 122780
6839 122780 143073 123543 107413 83284 115149 103013 79441 75140 98766 103465 133057 124973
6827 124973 132660 126177 129819 147376 147916 131257 128175 146206 138932 104945 120602 102513 116913
6814 116913 124394 133122 135413 140927 132014 127335 133601 140558 151687 138302 132191 171648 175315 153446
6800 153446 116246 117243 112173 127450 120261 102555 136366 128713 118966 120451 111968 141681 148501
6787 148501 107932 80029 95388 108668 122453 154756 136320 143354 116186 130671 110352 119005
6775 119005 101925 120497 147010 144950 133084 129252 134786 123059 139232 138468 137047 114248 118831
6762 118831 141126 166852 154929 127232 152496 148511 167308 157038 128790 126848 179838 141220
6750 141220 154109 187904 205521 147997 119405 148899 154110 166995 176784 160577 122520 132373
6738 132373 138257 165656 160265 144886 173317 179926 162763 188406 227513 190464 163703 165309
6726 165309 158101 176309 175393 210483 218441 189374 172077 157079 180671 166550 193018 208209
6714 208209 172342 199898 191436 171480 182958 210115 194561 163772 177795 196890 212832 238206
6702 238206 263176 231500 202652 212358 193918 174428 192325 197021 177092 165954 165133 178718
6690 178718 207573 207654 222012 243689 227370 211506 212197 218246 208580 233150 266060 253626 263029
6677 263029 239720 259152 307662 294867 281181 248963 260246 265348 265205 246634 250963 273162
6665 273162 278635 278769 286491 251780 248031 250464 281764 315592 290290 268991 281619 280220 275682
6652 275682 294743 322356 308223 323339 311889 306634 301523 282747 280028 309129 283853 306455
6640 306455 321352 302994 340785 335993 320023 285711 296720 301999 306840 321502 362115 350593
6628 350593 345707 340730 319728 310493 342385 338107 328149 347840 346163 348320 349779 350348 323889 354632
6614 354632 357956 344108 373704 409034 381849 376637 374558 357731 369926 372701 358265 333112
6602 333112 361339 347749 369901 379768 404174 423186 411342 423700 390638 423165 418717 408979
6590 408979 409796 408569 421191 413789 409588 422239 427333 441036 414556 394159 412878 421029 446743
6577 446743 447580 434301 453272 494761 509942 511857 500367 485506 473605 497446 499852 494602 474518
6564 474518 470388 490759 507630 466740 469139 469624 500578 486786 485549 525975 519953 523645 534377
6551 534377 511145 506218 476681 458585 480418 502628 515636 507112 534552 522072 575557 578208
6539 578208 553984 563862 556221 555725 570078 577920 564701 582009 593624 594271 601434 605822 628768
6526 628768 662043 629881 617394 601686 642201 662803 670102 683917 701629 702811 684055 704162
6514 704162 754270 756184 741020 722711 714906 734744 725219 747552 716275 698728 730089 758795
6502 758795 770057 778460 787248 813164 823051 796021 814574 824611 824597 860419 835123 834489 846609
6489 846609 875779 885062 895675 938515 939072 912803 943516 956767 949905 973799 984918 997188
6477 997188 1014198 1010395 1011406 1022028 1046665 1031122 1017730 1045233 1097788 1102612 1109105 1095101
6465 1095101 1141200 1149103 1151374 1172866 1163574 1201535 1216538 1238669 1224109 1214305 1214453 1246649 1265548
6452 1265548 1269741 1317491 1335801 1349606 1366918 1374847 1379730 1403062 1439254 1465580 1456841 1489193
6440 1489193 1494435 1512013 1535795 1565301 1550965 1545496 1594913 1610190 1662294 1660542 1664172 1694181
6428 1694181 1717815 1728826 1764362 1799159 1830006 1834242 1836135 1886962 1931172 1953030 1970424 1984324
6416 1984324 2035963 2067670 2081694 2074604 2140030 2172956 2192973 2188008 2235018 2279718 2292426 2310194
6404 2310194 2359826 2425719 2442678 2476679 2532515 2577717 2581152 2605719 2624772 2666862 2696045 2749538
6392 2749538 2809614 2836764 2885508 2932093 2945439 3001126 3049928 3105750 3155021 3208176 3282056
6381 3282056 3341330 3387630 3453262 3525175 3589264 3649144 3704408 3763016 3811058 3866306 3933579
6370 3933579 4003264 4042351 4132653 4244265 4316018 4395782 4492177 4605719 4690651 4774790 4846990
6359 4846990 4932446 5050652 5170355 5290557 5342715 5440638 5568216 5655090 5787604 5913490
6349 5913490 6033723 6140545 6252640 6388691 6520380 6658329 6816113 6958956 7099178 7229920
6339 7229920 7373644 7510055 7626544 7779538 7926684 8097069 8217854 8396454 8533741 8681778
6329 8681778 8886100 9089927 9277510 9413824 9602995 9792718 9994308 10189442 10408202 10599806
6319 10599806 10799976 11047690 11257013 11503791 11764655 12014015 12265956 12525335 12793820
6310 12793820 13138560 13493608 13822571 14149840 14502951 14896694 15298182 15676167 16107219
6301 16107219 16579424 17050855 17540994 18087130 18633038 19176116 19764850 20386315 21050117
6292 21050117 21703913 22434531 23167694 23901129 24683569 25538164 26431323 27337072 28342162
6283 28342162 29394102 30438902 31580620 32754545 34015332 35334862 36744281 38211610
6275 38211610 39722858 41328268 43045131 44816468 46663506 48610168 50625113 52695437
6267 52695437 54862013 57086810 59340458 61591309 63831523 66030853 68183316 70279702
6259 70279702 72212550 74045889 75663384 77042760 78146732 78889948 79290245 79345138 78996148
6250 78996148 78262381 77178538 75759485 73977801 71929881 69692695 67332354 64843790
6242 64843790 62274741 59660068 57039193 54448929 51944352 49543131 47198806 44965786
6234 44965786 42843624 40814342 38916433 37097042 35388367 33791116 32269478 30842288
6226 30842288 29469966 28204676 27011315 25871189 24829733 23795411 22802650 21924139
6218 21924139 21087286 20285692 19506563 18765518 18063165 17456004 16842282 16262663 15720784
6209 15720784 15176219 14678055 14186335 13713942 13297777 12913921 12504974 12126876 11791412
6200 11791412 11484025 11165167 10834747 10532914 10267171 9994115 9732712 9488634 9263131
6191 9263131 9018474 8777413 8577268 8343423 8125455 7924995 7752610 7570905 7369134 7230420
6181 7230420 7088721 6879533 6686330 6529157 6405037 6257557 6104403 5988126 5864660 5717086
6171 5717086 5567353 5438018 5284262 5162998 5053160 4936017 4816984 4700891 4639223 4530810
6161 4530810 4420018 4330159 4229711 4143664 4084857 4028188 3913713 3831524 3774290 3717148 3592216
6150 3592216 3522348 3468953 3353544 3313437 3272090 3187706 3148176 3069874 3000562 2952605 2916296
6139 2916296 2911004 2886747 2827704 2802833 2768395 2711254 2648809 2622636 2591897 2471447 2454922
6128 2454922 2446463 2422916 2381474 2327622 2304215 2282849 2232933 2183277 2133422 2126401 2094059 2051123
6116 2051123 2018432 2009328 1990558 1989083 1938223 1926862 1909055 1849264 1812744 1794506 1772164 1736857
6104 1736857 1701590 1677915 1646792 1642947 1630748 1599650 1594658 1594104 1588883 1541612 1543114 1527059 1535864
6091 1535864 1501702 1500842 1473795 1445896 1414157 1404984 1387089 1383859 1361503 1321560 1317837 1311735 1289280
6078 1289280 1251663 1221875 1234373 1247660 1216785 1195179 1175051 1135912 1105605 1105685 1110330 1075668
6066 1075668 1065644 1034924 1027808 1035503 1032389 1032741 1017081 978953 965675 965007 946825 935477 925942
6053 925942 928657 936330 908604 872115 885110 850595 866670 864968 847612 843936 799456 790579 793645
6040 793645 811232 786543 770564 783346 789584 790174 763813 716863 692720 699321 706429 708935 690178
6027 690178 704730 687258 663702 669145 655253 676123 673380 640475 623251 622379 604245 603796 589272
6014 589272 570251 619419 597335 587353 559779 543666 517950 520748 526015 558514 586845 549667
6002 549667 540458 556115 524785 498900 497028 479720 461256 443452 468843 484287 457425 469563
5990 469563 457686 463104 461839 435771 424107 456520 468010 460868 432458 425716 450357 440774 428062
5977 428062 421100 394200 380898 391144 397546 364059 324715 364329 389667 395899 390348 387865 387773
5964 387773 389900 383540 386004 349070 355734 366590 383894 364274 338921 321920 313639 336616 326205
5951 326205 350983 325149 361265 392139 405978 405798 388059 410292 372185 352851 345173 319660
5939 319660 317561 306787 306334 285668 278792 299845 296547 291852 269138 264941 262464 250844 253332
5926 253332 276127 264628 224034 229225 254549 236093 235635 220351 241159 245251 198792 214283
5914 214283 224311 187899 208210 218625 218037 218896 205408 210666 178412 153480 154449 170900 194944
5901 194944 184476 181106 163419 163396 195474 195264 194765 211196 204336 183424 194901 171978 175282 184184
5887 184184 159098 179665 138206 137149 168835 182638 192197 185387 172535 178241 159392 173840
5875 173840 151626 109524 146784 145179 145822 140962 114688 140920 137712 139169 112875 128932 156304
5862 156304 135351 97974 87283 111411 127571 170399 140249 136934 129120 116880 101158 96079
5850 96079 91033 97540 131266 138703 134822 109755 102248 119358 138403 151641 133030 110744 125010
5837 125010 125530 107721 123664 127001 122967 91188 94382 97948 136915 137063 115977 150490 124044
5824 124044 107524 126295 127080 135759 121725 82541 84351 93358 101139 84329 87641 72314 96395
5811 96395 94089 101762 111240 105272 111217 118425 125328 110040 85439 73557 111628 83484 88747
5798 88747 113059 101824 120112 118616 127560 136649 111716 127104 150462 136580 157748 187796
5786 187796 146205 103573 99817 107699 124794 147375 139693 136354 117696 119302 87827 102494 94857
5773 94857 62143 62906 56328 83871 141846 141256 142672 91834 118232 142735 139438 101664 71187
5760 71187 78412 91018 87184 94805 80195 88589 72908 81209 95369 65374 74513 76352 75669 70913
5746 70913 70124 49705 47666 44750 57215 91917 81023 60902 65304 64222 96694 102914 96624
5733 96624 84200 80634 49721 53799 69485 91769 48674 42302 62262 75830 48317 44182 65670
5720 65670 88180 72282 76330 69908 70545 63506 60582 42468 35297 49890 73156 79771 98523
5707 98523 108726 93093 74170 91631 99482 92216 71293 92196 45027 49540 105627 107763 119530
5694 119530 98031 102414 110632 123407 108145 76842 74287 60495 68968 71232 33607 34236 31982
5681 31982 34363 71619 91932 77274 93278 55529 95905 134788 121131 97264 102508 92079
5669 92079 91764 113904 93133 95991 74221 93209 90785 70779 66285 46789 77227 64979 54394
5656 54394 90965 77867 67375 84022 74286 101812 99392 53141 67094 114718 104696 88875
5644 88875 76882 95069 112691 108762 131210 92726 64617 65781 63007 86696 93750 102657 111318
5631 111318 123607 101116 80500 107651 130283 112575 67562 88328 125861 120429 100920 84162
5619 84162 101739 126936 108644 81638 92575 69968 80337 67391 48044 56290 51129 57773
5607 57773 67514 74016 78143 45047 49440 54246 52123 77283 72512 78020 103277 81393 68832
5594 68832 63540 44622 17120 28764 50972 72080 93582 97606 93844 65682 114535 109241 99809
5581 99809 117542 112506 115189 117064 103384 88829 97115 92291 72481 101614 51886 24210 54068
5568 54068 63926 79252 93704 67237 70262 80790 76947 91625 117421 98721 64410 73478 72497
5555 72497 101279 80838 115929 118057 87052 88864 113712 127836 129823 128110 122153 118142 88099
5542 88099 80202 91783 91610 88291 100717 94672 90588 101465 94528 84752 85239 105958 111335 118725
5528 118725 125850 106238 90366 97306 100325 114845 113446 111030 86119 80055 99365 121736 131770
5515 131770 111646 102289 122087 129995 132024 141238 109999 134366 160487 137751 99461 67817
5503 67817 78988 120532 107590 145833 106045 104826 159357 162296 152306 164086 159117 120592 136322
5490 136322 167018 165764 139359 162207 169461 155872 166190 155497 173517 182638 150014 146827
5478 146827 136987 145014 156575 152834 137978 175796 166558 150657 176284 182691 140367 132194 140025
5465 140025 150734 151391 137766 134857 140817 135397 116830 134092 113156 133405 145930 170252 163015
5452 163015 166434 168495 174970 184459 216800 209966 197612 183908 179689 182979 184505 224321 245069
5439 245069 232930 217743 196023 189013 204610 217401 214370 220088 213096 189350 235043 240511 214638
5426 214638 236070 227830 217541 232651 225539 213951 204497 219887 206096 202512 178899 185971 200611
5413 200611 206794 255596 228480 242150 275388 279264 260906 227742 227872 260628 272339 277675 301850
5400 301850 318739 293511 264505 280492 316457 306742 290359 272052 285434 334036 301291 323067
5388 323067 336015 324704 343153 353326 331608 348298 387139 417529 429115 447148 476665 497381
5376 497381 511290 514958 516946 514323 485613 440984 401877 390998 362536 344466 319399 342310
5364 342310 372503 373198 337415 336480 335007 332200 308318 323755 353714 336190 333067 331604 319386
5351 319386 339402 333131 325709 324487 303451 316801 322010 297344 304324 329097 316151 300296 303755
5338 303755 304046 335768 332152 361694 361591 357752 354106 344853 371416 343696 326599 350103 375489
5325 375489 349436 350865 356952 401663 390935 373778 391849 421170 429737 440585 455783 473572
5313 473572 476059 493505 543522 528042 497530 467060 444573 429298 414223 407498 385169 416094
5301 416094 421398 437077 412617 407793 410101 406345 398298 418846 428653 395536 386399 406128 395311
5288 395311 394681 382715 350858 328566 345287 338763 353471 388539 359047 357683 393724 363147
5276 363147 371353 370530 352602 386320 343808 333884 373409 360468 365205 361718 368875 380373 371694
5263 371694 385143 409416 429049 409141 428906 404176 388096 386775 390804 385391 373913 385209
5251 385209 395031 409345 384924 407417 445041 440672 443860 446940 452796 443735 456616 431487 419742
5238 419742 439692 446349 463884 472409 503827 466022 488716 531105 502747 508496 524485 537100
5226 537100 535937 536082 513152 517442 523987 559253 556982 553933 564612 556916 558651 554057 549796 558506
5212 558506 600393 618583 600962 592781 610660 608392 632222 662771 663084 651599 658652 697343 662926
5199 662926 674127 680983 661642 642707 647600 683405 692186 711321 733108 726893 721436 729798 742238
5186 742238 747227 765154 794408 790259 788987 802284 806214 841738 853861 851925 890155 909649 909866
5173 909866 918096 953555 979780 989100 1013671 1017179 1015116 1014277 1031234 1079855 1144298 1187673 1200086
5160 1200086 1224037 1280387 1284558 1297735 1311959 1350430 1360751 1378472 1388969 1430988 1480018 1506974
5148 1506974 1519967 1504368 1554172 1581750 1631849 1648423 1685033 1724550 1781755 1843378 1922100
5137 1922100 1942120 1999044 2088293 2133773 2150466 2175905 2254819 2314719 2346505 2373552 2428407
5126 2428407 2489873 2511662 2568772 2608177 2655713 2748516 2778080 2802195 2861207 2950036 3032607
5115 3032607 3089285 3210476 3348463 3443253 3530301 3649016 3731495 3867971 4021685 4164341
5105 4164341 4284583 4435009 4592403 4768984 4942875 5095757 5321201 5524755 5775037 6030388
5095 6030388 6298480 6542818 6815261 7117852 7487730 7760973 8032855 8353606 8629182 8891458
5085 8891458 9142556 9418056 9666979 9939832 10264116 10610905 11024471 11529493 12081059 12645791
5075 12645791 13237096 13889037 14647576 15588436 16616327 17853617 19351354 21222153 23653464
5066 23653464 26714713 30013968 33340645 37420004 42590866 48595084 52633265 51593599
5058 51593599 47737000 43617270 38923459 33718874 28894994 25031188 21917950 19456909
5050 19456909 17526403 16022254 14755970 13684146 12835137 12163940 11585716 11088523 10663050
5041 10663050 10303487 9991399 9735138 9483497 9251974 9031136 8809428 8575487 8337344
5032 8337344 8137092 7898781 7661507 7441471 7255165 7076207 6966715 6863244 6728998 6643841
5022 6643841 6550410 6471162 6453851 6439174 6441255 6505909 6638993 6801460 7015668 7207805 7457325
5011 7457325 7752194 8113754 8527525 9010517 9549244 10167412 10965074 12011537 13460885
5002 13460885 15166752 16937850 18904371 21388864 24443411 27532879 28610651 27317462
4994 27317462 25162725 22540399 19618731 16632830 14078680 11995013 10347440 9072420
4986 9072420 8078601 7261149 6558439 6026096 5581470 5199393 4874682 4585803 4358529 4145427
4976 4145427 3951084 3754975 3552445 3371189 3207896 3029694 2869284 2764345 2662779 2558199
4966 2558199 2451417 2372688 2270881 2212733 2143025 2092451 2035983 1959804 1879561 1844323 1816847
4955 1816847 1792413 1763101 1746568 1713187 1659219 1633077 1615572 1590858 1610171 1602317 1602392 1599331
4943 1599331 1578904 1533789 1519699 1479384 1455689 1446118 1419747 1426378 1388249 1347846 1335857 1332481
4931 1332481 1329450 1312628 1295709 1279073 1222029 1241433 1260935 1292628 1295346 1285100 1222516 1209266
4919 1209266 1235518 1231269 1217381 1190691 1220112 1208805 1212443 1249548 1278200 1285380 1274423 1296714
4907 1296714 1307561 1257924 1229075 1243484 1248419 1196974 1177790 1202310 1215199 1227655 1228248 1199235
4895 1199235 1221093 1206719 1184836 1204370 1224627 1228795 1258089 1268977 1261132 1279162 1306635 1312680
4883 1312680 1345518 1408935 1436903 1422950 1391112 1405062 1420049 1405386 1369478 1348049 1354497 1363768
4871 1363768 1359633 1342343 1366278 1369097 1372553 1405049 1380147 1403857 1381889 1380155 1400563 1404821
4859 1404821 1368169 1334317 1310450 1307882 1279695 1248913 1195767 1131434 1138518 1171090 1149869 1130844
4847 1130844 1136472 1129182 1095529 1086781 1055528 1040537 1009994 1023390 1064466 1040676 1018414 1022987
4835 1022987 1034587 1042519 1076631 1044426 1024683 1032522 1026815 1048591 1042066 1079543 1109862 1106195
4823 1106195 1159946 1181951 1196469 1239244 1258148 1298379 1390084 1425550 1435852 1502884 1560959
4812 1560959 1537234 1503952 1470762 1398810 1366994 1295305 1232585 1239940 1193412 1161051 1138637 1110300
4800 1110300 1099779 1058899 1061087 1047381 1018511 1031535 1020036 1047013 1038284 1031413 1017882 1024127
4788 1024127 1025393 1037453 1069526 1077074 1093264 1097960 1085262 1108148 1102120 1118873 1117616 1122055 1158826
4775 1158826 1176097 1188854 1170745 1169696 1152465 1164046 1177398 1205101 1242015 1264807 1254524 1232861
4763 1232861 1277628 1303171 1315241 1320361 1342686 1356289 1363473 1368946 1394706 1418069 1449396 1441208
4751 1441208 1456130 1493519 1497102 1517724 1550801 1589790 1618534 1659375 1711647 1749277 1779863 1782742
4739 1782742 1802237 1802450 1816160 1802949 1780791 1792955 1760081 1755778 1800783 1801733 1818339 1821307 1823940
4726 1823940 1834508 1862053 1920849 1968370 1999075 2008286 2029644 2086282 2145760 2157436 2209102 2235782
4714 2235782 2241308 2268007 2282852 2325923 2337129 2299733 2343406 2377229 2438326 2485666 2537323 2578567
4702 2578567 2624811 2652096 2645738 2677968 2715002 2757056 2811450 2863227 2939922 3010098 3065309 3148032
4690 3148032 3241777 3253251 3344060 3406832 3446702 3506451 3552964 3627787 3699236 3795093 3884545
4679 3884545 4000071 4122272 4236478 4353986 4414500 4477943 4581851 4689953 4774068 4868802
4669 4868802 4945753 5042960 5163362 5220577 5336329 5486760 5643882 5782181 5946394 6123464
4659 6123464 6226324 6372493 6542886 6660001 6821606 6991289 7142243 7294207 7420249 7597409
4649 7597409 7775648 7925877 8137124 8365986 8591928 8819456 9062917 9291385 9534904 9815374
4639 9815374 10054213 10308646 10586940 10864651 11144625 11417592 11755713 12109403 12500288 12930980
4629 12930980 13327627 13759463 14237127 14756876 15283582 15841143 16428301 17029324 17701573
4620 17701573 18393371 19139397 19919853 20697855 21514429 22403012 23340104 24343913 25416267
4611 25416267 26566436 27860008 29322410 30844119 32470829 34180071 35929386 37814004
4603 37814004 39884229 42050786 44183778 46163897 47867855 49274933 50400878 51339548
4595 51339548 51991018 52492883 52933253 53427927 54045996 54792767 55671604 56683205 57766181
4586 57766181 58932145 60247413 61660745 63173210 64869918 66613279 68373342 70197093
4578 70197093 72114945 74206864 76411099 78800774 81293664 83912441 86646978 89433048
4570 89433048 91989740 93881297 94684256 94454053 93357738 91505008 89111496 86438229
4562 86438229 83645278 81003970 78576536 76347956 74271238 72267162 70342287 68426063
4554 68426063 66644454 65077669 63632126 62386024 61350960 60519066 59789358 59184646 58767354
4545 58767354 58535075 58448799 58410599 58442484 58434003 58366819 58264698 57869280 57080271 55881135
4535 55881135 54358524 52698407 50999759 49394894 47977116 46857013 46035752 45599698
4527 45599698 45461017 45620961 46042271 46705248 47648738 48980386 50770074 53014940 55749702
4518 55749702 59191670 63641125 69308811 76384536 84557067 93412758 103343225 114719794
4510 114719794 126349671 134246704 133976642 126834055 116776394 105058998 92376028 80081724
4502 80081724 69364579 60422979 53050175 47056273 42150005 38101547 34788797 31964683
4494 31964683 29595163 27615022 25910245 24430508 23134893 21999251 20912411 19881900
4486 19881900 18938336 18050210 17186526 16387351 15650999 14975989 14350701 13784665 13287927
4477 13287927 12782077 12297236 11881709 11428221 11029249 10668394 10303376 9975490 9676196
4468 9676196 9386945 9162942 8962764 8766556 8624027 8452000 8337119 8246762 8174733 8139115
4458 8139115 8103912 8054226 8020692 7984642 7959807 7936429 7946764 7913466 7840560 7791142 7726411
4447 7726411 7587203 7488448 7374376 7239311 7156406 7086468 6990700 6936839 6910428 6858152 6842927
4436 6842927 6854072 6827828 6783621 6807781 6831420 6850456 6871637 6909777 6928586 6980066 7022806
4425 7022806 7071343 7154839 7211516 7308478 7391275 7436816 7456196 7496842 7560928 7534197 7467555
4414 7467555 7320861 7137674 6974335 6776114 6591161 6402590 6204169 6025348 5897889 5815076
4404 5815076 5674371 5542977 5433625 5323185 5230278 5146128 5088226 5023058 4961245 4922001 4907516
4393 4907516 4829770 4806424 4780787 4719251 4690663 4675553 4634057 4578729 4576027 4522807 4428098 4303169
4381 4303169 4201144 4047925 3929758 3806447 3664476 3551107 3444598 3343931 3281693 3208315
4371 3208315 3111668 3065675 3017208 2905725 2802300 2705757 2614239 2510771 2431504 2350484 2269522
4360 2269522 2203070 2125772 2108908 2070959 2031895 1998075 1959761 1964946 1930805 1917993 1891593 1838005
4348 1838005 1791938 1801809 1787644 1729873 1735746 1713938 1657658 1630527 1601096 1601609 1616259 1610136
4336 1610136 1603611 1612635 1593108 1554513 1561003 1537084 1525905 1508798 1482466 1467072 1471525 1453507
4324 1453507 1452340 1471002 1472396 1484824 1471874 1445539 1461620 1449784 1448845 1470982 1449043 1430584
4312 1430584 1412930 1400292 1375533 1375877 1341819 1338990 1383187 1417093 1413672 1406871 1414159 1408302 1392868
4299 1392868 1400605 1446177 1424591 1439209 1450250 1453135 1491915 1528057 1560310 1581364 1596540 1640864
4287 1640864 1679381 1675397 1696125 1708407 1728431 1738473 1731437 1762783 1763913 1816483 1822189 1819032
4275 1819032 1837708 1880151 1943470 1995235 2052332 2059648 2102178 2170187 2193530 2268367 2303038 2360876
4263 2360876 2462301 2533061 2654869 2754967 2850617 2973284 3135355 3293080 3484192 3728882
4253 3728882 3959613 4229858 4585460 4976635 5400021 5836259 6272933 6684778 6943686 6871597
4243 6871597 6569917 6176567 5706858 5270100 4861513 4475563 4181022 3913787 3706995 3529541
4233 3529541 3344457 3200726 3022554 2845049 2701156 2562474 2417268 2323960 2248011 2162162
4223 2162162 2120325 2062626 1973602 1941975 1905120 1852326 1812704 1787897 1738941 1720203 1711244 1683829
4211 1683829 1654496 1690953 1681340 1721128 1757457 1787933 1790263 1798363 1845732 1869468 1887625 1848551
4199 1848551 1793914 1723453 1673193 1604380 1533966 1473435 1446549 1368632 1335290 1331919 1316407 1301455
4187 1301455 1269975 1261878 1272721 1240939 1227720 1194451 1170358 1198681 1177941 1165188 1187314 1196295
4175 1196295 1182025 1154412 1196369 1191927 1151866 1191449 1185828 1184466 1189518 1189796 1163674 1146399 1175290
4162 1175290 1197798 1202437 1222654 1237334 1230801 1237508 1238477 1246133 1267183 1255351 1244331 1257562 1257546
4149 1257546 1250750 1238745 1244477 1252826 1240666 1232982 1257517 1266533 1266335 1242959 1220456 1209252 1233146
4136 1233146 1266506 1258402 1256895 1271259 1288872 1322080 1341863 1349243 1349037 1378076 1420921 1465088
4124 1465088 1476961 1425279 1421586 1441906 1431657 1474603 1486910 1499743 1540778 1592589 1616628 1630134
4112 1630134 1633330 1635115 1643860 1669197 1671918 1713489 1727957 1732334 1754459 1774686 1808603 1839109
4100 1839109 1862663 1921378 1933749 1955557 1984686 1964515 1955883 2009405 2061189 2098023 2107735 2101465
4088 2101465 2108608 2124658 2151509 2178069 2200118 2265093 2274496 2320849 2387498 2440473 2487242 2527534
4076 2527534 2568770 2583160 2575439 2616886 2679587 2705244 2743410 2746136 2781954 2819207 2856125 2889592
4064 2889592 2976094 3001324 3028353 3096583 3170851 3237015 3318368 3419735 3502544 3570273 3633004
4053 3633004 3704991 3764754 3834841 3919272 4035251 4106678 4182744 4293047 4366445 4462732 4561401
4042 4561401 4638033 4728359 4802337 4878490 5027017 5094221 5191675 5264627 5368504 5468098 5583668
4031 5583668 5718676 5911332 6065745 6249496 6438709 6643937 6820240 7014658 7224119 7431342
4021 7431342 7628783 7838833 8039105 8228650 8408268 8601339 8830582 9071664 9324648 9595202
4011 9595202 9860299 10171255 10475832 10758802 11069382 11401248 11707333 12052028 12426898 12885134
4001 12885134 13339808 13787428 14247217 14711754 15219992 15784469 16378122 16963460 17584512
3992 17584512 18338722 19105368 19945918 20832329 21794148 22689883 23595770 24362486 25094925
3983 25094925 25765989 26406747 27129186 27980966 28938272 30064878 31455707 32966910 34628151
3974 34628151 36376294 38125805 39701760 41073453 42307518 43306814 44200230 45231941
3966 45231941 46554811 48167024 49971096 51964368 54392483 57163438 60322263 63767379
3958 63767379 67428770 71162223 75217651 80037561 86233399 94471986 103525237 112088487
3950 112088487 123160193 138418498 157798637 170435085 163201861 150740234 139846138
3943 139846138 126886356 112402235 99687223 89880151 81781490 75283897 69984628 65716698
3935 65716698 62059877 59222694 56842191 54976376 53509796 52435689 51507713 50706947
3927 50706947 49801380 48882415 47700616 46300172 44694863 43027065 41348213 39753748
3919 39753748 38310356 37091015 35967108 35061377 34184838 33412718 32673784 31884777 31011332
3910 31011332 30050383 29007251 27929721 26756599 25627553 24496415 23504838 22486561
3902 22486561 21624858 20849943 20142673 19466711 18814256 18170031 17530669 16851264 16189930
3893 16189930 15471391 14792158 14101466 13451689 12840405 12275604 11720233 11221663 10724202
3884 10724202 10280480 9888821 9550838 9190098 8886557 8590451 8336228 8076883 7738999
3875 7738999 7443070 7213903 6994011 6778527 6563581 6403319 6189066 6053130 5888140 5737304
3865 5737304 5609441 5522106 5433188 5304130 5200279 5136052 5007344 4866410 4703539 4517055
3855 4517055 4395663 4306142 4223551 4149425 4079500 4001106 3927198 3841474 3812464 3780269 3750005
3844 3750005 3669805 3643030 3627057 3593562 3547149 3480780 3451770 3449914 3423105 3383958 3353019 3338643
3832 3338643 3321514 3346573 3314448 3267800 3251027 3217985 3185974 3129899 3126062 3133680 3083506 3067811
3820 3067811 3046029 3033587 3002930 3003778 3004818 2977813 2944763 2981059 3002106 3043381 3025186 3034575
3808 3034575 3039984 3052322 3001366 3006769 2998887 2996001 3006541 2988276 3005644 3035911 3065204 3077482
3796 3077482 3089416 3099308 3100149 3133224 3163897 3167207 3216269 3230146 3263638 3318543 3356731 3408109
3784 3408109 3401115 3416693 3427755 3451929 3486510 3523016 3523626 3535016 3567119 3608547 3682749 3749298
3772 3749298 3799544 3834541 3876351 3927851 3977103 4031047 4112857 4188407 4223299 4308568 4360265
3761 4360265 4409108 4469525 4479680 4556848 4611976 4662796 4681021 4715747 4755005 4795917 4827704
3750 4827704 4880978 4968160 5031566 5126687 5209975 5296232 5377418 5437083 5519324 5642039 5704244
3739 5704244 5728499 5778592 5869411 5946093 6080341 6200778 6317539 6432840 6564110 6700141
3729 6700141 6846307 7008868 7183819 7303712 7431524 7619392 7816710 8012984 8186742 8382063
3719 8382063 8563075 8773204 8989703 9194276 9432087 9594467 9762412 9978973 10150126 10381435
3709 10381435 10617989 10866074 11142961 11458839 11814403 12165599 12564976 13011086 13462277
3700 13462277 13953275 14387537 14788152 15125483 15475838 15718641 15951398 16220044 16499413
3691 16499413 16809402 17103485 17469972 17912969 18357973 18921441 19554075 20262187 21049011
3682 21049011 21873056 22849130 23898756 25043866 26328724 27755939 29250431 30871380
3674 30871380 32629291 34468577 36383874 38447567 40666512 43001574 45422106 47731401
3666 47731401 49683774 51194152 52267127 52956160 53465679 53736242 53977696 54481624 55314988
3657 55314988 56438961 57929065 59710020 61608752 63454363 65152043 66608754 67754274
3649 67754274 68652945 69356539 69985857 70668892 71487677 72667779 74229310 76285276 78834805
3640 78834805 81762990 85062558 88619513 92059457 94671995 95742077 94847281 92407454
3632 92407454 88956042 84901935 80622019 76585161 73116212 70276900 68055164 66361580
3624 66361580 65092011 64121129 63317024 62524963 61636912 60518939 59124761 57411009 55360121
3615 55360121 53154976 51071529 49114822 47451803 46214840 45311493 44667183 44178152 43730814
3606 43730814 43233308 42474271 41352010 39714061 37742069 35598067 33415594 31265809
3598 31265809 29262880 27425002 25735221 24204144 22767255 21493628 20355987 19288861
3590 19288861 18368691 17564956 16853695 16247169 15740306 15303124 14897884 14547401 14233873
3581 14233873 13987246 13759404 13622781 13501233 13387905 13276535 13195429 13079566 12964916 12764448
3571 12764448 12588302 12396759 12169475 11962979 11767483 11557489 11419829 11273170 11174921 11086624
3561 11086624 11045311 10998630 10994233 10977095 10989343 11051116 11068188 11093198 11072097 11102344 11132284
3550 11132284 11116776 11161191 11149291 11143144 11155556 11171090 11190119 11209441 11254067 11281995 11325314
3539 11325314 11412751 11518905 11627137 11726047 11870275 12019252 12168175 12306957 12460494 12655651
3529 12655651 12831699 13034797 13240675 13462515 13679289 13919527 14150491 14427830 14689097
3520 14689097 15003316 15248409 15503772 15814174 16107991 16450342 16777097 17173456 17581473
3511 17581473 18019790 18432474 18867306 19334614 19812099 20316375 20785556 21269363 21755699
3502 21755699 22280518 22863551 23445629 24065372 24705623 25396804 26205063 27004042 27860481
3493 27860481 28870926 29937324 31053533 32284062 33610844 35071606 36705543 38470449
3485 38470449 40400488 42552921 44932550 47595333 50522848 53747852 57207008 60786961
3477 60786961 64338470 67808544 70979474 73751385 76000633 77659758 78734364 79189546
3469 79189546 79206564 78917602 78463937 78038004 77702857 77680942 77891137 78266975 78712241 79031132
3459 79031132 79073059 78729497 77863285 76400868 74315227 71724896 68706883 65353954 61948770
3450 61948770 58569422 55349181 52384038 49713441 47378868 45365323 43703829 42267887
3442 42267887 41004000 39945071 39073624 38335226 37696836 37235362 36891531 36699566 36606064
3433 36606064 36683023 36871441 37116658 37424661 37798916 38168443 38598073 39041520 39480699 40004883
3423 40004883 40601928 41339686 42239676 43335832 44622884 46146799 47911328 49917086 52173766
3414 52173766 54628900 57268035 59997990 62769918 65459485 67887725 69997805 71739894
3406 71739894 72962379 73685950 73959867 73817769 73384067 72765257 72092309 71444870 70886648
3397 70886648 70427835 70076273 69695108 69246024 68552085 67518058 66151462 64349506 62107791
3388 62107791 59507379 56557521 53423294 50213626 47031250 43889784 40941422 38260819
3380 38260819 35814602 33579387 31614305 29921710 28427535 27125902 26016044 25015323
3372 25015323 24102901 23305034 22606181 21985134 21449443 20959531 20539062 20138732 19773279
3363 19773279 19480587 19205906 18968502 18769707 18634647 18498528 18393475 18370144 18342121 18273698
3353 18273698 18281875 18269442 18286909 18276506 18343089 18434545 18514943 18594516 18726755 18918470 19116800
3342 19116800 19329251 19561443 19830088 20151518 20497635 20858467 21293283 21769659 22291329
3333 22291329 22879131 23518595 24186832 24905705 25682428 26472507 27259588 28132665 29001887
3324 29001887 29782579 30525258 31114657 31560381 31877402 32045195 32080294 32051775 31966293 31859111
3314 31859111 31692144 31556633 31486609 31492998 31584084 31814720 32077688 32424339 32857348 33373477
3304 33373477 33953966 34551241 35173411 35870338 36596401 37373801 38188212 39091618 40051093
3295 40051093 41059134 42174976 43382628 44729453 46186144 47801605 49544201 51449628
3287 51449628 53524703 55767273 58246284 60965044 63969183 67276610 70923568 75011966
3279 75011966 79448104 84305295 89520742 95055356 100792649 106531675 112053761 117181194
3271 117181194 121792437 125742556 129102030 131916489 134034501 135563144 136461122 136738538
3263 136738538 136632224 136231306 135636805 135023094 134352780 133689060 133074505 132518800 131997925
3254 131997925 131466918 130759633 129804428 128578480 126998513 125063897 122789437 120216231
3246 120216231 117470350 114650776 111911552 109349961 107060385 105115302 103548024 102494580
3238 102494580 101948881 101845178 102296954 103280870 104727739 106639236 109045732 111920135 115237490
3229 115237490 118948249 123020086 127337988 131781161 136170307 140409932 144336047 147759863
3221 147759863 150642493 152957965 154674968 155817410 156487301 156760586 156830308 156764683 156649756
3212 156649756 156575702 156561522 156680716 156983782 157415345 158018311 158658004 159314981 159925664 160414563
3202 160414563 160721041 160778754 160600443 160180752 159549712 158781427 157933200 157061831 156363908
3193 156363908 155974184 155999198 156556562 157798997 159755064 162447252 165785985 169691319 173975199
3184 173975199 178544819 183200776 187807646 192266459 196494287 200386214 203944500 207213796
3176 207213796 210335508 213453235 216631089 219939470 223302117 226532160 229551658 232163771
3168 232163771 234155322 235434427 235865810 235403166 233983033 231680318 228586814 224873755
3160 224873755 220663081 216122318 211289894 206217338 200961567 195504823 189853393 184088570
3152 184088570 178185391 172216440 166208607 160166684 154051476 147895633 141714289 135560106
3144 135560106 129357126 123105432 116842126 110691494 104655376 98782319 93139871 87757324
3136 87757324 82652679 77861084 73481594 69439145 65751225 62404332 59404747 56718994
3128 56718994 54327389 52225509 50327298 48649131 47202204 45930291 44796718 43780462
3120 43780462 42799191 41870351 40955442 40041818 39203674 38366864 37540618 36807139 36157862
3111 36157862 35570116 35026582 34562177 34150408 33778389 33408851 33053309 32726380 32363404
3102 32363404 31947582 31540801 31103472 30678195 30221855 29761281 29304596 28857848 28443469
3093 28443469 28053659 27683229 27357640 27054077 26743719 26455376 26151164 25878848 25601913
3084 25601913 25302950 25032641 24779752 24550090 24363855 24218756 24088125 23981924 23938917 23926594
3074 23926594 23885312 23806322 23741130 23700166 23670627 23663972 23657190 23585006 23543023 23504426 23464489 23464313
3062 23464313 23498252 23515431 23595123 23729174 23848322 24017813 24233230 24461954 24782087 25117320
3052 25117320 25469332 25841095 26266506 26750558 27318310 27881843 28476484 29146927 29866839
3043 29866839 30496589 31130621 31767790 32418117 33126749 33870246 34672714 35575128 36548324
3034 36548324 37608534 38754002 40002352 41399386 42848721 44452483 46207619 48165433
3026 48165433 50389180 52938657 55795173 58994412 62554602 66451064 70607717 74937501
3018 74937501 79385918 83969347 88586909 93279199 97929823 102437267 106693500 110552132
3010 110552132 114011024 117069413 119777878 122164939 124253859 126114858 127734974 129078639
3002 129078639 130190173 131045475 131596271 131634932 131145497 130005139 128143299 125502307 121973448
2993 121973448 117631630 112551826 106769386 100502641 93925953 87257683 80679403 74325321
2985 74325321 68367472 62895741 57904595 53416018 49439440 45907853 42807177 40027059
2977 40027059 37574875 35432990 33434199 31661987 30095982 28660523 27318402 26155035
2969 26155035 25064063 24082716 23195352 22373102 21628110 20950646 20361254 19803183 19335011
2960 19335011 18879732 18484682 18154013 17853611 17581621 17360993 17170416 16991570 16812505
2951 16812505 16651855 16510105 16397111 16250722 16086152 15870738 15609099 15320444 15019404
2942 15019404 14730237 14407497 14045526 13694235 13389937 13101036 12771425 12515844 12305186
2933 12305186 12095136 11889953 11704160 11491513 11340947 11190068 11030512 10838764 10678465
2924 10678465 10522386 10360025 10244318 10129380 10019417 9977640 9951114 9899712 9874224 9817112
2914 9817112 9809851 9766301 9698496 9647219 9610106 9581406 9556027 9540611 9489838 9432822 9431272 9469942
2902 9469942 9452096 9486893 9552257 9605613 9641657 9692866 9770476 9859202 9929069 10016258 10058362
2891 10058362 10084456 10120955 10219393 10284536 10359108 10441453 10521172 10637233 10770551 10906000 11046196
2880 11046196 11196827 11318889 11496055 11654696 11820018 11948003 12080193 12255872 12380632
2871 12380632 12481698 12636845 12791024 12932228 13085266 13292424 13462292 13680878 13878597
2862 13878597 14127859 14330866 14511258 14666705 14768120 14855444 14988776 15141628 15266813 15388456
2852 15388456 15518919 15701507 15907080 16137393 16438259 16793458 17151118 17536129 17922325
2843 17922325 18300665 18740146 19198975 19607339 20027777 20458879 20875496 21322941 21774074
2834 21774074 22230654 22707371 23258334 23806595 24370662 24965178 25569406 26183797 26785360
2825 26785360 27348477 27932345 28543136 29142751 29800137 30479011 31208353 31998768 32888958
2816 32888958 33789387 34734527 35698402 36753841 37826429 38859598 39974126 41165831 42401261
2807 42401261 43712993 45100579 46525128 48079356 49647985 51293176 52977924 54786861
2799 54786861 56706887 58744877 60908559 63199536 65651031 68276420 71045468 73847425
2791 73847425 76770514 79743662 82812887 86028123 89414332 93133494 97255220 101824743
2783 101824743 106951256 112689758 118976459 125640678 132677293 140111565 148087012 156837664
2775 156837664 166599793 177633290 190252391 205063301 222886694 244229220 269112372
2768 269112372 296958692 327659102 361498986 396929393 428203144 447069522 450027023
2761 450027023 441472861 427291006 410990531 395740114 384825719 379944359 380816410 386380385
2753 386380385 395826903 408210338 420721760 428106907 424621248 408811349 383923127
2746 383923127 353713518 320938899 288138899 257541811 230341600 206812802 186641806
2739 186641806 169271723 154241246 141212320 129881897 120004140 111388499 103858534
2732 103858534 97274153 91396400 86122393 81313077 76843044 72686995 68804921 65179180
2724 65179180 61805370 58679055 55855553 53299345 50980890 48868864 46858928 45057585
2716 45057585 43412414 41834261 40338298 38935370 37548396 36207340 34995394 33832203
2708 33832203 32691838 31663127 30718086 29780077 28888022 27998281 27169951 26413294 25678991
2699 25678991 25022975 24355335 23731096 23083077 22458304 21870761 21305731 20689660 20061165
2690 20061165 19404012 18770094 18208215 17644272 17133766 16666046 16250384 15818013 15434715
2681 15434715 15112581 14773957 14430132 14101981 13730102 13399101 13022613 12597634 12247612
2672 12247612 11903875 11581046 11294276 10998236 10763017 10551280 10353074 10165976 9959764
2663 9959764 9762295 9570746 9388805 9187751 8978930 8782008 8565657 8353927 8160414 7978637
2653 7978637 7797154 7688237 7590250 7491293 7397289 7347302 7311675 7266570 7211906 7127129 7047590
2642 7047590 6904544 6821482 6733763 6657916 6568632 6448166 6395713 6290575 6184897 6098602 6014555
2631 6014555 5945464 5866100 5793667 5723223 5653467 5606279 5527008 5451194 5367169 5226632 5122978
2620 5122978 5021606 4940819 4855854 4768215 4733290 4667149 4623378 4612622 4560351 4492642 4480754
2609 4480754 4418746 4371267 4360187 4304958 4260365 4207563 4163423 4122851 4053162 3977138 3935873
2598 3935873 3891950 3856201 3822031 3840303 3840076 3811173 3805966 3758422 3727040 3729407 3703151 3635261
2586 3635261 3551431 3483212 3454045 3404702 3380747 3349572 3313274 3265806 3297748 3304576 3288410 3258813
2574 3258813 3241064 3182697 3079779 3031901 2990566 2947889 2907027 2828853 2752663 2728075 2709293
2563 2709293 2684796 2699030 2689685 2646128 2640869 2654050 2627811 2564819 2540587 2492287 2464973 2423950
2551 2423950 2399275 2369518 2371011 2335643 2318342 2323583 2336629 2347633 2325857 2318730 2300639 2273100
2539 2273100 2243064 2231080 2224559 2217123 2199577 2202855 2211887 2215864 2217869 2185590 2196968 2203514 2195110
2526 2195110 2157741 2148400 2100776 2074073 2051031 2059768 2087403 2070797 2061165 2085278 2060895 2046306
2514 2046306 2025682 1999760 2020368 2000516 1992663 1995450 2002528 1998752 1995664 2001122 1997493 2035289 2069240
2501 2069240 2071763 2075611 2103575 2144620 2178412 2233387 2262284 2300505 2337536 2389661 2459845 2526976
2489 2526976 2575310 2661884 2747795 2857519 2985387 3123312 3285121 3472171 3634828 3756684
2479 3756684 3778047 3725873 3687945 3631204 3507828 3429285 3390086 3370251 3403588 3409220 3452751
2468 3452751 3470134 3512580 3512331 3439851 3364616 3226150 3086916 2884641 2715136 2561959 2392160
2457 2392160 2275702 2166558 2014238 1925339 1855694 1766161 1713374 1643321 1601669 1548810 1479723
2446 1479723 1452727 1426212 1383117 1338004 1318320 1279206 1287164 1259391 1198541 1195405 1156888 1157091
2434 1157091 1142466 1119687 1155939 1120444 1115666 1120475 1105082 1069694 1055198 1024690 1005259 1002863
2422 1002863 983491 952100 914325 907155 889764 842694 841887 838163 817378 783242 736067 705689
2410 705689 698197 697142 669467 653552 659284 660556 624501 603831 596377 620063 605341 575911 541745
2397 541745 542546 523272 525421 490699 483552 487328 509696 499173 488036 469938 433716 424893 437243
2384 437243 440791 436040 420510 405577 408031 398034 417307 396725 376384 370765 378908 386937 385022
2371 385022 404792 416335 394233 368182 397512 398295 426070 428726 400449 398570 397599 384875 398085
2358 398085 384664 378476 375110 366113 374713 355411 345341 330991 332614 352717 322992 293496 314721
2345 314721 295901 316590 319720 302972 308933 309370 293758 337324 302433 265994 253764 241570
2333 241570 232346 249776 289901 272595 223204 254433 250015 227244 230069 232194 223176 207692 197296
2320 197296 192065 209423 208289 233178 218196 238458 260501 225011 259181 265375 274965 274028 274643
2307 274643 301560 298365 289332 276969 275556 272970 285399 294125 270387 264719 268140 266610 308007
2294 308007 303158 283479 273134 296124 285381 291996 275672 254843 242836 210119 189447 208598
2282 208598 182636 190656 217360 214178 220872 190664 177401 169637 146510 140112 168846 159951 135416
2269 135416 115477 86420 100903 119625 123843 153402 133575 129038 152003 160815 138559 110896
2257 110896 115796 129490 131574 127620 144433 151434 139566 125021 140831 140914 155746 176208 156617
2244 156617 204815 211429 203700 178686 150002 158055 160898 141185 141730 122853 113454 118085 90183
2231 90183 84510 101560 155555 141520 126004 97358 49736 103021 98149 76083 77750 90577
2219 90577 82063 74681 95727 82702 69731 91757 84669 79720 90367 58963 86043 99530 100590
2206 100590 120611 128376 125851 103556 96414 104362 121310 123062 111460 126780 77966 63079 82538
2193 82538 101546 96237 82155 72830 88165 113281 103837 84063 77818 94974 79815 88684 63005
2180 63005 73727 102321 85667 63333 67923 91402 95938 89755 96443 117831 112777 131721 118814
2167 118814 109557 102453 117166 89199 105718 121452 109681 101847 122468 151726 115568 99796
2155 99796 103919 73981 73358 91199 87740 94726 77287 123074 113781 68485 95975 98111 98911 86538
2141 86538 89506 107548 132362 116727 101497 119088 143495 111020 86038 118893 102171 114905
2129 114905 93965 97019 110165 90027 78376 102525 72959 69879 70226 66940 85181 91303 88540
2116 88540 83828 119919 91182 47154 70160 48351 58125 70990 76322 82898 54341 72524 93748
2103 93748 95808 95112 83748 77948 74194 46382 28700 68103 69226 59919 54113 68489 80100
2090 80100 73143 78580 79736 54829 57904 29254 24791 43993 83523 131481 113440 94832 116260
2077 116260 112074 81468 102412 118051 109914 95386 82139 54242 84975 106132 91564 77338
2065 77338 83818 76538 97641 119098 92350 98922 108778 139173 157925 116862 146168 147204 160960
2052 160960 160429 160081 131054 128235 156425 165819 153705 175878 190167 198929 238870 263350 255273
2039 255273 256417 282131 276466 278874 261556 266700 267944 260432 273957 299789 281905 267359 275307
2026 275307 304423 325528 322940 325263 344246 353103 376120 393570 425287 448307 437862 470455
2014 470455 473197 511290 543540 564703 575579 609348 615947 625969 674385 688765 698881 757515
2002 757515 811445 816961 857796 901219 968963 1017542 1046146 1089404 1168162 1267986 1366057 1478000
1990 1478000 1640628 1732190 1840143 1975797 2106947 2249850 2483530 2772276 3204143 3762326
1980 3762326 4339896 4896990 5663933 6618415 7852044 8637062 8121947 7290365 6528117
1971 6528117 5628694 4704691 3889842 3264685 2771664 2389703 2096894 1888060 1712817 1595892
1961 1595892 1487889 1375085 1278271 1185362 1123487 1052978 991571 923009 877352 776491 726800
1950 726800 678135 611702 565409 562223 516822 469835 460917 479841 456722 455449 427808 388283
1938 388283 363114 328727 320700 299799 278726 275861 262178 260247 263693 256948 285710 242472 222109
1925 222109 238994 274178 252440 236840 232649 243912 229308 207279 216952 221946 231142 170079
1913 170079 181733 169793 177331 184504 156883 155723 151669 112807 103820 120036 136477 119913 95176
1900 95176 66396 43890 64507 88004 77101 80131 59450 59207 84633 87914 109149 68444 80838
1887 80838 81894 53108 52481 53969 72210 82510 75796 50634 31684 59936 44405 31498 32855
1874 32855 58542 41734 47383 46069 10962 -9383 22085 170 10291 13045 4430 1480 18446
1861 18446 31267 62204 46886 61299 83800 37149 36473 39868 36944 22398 21477 33440 42376
1848 42376 20664 -34756 -23514 -28572 -25663 -3148 -4643 12299 10998 6013 -3290 -2105 -17798
1835 -17798 -2686 -7079 15371 27662 22344 9546 5371 12103 17508 22885 3393 7427 7579 4305
1821 4305 22948 16132 -8915 9517 36623 26391 17316 22962 44934 18931 44129 37052 8126
1808 8126 -17996 -12140 -14901 12081 -919 -13957 -5705 -2203 2851 -24369 -21611 -30635 528
1795 528 -11953 -12246 -5768 -9058 -12117 -18736 -29941 -73228 -50054 -32151 -23386 -11113 -24308 -28305
1781 -28305 -12103 21122 9750 1529 25528 11309 -8980 -18684 -20067 -23922 -42940 -41788 -8748
1768 -8748 1746 -6851 -10101 -24515 -26334 -45992 -46674 -22523 -25537 -27796 -9737 -15301 -1112 31422
1754 31422 26424 31035 -476 -11032 -26071 -30544 -33796 -53278 -29702 -9229 -22353 -20792 3392
1741 3392 747 368 24094 -18652 -2880 -14947 -28078 -12720 -705 4323 -2061 13234 12287
1728 12287 -1211 -3906 -18158 -27888 -30880 -41791 -15662 -15312 -23484 -4307 10439 18274 34937
1715 34937 -7446 -17847 15584 8563 -17581 13582 12026 51801 40723 4083 29957 27241
1703 27241 25915 37901 12809 11263 39078 47225 39417 -4185 -21725 -19626 -17838 2062 -41148
1690 -41148 -32619 -17522 -34165 -38636 -21083 -29033 -15012 -32679 -22346 18402 15789 7687 20632
1677 20632 20130 9698 22382 55826 37418 20512 13929 12114 -3276 -14441 590 -4904 -41572
1664 -41572 -59528 -59656 -74146 -59154 -34986 -22045 -62296 -56675 -53324 -40484 -10413 -9745 -4393
1651 -4393 -19533 -29409 -29101 -27027 -34313 -44149 -47967 -40247 -35718 -39848 -33511 -17808 -19256 -13576 10164
1636 10164 -29442 -40934 -36502 -28593 -55317 -47320 -61444 -58073 -37126 -70372 -75943 -59787 -50170
1623 -50170 -54652 -55544 -64338 -49692 -16984 -32670 -45805 -36573 -25557 -18517 -48509 -52668 -11965
1610 -11965 -9481 -36302 -31723 -11904 -2758 7661 -20701 -48772 -40758 -35074 -34449 -34568 -31792 13867
1596 13867 -5995 -4578 -7761 -25331 -61756 -87700 -73400 -77228 -83222 -44996 -4693 -25797 -7046
1583 -7046 1497 14371 17180 -17532 -19746 -23174 -36832 -22902 -27182 -798 -3244 15113 25337
1570 25337 17877 21945 12516 -2934 -38397 -7416 -36667 -27829 -2707 20114 8006 -6821 -11938
1557 -11938 -17885 -43883 -35858 -34418 -37947 -64837 -57769 -68809 -43994 -37973 -51104 -33481 -45000
1544 -45000 -40570 -22699 -10498 -39514 -52576 -83363 -45294 -40700 -7967 17702 -5146 -51295
1532 -51295 -58102 -38524 -55480 -49821 -2134 -34455 -14000 -17490 -24709 -31970 -25164 -60110 -72768
1519 -72768 -55234 -65752 -67816 -30176 -35276 -16184 -25016 -61220 -26461 -13630 -11032 -10653 -34474
1506 -34474 -33419 -9335 -30034 -17012 -24515 -22262 -14553 -23540 -18259 -23441 -53113 -57417 -72391
1493 -72391 -44196 -32685 -45770 -58587 -78451 -55886 -22630 -48954 -51051 -28010 -29670 2330
1481 2330 -29168 -41909 -26187 -60595 -67628 -93260 -76740 -32296 -31837 -28673 -40921 -54882 -45343
1468 -45343 -29420 -8044 -10154 -34158 -44292 -43877 -44180 -41825 -54193 -35186 -25264 -51668 -27742
1455 -27742 -11872 -16112 -15155 -9408 9295 -6473 -32650 -14676 -33464 -32109 -6885 -13176 -38291
1442 -38291 -31334 -10926 -12150 -32847 -3480 -2814 -23352 -46931 -26362 -32328 -21491 6044 -15390
1429 -15390 -10280 -14010 -44830 -25798 -19259 -24010 21310 -1732 -20714 -52338 -48517 -16367 -5590
1416 -5590 -11638 -19519 -37261 -34879 13351 21626 14848 -7376 782 -9404 -14862 -18244 -59993 -37130
1402 -37130 -53303 -22333 -21175 -32293 -28992 -15467 -7041 4934 -13886 -26826 -15956 -18081 -24397
1389 -24397 -37485 -26597 3903 19932 11863 5495 -850 -20064 19328 5614 -14603 599
1377 599 -583 -17201 -19902 -8054 3215 -8895 -31450 -19259 -20002 3527 21772 88 11564
1364 11564 -4761 -9048 -23954 -24578 -7265 -23475 -36559 -16951 -6885 -25187 -266 -3051 -26961
1351 -26961 -8734 -23572 -45951 -32319 -25052 -15695 -61179 -48939 -55399 -11566 8538 -14829
1339 -14829 -17865 -13459 -6599 -3467 8338 -17159 -30384 -43888 -70086 -64266 -53525 -43763 -33843
1326 -33843 -49648 -47309 -41446 -20893 -2114 -24405 -54270 -42328 -34978 -28565 -10686 -17941 -37572
1313 -37572 3 2109 -25108 -22921 -24467 -20714 -33235 -4565 1562 -33114 -27244 -29491 -20848
1300 -20848 -21889 -27431 -17602 5498 -644 -28421 -48516 -83043 -67752 -53506 -40095 -37209 -25530
1287 -25530 -31146 -34148 -17718 -12046 -10240 31977 41844 39481 13587 15620 7893 29349 30866 1958
1273 1958 -11300 19732 1666 -15459 4249 -16796 -12614 33494 7220 -44639 -30664 -22705
1261 -22705 -13972 -17353 -37899 -28791 -20519 -13508 -970 -6369 -40404 -24297 -17737 -29237 6194
1248 6194 2477 12998 6991 -18992 23563 30610 -1865 -22021 -39248 -34780 -34562 -3669 -31912
1235 -31912 -29755 -559 12438 -14409 -2269 5745 4689 29972 -7914 -44478 -25513 -47823
1223 -47823 -40169 11695 -11056 -29216 -28013 -30796 -29706 -26085 -5840 3661 -3390 -7034 -15663 -10093
1209 -10093 -7832 1644 18794 29957 41834 44451 35987 13197 56858 53457 8317 -26379 6399
1196 6399 -13609 -13092 -23380 -18501 -6441 -13000 -1152 71 -25093 1008 134 61 -16457 223
1182 223 53360 27882 -30047 -24890 5983 -4931 8169 9185 11160 -2757 -10312 -15827 -32565
1169 -32565 -28328 -28371 -37842 -48680 -49058 -38712 -32886 -8137 -48617 -50171 -60236 -19005 -9191 -1157
1155 -1157 -10657 -12318 18125 -45521 -56613 -18043 649 2843 -21450 -36873 -28284 -38503 -45175
1142 -45175 -19293 -25407 -27117 -43618 -41168 -36060 -8550 12234 -10289 -7292 9237 -6854 -4325
1129 -4325 18967 43835 -1934 -5972 1296 -3569 -3579 20022 -4452 -42516 -59133 -31869 12189
1116 12189 -7846 -17993 -40472 -25357 -9045 -36497 -34408 -21769 -32932 -30222 -29958 -55390 -35832
1103 -35832 -11389 13614 7671 -1885 23784 -35614 -40237 -36036 -43922 -41949 -42769 -32895 -26549 -10836
1089 -10836 -5245 -23305 -13662 -13212 -6274 -22896 2454 -2516 -6046 -7155 -30854 -30868 7010 21334
1075 21334 15441 -7195 3135 3479 -16442 7412 2850 -24477 2026 14051 -7689 -7043 -37566
1062 -37566 -42832 -26149 -30403 -18949 18193 -3855 -2655 -9785 -11975 2914 16364 9425 -16305
1049 -16305 -22237 -35962 -61965 -43637 -10450 -12880 -16601 -27689 -34011 -20092 -17245 -5881 -42743
1036 -42743 -38505 -5360 21020 25846 11966 -7729 -32827 -18649 -34069 -38494 -39080 -52630 -71287
1023 -71287 -24764 12630 25212 9110 -9748 -42905 -66176 -31672 -19881 -22495 33038 46808
1011 46808 41194 36781 4199 14597 5189 2186 9262 -15399 -2450 -14853 -6508 25764 41555
998 41555 51208 23564 25938 40266 -10668 -13858 -13295 -1847 13451 15063 15899 -6032 -6720 -42449
984 -42449 -26943 -54772 -52894 -39738 -21156 -4362 19641 8160 19816 11527 -7905 7629
972 7629 6824 11855 17608 -434 -22060 7502 18500 3821 33127 25340 30353 35903 -26984 -4824
958 -4824 15980 -14844 13510 24045 5373 2792 27035 45507 17906 1204 -34553 -33491 -8701
945 -8701 17534 9666 -8016 -8848 -17751 -16063 4131 20466 27044 15501 -2995 23401 23097 -14202
931 -14202 -24502 -21814 -23391 -9960 -8408 -8505 -52414 -49386 -54302 -55453 432 114 -24654 -48221
917 -48221 -57266 -20731 6164 102 -18278 -42371 3239 -6074 -6182 5689 28285 -21518 -17919
904 -17919 13448 8529 16099 -9571 -9388 22324 35505 19388 17803 -3501 -13422 -2964 -3210 -9811
890 -9811 -7371 -6206 -16187 -2235 -15578 -33862 -23634 4471 -36584 -21392 -448 11638 -14009
877 -14009 -20883 -6091 1787 18122 11139 12825 -22728 38468 20097 1756 -13732 13948 -8279
864 -8279 1533 14191 41180 28151 19932 43956 17514 16757 5805 10744 -12740 4620 -13283
851 -13283 -23378 -6869 -14204 -24999 -19941 11356 27868 -17205 -15965 -13387 -13962 -30407 -16255
838 -16255 8393 7961 25037 30631 -4159 17388 21467 17941 1828 -13051 25864 25422 14390
825 14390 17767 46210 21760 -10618 -11350 17247 -11957 -12564 15864 15932 15806 8610 41632 38021
811 38021 38564 24635 -10639 14840 14951 -19154 -33706 -18105 -18146 -6682 6023 -26730 -6455
798 -6455 34308 31273 54843 70401 39627 26001 43392 60857 41309 45575 62505 26600 22995
785 22995 17203 43536 38263 31734 20141 25484 12529 16774 5059 2989 -1679 12998 16531 -16512
771 -16512 -3036 21548 35572 3520 2811 24037 -14891 -18526 -14223 526 -18979 -12847 -4316
758 -4316 16551 -4716 -2842 36479 16444 21351 3350 25968 37175 41517 32040 37950 23262
745 23262 22315 11344 1930 8324 22153 -551 16557 8806 5527 12986 -21384 9607 55091
732 55091 23281 -16419 -25511 -12787 -25892 9033 -8256 6419 27508 -20063 -13805 36743
720 36743 10233 -4566 -22130 -19230 -8263 -13591 -17305 4138 20480 21559 -7041 -14678 43241
707 43241 46986 39882 21967 27674 17922 6404 -1525 3228 10025 8495 -5466 -15372 -44804 -51002
693 -51002 -38893 -12328 5111 2476 59035 62341 5418 12215 35332 27356 31123 26224 22270
680 22270 -1377 -43859 -34482 -1655 -6938 -32687 -4859 -1063 25111 3621 -26026 -24406 -2506
667 -2506 -12629 -404 26735 40315 17409 -6355 -4387 36077 73948 36841 4467 20376
655 20376 34435 5370 46314 77424 61137 30026 -5047 8274 47895 47394 8738 6766 37312
642 37312 42702 37456 17037 24461 38326 44400 32856 11592 20575 6405 5638 7332 22605 49052
628 49052 48124 77882 34205 -8452 21437 12172 39224 48547 37293 6097 -11122 -426 7753
615 7753 35398 9770 19360 23619 24263 53994 40150 21793 19790 22059 25848 24952 24707 5688
601 5688 7127 1476 -13916 -15769 25878 7298 -10584 -11248 -11747 7133 3291 12677 26050 27844
587 27844 38211 25032 -10252 14893 24117 29497 59881 37623 22470 28563 19357 35674 4589
574 4589 869 21326 44109 53318 45006 31256 9135 13990 24438 43740 26988 13182 63041
561 63041 78616 65709 44232 52685 56137 64528 78517 37736 35070 31937 41764 35262 16142
548 16142 29422 24590 17002 23981 20170 24792 35764 34110 22017 11377 15861 -505 21811
535 21811 6114 12522 -10886 -20099 18829 43166 46506 58413 54498 28989 19793 38084 52714
522 52714 37165 55466 21915 19004 19114 16599 58858 67797 40133 30749 40759 46901 49781 34695
508 34695 16167 8354 31061 39938 20132 14987 8304 -7831 6174 30380 25215 20670 52302
495 52302 56952 50660 32575 13474 21531 -13644 16057 7952 -15547 9572 34374 34427 31521 26704
481 26704 11753 29788 31732 35919 35426 20439 12163 2804 16491 54052 40594 26364 78516
468 78516 57865 35817 31846 26807 44770 56577 59407 63391 36804 60996 69327 29210 11667
455 11667 31169 43498 40781 3228 8435 53868 23280 40575 73751 71510 47546 11092 11535
442 11535 31548 31944 6108 22115 45951 14658 43902 59973 55053 50825 23348 69614 79217
429 79217 41836 18467 661 3251 16203 21856 18226 11396 31644 36149 50071 32526 49696
416 49696 53107 -1784 26722 64795 45876 1084 32147 49050 54437 61242 93566 65609 45445
403 45445 35632 52252 44093 35316 17972 36885 63532 64085 43773 45911 51133 45773 47869 11861
389 11861 16510 -4992 32106 23151 26652 33758 5519 47305 63387 66210 83610 88176 50736
376 50736 24111 23873 36446 52071 57392 49032 45850 40951 29689 39046 40205 26954 31503 27406
362 27406 23501 21155 39174 35564 23117 59989 78598 59227 21888 43653 29951 19288 35857
349 35857 41823 -3157 24161 66252 48482 67969 66300 47539 36505 57907 85609 69370
337 69370 27663 15302 42235 56124 76936 72776 48878 44080 30580 20872 32771 45913 47490
324 47490 62889 58356 75153 83574 29984 31889 67330 68200 28927 25657 60085 52758 61553 50780
310 50780 52226 65638 67111 44961 48021 8160 25968 57504 70323 72953 51962 61582 83510
297 83510 74418 72932 69596 57424 65549 95303 97336 52700 40854 8435 16704 18123 15766 12197
283 12197 42358 68212 43520 63741 66086 38969 36715 54068 56556 36695 21552 46127 56942
270 56942 43682 38345 23735 47541 33015 43676 34876 59906 57813 27012 40145 57843 66374
257 66374 96005 67592 39220 26386 30721 35983 45446 57711 36301 37284 36657 43759 39265 30114
243 30114 37026 50580 20292 34982 49799 45661 43315 25263 17841 3590 26084 68080 66730
230 66730 67149 57102 57721 52419 53897 46833 44186 41598 30585 59816 50340 45485 69392 71873
216 71873 68172 41467 30215 33025 54631 41073 15942 26683 30191 48614 78366 68915 63355
203 63355 73714 68513 84507 83367 67417 44850 54003 40370 14221 38375 23660 11156 14556
190 14556 24278 19382 -3175 11553 36006 63483 65736 30425 52226 46774 13676 24263 25559
177 25559 39738 76959 63236 64883 88692 37911 37715 51159 46238 29001 30218 32616 29775
164 29775 67620 67817 65220 82249 80032 75523 72067 63645 72739 51753 34700 45981 57512 59190
150 59190 61435 59661 64050 74999 77569 87697 85148 83331 75922 65727 46143 64682 56857 32851
136 32851 57332 74970 52777 68508 95251 64274 62534 72703 72994 51102 57855 49197 32839
123 32839 48632 64116 49907 47844 36593 50978 51632 33046 51283 56788 57135 64582 60556 48771
109 48771 38668 30192 34050 68797 28583 34592 76675 73874 64710 67645 62183 39849 14524
96 14524 13012 12690 29187 46340 45484 59580 68527 34832 7974 41625 29695 52051 70872
83 70872 65823 53480 57304 42268 52126 48954 44351 30687 24474 27876 14939 39943 27641 30553
69 30553 36738 41625 57218 51616 60098 54928 72067 52431 31756 44035 57777 36497 44353
56 44353 60401 54452 49890 51605 66014 65232 46414 55629 50252 50933 49621 49217 56693 61780 57052
41 57052 55625 49420 42695 70331 83780 86696 72599 69526 86229 75980 77555 93330 60832
28 60832 31224 39052 65261 56126 65222 50925 32891 50084 60416 72063 65743 34450 35866
15 35866 62648 65173 76581 72522 66724 62299 65822 48129 42642 44139 34139 29373 25778 50157
1 50157 43362
0 43362
$$ Imaginary data points
##PAGE= N=2
##DATA TABLE= (X++(I..I)), XYDATA
16383 -2915402 -2892327 -2857707 -2817531 -2792014 -2768344 -2733722 -2698792 -2674460 -2638200 -2587581 -2526768
16372 -2526768 -2486488 -2480917 -2439118 -2399829 -2379722 -2352585 -2302288 -2269681 -2235410 -2194644 -2165703
16361 -2165703 -2150918 -2130100 -2089290 -2069806 -2043660 -1996586 -1958083 -1931898 -1896535 -1843904 -1804636
16350 -1804636 -1788264 -1741284 -1724468 -1687013 -1649758 -1609584 -1589333 -1559671 -1520312 -1477258 -1423345
16339 -1423345 -1417497 -1394455 -1371836 -1335940 -1311679 -1309251 -1266168 -1242642 -1200407 -1142557 -1127354 -1084056
16327 -1084056 -1043516 -1005075 -1002420 -982492 -922627 -895976 -863206 -822658 -796958 -789423 -769089 -719909
16315 -719909 -684340 -639670 -632293 -600156 -605889 -570183 -531308 -493824 -442746 -411914 -397946 -359541
16303 -359541 -317196 -300897 -283392 -249006 -222412 -198235 -184632 -162252 -128201 -113508 -103180
16292 -103180 -71716 -22279 -14889 9428 37264 60129 97475 132394 141455 162822 210504 239745
16280 239745 259331 274218 257304 293912 350396 375525 416039 436848 455613 482452 487105 528961
16268 528961 568141 574091 578635 604545 625515 644867 661377 670248 705021 734614 721920 741756
16256 741756 769575 798506 822148 861291 871298 888389 920932 950923 955433 970943 986457 985207
16244 985207 1003196 1024218 1055667 1086902 1105072 1121330 1143593 1137828 1161660 1169821 1198532 1203062
16232 1203062 1205381 1216108 1257217 1292227 1290201 1299739 1350495 1342894 1340552 1362663 1376513 1394532
16220 1394532 1419741 1421056 1413406 1445789 1454706 1496900 1516620 1559686 1545229 1558314 1574549 1572132
16208 1572132 1582937 1581015 1600519 1603041 1620766 1655005 1678477 1694106 1681995 1688670 1707724 1758189
16196 1758189 1757527 1737200 1776080 1768268 1793611 1806986 1818987 1834801 1854175 1846571 1884693 1881909
16184 1881909 1865096 1898851 1879397 1905461 1911694 1923501 1939109 1952984 1973531 1958327 1968947
16173 1968947 1994564 1990311 1992320 1998609 2022101 1988268 1978952 2046282 2059056 2068964 2091881 2078421
16161 2078421 2072553 2052609 2078515 2093228 2078632 2105473 2139504 2122482 2114802 2125153 2142242 2153806
16149 2153806 2143498 2174971 2165638 2160607 2183637 2192542 2208138 2207019 2186679 2193141 2187960 2214430
16137 2214430 2230851 2212495 2228883 2222900 2233577 2232335 2209496 2233961 2257395 2269831 2259236 2266017
16125 2266017 2268469 2248192 2261691 2284714 2275166 2284074 2311475 2294176 2301989 2295070 2292554 2321475
16113 2321475 2303503 2306269 2307703 2308105 2315173 2317733 2294101 2326229 2311310 2323682 2342466 2325656
16101 2325656 2325421 2349737 2325128 2341185 2352425 2365772 2349469 2331458 2376033 2359913 2364088 2371287
16089 2371287 2354613 2337252 2327097 2328471 2387336 2392594 2376084 2372987 2385200 2399907 2402773 2408471
16077 2408471 2427082 2391638 2363322 2408084 2418675 2372683 2390555 2417489 2443070 2428798 2416723
16066 2416723 2439524 2424458 2387431 2401908 2426269 2403967 2398373 2428684 2411159 2433565 2427121 2415083
16054 2415083 2411415 2395228 2419518 2409613 2419321 2431714 2416268 2419373 2430159 2417414 2415606 2446703
16042 2446703 2492760 2460642 2419282 2424123 2458481 2464408 2425497 2414969 2441367 2432798 2431001 2439541
16030 2439541 2420098 2440425 2431540 2443918 2450524 2455983 2485364 2460060 2481661 2480774 2453492 2457874
16018 2457874 2453154 2444685 2431668 2425918 2439581 2441606 2437036 2468704 2457946 2415825 2396569 2443796
16006 2443796 2441325 2440897 2463100 2447538 2469567 2462121 2450913 2423151 2425462 2397649 2417358 2472719
15994 2472719 2475839 2439254 2417914 2436013 2451286 2438365 2430057 2428792 2434627 2457803 2441353 2427174
15982 2427174 2418168 2450814 2466205 2459841 2442564 2451541 2467842 2448835 2430280 2423223 2456846 2475379
15970 2475379 2481958 2480316 2453333 2462375 2470717 2458238 2465963 2462886 2461933 2425779 2461202 2481526 2458786
15957 2458786 2491115 2446542 2461455 2453685 2451718 2444782 2456515 2442394 2443998 2457856 2480358 2500449
15945 2500449 2485001 2481972 2490219 2483224 2469670 2450767 2430775 2416885 2437567 2471061 2491683 2516027
15933 2516027 2516618 2510775 2463334 2490895 2494764 2469800 2469029 2466465 2469131 2450812 2420433 2462130 2466587
15920 2466587 2496120 2485884 2499007 2494932 2480035 2451901 2439138 2427960 2440393 2439078 2475187 2476884
15908 2476884 2449247 2463853 2432626 2445502 2471615 2437059 2446489 2446054 2441116 2488624 2452625 2466019
15896 2466019 2464410 2468808 2485731 2489780 2474834 2493620 2495372 2474907 2461515 2453186 2456688 2459078 2453283
15883 2453283 2473048 2438695 2441335 2482414 2491697 2503434 2459796 2451016 2481377 2499368 2482873 2467592
15871 2467592 2493830 2526354 2517486 2502705 2478704 2483586 2502244 2488929 2467256 2494903 2487025 2496847
15859 2496847 2481894 2472715 2496220 2481728 2499102 2513143 2473858 2455958 2471734 2455743 2472610
15848 2472610 2481173 2472269 2467692 2490097 2492550 2455857 2465874 2471862 2485266 2487944 2466431 2466401 2461944
15835 2461944 2471909 2454328 2492485 2508874 2508769 2463255 2452641 2487321 2500831 2517138 2492794 2516146
15823 2516146 2518776 2492186 2499203 2480677 2477174 2507423 2508560 2491114 2523475 2518811 2500518 2481735
15811 2481735 2483951 2485617 2517221 2492588 2470947 2486591 2475594 2474439 2475717 2466494 2472772 2500849
15799 2500849 2509797 2508600 2524931 2506037 2516089 2525529 2508079 2506352 2492532 2469937 2483794 2511346
15787 2511346 2488681 2480360 2478070 2484470 2493465 2503591 2475271 2472795 2466495 2479319 2473550 2459455 2457090
15774 2457090 2484578 2490212 2466421 2456382 2482491 2511403 2483619 2492920 2518652 2525069 2532958 2552867
15762 2552867 2544082 2518824 2508421 2481479 2447223 2478028 2476887 2478455 2502090 2507533 2507786 2484875
15750 2484875 2489032 2496418 2511813 2477868 2490486 2499975 2495891 2495621 2510174 2509579 2508256 2497425 2458695
15737 2458695 2455848 2461004 2465165 2521541 2542796 2535487 2502921 2502271 2483513 2481088 2531606 2478043 2457607
15724 2457607 2492245 2489520 2503580 2511245 2521905 2530263 2508686 2493788 2508658 2523188 2517882 2497331
15712 2497331 2493477 2486872 2469596 2491967 2476521 2483945 2471924 2488055 2497421 2514074 2514041 2518616 2501321
15699 2501321 2536509 2544582 2513950 2517636 2508501 2513016 2511707 2486361 2486294 2520087 2500864 2512074 2528398
15686 2528398 2540044 2513318 2531070 2542787 2525985 2512214 2523002 2489424 2487048 2503165 2495030 2502490
15674 2502490 2496172 2503519 2509302 2496581 2512840 2506376 2508729 2533924 2518911 2519971 2518596 2509943 2503738
15661 2503738 2506973 2510771 2513283 2509393 2523059 2519478 2502434 2520530 2517824 2521635 2516760 2525816 2518715
15648 2518715 2506807 2498056 2482011 2516616 2510960 2524926 2533032 2520065 2537424 2532001 2532970 2531917 2527169
15635 2527169 2517842 2505864 2533087 2527212 2529036 2541763 2506528 2489124 2548763 2552255 2547839 2517738
15623 2517738 2504026 2532335 2508233 2512625 2509016 2528427 2537961 2501669 2518900 2501826 2476282 2494298
15611 2494298 2511775 2528988 2565590 2549548 2562762 2558059 2523793 2505797 2471929 2500580 2478873
15600 2478873 2488194 2523034 2540826 2572388 2534317 2563268 2573917 2542303 2551994 2522769 2508146 2527937
15588 2527937 2525295 2529951 2534041 2508166 2519660 2557391 2544428 2534080 2530034 2538779 2525207 2516578
15576 2516578 2514186 2498770 2506012 2551280 2563556 2527417 2519885 2525336 2525655 2546382 2557433 2570645
15564 2570645 2549612 2538026 2532465 2529336 2531654 2521190 2539516 2551740 2559008 2571400 2573267 2543300
15552 2543300 2519726 2524430 2529790 2550358 2577307 2547292 2550069 2522730 2512367 2534648 2533991 2540367
15540 2540367 2544302 2542858 2533909 2539007 2529550 2504090 2500165 2492923 2489314 2505575 2560190 2544524 2540208
15527 2540208 2564298 2583560 2561485 2555564 2543279 2555880 2519076 2534640 2556053 2538962 2543243 2519211
15515 2519211 2539812 2538026 2511279 2514587 2535210 2539624 2559178 2553140 2561365 2563222 2531228 2526485 2536577
15502 2536577 2550215 2548795 2540240 2541354 2538549 2534273 2533313 2529340 2514194 2530229 2596513 2590982 2550729
15489 2550729 2570758 2550701 2548354 2548677 2546008 2535060 2550090 2584827 2568231 2568144 2545874 2524350 2562392
15476 2562392 2563985 2568644 2554595 2558625 2564946 2569862 2561719 2586977 2577126 2562112 2545824 2524096 2504857
15463 2504857 2540396 2580756 2587191 2582924 2580414 2553708 2542914 2542332 2531040 2551523 2521269 2515111
15451 2515111 2552023 2582025 2558725 2566223 2545349 2569986 2595303 2559642 2558026 2572530 2535164 2570368
15439 2570368 2567861 2574652 2598633 2580189 2561424 2560530 2561553 2571520 2566269 2567693 2592537 2578466 2526867
15426 2526867 2554001 2575664 2566528 2566689 2561562 2542746 2562154 2567142 2583115 2602037 2588143 2615244
15414 2615244 2595460 2562320 2572364 2570668 2572486 2580616 2569839 2582651 2549291 2566926 2603153 2600913
15402 2600913 2591251 2580315 2582376 2551961 2552150 2563055 2584682 2574090 2550395 2564495 2530376 2520961
15390 2520961 2543017 2557807 2536251 2559605 2561582 2587384 2584869 2564849 2537006 2555496 2577263 2619156
15378 2619156 2586831 2571649 2582472 2539693 2567667 2572708 2584805 2618374 2555709 2570247 2590965
15367 2590965 2569313 2550474 2556806 2562288 2584691 2592844 2579555 2600430 2572207 2565855 2553997 2581626
15355 2581626 2585095 2592521 2599620 2595410 2612127 2599359 2592757 2612692 2610557 2631050 2596773 2596227 2618399
15342 2618399 2621572 2623070 2601758 2613880 2583570 2601833 2582548 2594613 2609199 2593738 2590508 2582154
15330 2582154 2582627 2581595 2609170 2620551 2642315 2601560 2584899 2597128 2607696 2628264 2620124 2591861
15318 2591861 2573806 2594209 2571909 2584241 2592478 2604472 2635823 2616434 2585580 2586453 2586382 2571810
15306 2571810 2553903 2590462 2592694 2579759 2592867 2558734 2553162 2549182 2591161 2601428 2615854 2624779
15294 2624779 2598655 2592493 2589648 2615883 2616905 2588452 2602612 2596850 2592296 2580854 2602327 2583462
15282 2583462 2587183 2600046 2567738 2578920 2588301 2627295 2620252 2627500 2602758 2581524 2620599 2607731
15270 2607731 2608867 2600405 2575979 2593807 2618679 2614466 2623604 2595640 2585246 2584211 2593231 2606781
15258 2606781 2592832 2605675 2627764 2632668 2641684 2598580 2648164 2650481 2617979 2583753 2604762 2616391
15246 2616391 2596658 2597889 2608996 2636622 2667610 2643288 2635321 2614735 2603574 2591670 2598041 2609528
15234 2609528 2583372 2594455 2597823 2579271 2562792 2587537 2642340 2642981 2602531 2557402 2563487 2591751
15222 2591751 2605870 2617798 2617160 2599417 2615894 2647268 2618861 2627193 2602815 2628573 2626178 2615950
15210 2615950 2626916 2638013 2631172 2638660 2619010 2636503 2628350 2647425 2638069 2599422 2610042 2611426
15198 2611426 2595111 2598935 2602886 2629299 2628571 2649911 2626824 2634143 2632295 2659643 2654181 2659589 2657804
15185 2657804 2645610 2674859 2631971 2612283 2599794 2636209 2632842 2610776 2611444 2633960 2645787 2619541
15173 2619541 2634240 2640921 2617888 2652351 2654844 2660584 2628657 2625103 2615563 2638002 2637522 2621337 2641363
15160 2641363 2644495 2600870 2585389 2626884 2619512 2636505 2618927 2648746 2670869 2661239 2639013 2636855
15148 2636855 2622645 2625064 2615040 2600918 2602529 2650655 2632422 2644377 2639944 2633589 2612946 2605475
15136 2605475 2635051 2639873 2627621 2631533 2650112 2652164 2629091 2597406 2635489 2635997 2626784 2652509
15124 2652509 2641259 2625144 2647876 2668696 2657132 2635517 2624523 2609419 2628048 2626101 2624600 2601026
15112 2601026 2633792 2667098 2653526 2649523 2664825 2677940 2656385 2640265 2662255 2649402 2676204
15101 2676204 2641934 2628858 2634632 2654834 2642856 2614364 2661956 2662407 2644744 2658389 2669707 2657038
15089 2657038 2660755 2637790 2619492 2623615 2602877 2595624 2614857 2626887 2646859 2651269 2624449 2601669
15077 2601669 2618518 2647173 2602895 2629377 2650732 2636499 2634375 2653587 2613182 2618011 2601241 2627444
15065 2627444 2651932 2650888 2662825 2653443 2642017 2641281 2649485 2650299 2660684 2647429 2678905 2686218 2667785
15052 2667785 2639668 2663911 2660371 2616352 2612138 2619279 2653323 2685965 2664417 2653456 2664301 2663430
15040 2663430 2658952 2657971 2720845 2691052 2674162 2653686 2631953 2667327 2684405 2646575 2647687 2674953
15028 2674953 2655761 2689398 2694163 2672705 2701554 2689008 2655727 2678295 2680557 2675101 2657463 2685501
15016 2685501 2680234 2661555 2655230 2623089 2628967 2647504 2649190 2655671 2665317 2663244 2650894 2698115 2687944
15003 2687944 2662102 2652136 2642625 2665272 2670823 2678655 2679742 2673112 2685752 2692442 2688794 2691343 2678497
14990 2678497 2669770 2682881 2688900 2684389 2660748 2667877 2665576 2671871 2671852 2675127 2654842 2662073 2685127
14977 2685127 2694861 2708209 2680056 2652164 2678125 2676406 2681250 2726968 2702606 2685366 2702694 2703993
14965 2703993 2677383 2682552 2672512 2638369 2668766 2651208 2682189 2666347 2654257 2645241 2618905 2670010
14953 2670010 2682695 2670105 2702331 2679650 2664496 2676301 2702636 2690690 2708375 2663267 2650162
14942 2650162 2683473 2719177 2696777 2665323 2679623 2687964 2705492 2702208 2702671 2689025 2717603 2703779
14930 2703779 2719893 2710966 2706671 2691799 2693469 2702093 2708948 2722987 2711329 2682864 2701886 2689646
14918 2689646 2647606 2655219 2675734 2673651 2646244 2652095 2691597 2696403 2694472 2696991 2706336 2702833 2689391
14905 2689391 2694985 2678570 2699120 2708316 2726651 2746559 2716631 2708214 2727699 2701099 2691524 2692980
14893 2692980 2693800 2713944 2696154 2716690 2706865 2703117 2690490 2678105 2644543 2663098 2677210 2716606
14881 2716606 2693137 2680515 2715981 2712557 2664649 2707617 2730570 2716814 2687248 2684627 2692602 2687462
14869 2687462 2674168 2674902 2676935 2657936 2656792 2675962 2726900 2703669 2683261 2689698 2707813 2696950
14857 2696950 2700399 2688117 2700055 2728986 2706322 2693534 2716082 2709289 2697194 2677165 2713233 2731527
14845 2731527 2723769 2699265 2717680 2717937 2715432 2737253 2711922 2683657 2654077 2687452 2685865 2681908
14833 2681908 2688671 2692099 2695271 2684994 2683895 2709156 2751816 2720097 2702545 2720467 2728439 2758866
14821 2758866 2733001 2687555 2715462 2713514 2689433 2706629 2710612 2724613 2753376 2715808 2724099 2728867
14809 2728867 2706978 2692469 2672789 2700655 2675844 2670918 2718137 2683279 2713036 2712695 2718030 2713077
14797 2713077 2706348 2691501 2687070 2719340 2714080 2705964 2722313 2716398 2692972 2714712 2714523 2742904 2741522
14784 2741522 2734775 2702547 2718652 2727390 2697863 2695206 2716776 2720401 2724222 2732988 2711167 2717736 2689173
14771 2689173 2707307 2702068 2674555 2706066 2744892 2737087 2713901 2730800 2714893 2732260 2755603 2759151
14759 2759151 2736349 2736977 2714278 2713653 2721120 2743657 2735771 2729664 2738002 2757378 2738312 2722834 2731084
14746 2731084 2741754 2791837 2778909 2751763 2739992 2757202 2764134 2745619 2715407 2730028 2776812
14735 2776812 2777906 2767500 2751216 2753999 2758252 2730796 2742772 2726084 2747537 2734047 2751972 2752153
14723 2752153 2731839 2718886 2745166 2692651 2684845 2713526 2720389 2738876 2762575 2772732 2769274 2784655
14711 2784655 2749446 2732998 2741162 2760058 2764462 2748636 2729626 2721950 2734777 2746909 2734244 2754180
14699 2754180 2764040 2717223 2734382 2768189 2743432 2760669 2770292 2740910 2716657 2758092 2755528 2765000
14687 2765000 2770216 2765904 2754213 2714306 2736324 2761959 2751821 2754367 2734488 2746719 2752415 2740903
14675 2740903 2758717 2724093 2730563 2730645 2721837 2724074 2725428 2710277 2731752 2755962 2748349 2762476 2755296
14662 2755296 2759893 2782783 2764710 2763020 2763931 2766508 2787335 2756989 2753229 2752311 2765655 2775113 2790263
14649 2790263 2765640 2756616 2757456 2754641 2771345 2750820 2736292 2745747 2766700 2777048 2786947 2761964
14637 2761964 2761867 2767790 2752169 2749466 2764429 2769348 2766796 2731510 2754679 2749366 2745462 2774762 2749395
14624 2749395 2762706 2769362 2745335 2716363 2763277 2757559 2758963 2763261 2753537 2771669 2757365 2746176
14612 2746176 2768588 2758521 2766204 2765747 2786115 2758566 2749724 2755025 2740980 2714173 2751195 2762878
14600 2762878 2777366 2785095 2746347 2758984 2747246 2760943 2773240 2769253 2794578 2809710 2804492 2798093
14588 2798093 2773461 2777886 2774754 2764781 2761369 2755083 2779906 2757508 2752336 2758442 2753715 2777798 2770019
14575 2770019 2780937 2790185 2792440 2754770 2754992 2766876 2770869 2784866 2775254 2740950 2734113 2757610 2761163
14562 2761163 2779330 2781585 2785978 2801083 2780290 2758495 2761454 2760329 2735439 2790613 2778571 2744630
14550 2744630 2764640 2765425 2760782 2787255 2777861 2785939 2802408 2781737 2759077 2769487 2754967 2759882
14538 2759882 2759832 2759515 2790407 2812865 2773873 2782511 2790400 2757258 2746887 2756310 2762910 2758476 2758961 2768558
14524 2768558 2758687 2748996 2780656 2776104 2782188 2785664 2797864 2789436 2773985 2777183 2771115 2749865 2790213
14511 2790213 2803232 2782961 2780838 2780422 2800876 2807393 2787999 2795898 2769213 2788284 2779967 2770927 2792753
14498 2792753 2776081 2777760 2771377 2788743 2778250 2754521 2764402 2799411 2798731 2785862 2791179 2818017
14486 2818017 2819183 2800775 2790035 2802464 2825712 2800647 2796736 2801858 2773449 2810053 2833089 2814911
14474 2814911 2789032 2776996 2789757 2798725 2785586 2800495 2780838 2825215 2817204 2802808 2794865 2779853
14462 2779853 2793430 2808599 2816801 2773605 2789976 2767847 2762200 2784561 2827050 2836556 2811163 2824890
14450 2824890 2847626 2836007 2834255 2833549 2865059 2833780 2817624 2804367 2807094 2778400 2791388 2795204
14438 2795204 2776245 2794632 2830013 2840184 2834078 2809277 2803149 2804860 2817448 2824242 2824343 2837241
14426 2837241 2779630 2831912 2838084 2798522 2813980 2815356 2811382 2818735 2822391 2826131 2807242 2784820
14414 2784820 2809006 2804093 2829540 2826310 2816369 2818101 2841970 2820748 2820106 2816773 2821969 2818987 2802145
14401 2802145 2826815 2807182 2816616 2844436 2851406 2843043 2862430 2809333 2819780 2827093 2849938 2846061
14389 2846061 2833611 2823184 2810762 2813762 2800455 2821753 2814365 2802697 2788694 2796478 2823815 2843488
14377 2843488 2847893 2841431 2855325 2848584 2822111 2828843 2822958 2828739 2818759 2809526 2814583 2802815 2806908
14364 2806908 2810845 2802201 2792780 2804194 2803732 2803566 2799007 2811417 2800593 2821244 2801548 2817919 2835745
14351 2835745 2817194 2832154 2839738 2830869 2827811 2841343 2841820 2849660 2854651 2825524 2808856 2820144 2835677
14338 2835677 2834001 2848065 2834477 2806703 2825902 2832076 2843422 2870313 2874635 2841610 2844973 2834007
14326 2834007 2831449 2829123 2845993 2829914 2848400 2864291 2861387 2832487 2798966 2819236 2817464 2837119
14314 2837119 2848132 2865050 2856919 2833405 2849524 2841284 2861631 2834345 2844603 2895382 2872031 2856922
14302 2856922 2864602 2847682 2838197 2822203 2842132 2865766 2845384 2840773 2822112 2833650 2825462 2802442
14290 2802442 2825606 2836035 2835627 2843866 2846431 2849123 2858626 2843860 2839449 2843006 2842711 2852069 2868695
14277 2868695 2895816 2888935 2858924 2873289 2871684 2819606 2814419 2826557 2833306 2821279 2832516 2818720
14265 2818720 2833760 2840540 2852247 2826140 2824077 2864313 2856581 2860315 2843943 2876436 2867986 2849471
14253 2849471 2837441 2845301 2823701 2809783 2832594 2855741 2842283 2800106 2845140 2850277 2856234 2849217
14241 2849217 2858689 2860113 2880837 2871956 2824856 2834621 2850507 2873897 2852700 2848779 2844227 2844344 2860849
14228 2860849 2847686 2846892 2854647 2854785 2855961 2858508 2845032 2848167 2857159 2854206 2864458 2854282 2866526
14215 2866526 2893872 2865630 2891834 2863989 2843557 2835103 2831105 2844037 2830762 2864096 2860591 2862433
14203 2862433 2881288 2891799 2929029 2924383 2905968 2876069 2874054 2873605 2859439 2883049 2863017 2862453
14191 2862453 2851931 2870568 2871735 2851348 2866129 2904451 2889256 2868470 2886639 2865630 2868862 2883151
14179 2883151 2904221 2893146 2861146 2850684 2858284 2897143 2888605 2871391 2857786 2874086 2892995 2876730
14167 2876730 2877483 2869787 2885874 2925521 2925718 2879429 2886699 2911408 2913027 2898347 2878784 2891815 2902330
14154 2902330 2916849 2894596 2873059 2855898 2873816 2889127 2899460 2897852 2925621 2922914 2893065 2887086
14142 2887086 2860833 2894255 2858575 2868488 2897224 2869788 2887179 2877516 2866099 2858573 2881535 2890255
14130 2890255 2907173 2887846 2869692 2876911 2872378 2874502 2885843 2929857 2945619 2917283 2903838 2884782
14118 2884782 2884681 2880963 2923457 2929624 2876340 2874903 2894537 2899027 2892615 2899739 2910931 2917588 2941045
14105 2941045 2915164 2891472 2925972 2909397 2915958 2898784 2895418 2910870 2923896 2945045 2902112 2874577
14093 2874577 2912642 2917877 2907904 2916573 2931618 2907428 2915205 2904452 2896456 2918221 2923900 2914038 2898718
14080 2898718 2875693 2863590 2905348 2918011 2926677 2935734 2900526 2880400 2899579 2900257 2890085 2894385
14068 2894385 2941239 2945379 2913647 2912922 2914640 2936220 2924999 2904620 2902129 2896300 2906258 2914998 2900936
14055 2900936 2876816 2882958 2888424 2896836 2908515 2931468 2924001 2918792 2932134 2909304 2932169 2954558
14043 2954558 2944867 2927918 2930540 2904199 2911010 2912585 2890445 2921161 2936239 2935416 2938752 2932296 2923933
14030 2923933 2922636 2913135 2910692 2919935 2930520 2910475 2886300 2901544 2890729 2909220 2921320 2891742
14018 2891742 2861064 2875880 2875993 2878556 2877988 2886810 2930251 2912844 2889570 2900432 2927098 2929090 2935469
14005 2935469 2937101 2887511 2901622 2945216 2967605 2965240 2929346 2936586 2938244 2919337 2919145 2929518
13993 2929518 2963605 2965100 2918196 2894579 2909411 2908728 2923049 2922344 2917465 2917847 2907909 2890359 2931894
13980 2931894 2928130 2898692 2874749 2889405 2946131 2946414 2968113 2995164 2970774 2939298 2931763 2924473
13968 2924473 2935733 2917098 2931230 2918754 2891104 2904129 2944517 2910478 2907451 2918031 2924336 2921822
13956 2921822 2904178 2919842 2949386 2941116 2958819 2963369 2946731 2928366 2948645 2956525 2980737 2995003
13944 2995003 2952128 2926394 2926342 2952954 2926685 2909683 2940548 2970159 2945295 2932050 2938487 2958210
13932 2958210 2978221 2958097 2923049 2913421 2950855 2988038 2959360 2950171 2968160 2952001 2939579 2928827
13920 2928827 2945499 2975858 2967976 2968366 2977584 2976025 2990259 2960248 2955425 2958606 2966556 2964575 2931011
13907 2931011 2924066 2930253 2925860 2948753 2939220 2918973 2956454 2965710 2934831 2942498 2937449 2942570 2985762
13894 2985762 2997184 2984223 2964843 2978361 2967055 2977381 3003787 2977403 2954521 2944651 2979376
13883 2979376 2976563 2961579 2985176 2955553 2934641 2939944 2983097 2947446 2941407 2930091 2940246 2967589
13871 2967589 2945320 2936642 2921157 2936002 2953371 2928227 2934240 2937156 2950039 2953949 2972915 2970356
13859 2970356 2973773 3002232 3004212 2992255 2983337 3003029 2954426 2944297 2970669 2964234 2975403 2977059
13847 2977059 2968104 2944304 2921325 2959739 2990558 2978008 2962051 2989870 2988078 2945904 2954647 2991047
13835 2991047 2951511 2948498 2955874 2948776 2970466 2994034 3006192 3005369 2989750 2975487 2974500 2956672 2928498
13822 2928498 2965394 2989918 2990805 2990567 2991379 2992272 2996176 3025848 3019016 3014734 3002716 3004685 3004444 2981304
13808 2981304 2957273 2956759 2994204 2992740 2951783 2958859 2971642 2984523 2992007 2995687 3006985 2998134 3006034
13795 3006034 3000030 3002159 2988103 2976321 2995398 2982535 2973162 2974891 3014889 3011804 3004380 2974079
13783 2974079 2967261 2991344 3023790 3024114 2996350 2988661 3006389 2973323 2966747 2961391 3006873 3004354 2975227
13770 2975227 2964732 2931853 2970041 2987772 3015530 3009244 2995365 3007024 2967879 2964664 2970985 2970832
13758 2970832 2957491 3006809 3025521 3010187 3029034 3027802 3054926 2995392 2992261 3013016 3029031 3015827
13746 3015827 3032692 3034492 2986140 2974329 2978709 2993006 3000255 2999445 2990912 3018370 3031930 3012265
13734 3012265 3004117 3003237 3019171 3010697 3014045 3010763 2993814 3008885 3016348 2988363 2991427 2999829 3019929
13721 3019929 3031550 3004402 2998863 3006150 2989067 2999245 3023091 2998822 2976105 2988932 3012714 3026817
13709 3026817 3014065 3020802 2997815 3002554 3013792 3032257 3009369 3020048 3030066 2999355 3005738 3009832
13697 3009832 3008637 3016506 3000464 3013997 3033254 3017022 3032314 3022535 3010140 3038237 3042418 3051211
13685 3051211 3041718 3028649 3040589 3062474 3074351 3052310 3015359 2999482 2996431 3012294 3000143 3011333
13673 3011333 3002812 3011475 3039714 3027705 3018443 3023028 3026305 2996505 3000771 3021914 3023178 3015457 3016950
13660 3016950 3052707 3066870 3055165 3032733 3040016 2998218 2997916 3050055 2997178 3052465 3043658 3061346
13648 3061346 3052643 3057031 3077534 3049144 3009861 3022623 3037698 3023451 3034741 3054696 3039663 3012671
13636 3012671 3014803 3060412 3025247 3022658 3038430 3005169 3016492 2997928 2983124 2992867 3000095 3024703
13624 3024703 3041600 3039618 3056385 3048732 3056675 3037649 3051851 3046635 3025518 3042549 3057309 3074730
13612 3074730 3052544 3053924 3057959 3076486 3085902 3082311 3052099 3014045 3024960 3040254 3026146 3042474
13600 3042474 3031442 3007612 3030789 3023844 3028430 3045079 3059134 3059231 3061834 3065450 3064110 3043016 3027760
13587 3027760 3031066 3019321 3032905 3037237 2999471 3042508 3085428 3074005 3053520 3043954 3061933 3072060
13575 3072060 3056600 3077322 3105084 3057952 3050974 3074200 3067295 3041406 3049421 3066112 3070451 3075795
13563 3075795 3090931 3081700 3069103 3045926 3044939 3059634 3053379 3045303 3036934 3068812 3061183 3075612 3089342
13550 3089342 3048147 3053583 3064526 3055321 3081724 3063101 3033545 3060776 3082106 3082165 3065895 3073406
13538 3073406 3069424 3058495 3083584 3071658 3035169 3047097 3065034 3076481 3068925 3051617 3062268 3064334
13526 3064334 3079931 3059743 3044102 3051421 3046856 3038407 3045193 3092749 3120105 3098588 3078036 3076896
13514 3076896 3067667 3047841 3069442 3054440 3045270 3065908 3089100 3060439 3046592 3062939 3081985 3052881
13502 3052881 3072964 3059597 3047294 3061857 3099465 3106978 3084067 3075504 3082836 3069504 3064249 3080489
13490 3080489 3068506 3057474 3019455 3061699 3054126 3052219 3083766 3078267 3087371 3093762 3105699 3105617 3113869
13477 3113869 3085809 3049816 3076825 3098850 3113412 3092044 3084634 3079079 3063125 3046893 3060676 3066077
13465 3066077 3068269 3072575 3080022 3141380 3135655 3105239 3120015 3093139 3109162 3112341 3126038 3100481
13453 3100481 3090905 3086967 3095569 3121435 3089043 3086387 3092684 3080592 3100643 3113220 3103046 3091930
13441 3091930 3135684 3161011 3111614 3117395 3113044 3107164 3092861 3114816 3150579 3114528 3093055 3129053
13429 3129053 3137077 3130348 3109709 3067457 3074441 3087386 3108798 3102502 3082855 3122832 3124746 3098402
13417 3098402 3116555 3129507 3109800 3090042 3085928 3073508 3112284 3131203 3116338 3128387 3121494 3110788
13405 3110788 3117033 3112177 3137970 3103992 3089776 3122797 3127348 3127229 3123089 3134618 3121303 3117694 3129622
13392 3129622 3142748 3140697 3119526 3110509 3106423 3125410 3133546 3149796 3134443 3107382 3105584 3109242
13380 3109242 3108894 3126574 3137485 3092638 3114240 3101652 3129248 3139234 3132552 3154040 3130435 3088352
13368 3088352 3089628 3093410 3093210 3100169 3093907 3101198 3094638 3097890 3121261 3170430 3181302 3147939 3151983
$$ [...]
##END NTUPLES=NMR SPECTRUM
##END=
