##TITLE=1H_CA-9138-2
 CDCl3
 8 sc, 
 13.4.2023
##JCAMPDX= 6.0         $$ Bruker NMR JCAMP-DX V2.0
##DATA TYPE= NMR SPECTRUM
##DATA CLASS= NTUPLES
##ORIGIN= UXNMR, Bruker Analytische Messtechnik GmbH
##OWNER= root
$$ XWIN-NMR		Version 3.5
$$ Thu Apr 13 14:55:34 2023 Russian Standard Time (UT+4h)  she@DPX200
##.OBSERVE FREQUENCY= 200.13135
##.OBSERVE NUCLEUS= ^1H
##.ACQUISITION MODE= SIMULTANEOUS
##.ACQUISITION SCHEME= undefined
##.AVERAGES= 8
##.DIGITISER RES= 18
##SPECTROMETER/DATA SYSTEM= spect
##.PULSE SEQUENCE= zg30
##.SOLVENT NAME= DMSO
##.SHIFT REFERENCE= (INTERNAL, DMSO, 0, 15.7733)
##AUDIT TRAIL= $$ (NUMBER, WHEN, WHO, WHERE, WHAT)
$$ ##TITLE= Audit trail, XWIN-NMR		Version 3.5
$$ ##JCAMPDX= 5.01
$$ ##ORIGIN= Bruker BioSpin GmbH
$$ ##OWNER= she
$$ F:/spectra/data/she/nmr/H-F/1/pdata/1/auditp.txt
$$ ##AUDIT TRAIL=  $$ (NUMBER, WHEN, WHO, WHERE, WHAT)
(   1,<2023-04-13 14:54:19.04 +0400>,<she>,<DPX200>,
      <created by zg, POWCHK disabled, PULCHK disabled
       configuration hash MD5:
       00 E9 B6 7A A2 85 ED C7 34 08 36 98 17 FE 4E 26
       data hash MD5: 16K
       20 76 C1 DA 64 5E 24 3F 64 4F 68 B7 87 88 55 8F>)
(   2,<2023-04-13 14:54:21.10 +0400>,<she>,<DPX200>,
      <Start of raw data processing
       efp BC_mod = 2 LB = 0.24 FT_mod = 6 PKNL = 1 PHC0 = -19833.43 PHC1 = 11.40081 SI = 16K 
       data hash MD5: 16K
       19 5A D8 9B 06 2E 37 28 97 3C D0 71 91 8E 01 65>)
(   3,<2023-04-13 14:54:41.75 +0400>,<she>,<DPX200>,
      <pk PHC0 = 2.679213 PHC1 = -1.4 
       data hash MD5: 16K
       01 88 2B 8B 5E 5A 44 48 95 77 7A AB D1 15 80 6A>)
(   4,<2023-04-13 14:54:45.23 +0400>,<she>,<DPX200>,
      <abs ABSG = 5 
       data hash MD5: 16K
       71 0A 96 EA 3C 58 A8 E6 64 56 DD CC 34 E4 2B A5>)
$$ ##END=
$$ 
$$ hash MD5
$$ FD 27 6B 29 2B 42 48 ED 8C 30 6F 1F 62 FD 8E 0A
##$RELAX= 
##$RELAX= 
##$RELAX= 
##$RELAX= 
##$RELAX= 
##$RELAX= 
$$ Bruker specific parameters
$$ --------------------------
##$DU= <F:/spectra>
##$EXPNO= 1
##$NAME= <H-F>
##$PROCNO= 1
##$TYPE= <nmr>
##$USER= <she>
##$AMP= (0..31)
100 100 100 100 100 100 100 100 100 100 100 100 100 100 100 100 100 100 
100 100 100 100 100 100 100 100 100 100 100 100 100 100 
##$AQSEQ= 0
##$AQ_mod= 1
##$AUNM= <au_zg>
##$AUTOPOS= <>
##$BF1= 200.13
##$BF2= 200.13
##$BF3= 200.13
##$BF4= 200.13
##$BF5= 200.13
##$BF6= 200.13
##$BF7= 200.13
##$BF8= 200.13
##$BYTORDA= 1
##$CFDGTYP= 0
##$CFRGTYP= 5
##$CHEMSTR= <none>
##$CNST= (0..31)
1 1 145 1 1 1 1 1 1 1 1 1 1 1 1 1 1 1 1 1 1 1 1 1 1 1 1 1 1 1 1 1 
##$CPDPRG= <>
##$CPDPRG1= <>
##$CPDPRG2= <>
##$CPDPRG3= <>
##$CPDPRG4= <mlev>
##$CPDPRG5= <mlev>
##$CPDPRG6= <mlev>
##$CPDPRG7= <mlev>
##$CPDPRG8= <mlev>
##$CPDPRGB= <>
##$CPDPRGT= <>
##$D= (0..31)
0 1.2 0 0 0 0 0 0 0 0.06 0 0.03 0 0 0 0 0.0002 0 0 0 0 0 0 0 0 0 0 0 0 
0 0 0 
##$DATE= 1681383258
##$DBL= (0..7)
120 120 120 120 120 120 120 120 
##$DBP= (0..7)
150 150 150 150 150 150 150 150 
##$DBP07= 0
##$DBPNAM0= <>
##$DBPNAM1= <>
##$DBPNAM2= <>
##$DBPNAM3= <>
##$DBPNAM4= <>
$$ [...]
##$SUBNAM3= <"">
##$SUBNAM4= <"">
##$SUBNAM5= <"">
##$SUBNAM6= <"">
##$SUBNAM7= <"">
##$SUBNAM8= <"">
##$SUBNAM9= <"">
##$SW= 18.05172834244
##$SWIBOX= (0..15)
0 0 2 0 0 0 0 0 0 0 0 0 0 0 0 0 
##$SW_h= 3612.71676300578
##$TD= 16384
##$TD0= 1
##$TE= 0
##$TE2= 300
##$TE3= 300
##$TEG= 300
##$TL= (0..7)
0 120 120 120 120 120 120 120 
##$TP= (0..7)
150 150 150 150 150 150 150 150 
##$TP07= 0
##$TPNAME0= <>
##$TPNAME1= <>
##$TPNAME2= <>
##$TPNAME3= <>
##$TPNAME4= <>
##$TPNAME5= <>
##$TPNAME6= <>
##$TPNAME7= <>
##$TPOAL= (0..7)
0.5 0.5 0.5 0.5 0.5 0.5 0.5 0.5 
##$TPOFFS= (0..7)
0 0 0 0 0 0 0 0 
##$TUNHIN= 0
##$TUNHOUT= 0
##$TUNXOUT= 0
##$USERA1= <user>
##$USERA2= <user>
##$USERA3= <user>
##$USERA4= <user>
##$USERA5= <user>
##$V9= 5
##$VALIST= <valist>
##$VCLIST= <CCCCCCCCCCCCCCC>
##$VD= 0
##$VDLIST= <DDDDDDDDDDDDDDD>
##$VPLIST= <PPPPPPPPPPPPPPP>
##$VTLIST= <TTTTTTTTTTTTTTT>
##$WBST= 1024
##$WBSW= 4
##$XGAIN= (0..3)
0 0 0 0 
##$XL= 0
##$YL= 0
##$YMAX_a= 595197
##$YMIN_a= -667069
##$ZGOPTNS= <>
##$ZL1= 120
##$ZL2= 120
##$ZL3= 120
##$ZL4= 120
##$ABSF1= 15.74138
##$ABSF2= -2.31047
##$ABSG= 5
##$ABSL= 3
##$ALPHA= 0
##$AQORDER= 0
##$ASSFAC= 0
##$ASSFACI= 0
##$ASSFACX= 0
##$ASSWID= 0
##$AUNMP= <proc_1d>
##$AZFE= 0.1
##$AZFW= 0.1
##$BCFW= 0
##$BC_mod= 2
##$BYTORDP= 0
##$COROFFS= 0
##$CY= -3
##$DATMOD= 1
##$DC= 0
##$DFILT= <>
##$DTYPP= 0
##$F1P= 0
##$F2P= 0
##$FCOR= 1
##$FTSIZE= 16384
##$FT_mod= 6
##$GAMMA= 0
##$GB= 0
##$INTBC= 1
##$INTSCL= 3.70164e-10
##$ISEN= 128
##$LB= 0.24
##$LEV0= 0
##$LPBIN= 0
##$MAXI= 10000
##$MC2= 0
##$MEAN= 0
##$ME_mod= 0
##$MI= 1.114404
##$NCOEF= 0
##$NC_proc= -5
##$NLEV= 6
##$NOISF1= 3.799351
##$NOISF2= 2.8
##$NSP= 0
##$NTH_PI= 0
##$NZP= 0
##$OFFSET= 15.77333
##$PC= 1
##$PHC0= -19830.75
##$PHC1= 10.00081
##$PH_mod= 1
##$PKNL= yes
##$PPARMOD= 0
##$PSCAL= 0
##$PSIGN= 0
##$REVERSE= no
##$SF= 200.129999640429
##$SI= 16384
##$SIGF1= 3
##$SIGF2= 2
##$SINO= 5.538805
##$SIOLD= 16384
##$SREGLST= <1H.CDCl3>
##$SSB= 0
##$STSI= 16384
##$STSR= 0
##$SW_p= 3612.71676300578
##$SYMM= 0
##$S_DEV= 0
##$TDeff= 16384
##$TDoff= 0
##$TI= <>
##$TILT= no
##$TM1= 0
##$TM2= 0
##$TOPLEV= 0
##$USERP1= <user>
##$USERP2= <user>
##$USERP3= <user>
##$USERP4= <user>
##$USERP5= <user>
##$WDW= 1
##$XDIM= 16384
##$YMAX_p= 410064452
##$YMIN_p= -146009
$$ End of Bruker specific parameters
$$ ---------------------------------
##NTUPLES= NMR SPECTRUM
##VAR_NAME=  FREQUENCY,     SPECTRUM/REAL,   SPECTRUM/IMAG
##SYMBOL=    X,             R,               I
##VAR_TYPE=  INDEPENDENT,   DEPENDENT,       DEPENDENT
##VAR_FORM=  AFFN,          ASDF,            ASDF
##VAR_DIM=   16384,         16384,           16384
##UNITS=     HZ,            ARBITRARY UNITS, ARBITRARY UNITS
##FACTOR=    0.220516191357247, 1,           1
##FIRST=     3156.71647415434, 0,            0
##LAST=      -456.000288851439, 0,           0
##MIN=       -456.000288851439, -146009,     0
##MAX=       3156.71647415434, 410064452,    0
$$ Real data points
##PAGE= N=1
##DATA TABLE= (X++(R..R)), XYDATA
$$ [...]
$$ plain form
6876 -29981 8447 -42012 -45973 -9103 -7470 -29668 -94265 -56012 -57651 1562 -69155 -70953 -29513
6863 -29513 -52587 -27612 -15310 -34141 -102736 -47733 12894 -19457 -49442 -26509 -30199 -53889
6851 -53889 -37668 11251 -31875 -81084 -48837 -35165 -32252 -19105 -13058 4789 -5209 -38045
6839 -38045 -22672 35768 -10461 -47698 -22714 -49861 -74988 -51501 -27001 -76305 -100652 -54852
6827 -54852 -21389 -15602 -29162 -35098 -13935 -17293 -9851 -24936 -25142 -25476 11385 -39631 -24408
6814 -24408 -34972 -39174 12697 -28430 -64128 -93808 -17112 17515 76 -19383 11538 46323
6802 46323 9008 -23848 -2603 -21525 -26865 -28749 -17444 -7233 -5492 -9074 -15975 -49773 11345
6789 11345 -19281 9115 11499 -6906 20153 23708 -8805 -20362 -18393 -13385 -8826 -19936 -9350
$$ packed form
6876b9981L8428n0459l961L6870J633k2198o4597L8253j639N9213p0717j798M1440
6863b9513k3074K4975J2302j8831o8595N5003O0627l2351k9985K2933l690k3690
6851e3889J6221M8919m3126m9209L2247J3672K913J3147O047J7847r998l2836
6839c8045J5373N8440m6229l7237K4984k7147k5127K3487K4500m9304k4347M5800
6827e4852L3463N787j3560n936K1163l358P442j5085k06l34L6861n1016J5223
6814b4408j0564m202N1871m1127l5698k9680P6696L4627j7439j9459L0921L4785
6802D6323l7315l2856K1245j8922n340j884J1305J0211J741l582o901l3798O1118
6789A1345l0626K8396K384j8405K7059L555l2513j1557J969N008M559j1110J0586
$$ plain form
6776 -9350 -60477 -38975 -46838 -9344 3312 -567 -13184 -4850 -5364 -10075 -74001 -21421 -37207
6763 -37207 -22429 43898 49026 24093 17043 40125 12442 5102 -54912 -68358 -45489 -48069 -44027
6750 -44027 -26159 -78082 -107586 -29413 -25162 27847 9057 -23198 -56571 -58242 -37324 7038
6738 7038 -6562 -36415 -22904 -27951 -61728 -26290 3857 -40619 -38029 -56243 -25840 -32378 21028
6725 21028 -48317 -62574 -11371 -1642 -24999 -2988 -19885 -11369 -41931 -93820 -54272 5269
6713 5269 -962 -69518 -38071 -22954 -42564 -46617 -78307 -99341 -75547 -45465 -30822 6867
6701 6867 12058 -23026 -79768 -49339 -31245 -24652 10792 26584 -7091 -38593 -20878 -32553
6689 -32553 -104018 -105128 -43498 -39405 -58480 -54053 -38121 -84806 -54834 -6105 -13543 -36782 -67864
$$ packed form
6776i350n1127K1502p863L7494J2656l879j2617Q334n14m711o3926N2580j5786
6763c7207J4778O6327N128k4933p050K3082k7683p340o0014j3446K2869k580M042
6750d4027J7868n1923k9504P8173M251N3009j8790l2255l3373j671K0918M4362
6738G038j3600k9853J3511n047l3777L5438L0147m4476K590j8214L0403o538N3406
6725B1028o9345j4257N1203R729k3357K2011j6897Q516l0562n1889L9548N9541
6713E269o231o8556L1447J5117j9610m053l1690k1034K3794L0082J4643L7689
6701F867N191l5084n6742L0429J8094O593L5444J5792l3675l1502J7715j1675
6689c2553p1465j110O1630M093j9075M427J5932m6685K9972M8729p438k3239l1082
$$ plain form
6676 -67864 -44088 -52013 -63015 -29641 -33348 -80283 -83715 -14652 -25912 -21536 -8822 1996 -18148
6663 -18148 -22826 -48646 -57702 -44851 -35511 -46192 -27116 -25260 -53708 -71721 -45558 -29588 -51848
6650 -51848 -34676 -37964 -7024 -18125 3585 15795 -2765 13903 -27568 -45544 -9174 -55878
6638 -55878 -40283 10258 22518 -33930 -64655 -101415 -62425 -20290 -23826 -26586 -18111 -24766 -2344
6625 -2344 -4183 -21321 -5764 -25743 -27089 -66353 -57119 -50686 -31726 -91370 -39440 -24260 -52193
6612 -52193 -47791 -42756 -41655 -41193 -34451 -17110 -4170 -15266 -25810 -43978 -59169 -64447 -53416
6599 -53416 13413 -12206 -21686 21596 -5630 -18609 -18410 -21904 -15108 -19907 -14039 13395 -59919
6586 -59919 -25894 -27914 -87959 -43234 -16155 -15144 -49008 -33562 -33356 -55716 -36050 -27453 -62927
$$ packed form
6676f7864K3776p925j1002L3374l707m6935l432O9063j1260M376J2714J0818k0144
6663a8148m678k5820r056J2851R340j0681J9076J856k8448j8013K6163J5970k2260
6650e1848J7172l288L0940j1101K1710J2210j8560J6668m1471j7976L6370m6704
6638e5878J5595N0541J2260n6448l0725l6760L8990M2135l536k760Q475o655K2422
6625b344j839j7138J5557j9979j346l9264R234O433J8960n9644N1930J5180k7933
6612e2193M402N035J101M62O742J7341J2940j1096j0544j8168j5191n278J1031
6599e3416O6829k5619r480M3282k7226j2979J99l494O796m799N868K7434p3314
6586e9919L4025k020o0045M4725K7079J011l3864J5446K06k2360J9666Q597l5474
$$ plain form
6573 -62927 -17212 -23779 -51564 -85611 -104998 -59724 -43281 -43404 -24104 9846 -30478 -11023
6561 -11023 -13175 -87613 -42613 -45544 -69103 -38105 -47054 -35179 -31741 -36986 -17743 -34201 -60437
6548 -60437 -57755 -44674 -40838 -83399 -38472 -37726 -21609 -11704 -28684 -17331 32870 -10640 -42581
6535 -42581 -62795 -43036 -34916 -34487 -67423 -86197 -52124 -3407 -18810 -95812 -118488 -102324
6523 -102324 -64238 -38897 -32129 -39157 -31623 -43866 -8402 15059 21160 26655 8317 1120 -18578
6510 -18578 -31286 -68741 -86136 -69291 11383 7752 675 11212 6012 32446 -9814 -40390
6498 -40390 6521 -51106 -87255 -73800 -98411 -19045 -20986 -43639 22182 18540 -10592 -10188 -22234
6485 -22234 -10373 -36469 -3023 -57136 -36064 -15672 -34132 -1749 -57034 -43063 -15036 -52453
$$ packed form
6573f2927M5715o567k7785l4047j9387M5274J6443j23J9300L3950m0324J9455
6561a1023k152p4438M5000k931k3559L0998q949J1875L438n245J9243j6458k6236
6548f0437K682J3081L836m2561M4927P46J6117R905j6980J1353N0201m3510l1941
6535d2581k0214J9759Q120M29l2936j8774L4073M8717j5403p7002k2676J6164
6523a02324L8086K5341O768p028P534j2243L5464K3461O101N495j8338p197j9698
6510a8578j2708l7455j7395J6845Q0674l631p077J0537n200K6434m2260l0576
6498d0390M6911n7627l6149J3455k4611P9366j941k2653O5821l642k9132M04j2046
6485b2234J1861k6096L3446n4113K1072K0392j8460L2383n5285J3971K8027l7417
$$ plain form
6473 -52453 -55328 -38568 -47952 -17881 -13121 -84901 -66375 -37126 14795 40597 -3746 -56199
6461 -56199 -19348 -50001 -17867 23890 -30087 -53478 -49488 -7558 -2230 -990 14115 28853
6449 28853 51421 -3 -13834 -12139 -23453 4870 -22720 -38028 -17840 -20858 -43400 -96666
6437 -96666 -71429 -22461 -29248 1608 -19365 -51071 -55465 -3511 8760 -42641 -25377 24673
6425 24673 3439 -9258 -13040 -7066 -20890 -22375 -26729 -50256 -5174 2124 -25229 -43192 -29389
6412 -29389 -18910 -31643 -36480 -51225 -4692 -19098 -2351 3009 -5993 -21483 -47674 24035
6400 24035 48120 24223 28549 16813 -3042 -15894 -28350 58786 20995 -43590 -41747 -27388
6388 -27388 8055 -7227 -77885 -35272 21025 -30086 -28824 -52978 -26187 -6620 -4686 35290
$$ packed form
6473e2453k875J6760r384L0071M760p1780J8526K9249N1921K5802m4343n2453
6461e6199L6851l0653L2134M1757n3977k3391L990M1930N328J240J5105J4738
6449B8853K2568n1424j3831J695j1314K8323k7590j5308K0188l018k2542n3266
6437i6666K5237M8968o787L0856k0973l1706m394N1954J2271n1401J7264N0050
6425B4673k1234j2697l782N974j3824j485m354k3527M5082P298k7353j7963J3803
6412b9389J0479j2733m837j4745M6533j4406J6747N360r002j5490k6191P1709
6400B4035K4085k3897M326j1736j9855j2852j2456Q7136l7791o4585J843J4359
6388b7388L5443j5282p0658M2613N6297n1111J262k4154K6791J9567J934L9976
$$ plain form
6376 35290 20603 -47608 -16152 7827 -1115 -11836 -2486 24464 -43999 -89780 -75853 -21120
6364 -21120 10283 -10176 -44639 -32885 -90026 -123149 -85489 -74874 -72770 -31289 14528 -22320
6352 -22320 -68131 -58689 -67788 -31022 42336 13801 -3924 -8448 -41652 -16162 -67489 -27429
6340 -27429 18681 -5135 1843 -12165 30360 13299 -39437 -58768 -80905 -136620 -83458 -75293
6328 -75293 -104024 -84389 -78532 -87957 -44029 -72458 -41359 -32065 -25880 31292 17715 -51469 -28741
6315 -28741 -63777 -95003 3111 6887 51682 11547 -39659 -68610 -107093 -63272 -63629 -33207
6303 -33207 -69941 -76708 -41486 -15861 -5782 -20455 -6653 -55748 -14637 -11545 -9738 7871
6291 7871 -53884 -5201 12092 -30384 -48860 -32305 -50531 -15500 -11295 -38778 -8176 21251
$$ packed form
6376C5290j4687o8211L1456K3979q942j0721R350K6950o8463m5781J3927N4733
6364b1120L1403k0459l4463J1754n7141l3123L7660J0615K104M1481M5817l6848
6352b2320m5811R442r099L6766P3358k8535j7725m524l3204K5490n1327M0060
6340b7429M6110k3816O978j4008M2525j7061n2736j9331k2137n5715N3162Q165
6328g5293k8731J9635N857r425M3928k8429L1099R294O185N7172j3577o9184K2728
6315b8741l5036l1226R8114L776M4795m0135n1206k8951l8483M3821l57L0422
6303c3207l6734o767L5222K5625J0079j4673J3802m9095M1111L092J807J7609
6291G871o1755M8683J7293m2476j8476J6555j8226L5031M205k7483L0602K9427
$$ plain form
6279 21251 34554 -11319 -35491 -57934 -29812 1131 18909 45836 -39748 -13519 3880 -74010
6267 -74010 -59510 -40085 6342 -1343 -39108 -92115 -74374 -57119 -39152 -36811 -58006 -10793
6255 -10793 8525 -7348 32016 29936 -4260 -10340 33473 -5329 -43 -47702 -43487 -57005 -66934
6242 -66934 -108134 -65190 8821 -15832 -54234 -63280 -49958 -63102 -78276 -20394 3759 31992
6230 31992 23160 13538 20918 -43651 -24938 27508 63478 39880 18205 49016 6323 -15957
6218 -15957 -25073 -42753 -24398 -55168 -15460 13089 -6220 23406 56126 46387 68926 52168
6206 52168 14646 6990 32314 22978 43668 47030 12239 11667 36853 30447 17249 -14373 -19449
6193 -19449 575 61993 11023 48936 63071 52669 29042 40631 57035 51809 54597 44399
$$ packed form
6279B1251J3303m5873k4172k2443K8122L0943J7778K6927q5584K6229J7399p7890
6267g4010J4500J9425M6427p685l7765n3007J7741J7255J7967K341k1195M7213
6255a0793J9318j5873L9364k080l4196o080M3813l8802N286m7659M215j3518r929
6242f6934m1200M2944P4011k4653l8402r046J3322j3144j5174N7882K4153K8233
6230C1992q832r622P380o4569J8713N2446L5970k3598k1675L0811m2693k2280
6218a5957r116j7680J8355l0770L9708K8549j9309K9626L2720r739K2539j6758
6206E2168l7522p656K5324r336K0690L362l4791n72K5186o406j3198l1622n076
6193a9449K0024O1418n0970L7913J4135j0402k3627J1589J6404n226K788j0198
$$ plain form
6181 44399 58380 82660 66596 66378 104821 111088 94817 136701 112746 122232 108516 30148 46216
6168 46216 88301 140463 173800 236194 249860 233661 207418 229339 272122 255680 279113 329523
6156 329523 322333 343692 397331 436181 472640 504506 587573 696047 843225 1056431 1284021
6145 1284021 1594936 1807728 1989203 1991900 1752566 1428328 1151061 978105 799551 634715
6135 634715 556185 441452 404282 357323 336199 371668 343669 308061 263522 246628 195563
6124 195563 130587 147879 167643 130661 147276 156847 137363 152233 154857 114576 160022 156223
6112 156223 145923 104565 103162 110695 118184 114960 78026 31333 11545 47918 34530 51415
6100 51415 77426 76256 74040 28322 -4787 3714 5533 -25551 -10278 8997 5011 37416 48483
$$ packed form
6181D4399J3981K4280j6064k18L8443O267j6271M1884k3955R486j3716p8368J6068
6168D6216M2085N2162L3337O2394J3666j6199k6243K1921M2783j6442K3433N0410
6156C29523p190K1359N3639L8850L6459L1866Q3067J08474J47178K13206K27590
6145A284021L10915K12792J81475K697k39334l24238k77267j72956j78554j64836
6135F34715p8530j14733l7170m6959k1124L5469k7999l5608m4539j6894n1065
6124A95563o4976J7292J9764l6982J6615R571j9484J4870K624m0281M5446l799
6112A56223j0300m1358j403P533P489l224l6934m6693j9788L6373j3388J6885
6100E1415K6011j170k216m5718l3109Q501J819l1084J5273J9275l986L2405J1067
$$ plain form
6087 48483 1537 -2687 39974 59022 87890 18087 23527 53615 56185 62931 98877 28482 33395
6074 33395 27520 57941 23301 -18058 804 8006 -14783 7017 61389 268 62496 -15206
6062 -15206 -28870 2812 73754 124765 109760 131957 60299 46897 49756 72457 42662 44964
6050 44964 65027 19461 -159 32214 93322 118398 82735 22759 1112 27472 75813 75023
6038 75023 80067 51507 37531 36858 1169 27934 63002 96769 56387 27398 78718 93219
6026 93219 31881 36953 86809 65183 82676 77065 42447 89257 66440 71984 80198 7324 13242
6013 13242 18083 20792 5992 38283 64611 66379 43272 39630 3111 -25196 39021 1299 11395
6000 11395 25093 4387 39369 47456 -10581 -23682 -18864 -28080 -8816 -4328 -9363 -76277 -47114
$$ packed form
6087D8483m6946m224M2661J9048K8868o9803N440L0088K570O746L5946p0395M913
6074C3395n875L0421l4640m1359J8862P202k2789K1800N4372o1121O2228p7702
6062a5206j3664L1682P0942N1011j5005K2197p1658j3402K859K2701k9795K302
6050D4964K0063m5566j9620L2373O1108K5076l5663n9976k1647K6360M8341p90
6038G5023N044k8560j3976o73l5689K6765L5068L3767m0382k8989N1320J4501
6026I3219o1338N072M9856k1626J7493n611l4618M6810k2817N544Q214p2874N918
6013A3242M841K709j4800L2291K6328J768k3107l642l6519k8307O4217l7722J0096
6000A1395J3698k0706L4982Q087n8037j3101M818r216J9264M488n035o6914K9163
$$ plain form
5987 -47114 -21238 -1767 42542 54373 23058 -14846 23247 35862 6657 -37794 -33807 -17314
5975 -17314 802 -42 -18020 47191 -32251 -887 37045 -10396 -31769 -40822 -38839 22612 26917
5962 26917 1245 -39347 -2581 14065 -16280 20583 1250 33952 -2795 -7091 -6562 -35162
5950 -35162 -33855 59877 48547 11814 53361 22549 -12374 -45155 -22202 13715 15745 -10335
5938 -10335 -35749 -50425 -16907 -13442 -9419 -15691 -11104 -12739 -7174 17974 12743 -2681 -11001
5925 -11001 7404 28356 52862 15229 -14323 37630 76017 37827 -13312 27378 39635 21529
5913 21529 -2519 -46100 -24404 -54626 -4637 -30468 -40832 -40121 17895 -12639 -36685 -30481
5901 -30481 -15627 14545 -2655 12461 -2890 1253 38615 58359 54769 55076 13236 37941 26176
$$ packed form
5987d7114K5876J9471M4309J1831l1315l7904L8093J2615k9205m4451L987J6493
5975a7314J8116q44j7978O5211p9442L1364L7932m7441k1373r053J983O1451M305
5962B6917k5672m0592L6766J6646l0345L6863j9333L2702l6747m296N29k8600
5950c5162J307R3732j1330l6733M1547l0812l4923l2781K2953L5917K030k6080
5938a0335k5414j4676L3518L465M023o272M587j635N565K5148n231j5424q320
5925a1001J8405K0952K4506l7633k9552N1953L8387l8190n1139M0690J2257j8106
5913B1529k4048m3581K1696l0222M9989k5831j0364P11N8016l0534k4046O204
5901c0481J4854L0172j7200J5116j5351M143L7362J9744l590L07m1840K4705j1765
$$ plain form
5888 26176 33123 24807 -7659 -15965 4449 -5515 -6397 -21094 -26423 -37100 6648 61377 19921
5875 19921 39389 16201 12091 38490 32485 30393 30498 -58 6028 7656 7415 -18504 -29463 4009
5861 4009 5413 -26369 27020 41091 7873 -26291 -29045 -46414 -1136 22180 11865 18793 -1657
5848 -1657 1916 35887 66243 1674 -58361 -38083 -11855 13728 20255 -2401 -18786 -65356
5836 -65356 -7155 -19836 13197 24507 28381 43791 11496 -624 17355 51786 41526 30639
5824 30639 40962 26809 -12018 -374 -26828 -18158 -10509 -27882 -9831 22491 15483 13120 41820
5811 41820 6551 -35550 4574 -30857 -62331 -11420 -16949 -17648 16002 7637 15434 71690 49252
5798 49252 27922 12406 -69675 -103433 -32355 -48467 -31379 22000 -1130 13206 49089 66063
$$ packed form
5888B6176O947q316l2466q306K0414r964q82j4697n329j0677M3748N4729m1456
5875A9921J9468k3188m110K6399o005k092J05l0556O086J628k41k5919j0959L3472
5861D009J404l1782N3389J4071l3218l4164k754j7369M5278K3316j0315O928k0450
5848a657L573L3971L0356o4569o0035K0278K6228K5583O527k2656j6385m6570
5836f5356N8201j2681L3033J1310L874J5410l2295j2120J7979L4431j0260j0887
5824C0639J0323j4153l8827J1644k6454Q670P649j7373J8051L2322p008k363K8700
5811D1820l5269m2101M0124l5431l1474N0911n529o99L3650q365P797N6256k2438
5798D9252k1330j5516q2081l3758P1078j6112J7088N3379k3130J4336L5883J6974
$$ plain form
5786 66063 62386 3572 33070 7952 -12922 7530 -14874 -26297 21427 29469 -32049 26901
5774 26901 1179 36952 67337 22046 14760 42121 50614 38014 43602 23717 17469 33292 27308
5761 27308 2563 -30319 -6205 33262 54461 73561 38721 14313 25600 52708 15522 28439
5749 28439 26139 48408 51631 61238 59523 41617 -10646 12532 48220 70651 57508 26002 22239
5736 22239 25114 16602 72146 102875 86200 69738 40460 39299 64345 127395 62153 -1638
5724 -1638 8890 45778 10595 -46544 -6614 64817 61297 49217 48621 -18636 -46930 -51592 -5609
5711 -5609 18666 26344 11751 -31349 10833 -16835 -60835 -56001 39017 57984 5949 -23293
5699 -23293 -22451 1756 31971 22974 32387 27033 36843 -9819 -2251 -1015 14036 -11470 -37981
$$ packed form
5786F6063l677n8814K9498k5118k0874K0452k2404j1423M7724Q042o1518N8950
5774B6901k5722L5773L0385m5291p286K7361Q493j2600N588j9885o248J5823n984
5761B7308k4745l2882K4114L9467K1199J9100l4840k4408J1287K7108l7186J2917
5749B8439k300K2269L223R607j715j7906n2263K3178L5688K2431j3143l1506l763
5736B2239K875q512N5544L0729j6675j6462k9278j161K5046O3050o5242o3791
5724a638J0528L6888l5183n7139L9930P1431l520j2080n96o7257k8294m662M5983
5711e609K4275P678j4593m3100M2182k7668m4000M834R5018J8967n2035k9242
5699b3293Q42K4207L0215q997R413n354R810m6662P568J236J5051k5506k6511
$$ plain form
5686 -37981 -57650 7481 55211 14077 14784 -10724 21476 20381 18364 14886 15873 -17888 -41849
5673 -41849 -27380 16294 77229 72039 82485 69385 -15544 3491 72167 74729 -1913 -30542
5661 -30542 -253 11710 -12191 -29755 -35943 747 -11849 28112 -281 -9963 35407 27739
5649 27739 58573 49737 48254 -2356 8449 11969 38172 33884 10587 21363 47363 86805 60661
5636 60661 38240 24783 7831 -1876 15283 27357 -28597 -6178 -30879 -38111 -75912 -60208
5624 -60208 -67300 -57743 -906 12726 11395 100 47817 46188 -2719 -12117 6427 -5779 -35002
5611 -35002 11819 11148 17566 -16503 -66516 -52946 -41641 -32886 -79978 -78163 -42738 -16395 -34747
5598 -34747 -12270 12512 20305 2570 -17457 -7706 40052 34091 62042 48183 61790 35265
$$ packed form
5686c7981j9669O5131M7730m1134P07k5508L2200j095k017l478R87l3761k3961
5673d1849J4469M3674O0935n190J0446j3100q4929J9035O8676K562p6642k8629
5661c0542L0289J1963k3901j7564o188L6690j2596L9961k8393r682M5370p668
5649B7739L0834q836j483n0610J0805L520K6203m288k3297J0776K6000L9442k6144
5636F0661k2421j3457j6952r707J7159J2074n5954K2419k4701p232l7801J5704
5624f0208p092R557N6837J3632j331j1295M7717j629m8907r398J8544j2206k9223
5611c5002M6821o71O418l4069n0013J3570J1305Q755m7092J815L5425K6343j8352
5598c4747K2477K4782P793j7735k0027R751M7758n961K7951j3859J3607k6525
$$ plain form
5586 35265 -10736 -18974 -24533 11446 -12529 7937 -9870 -20861 -22046 9826 9854 12667 44192
5573 44192 40055 20893 -6326 17113 2597 34602 900 28924 4331 55427 29851 -26139
5561 -26139 -11060 -4924 -15746 -18589 -42710 -17947 8743 -2036 -8372 -23107 18572 -21025
5549 -21025 22191 62580 10977 -18516 1514 -400 -19508 -32776 4805 15417 10446 39431
5537 39431 16543 24984 33160 69332 25790 -5272 -14699 -18516 35268 43073 32295 8650 17206
5524 17206 54681 56134 28554 3995 958 -51244 11081 70180 80083 11795 -5705 -6806 16489
5511 16489 93934 67926 6129 49867 59456 56399 71021 6776 -18704 -78243 -21815 44987
5499 44987 42820 -28355 -15093 8765 -15060 -29179 -1676 26381 7632 -33679 -12694 30121
$$ packed form
5586C5265m6001q238n559L5979k3975K0466j7807j0991j185L1872K8K813L1525
5573D4192m137j9162k7219K3439j4516L2005l3702K8024k4593N1096k5576n5990
5561b6139J5079O136j0822k843k4121K4763K6690j0779o336j4735M1679l9597
5549b1025M3216M0389n1603k9493K0030j914j9108j3268L7581J0612m971K8985
5537C9431k2888Q441Q176L6172m3542l1062r427l817N3784P805j0778k3645Q556
5524A7206L7475J453k7580k4559l037n2202O2325N9099R903o8288j7500j101K3295
5511A6489P7445k6008o1797M3738R589l057J4622o4245k5480n9539N6428O6802
5499D4987k167p1175J3262K3858k3825j4119K7503K8057j8749m1311K0985M2815
$$ plain form
5487 30121 41254 54683 41604 32465 15931 20332 2714 71763 106581 68741 22879 12068
5475 12068 55144 -15117 -3475 24707 28736 75423 92838 11330 49402 62134 58964 83512
5463 83512 48771 25690 101493 89511 72841 62188 74922 62412 69564 97993 92097 87556
5451 87556 90169 36600 89935 51129 61404 86621 48483 34008 36481 31934 37387 67948 70088
5438 70088 40804 90639 78440 65872 106049 112047 130447 107564 91592 96095 65429 78222
5426 78222 159096 176723 137450 163026 161158 204050 197345 144051 182861 174440 189676 213902
5414 213902 201959 173420 214388 209988 173343 135879 152293 118446 133097 167435 196536 240191
5402 240191 197852 162143 171210 121069 105084 77260 133752 189102 194361 158947 200450 237777
$$ packed form
5487C0121J1133J3429j3079r139j6534M401j7618O9049L4818l7840m5862j0811
5475A2068M3076p0261J1642K8182M029M6687J7415q1508L8072J2732l170K4548
5463H3512l4741k3081P5803j1982j6670j0653J2734j2510P152K8429n896m541
5451H7556K613n3569N3335l8806J0275K5217l8138j4475K473m547N453L0561K140
5438G0088k9284M9835j2199j2568M0177N998J8400k2883j5972M503l0666J2793
5426G8222Q0874J7627l9273K5576j868M2892o705n3294L8810q421J5236K4226
5414B13902j1943k8539M0968m400l6645l7464J6414l3847J4651L4338K9101M3655
5402B40191m2339l5709R067n0141j5985k7824N6492N5350N259l5414M1503L7327
$$ plain form
5390 237777 251365 273225 275550 197066 166120 165999 183796 164807 155860 142959 162743 181160
5378 181160 234754 221166 197180 167640 131632 109730 94556 92100 92573 88237 86733 87518 84838
5365 84838 51698 40640 8274 89446 79127 70630 131518 110822 121934 124087 149331 143199
5353 143199 123103 104250 147374 191984 172221 156289 123316 115245 103680 118397 128709 113199
5341 113199 102246 148413 177411 170259 163280 184205 175960 196387 200928 173020 102579 97434 115999
5328 115999 73255 124220 177989 149861 122013 123331 167006 157681 121244 108447 99032 134816
5316 134816 119567 119129 89342 114569 91570 125357 88563 94097 72048 95462 86676 103411
5304 103411 128250 148027 155310 135624 98801 137431 159218 167174 191841 153119 111099 95976
$$ packed form
5390B37777J3588K1860K325p8484l0946j21J7797j8989q947j2901J9784J8417
5378A81160N3594j3588k3986k9540l6008k1902j5174k456M73m336j504P85k680
5365H4838l3140j1058l2366Q1172j0319q497O0888k0696J1112K153K5244o132
5353A43199k0096j8853M3124M4610j9763j5932l2973q071j1565J4717J0312j5510
5341A13199j0953M6167K8998p152o979K0925q245K0427M541k7908p0441n145J8565
5328A15999m2744N0965N3769k8128k7848J318M3675r325l6437j2797r415L5784
5316A34816j5249m38k9787K5227k2999L3787l6794N534k2049K3414q786J6735
5304A03411K4839J9777P283j9686l6823L8630K1787P956K4667l8722m2020j5123
$$ plain form
5292 95976 84475 115347 126677 68301 96309 158787 158124 192776 203569 149271 107552 141210
5280 141210 157443 180323 163928 132170 144876 186450 183407 203695 223986 160790 176257 242527
5268 242527 218411 223038 215363 202177 214595 242189 203485 175372 168597 146406 128061 191763
5256 191763 196787 205731 199474 230901 287802 265103 222996 229500 227327 240225 266400 291745 307642
5243 307642 326464 288346 303416 322410 247399 290462 288303 280300 207750 193698 167375 176069
5231 176069 229297 279121 235549 206948 175671 181502 201978 241603 204264 226740 274918 251291
5219 251291 225858 197198 201151 200404 141753 137371 147470 134492 118671 150376 142483 122860 137387
5206 137387 102950 145127 181170 171387 167706 132492 173235 215573 190784 174139 190380 171823
$$ packed form
5292I5976j1501L0872J1330n8376K8008O2478o63L4652J0793n4298m1719L3658
5280A41210J6233K2880j6395l1758J2706M1574l043K0288K0291o3196J5467O6270
5268B42527k4116M627p675j3186J2418K7594l8704k8113o775k2191j8345O3702
5256A91763N024Q944o257L1427N6901k2699m2107O504k173J2898K6175K5345J5897
5243C07642J8822l8118J5070J8994p5011M3063k159q003p2550j4052k6323Q694
5231A76069N3228M9824m3572k8601l1277N831K0476L9625l7339K2476M8178k3627
5219B51291k5433k8660L953p47n8651m382J0099j2978j5821L1705p893j9623J4527
5206A37387l4437M2177L6043r783l681l5214M0743M2338k4789j6645J6241j8557
$$ plain form
5194 171823 169784 137977 153557 162164 151611 100848 97926 121456 136428 145780 204872 227933
5182 227933 213782 194097 182302 172440 173139 170218 155892 158565 234695 247080 223501 205815 243078
5169 243078 340484 359897 358265 402224 453115 434080 451568 407800 362594 328051 309284 261584
5157 261584 266984 258820 201590 221358 223707 182729 159075 170388 151026 163667 156148 150836 183280
5144 183280 193438 184616 213011 241637 166899 183212 162417 203717 220429 223644 208879 264984
5132 264984 280445 230988 217733 236290 259563 280885 324045 313514 278899 314938 347491 375917
5120 375917 359600 447003 548460 618345 694605 806594 959216 1088035 1151523 1218737 1109548
5109 1109548 898020 770964 648378 580176 527693 430170 341356 351914 310578 257134 263136
$$ packed form
5194A71823k039l1807J5580Q607j0553n0763k922K3530J4972R352N9092K3061
5182B27933j4151j9685j1795r862O99k921j4326K673P6130J2385k3579j7686L7263
5169B43078R7406J9413j632M3959N0891j9035J7488m3768m5206l4543j8767m7700
5157B61584N400q164n7230J9768K349m0978k3654J1313j9362J2641p519n312L2444
5144A83280J0158q822K8395K8626p4738J6313k0795M1300J6712L215j4765N6105
5132B64984J5461m9457j3255J8557K3273K1322M3160j0531l4615L6039L2553K8426
5120C75917j6317Q7403J01457O9885P6260J11989J52622J28819O3488O7214j09189
5109A109548k11528j27056j22586o8202n2483r7523q8814J0558m1336n3444O002
$$ plain form
5098 263136 263305 254344 239798 238074 229013 178980 171415 135904 207123 197964 163778 185933 195237
5085 195237 161702 147819 128644 163755 163898 166873 159274 138237 105974 91186 94661 152702 193050
5072 193050 109724 97451 144940 156528 154801 162046 186738 150159 114551 124929 109862 93412
5060 93412 77454 101038 65447 51847 73155 53592 127425 166589 87792 79705 41262 45278
5048 45278 45387 80512 62083 17462 47775 101456 126845 150659 157038 125818 87439 59126
5036 59126 43589 42957 81753 70392 39865 79144 51783 53740 73811 52751 48171 55972 10894
5023 10894 19929 59081 67967 77454 35649 59394 64811 31185 64597 96944 87068 65007 37559
5010 37559 90442 48837 28674 88435 126784 83458 53397 84083 50352 28120 81488 103694
$$ packed form
5098B63136J69q961j4546j724r061n0033p565l5511P1219r159l4186K2155R304
5085A95237l3535j3883j9175L5111J43K975p599k1037l2263j4788L475N8041M0348
5072A93050q3326j2273M7489J1588j727P245K4692l6579l5608J0378j5067j6450
5060I3412j5958K3584l5591j3600K1308j9563P3833L9164p8797q087l8443M016
5048D5278J09L5125j8429m4621L0313N3681K5389K3814O379l1220l8379k8313
5036E9126j5537o32L8796j1361l0527L9279k7361J957K0071k1060m580P801m5078
5023A0894R035L9152Q886R487m1805K3745N417l3626L3412L2347r876k2061k7448
5010C7559N2883m1605k0163N9761L8349m3326l0061L0686l3731k2232N3368K2206
$$ plain form
4998 103694 100899 108782 106251 115644 115414 109268 69044 47706 71626 101269 46474 66799 128008
4985 128008 135757 86075 108300 93772 60109 79811 82904 76981 70259 92697 91532 90090 91557
4972 91557 75769 61022 118354 80426 45627 82821 77152 100494 150536 109971 116763 96425
4960 96425 132253 159841 100266 112165 145239 83596 67005 71293 123390 149339 153782 134715
4948 134715 69310 125414 154054 201381 157903 139422 114844 147474 154786 126720 133367 111070
4936 111070 119679 147386 175274 180853 186104 169606 197974 148140 166618 173203 138175 169909
4924 169909 223247 207947 218099 204865 202637 199475 274730 290896 273127 300114 257329 281081
4912 281081 276760 301823 266974 305295 335613 300532 313687 361524 390322 440049 447707 434406
$$ packed form
4998A03694k795P883k531R393k30o146m0224k1338K3920K9643n4795K0325O1209
4985A28008P749m9682K2225j4528l3663J9702L093n923o722K2438j165j442J467
4972I1557j5788j4747N7332l7928l4799L7194n669K3342N0042m0565O792k0338
4960I6425L5828K7588n9575J1899L3074o1643j6591M288N2097K5949M443j9067
4948A34715o5405N6104K8640M7327m3478j8481k4578L2630P312k8066O647k2297
4936A11070Q609K7707K7888N579N251j6498K8368m9834J8478O585l5028L1734
4924A69909N3338j5300J0152j3234k228l162P5255J6166j7769K6987m2785K3752
4912B81081m321K5063l4849L8321L0318l5081J3155M7837K8798M9727P658j3301
$$ plain form
4900 434406 457027 448687 494307 510605 576497 657165 735989 824772 885976 968882 1111784 1317161
4888 1317161 1587961 1927388 2310041 2741468 3015169 3121992 2918572 2441805 2052736 1622619
4878 1622619 1341990 1150506 1006862 886405 778707 749040 714837 680426 652411 644891 562323
4867 562323 505116 462713 452558 484652 478814 431005 388292 382133 428742 425608 406701 495622
4855 495622 548735 548677 556703 552021 553231 511396 433167 433422 440236 423371 442751 419637 348038
4842 348038 302549 312799 329438 323784 298213 337509 297154 302176 293025 303444 309179 240030
4830 240030 287826 329613 327569 349936 337149 359273 385257 398309 362677 390275 341456 327222
4818 327222 380695 373397 309231 252733 221840 248919 287383 307646 309586 282553 266060 290771
$$ packed form
4900D34406K2621q340M5620J6298O5892Q0668P8824Q8783O1204Q2906J42902K05377
4888A317161K70800L39427L82653M31427K73701J06823k03420m76767l89069m30117
4878A622619k80629j91484j43644j20457j07698k9667l4203l4411k8015p520q2568
4867E62323n7207m2403j0155L2094n838m7809m2713o159M6609l134j8907Q8921
4855D95622N3113n8Q026m682J210m1835p8229K55O814j6865J9380k3114p1599
4842C48038m5489J0250J6639n654k5571L9296m0355N022r151J0419N735o9149
4830B40030M7796M1787k044K2367j2787K2124K5984J3052l5632K7598m8819j4234
4818C27222N3473p298o4166n6498l0893K7079L8464K0263J940k7033j6493K4711
$$ plain form
4806 290771 312274 329369 338921 359455 383085 377822 373268 399733 430271 450924 461227 413387
4794 413387 526615 543173 504676 518305 556744 502047 479382 456539 405667 374084 288460
4783 288460 294266 340282 334898 353514 311193 332919 361108 328078 352142 351954 379735 417172
4771 417172 401859 402446 430240 388096 396058 443734 443702 429687 444039 449146 435633 409050 396619
4758 396619 381126 352217 406022 368173 361481 381627 356372 328002 352260 380807 374284 330732
4746 330732 329470 357956 324021 340297 338244 357502 333216 290315 366259 362338 368399 364411 393698
4733 393698 360674 372372 389556 347507 357910 355858 384148 381401 378810 413404 401383 395759
4721 395759 412584 419623 447658 401185 427804 433156 405869 375646 419400 430965 440099 465911
$$ packed form
4806B90771K1503J7095R552K0534K3630n263m554K6465L0538K0653J0303m7840
4794D13387J13228J6558l8497J3629L8439n4697k2665k2843n0872l1583q5624
4783B88460N806M6016n384J8616m2321K1726K8189l3030K4064j88K7781L7437
4771D17172j5313N87K7794m2144P962M7676l2j4015J4352N107j3513k6583j2431
4758C96619j5493k8909N3805l7849o692K0146k5255k8370K4258K8547o523m3552
4746C30732j262K8486l3935J6276k053J9258k4286m2901P5944l921O061l988K9287
4733C93698l3024J1698J7184m2049J0403k052K8290k747k591L4594j2021n624
4721C95759J6825P039K8035m6473K6619N352k7287l0223M3754J1565R134K5812
$$ plain form
4709 465911 452239 514643 528492 477737 492891 467376 449122 427726 448881 494077 462388 483565
4697 483565 529813 528792 492529 494673 497675 512735 519752 509015 515560 537681 506532 522861 500346
4684 500346 477144 517447 548511 566535 542711 567358 604558 607202 635060 681510 677723 687817
4672 687817 714638 716505 731538 786219 746453 763658 768065 781911 787428 765349 772234 754235
4660 754235 712165 688735 705268 703120 683797 693868 707401 683708 676521 692758 686150 704387
4648 704387 749244 748916 716655 720466 777838 715699 727665 723045 694161 714278 783085 726572
4636 726572 773432 846610 912517 933432 948362 1007288 1050559 1042000 1027195 1028100 998511 992637
4624 992637 1021587 1013793 1001196 1064374 1075461 1069593 1111182 1130970 1125684 1146676 1108228 1158338
$$ packed form
4709D65911j3672O2404J3849n0755J5154k5515j8254k1396K1155M5196l1689K1177
4697D83565M6248j021l6263K144L002J5060P017j0737O545K2121l1149J6329k2515
4684E00346k3202M0303L1064J8024k3824K4647L7200K644K7858M6450l787J0094
4672F87817K6821J867J5033N4681l9766J7205M407J3846N517k2079O885j7999
4660G54235m2070k3430J6533k148j9323J0071J3533k3693p187J6237o608J8237
4648G04387M4857l28l2261L811N7372o2139J1966m620k8884K0117O8807n6513
4636G26572M6860P3178O5907K0915J4930N8926M3271q559j4805R05k9589n874
4624I92637K8950p794j2597O3178J1087n868M1589J9788n286K0992l8448N0110
$$ plain form
4612 1158338 1189655 1245458 1306526 1367884 1375011 1426106 1509381 1586423 1597184 1566665 1597898 1663673
4600 1663673 1609648 1626386 1676751 1722024 1746883 1797284 1753643 1800099 1794262 1823113 1873456 1873372
4588 1873372 1915379 1921128 2014027 2089413 2159833 2222459 2292497 2387958 2452452 2486922 2560901 2616592
4576 2616592 2660284 2686031 2701103 2768623 2834802 2871438 2963491 2987207 3064432 3188369 3267868
4565 3267868 3285259 3341539 3451747 3534076 3607324 3694859 3826990 3980486 4052439 4123465 4184635
4554 4184635 4256646 4244508 4306874 4358654 4415502 4445032 4452810 4528368 4600678 4684740 4749373 4857442
4542 4857442 4983435 5062275 5140249 5300275 5391359 5535242 5660751 5798616 5966966 6170204
4532 6170204 6451667 6762667 7018350 7359128 7780993 8185164 8597732 9001446 9455000 9934483
$$ packed form
4612A158338L1317N5803O1068O1358P127N1095Q3275P7042J0761l0519L1233O5775
4600A663673n4025J6738N0365M5273K4859N0401m3641M6456n837K8851N0343q4
4588A873372M2007N749R2899P5386P0420O2626P0038R5461O4494L4470P3979N5691
4576B616592M3692K5747J5072O7520O6179L6636R2053K3716P7225J23937P9499
4565C267868J7391N6280J10208Q2329P3248Q7535J32131J53496P1953P1026O1170
4554D184635P2011j2138O2366N1780N6848K9530P778P5558P2310Q4062O4633J08069
4542D857442J25993P8840P7974J60026R1084J43883J25509J37865J68350K03238
4532F170204K81463L11000K55683L40778M21865M04171M12568M03714M53554M79483
$$ plain form
4522 9934483 10380085 10906310 11467085 11991568 12594566 13258347 13997840 14675788 15406373 16148107
4512 16148107 17005840 17950390 19020994 20315980 21804408 23475035 25519768 27865620
4504 27865620 30680551 34106255 38078919 42668492 48153066 54781211 62940613 73062053
4496 73062053 85305116 99361842 113359571 124360308 129450924 125840950 114172713
4489 114172713 99231943 84708835 71925658 61366386 52870479 46087675 40750570
4482 40750570 36408802 32868643 29864847 27325916 25154472 23378180 21847613 20500020
4474 20500020 19282470 18123551 17173150 16251511 15389206 14648494 14013081 13382392 12863686
4465 12863686 12406809 11912756 11563334 11236908 10876115 10568748 10315920 10190030 10015122
$$ packed form
4522I934483M45602N26225N60775N24483O02998O63781P39493O77948P30585P41734
4512A6148107Q57733R44550J070604J294986J488428J670627K044733K345852
4504B7865620K814931L425704L972664M589573N484574O628145Q159402J0121440
4496G3062053J2243063J4056726J3997729J1000737N090616l609974j1668237
4489A14172713j4940770j4523108j2783177j0559272q495907o782804n337105
4482D0750570m341768l540159l003796k538931k171444j776292j530567j347593
4474B0500020j217550j158919r50401r21639q62305p40712o35413o30689n18706
4465A2863686m56877m94053l49422l26426l60793l07367k52828j25890j74908
$$ plain form
4456 10015122 9863361 9713082 9520997 9327101 9105374 8894834 8637587 8361767 8030340
4447 8030340 7728081 7425274 7165268 6891466 6642920 6374864 6197367 5978954 5758811 5544264
4437 5544264 5386800 5258542 5037474 4851791 4669384 4461450 4343608 4203446 3991136 3875180
4427 3875180 3758481 3636482 3507366 3376674 3332590 3202710 3062557 3018394 2950394 2870945
4417 2870945 2800578 2747914 2699669 2663217 2637533 2603793 2502638 2406739 2343966 2306981 2250878
4406 2250878 2171183 2108270 2067623 2023873 1978724 1938304 1952801 1889099 1885685 1888017 1881573 1797622
4394 1797622 1713380 1701066 1627340 1587087 1580680 1543277 1511821 1439324 1410921 1432432 1389339 1350581
4382 1350581 1295438 1329299 1308229 1242524 1189685 1175680 1145535 1142692 1144542 1179967 1206935 1196959
$$ packed form
4456A0015122j51761j50279j92085j93896k21727k10540k57247k75820l31427
4447H030340l02259l02807k60006k73802k48546k68056j77497k18413k20143k14547
4437E544264j57464j28258k21068j85683j82407k07934j17842j40162k12310j15956
4427C875180j16699j21999j29116j30692m4084j29880j40153m4163o8000p9449
4417B870945p0367n2664m8245l6452k5684l3740j01155r5899o2773l6985n6103
4406B250878p9695o2913m0647m3750m5149m0420J4497o3702l414K332o444q3951
4394A797622q4242j2314p3726m0253o407l7403l1456p2497k8403K1511m3093l8758
4382A350581n5143L3861k1070o5705n2839j4005l0145k843J850L5425K6968r976
$$ plain form
4370 1196959 1159494 1160442 1117949 1120770 1087480 1063630 1060701 1033321 988203 1003004 1013933 998875
4358 998875 977548 966089 943327 929831 974297 941691 937996 917504 949522 1003848 1036888 1003482
4346 1003482 1033339 982781 1022976 1016022 935348 959954 956025 888471 823850 818791 830532 834528
4334 834528 818781 775856 804370 819143 787070 776701 747627 699952 695240 727725 688100 653352
4322 653352 667053 668912 662341 583419 548890 548055 557804 532632 550094 616404 583366 601693 599205
4309 599205 594417 592185 657422 639181 612558 623692 626345 665778 596444 631836 619707 646129
4297 646129 655107 632185 626852 598920 598614 605209 564172 563916 544870 553229 604048 637357 637092 602154
4283 602154 637300 653873 654256 620013 664385 666776 653315 630681 560626 568348 631820 618320
$$ packed form
4370A196959l7465R48m2493K821l3290k3850k929k7380m5118J4801J0929j5058
4358I98875k1327j1459k2762j3496M4466l2606l695k0492L2018N4326L3040l3406
4346A003482K9857n0558M0195o954q0674K4606l929o7554o4621n059J1741L996
4334H34528j5747m2925K8514J4773l2073j0369k9074m7675m712L2485l9625l4748
4322F53352J3701J859o571p8922l4529q35R749k5172J7462O6310l3038J8327k488
4309E99205m788k232O5237j8241k6623J1134K653L9433o9334L5392j2129K6422
4297F46129Q978k2922n333k7932l06O595m1037k56j9046Q359N0819L3309k65l4938
4283F02154L5146J6573L83l4243M4372K391j3461k2634p0055P722O3472j3500
$$ plain form
4271 618320 625810 696587 712943 731706 757575 757720 794543 784103 804467 824200 791863 819977
4259 819977 899385 989377 943811 918565 978738 977067 991473 1011421 1036394 1020189 1028590 1070336
4247 1070336 1094040 1130657 1146820 1166825 1157407 1189771 1208274 1237419 1261904 1266046 1347884 1356818
4235 1356818 1314528 1296360 1346084 1296138 1286598 1302020 1320707 1364688 1355665 1370881 1404210 1439384
4223 1439384 1424202 1393801 1367783 1394008 1412005 1410819 1395901 1395478 1402081 1373073 1367502 1337886
4211 1337886 1332979 1335054 1297243 1257042 1187446 1208204 1221166 1195373 1187334 1209784 1209288 1182549
4199 1182549 1169683 1156330 1195977 1212323 1205400 1214603 1244532 1242825 1306287 1346879 1392118 1393012
4187 1393012 1334933 1321007 1284365 1234207 1219111 1196945 1174206 1123078 1146903 1156580 1160598 1199457
$$ packed form
4271F18320P490P0777J6356J8763K5869J45L6823j0440K0364J9733l2337K8114
4259H19977P9408Q9992m5566k5246O0173j671J4406J9948K4973j6205Q401M1746
4247A070336K3704L6617J6163K0005r418L2364J8503K9145K4485M142Q1838Q934
4235A356818m2290j8168M9724m9946r540J5422J8687M3981r023J5216L3329L5174
4223A439384j5182l0401k6018K6225J7997j186j4918m23O603k9008n571k9616
4211A337886m907K075l7811m0201o9596K0758J2962k5793q039K2450m96k6739
4199A182549j2866j3353L9647J6346o923R203K9929j707O3462M0592M5239Q94
4187A393012n8079j3926l6642n0158j5096k2166k2739n1128K3825R677M018L8859
$$ plain form
4175 1199457 1155241 1133943 1087520 1158178 1228154 1182993 1142130 1180973 1189870 1184474 1195442 1190456
4163 1190456 1215175 1181126 1221858 1212271 1272025 1321457 1285196 1309239 1313448 1306556 1276738 1269320
4151 1269320 1267369 1200110 1268583 1314515 1277984 1280871 1295463 1293250 1278965 1341298 1362045 1347222
4139 1347222 1353157 1407796 1370396 1416971 1446475 1438196 1449379 1463580 1447828 1449306 1471279 1550366
4127 1550366 1562070 1572212 1620330 1605744 1559319 1577257 1556443 1575311 1586864 1586723 1566503 1567931
4115 1567931 1615653 1651307 1656193 1639227 1678843 1675655 1654658 1676805 1713406 1669809 1679342 1701656
4103 1701656 1711096 1710041 1716550 1685961 1714583 1768115 1756274 1771888 1822565 1803693 1778253 1849560
4091 1849560 1868449 1887555 1911262 1969528 2009583 1953837 2011016 2038420 2029661 2022900 2053408 2109609
$$ packed form
4175A199457m4216k1298m6423P0658O9976m5161m0863L8843Q897n396J0968m986
4163A190456K4719l4049M0732r587N9754M9432l6261K4043M209o892k9818p418
4151A269320j951o7259O8473M5932l6531K887J4592k213j4285O2333K0747j4823
4139A347222N935N4639l7400M6575K9504q279J1183J4201j5752J478K1973P9087
4127A550366J1704J0142M8118j4586m6425J7938k0814J8868J1553j41k0220J428
4115A567931M7722L5654M886j6966L9616l188k0997K2147L6601m3597R533K2314
4103A701656R440j055O509l0589K8622N3532j1841J5614N0677j8872k5440P1307
4091A849560J8889J9106K3707N8266M0055n5746N7179K7404q759o761L0508N6201
$$ plain form
4079 2109609 2151660 2191478 2154179 2177751 2259961 2280515 2345242 2355554 2366799 2407490 2444318
4068 2444318 2499250 2549069 2601446 2626482 2669039 2702229 2711401 2761165 2812014 2849658 2900835 2938297
4056 2938297 2987614 3059167 3085444 3139221 3254474 3280362 3311772 3448951 3573458 3614908 3643980
4045 3643980 3717656 3803908 3859703 4011411 4095478 4139490 4186662 4270546 4340547 4451989 4511309
4034 4511309 4602795 4755455 4818136 4924416 5006795 5158425 5231263 5376677 5522615 5657326
4024 5657326 5769347 5908086 6073095 6241453 6358876 6476102 6613221 6719740 6901612 7074912
4014 7074912 7235969 7417838 7613196 7856203 8006663 8196471 8387212 8573085 8824473 9019797
4004 9019797 9253342 9504065 9729504 9966025 10174810 10393704 10700070 10983232 11319008 11667293
$$ packed form
4079B109609M2051L9818l7299K3572Q2210K0554O4727J0312J1245M0691L6828
4068B444318N4932M9819N2377K5036M2557L3190R172M9764N0849L7644N1177L7462
4056B938297M9317P1553K6277N3777J15253K5888L1410J37179J24507M1450K9072
4045C643980P3676Q6252N5795J51708Q4067M4012M7172Q3884P0001J11442N9320
4034D511309R1486J52660O2681J06280Q2379J51630P2838J45414J45938J34711
4024E657326J12021J38739J65009J68358J17423J17226J37119J06519J81872J73300
4014G074912J61057J81869J95358K43007J50460J89808J90741J85873K51388J95324
4004I019797K33545K50723K25439K36521K08785K18894L06366K83162L35776L48285
$$ plain form
3994 11667293 11977492 12318861 12735640 13208484 13623419 14075065 14608457 15141999 15689188
3985 15689188 16246635 16861884 17496719 18276486 19073519 19915597 20797394 21798963 22955367
3976 22955367 24085385 25291060 26625104 28028045 29472954 31015388 32673048 34408542
3968 34408542 36244944 38276900 40274469 42458884 44749436 47092885 49495005 52028021
3960 52028021 54641263 57270523 59935376 62646257 65497935 68365173 71269165 74174615
3952 74174615 77143322 80091883 83003605 85907157 88769957 91534146 94181620 96735656
3944 96735656 99163540 101339264 103399849 105409282 107217953 108876766 110410618 111730361
3936 111730361 112929284 113921467 114718083 115157989 115398147 115340008 115000036 114433893 113671678
$$ packed form
3994A1667293L10199L41369M16779M72844M14935M51646N33392N33542N47189
3985A5689188N57447O15249O34835P79767P97033Q42078Q81797J001569J156404
3976B2955367J130018J205675J334044J402941J444909J542434J657660J735494
3968C4408542J836402K031956J997569K184415K290552K343449K402120K533016
3960E2028021K613242K629260K664853K710881K851678K867238K903992K905450
3952G4174615K968707K948561K911722K903552K862800K764189K647474K554036
3944I6735656K427884K175724K060585K009433J808671J658813J533852J319743
3936A11730361J198923R92183P96616M39906K40158n8139l39972n66143p62215
$$ plain form
3927 113671678 112697360 111524211 110141772 108594513 106891371 104996520 103004989 100878888
3919 100878888 98632504 96200727 93678946 91034453 88239767 85349995 82462911 79537049
3911 79537049 76558810 73593387 70620654 67730005 64911836 62114047 59418013 56745089
3903 56745089 54102207 51566079 49143234 46696416 44319269 42047768 39904108 37820545
3895 37820545 35815955 33951102 32154829 30481465 28902759 27477504 26076054 24789329
3887 24789329 23600931 22511325 21425612 20392867 19518832 18638029 17778508 17004003 16301395
3878 16301395 15623149 15043529 14489449 13966351 13439132 12981146 12596777 12222485 11822675
3869 11822675 11479852 11196553 10820037 10551936 10335738 10068407 9841426 9593197 9377204
$$ packed form
3927A13671678r74318j173149j382439j547259j703142j894851j991531k126101
3919A00878888k246384k431777k521781k644493k794686k889772k887084k925862
3911G9537049k978239k965423k972733k890649k818169k797789k696034k672924
3903E6745089k642882k536128k422845k446818k377147k271501k143660k083563
3895C7820545k004590j864853j796273j673364j578706j425255j401450j286725
3887B4789329j188398j089606j085713j032745q74035q80803q59521p74505p02608
3878A6301395o78246n79620n54080n23098n27219m57986l84369l74292l99810
3869A1822675l42823k83299l76516k68101k16198k67331k26981k48229k15993
$$ plain form
3860 9377204 9175135 9011023 8836034 8639571 8538281 8455665 8299857 8193729 8037234 7981876
3850 7981876 7888112 7787498 7693442 7646410 7636688 7589209 7574516 7487337 7504533 7521319 7432998
3839 7432998 7425550 7431040 7408157 7387343 7354154 7318961 7298550 7205847 7159273 7096329 7042687 6962890
3827 6962890 6787027 6787748 6745113 6637969 6612932 6514314 6453603 6338522 6231040 6159746 6066272
3816 6066272 5981212 5893256 5809158 5696953 5610121 5505942 5446640 5366428 5354411 5275032 5272189
3805 5272189 5251690 5168224 5158775 5128182 5056812 5085350 5102685 5092540 5114556 5122148 5141963 5137239
3793 5137239 5161635 5184412 5185938 5148327 5159196 5152085 5110993 5109871 5074530 5026864 5045847 5021086
3781 5021086 4990360 5005298 5014961 5004259 4996400 4999267 5006851 5006602 4934243 4930531 4927455 4867481 4843027
$$ packed form
3860I377204k02069j64112j74989j96463j01290q2616j55808j06128j56495n5358
3850G981876r3764j00614r4056m7032r722m7479j4693q7179J7196J6786q8321
3839G432998p448N490k2883k0814l3189l5193k0411r2703m6574o2944n3642p9797
3827F962890j75863P21m2635j07144k5037r8618o0711j15081j07482p1294r3474
3816F066272q5060q7956q4098j12205q6832j04179n9302q0212j2017p9379k843
3805E272189k0499q3466r449l0593p1370K8538J7335j0145K2016P592J9815m724
3793E137239K4396K2777J526l7611J0869p111m1092j122l5341m7666J8983k4761
3781E021086l0726J4938R663j0702p859K867P584k49p2359l712l076n9974k4454
$$ plain form
3768 4843027 4863996 4829675 4795946 4810321 4769085 4722035 4705607 4706216 4764765 4752621 4770125 4744154
3756 4744154 4779792 4798865 4806266 4821827 4825716 4861505 4872155 4913762 4947774 4966858 4953201 4973041
3744 4973041 4991902 5045051 5071844 5040922 5025056 5071641 5115077 5157891 5180386 5242490 5261035
3733 5261035 5290903 5389456 5437409 5476535 5487802 5565958 5638085 5677370 5718381 5775782 5818025
3722 5818025 5840376 5867058 5881521 5987077 6050610 6081068 6148856 6212884 6224899 6240928 6306976
3711 6306976 6389645 6453951 6487273 6502689 6555212 6626633 6653970 6672161 6735136 6782280 6790985 6831955
3699 6831955 6945415 7060862 7158390 7248991 7305041 7395663 7513122 7646479 7810678 7962186
3689 7962186 8070453 8183902 8361398 8541731 8624487 8691757 8820104 8927860 9105096 9265852
$$ packed form
3768D843027K0969l4321l3729J4375m1236m7050j6428O09N8549j2144J7504k5971
3756D744154L5638J9073P401J5561L889L5789J0650M1607L4012J9084j3657J9840
3744D973041J8861N3149K6793l0922j5866M6585M3436M2814K2495O2104J8545
3733E261035K9868R8553M7953L9126J1267P8156P2127L9285M1011N7401M2243
3722E818025K2351K6682J4463J05556O3533L0458O7788O4028J2015J6029O6048
3711F306976Q2669O4306L3322J5416N2523P1421K7337J8191O2975M7144Q705M0970
3699F831955J13460J15447R7528R0601N6050R0622J17459J33357J64199J51508
3689G962186J08267J13449J77496J80333Q2756O7270J28347J07756J77236J60756
$$ plain form
3679 9265852 9432836 9616557 9766778 9944629 10062612 10246695 10386731 10521394 10749134 10887765
3669 10887765 11079971 11279527 11448654 11648955 11851114 12017110 12254429 12444860 12694781
3660 12694781 12947585 13181235 13464881 13678806 14003564 14257435 14564414 14915931 15277613
3651 15277613 15645465 16045814 16460301 16870338 17330690 17777178 18291649 18785891 19367021
3642 19367021 19989988 20686268 21397741 22190274 23013846 23793669 24698154 25679990 26743704
3633 26743704 27821132 28854108 29926839 31068258 32207500 33286677 34464149 35679288
3625 35679288 36836598 38012242 39192967 40426917 41653494 42809229 43973766 45167766
3617 45167766 46284754 47354817 48277468 49152640 49896691 50580942 51193976 51814874 52385339
$$ packed form
3679I265852J66984J83721J50221J77851J17983J84083J40036J34663K27740J38631
3669A0887765J92206J99556J69127K00301K02159J65996K37319J90431K49921
3660A2694781K52804K33650K83646K13925L24758K53871L06979L51517L61682
3651A5277613L67852M00349M14487M10037M60352M46488N14471M94242N81130
3642A9367021O22967O96280P11473P92533Q23572P79823R04485R81836J063714
3633B6743704J077428J032976J072731J141419J139242J079177J177472J215139
3625C5679288J157310J175644J180725J233950J226577J155735J164537J194000
3617D5167766J116988J070063R22651Q75172P44051O84251O13034O20898N70465
$$ plain form
3608 52385339 52906767 53515296 54124509 54729708 55288815 55781070 56260589 56711122 57124301
3599 57124301 57514314 57921025 58481464 59146600 59906835 60760589 61845692 63014180 64318978
3590 64318978 65890177 67540084 69328473 71291547 73482129 75884193 78559335 81471948
3582 81471948 84657527 88247712 92198091 96484615 101187336 106222665 111597929 117250594
3574 117250594 123202617 129449624 135987261 142847708 149970726 157514345 165511929 173949004
3566 173949004 182972727 192498464 202680023 213554254 225138381 237519438 250732518
3559 250732518 264849777 279833279 295735084 312364421 329439942 346261523 362074520
3552 362074520 376219775 388145573 397405765 403930260 407870279 409725176 410064452 409576675
$$ packed form
3608E2385339N21428O08529O09213O05199N59107M92255M79519M50533M13179
3599E7124301L90013M06711N60439O65136P60235Q53754J085103J168488J304798
3590F4318978J571199J649907J788389J963074K190582K402064K675142K912613
3582H1471948L185579L590185L950379M286524M702721N035329N375264N652665
3574A17250594N952023O247007O537637O860447P123018P543619P997584Q437075
3566A73949004R023723R525737J0181559J0874231J1584127J2381057J3213080
3559B50732518J4117259J4983502J5901805J6629337J7075521J6821581J5812997
3552C62074520J4145255J1925798R260192O524495L940019J854897L39276m87777
$$ plain form
3544 409576675 408823258 408179609 407764287 407642285 407480097 406953103 405446063 402329566 397010578
3535 397010578 389120036 378595892 365642797 350962846 335421848 319877742 304801244
3528 304801244 290594292 277593325 265796485 255178748 245744206 237387613 229996057
3521 229996057 223315438 217374755 212172810 207740563 204165291 201650439 200312929 200462313
3513 200462313 201949782 204743617 208658392 213230986 217995654 222279918 225596303 227460628
3505 227460628 227632870 225993087 223043391 219208513 215119282 211249837 207912957 205346021
3497 205346021 203429503 202127334 201024975 199604631 197291288 193546390 188136804 181039544
3489 181039544 172539637 163064852 153033254 142911568 133139858 124049020 115845765 108716930
$$ packed form
3544D09576675p53417o43649m15322j22002j62188n26994j507040l116497n318988
3535C97010578p890542j0524144j2953095j4679951j5540998j5544106j5076498
3528C04801244j4206952j3000967j1796840j0617737r434542q356593p391556
3521B29996057o680619n940683n201945m432247l575272k514852j337510J49384
3513B00462313J487469K793835L914775M572594M764668M284264L316385J864325
3505B27460628J72242j639783k949696l834878m089231l869445l336880k566936
3497B05346021j916518j302169j102359j420344k313343l744898n409586p097260
3489A81039544q499907r474785j0031598j0121686r771710r090838q203255p128835
$$ plain form
3481 108716930 102473135 96993124 92229874 87862541 83990600 80515084 77359270 74547701
3473 74547701 71941387 69511848 67186695 65034333 62993757 61008638 59123194 57275587
3465 57275587 55324784 53411613 51555307 49722933 47981478 46364550 44784288 43249109
3457 43249109 41740171 40383635 39034916 37672005 36402793 35078874 33758700 32596912
3449 32596912 31474706 30344022 29266526 28220469 27211669 26309841 25453206 24613931 23850490
3440 23850490 23103832 22408963 21779546 21187222 20620360 20022989 19532663 19018331 18515406
3431 18515406 18113641 17678393 17200301 16822771 16465479 16091072 15751701 15395023 15116746
3422 15116746 14753067 14379700 14107453 13884385 13596605 13307466 13081111 12853145 12657693
$$ packed form
3481A08716930o243795n480011m763250m367333l871941l475516l155814k811569
3473G4547701k606314k429539k325153k152362k040576j985119j885444j847607
3465E7275587j950803j913171j856306j832374j741455j616928j580262j535179
3457D3249109j508938j356536j348719j362911j269212j323919j320174j161788
3449C2596912j122206j130684j077496j046057j008800r01828q56635q39275p63441
3440B3850490p46658o94869o29417n92324n66862n97371m90326n14332n02925
3431A8515406m01765m35248m78092l77530l57292l74407l39371l56678k78277
3422A5116746l63679l73367k72247k23068k87780k89139k26355k27966j95452
$$ plain form
3413 12657693 12440631 12289493 12065655 11794101 11618547 11488344 11305305 11109864 10934525
3404 10934525 10761969 10643187 10476973 10352430 10214388 10100028 9968437 9819343 9649628
3395 9649628 9539656 9435665 9351390 9205307 9132787 9011107 8918309 8835128 8719510 8667426
3385 8667426 8573833 8451918 8299517 8270770 8174553 8089239 8020049 7910455 7846070 7789028 7667300
3374 7667300 7661774 7628731 7575609 7633990 7636564 7670109 7695245 7726497 7809492 7905636 8004552 8029058
3362 8029058 8068306 8079783 8047359 8037027 7936813 7866542 7824161 7783664 7755536 7765433 7719430
3351 7719430 7695558 7738190 7696229 7692339 7705140 7687209 7617477 7461919 7335583 7194913 7057776
3340 7057776 6910264 6729106 6576761 6433712 6337010 6226434 6133949 6127883 6048217 5931865
$$ packed form
3413A2657693k17062j51138k23838k71554j75554j30203j83039j95441j75339
3404A0934525j72556j18782j66214j24543j38042j14360j31591j49094j69715
3395I649628j09972j03991q4275j46083p2520j21680r2798q3181j15618n2084
3385H667426r3593j21915j52401k8747r6217q5314o9190j09594o4385n7042j21728
3374G667300n526l3043n3122N8381K574L3545K5136L1252Q2995R6144R8916K4506
3362H029058L9248J1477l2424j0332j00214p0271m2381m0497k8128R897m6003
3351G719430k3872M2632m1961l890J2801j7931o9732j55558j26336j40670j37137
3340G057776j47512j81158j52345j43049r6702j10576r2485o066p9666j16352
$$ plain form
3330 5931865 5876705 5859548 5793547 5836653 5808184 5816528 5835659 5787258 5729725 5729069 5774044 5794795
3318 5794795 5822679 5816565 5847299 5853498 5828755 5884359 5974946 5942134 5991047 6055244 6084413 6153701
3306 6153701 6242026 6272027 6297229 6332731 6407107 6448168 6496230 6567530 6666267 6759282 6811962
3295 6811962 6861837 6987624 7039740 7127677 7233390 7339161 7482455 7587208 7756077 7890595
3285 7890595 8019910 8162533 8259827 8349815 8478875 8599140 8810199 8991497 9091037 9294752
3275 9294752 9510931 9694074 9883763 10096145 10351634 10500205 10704055 10910984 11073226 11322658
3265 11322658 11582631 11862443 12090922 12298297 12495897 12681099 12896384 13161047 13394201
3256 13394201 13603257 13825585 14123562 14338958 14589275 14941987 15309139 15598845 15967096
$$ packed form
3330E931865n5160j7157o6001M3106k8469Q344J9131m8401n7533o56M4975K0751
3318E794795K7884o114L0734O199k4743N5604R0587l2812M8913O4197K9169O9288
3306F153701Q8325L0001K5202L5502P4376M1061M8062P1300R8737R3015N2680
3295F811962M9875J25787N2116Q7937J05713J05771J43294J04753J68869J34518
3285G890595J29315J42623R7294Q9988J29060J20265K11059J81298R9540K03715
3275I294752K16179J83143J89689K12382K55489J48571K03850K06929J62242K49432
3265A1322658K59973K79812K28479K07375J97600J85202K15285K64663K33154
3256A3394201K09056K22328K97977K15396K50317L52712L67152K89706L68251
$$ plain form
3247 15967096 16391189 16813916 17255597 17684350 18204786 18762569 19386396 20047544 20704644
3238 20704644 21445788 22331851 23259329 24142688 25127967 26118314 27100460 28093102 29131661
3229 29131661 30140319 31201963 32317606 33450792 34692540 36082133 37570828 39130303
3221 39130303 40854497 42664043 44563201 46649315 48816346 51084581 53447445 55846064
3213 55846064 58370118 60855968 63384340 65836031 68164691 70391338 72313582 73933784
3205 73933784 75173071 75949843 76258198 75984676 75283776 74001611 72357781 70283208 67955093
3196 67955093 65421949 62698899 59912894 57161328 54398355 51802345 49271227 46869917
3188 46869917 44680667 42613439 40749745 38963915 37393397 35912297 34522381 33239729
$$ packed form
3247A5967096M24093M22727M41681M28753N20436N57783O23827O61148O57100
3238B0704644P41144Q86063R27478Q83359R85279R90347R82146R92642J038559
3229B9131661J008658J061644J115643J133186J241748J389593J488695J559475
3221C9130303J724194J809546J899158K086114K167031K268235K362864K398619
3213E5846064K524054K485850K528372K451691K328660K226647J922244J620202
3205G3933784J239287P76772L08355k73522p00900j282165j643830k074573k328115
3196F7955093k533144k723050k786005k751566k762973k596010k531118k401310
3188D6869917k189250k067228j863694j785830j570518j481100j389916j282652
$$ plain form
3180 33239729 32050299 30891522 29833955 28782755 27780380 26911143 26012491 25122578 24304952
3171 24304952 23523174 22798769 22088220 21382189 20747223 20123904 19494997 18934874 18404300
3162 18404300 17872709 17387420 16928985 16472618 15973508 15496564 15078483 14587225 14071989
3153 14071989 13574362 13141653 12695296 12305274 11930289 11487656 11089030 10706188 10329449
3144 10329449 9983369 9622870 9295906 8960197 8689973 8530770 8318424 8084511 7875925
3135 7875925 7685542 7504302 7336613 7183288 6965130 6823520 6669895 6543028 6433136 6292233
3125 6292233 6164169 6060883 5993770 5892897 5766347 5714144 5683722 5574241 5451244 5323457
3115 5323457 5224414 5135039 5116559 5018432 4982514 4927913 4828460 4785758 4677937 4603432 4577289
$$ packed form
3180C3239729j189430j158777j057567j051200j002375q69237q98652q89913q17626
3171B4304952p81778p24405p10549p06031o34966o23319o28907n60123n30574
3162A8404300n31591m85289m58435m56367m99110m76944m18081m91258n15236
3153A4071989m97627m32709m46357l90022l74985m42633l98626l82842l76739
3144A0329449l46080l60499l26964l35709k70224j59203k12346k33913k08586
3135G875925j90383j81240j67689j53325k18158j41610j53625j26867j09892j40903
3125F292233j28064j03286o7113j00873j26550n2203l0422j09481j22997j27787
3115E323457r9043q9375j8480r8127l5918n4601r9453m2702j07821p4505k6143
$$ plain form
3104 4577289 4487284 4352060 4253085 4207797 4097896 3983681 3947340 3911387 3799318 3733980 3643155
3093 3643155 3595083 3554095 3489733 3467807 3397155 3319403 3296097 3245265 3193774 3194195 3176194 3156269
3081 3156269 3143857 3133691 3118756 3170013 3126722 3166109 3262090 3267854 3312658 3454108 3540413
3070 3540413 3593440 3676768 3776783 3920645 4039091 4091960 4183628 4294416 4428811 4495959
3060 4495959 4498564 4515096 4532708 4484385 4435137 4341813 4140128 4033944 3892340 3755168 3600648
3049 3600648 3416110 3233020 3067740 2918394 2726518 2611724 2495492 2420158 2372197 2264496
3039 2264496 2163546 2099849 2019576 1980606 1969269 1941727 1906218 1847126 1811366 1769516 1716984
3028 1716984 1698134 1676951 1657129 1662675 1649976 1623755 1577027 1535430 1519567 1506199 1501901 1529861
$$ packed form
3104D577289r0005j35224r8975m5288j09901j14215l6341l5953j12069o5338r0825
3093C643155m8072m0988o4362k1926p0652p7752k3306n0832n1491M21j8001j9925
3081C156269j2412j0166j4935N1257m3291L9387R5981N764M4804J41450Q6305
3070C540413N3027Q3328J00015J43862J18446N2869R1668J10788J34395O7148
3060D495959K605J6532J7612m8323m9248r3324k01685j06184j41604j37172j54520
3049C600648j84538j83090j65280j49346j91876j14794j16232p5334m7961j07701
3039B264496j00950o3697q0273l8970j1337k7542l5509n9092l5760m1850n2532
3028A716984j8850k1183j9822N546j2699k6221m6728m1597j5863j3368m298K7960
$$ plain form
3016 1529861 1508662 1410881 1442124 1389744 1369290 1397404 1371819 1386085 1382911 1390054 1383570 1373686
3004 1373686 1397745 1346481 1306462 1334641 1321915 1303899 1275786 1271753 1245751 1241883 1221600 1186749
2992 1186749 1184384 1108179 1119117 1164459 1132727 1119853 1062723 1007652 1034487 1032814 1023479 1025791
2980 1025791 1020165 1031361 961920 997411 992553 1005269 1033982 989526 973185 1004300 995339 987014
2968 987014 970756 981003 987915 971527 963705 978283 1022629 989166 950614 924890 935853 919372
2956 919372 948325 965296 944726 905844 860119 846787 882025 892929 910100 906098 895316 821551
2944 821551 844055 882410 864342 830014 841532 892708 868277 866660 824378 830914 892991 930177
2932 930177 937591 962115 939020 919313 928175 941105 892843 886759 903678 883162 842438 804398
$$ packed form
3016A529861k1199r7781L1243n2380k0454K8114k5585J4266l174P143o484r884
3004A373686K4059n1264m0019K8179j2726j8016k8113m033k6002l868k0283l4851
2992A186749k365p6205J0938M5342l1732j2874n7130n5071K6835j673r335K312
2980A025791n626J1196o9441L5491m858J2716K8713m4456j6341L1115q961q325
2968I87014j6258J0247O912j6388p822J4578M4346l3463l8552k5724J0963j6481
2956I19372K8953J6971k0570l8882m5725j3332L5238J0904J7171m002j0782p3765
2944H21551K2504L8355j8068l4328J1518N1176k4431j617m2282O536O2077L7186
2932I30177P414K4524k3095j9707Q862J2930m8262o084J6919k0516m0724l8040
$$ plain form
2920 804398 887660 925361 863420 839364 810900 794694 773678 810125 765204 774176 775339 790882
2908 790882 813252 842631 812375 795074 811783 854422 874188 874136 855754 872906 932150 953581
2896 953581 934555 945524 999573 945402 936722 1006729 1020681 1008778 960687 950090 966310 949336
2884 949336 1000152 1010195 1004780 970999 955730 929325 979261 1010400 1009278 963706 995370 1009381
2872 1009381 1036657 1045502 1060449 1092987 1131102 1138767 1121331 1190930 1183412 1184665 1240165 1267697
2860 1267697 1284015 1319320 1353707 1400849 1400417 1464938 1551491 1640672 1652769 1752597 1823660 1825615
2848 1825615 1912322 1938944 2047589 2169053 2316102 2520338 2723435 2961104 3246120 3582899
2838 3582899 3960200 4344668 4808417 5384443 6135165 7074584 8328891 9821246 11510303
$$ packed form
2920H04398Q3262L7701o1941k4056k8464j6206k1016L6447m4921Q972J163J5543
2908G90882K2370K9379l0256j7301J6709M2639J9766n2j8382J7152N9244K1431
2896I53581j9026J0969N4049n4171q680P0007J3952j1903m8091j0597J6220j6974
2884I49336N0816J0043n415l3781j5269k6405M9936L1139j122m5572L1664J4011
2872A009381K7276Q845J4947L2538L8115P665j7436O9599p518J253N5500K7532
2860A267697J6318L5305L4387M7142m32O4521Q6553Q9181J2097R9828P1063J955
2848A825615Q6707K6622J08645J21464J47049K04236K03097K37669K85016L36779
2838C582899L77301L84468M63749N76026P50722R39419J254307J492355J689057
$$ plain form
2829 11510303 12935589 13784128 13671260 12538465 10848193 9118077 7669416 6470539
2821 6470539 5556618 4895388 4373916 3944533 3608888 3280098 2997527 2761392 2556956 2388057
2811 2388057 2220959 2117134 1925248 1760543 1710564 1626638 1504901 1452658 1380679 1280080
2801 1280080 1237412 1230281 1219562 1172664 1125610 1069985 1107296 1068367 1001384 942883 926616 951954
2789 951954 911284 848446 789052 814263 817350 765267 738174 691769 715087 706714 663443 654968
2777 654968 656515 687758 638568 591525 594875 623123 580817 540293 518826 486475 512075 492489
2765 492489 472594 461529 486831 477381 427026 377149 377112 400358 439716 446077 420595 364201 339106
2752 339106 322272 323532 341498 354743 337076 324155 328592 320052 312854 324193 297428 311324
$$ packed form
2829A1510303J425286Q48539j12868j132795j690272j730116j448661j198877
2821F470539r13921o61230n21472m29383l35645l28790k82571k36135k04436j68899
2811B388057j67098j03825j91886j64705m9979q3926j21737n2243p1979j00599
2801A280080m2668p131j0719m6898m7054n5625L7311l8929o6983n8501j6267K5338
2789I51954m0670o2838n9394K5211L087n2083k7093m6405K3318q373m3271q475
2777F54968J547L1243m9190m7043L350K8248m2306m0524k1467l2351K5600j9586
2765D92489j9895j1065K5302r450n0355m9877l7K3246L9358O361k5482n6394k5095
2752C39106j6834J260J7966J3245j7667j2921M437q540p198J1339k6765J3896
$$ plain form
2740 311324 315526 310896 280072 261418 289772 259773 260683 271956 258639 254800 213796 233310 202491
2727 202491 163087 187059 192151 203168 156733 150869 197722 193208 173310 169362 159741 189966 155197
2714 155197 156378 165547 137701 119466 124178 135018 185974 205426 151646 111182 140995 133504
2702 133504 112030 153691 197328 181275 139145 125150 94160 136470 154467 143801 113214 98189
2690 98189 120669 124417 109190 164885 126192 83729 76412 120226 189129 155703 198821 183172
2678 183172 158895 156303 151059 151958 150864 96255 88772 65359 91402 120342 94517 94811 88284
2665 88284 105341 55219 103597 120585 164141 178287 152751 74607 57802 117411 87593 34342
2653 34342 5028 -1698 27264 71968 45265 68124 70954 77048 90306 42050 40178 75150 52215
$$ packed form
2740C11324M202m630l0824j8654K8354k9999R10J1273j3317l839m1004J9514l0819
2727B02491l9404K3972N092J1017m6435n864M6853m514j9898l948r621L0225l4769
2714A55197J181R169k7846j8235M712J0840N0956J9452n3780m0464K9813p491
2702A33504k1474M1661M3637j6053m2130j3995l0990M2310J7997j0666l0587j5025
2690I8189K2480L748j5227N5695l8693m2463p317M3814O8903l3426M3118j5649
2678A83172k4277k592n244Q99j094n4609p483k3413K6043K8940k5825K94o527
2665H8284J7057n0122M8378J6988M3556J4146k5536p8144j6805N9609k9818n3251
2653C4342k9314o726K8962M4704k6703K2859K830O094J3258m8256j872L4972k2935
$$ plain form
2640 52215 48266 62253 79744 85503 30711 60862 65102 54346 57948 27369 38465 102950 117830
2627 117830 68092 54721 54958 36764 21178 48984 56796 39528 50047 77851 70495 103025
2615 103025 87563 46865 57323 83510 77132 81738 71096 75470 82154 74812 70250 76942 52446
2602 52446 51904 93095 89303 76090 70277 53446 89209 62171 102638 99439 101737 39581 74683
2589 74683 121999 158861 106799 70600 79957 100801 65696 63008 51982 64799 67123 39561
2577 39561 94073 52821 75504 95462 82992 71855 124760 108679 84879 53678 29565 32638
2565 32638 62515 88749 82779 71188 105882 97402 47361 70624 103366 75731 84748 97580
2553 97580 166025 149967 158289 195559 190313 186799 178193 155145 216224 217896 208828 204939 183983
$$ packed form
2640E2215l949J3987J7491N759n4792L0151M240j0756L602l0579J1096O4485J4880
2627A17830m9738j3371K37j8194j5586K7806P812j7268J0519K7804p356L2530
2615A03025j5462m0698J0458K6187o378M606j0642M374O684p342m562O692k4496
2602E2446n42M1191l792j3213n813j6831L5763k7038M0467l199K298o2156L5102
2589G4683M7316L6862n2062l6199R357K0844l5105k688j1026J2817K324k7562
2577C9561N4512m1252K2683J9958j2470j1137N2905j6081k3800l1201k4113L073
2565C2638K9877K6234n970j1591L4694q480n0041K3263L2742k7635R017J2832
2553I7580O8445j6058Q322L7270n246l514q606k3048O1079J672r068l889k0956
$$ plain form
2540 183983 173741 150798 124854 143125 131863 111160 98891 108435 117249 135743 87247 82178
2528 82178 71468 70658 83852 131546 68728 49320 76093 127401 81738 40431 70111 49613
2516 49613 103099 85144 42777 48740 27403 13909 79622 25437 37052 23974 -8314 24854
2504 24854 92460 83291 76556 65552 23794 36980 -3144 16207 26864 -1035 11566 14695
2492 14695 651 41264 84611 69832 42704 46728 28917 30472 51394 38000 28526 -149
2480 -149 10613 -35292 -20900 -6863 32128 44134 15895 28053 64331 14989 -4239 22161
2468 22161 -15787 -21283 -17727 -51122 9120 4974 11043 19062 42458 21388 -19107 5969 1538
2455 1538 7293 39977 40324 41988 29055 -40863 4168 49872 37853 27525 8226 -7558 1949
$$ packed form
2540A83983j0242k2943k5944J8271j1262k0703j2269R544Q814J8494m8496n069
2528H2178j0710q10J3194M7694o2818j9408K6773N1308m5663m1307K9680k0498
2516D9613N3486j7955m2367N963k1337j3494O5713n4185J1615j3078l2288L3168
2504B4854O7606r169o735j1004m1758J3186m0124J9351J0657k7899J2601L129
2492A4695j4044M0613M3347j4779k7128M024j7811J555K0922j3394r474k8675
2480a49J0762m5905J4392J4037L8991J2006k8239J2158L6278m9342j9228K6400
2468B2161l7948n496L556l3395O0242m146O069Q019K3396k1070m0495K5076m431
2455A538N755L2684L47J664j2933o9918M5031M5704j2019j0328j9299j5784R507
$$ plain form
2442 1949 -33503 -21111 38943 29401 44997 57212 5914 4296 -14168 -62886 -69033 -75658 -57482
2429 -57482 -53671 -17227 21351 13414 5172 -13916 -50025 -98317 -72278 -79180 -61881 -81858 -79398
2416 -79398 -71148 -75256 -38536 -60794 -19777 6442 29173 -19263 -48680 -48384 -49700 -59864 -70333
2403 -70333 -42942 -45584 -6073 -30272 -52616 -39720 -49689 -45225 -28808 -37900 34667 43653 421
2390 421 3920 -35187 -83420 -78929 -16167 -13260 -80652 -106884 -69867 -36348 -22433 10344 -10968
2377 -10968 -23057 -39482 -42139 -23322 -19245 31305 7835 -31056 -26531 -8472 -4788 -15695 -31371
2364 -31371 -19156 -4920 -34611 -25256 -4164 -5058 9227 -13838 -14888 -5042 20834 30892 -7191
2351 -7191 -22125 -19286 -16358 -12692 -10299 -39292 18201 63085 53733 53941 6332 5039 15335 22407
$$ packed form
2442A949l5452J2392O0054r542J5596J2215n1298j618j8464m8718o147o625J8176
2429e7482L811L6444L8578p937q242j9088l6109m8292K6039o902J7299j9977K460
2416g9398Q250m108L6720k2258M1017K6219K2731m8436k9417K96j316j0164j0469
2403g0333K7391k642L9511k4199k2344J2896r969M464J6417r092P2567Q986m3232
2390D21L499l9107m8233M491O2762K907o7392k6232L7017L3519J3915L2777k1312
2377a0968j2089j6425k657J8817M077N0550k3470l8891M525J8059L684j0907j5676
2364c1371J2215J4236k9691R355K1092q94J4285k3065j050R846K5876J0058l8083
2351g191j4934K839K928L666K393k8993N7493M4884r352K08m7609j293J0296P072
$$ plain form
2337 22407 27773 52971 51250 8778 -14926 -46333 -22520 -34168 -21417 21506 2824 8227
2325 8227 47207 39178 10622 -20867 -49323 -11519 3876 4703 64137 14881 6754 23689 4677
2312 4677 33145 24132 28484 6000 -10278 41110 12900 -34137 -34745 -32774 -44612 -26620 -10554
2299 -10554 -18133 -12815 -30900 -37594 -46129 -38544 16333 9666 -3699 -17959 -13911 47360 20623
2286 20623 27365 24577 -32657 -67641 -26653 -14571 -5864 -32232 -34368 -15246 -19129 688 -459
2273 -459 -18750 15324 23305 26833 -29372 -32558 -35165 -6884 41874 35559 54925 49554 17787
2260 17787 18698 -57078 -48310 -832 30603 16477 16426 37464 24095 48745 27366 8891 -22489
2247 -22489 -25119 -9329 12558 22360 32734 27829 25179 -1749 -8003 8985 16416 4434 35499
$$ packed form
2337B2407N366K5198j721m2472k3704l1407K3813j1648J2751M2923j8682N403
2325H227L8980q029k8556l1489k8456L7804J5395Q27N9434m9256q127J6935j9012
2312D677K8468r013M352k2484j6278N1388k8210m7037o08J971j1838J7992J6066
2299a0554p579N318j8085o694q535P585N4877o667j3365j4260M048O1271k6737
2286B0623O742k788n7234l4984M0988J2082Q707k6368k136J9122l883J9817j147
2273d59j8291L4074P981L528n6205l186k607K8281M8758o315J9366n371l1767
2260A7787R11p5776Q768M7478L1435j4126n1K1038j3369K4650k1379j8475l1380
2247b2489k630J5790K1887R802J0374m905k650k6928o254J6988P431j1982L1065
$$ plain form
2234 35499 44902 40358 43057 64959 17195 74689 64122 74886 36759 46029 79983 11842 -37789
2221 -37789 -59008 -58601 -73904 -55159 12698 -846 60379 65727 8702 -10649 4955 22381
2209 22381 40532 39562 90084 20655 37957 50553 13932 43020 40823 44025 53403 96902 77708
2196 77708 82044 89520 119429 79166 85008 72850 53998 43903 91427 45364 20435 100593
2184 100593 97017 101581 72002 88560 140618 132285 83772 73068 92166 105903 108101 129649
2172 129649 195648 160528 171920 134446 135225 183508 173235 157277 106519 71634 154647 174466
2160 174466 178975 202450 225323 209629 180187 193766 287190 247533 221483 289825 318055 335613
2148 335613 307180 344690 366671 336112 357390 354368 376219 417652 419351 347783 388616 415988
$$ packed form
2234C5499R403m544K699K1902m7764N7494j0567J0764l8127R270L3954o8141m9631
2221c7789k1219M07j5303J8745O7857j3544O1225N348n7025j9351J5604J7426
2209B2381J8151r70N0522o9429J7302J2596l6621K9088k197L202R378M3499j9194
2196G7708M336P476K9909m0263N842j2158j8852j0095M7524m6063k4929Q0158
2184A00593l576M564k9579J6558N2058q333m8513j0704J9098J3737K198K1548
2172A29649O5999l5120J1392l7474P79M8283j0273j5958n0758l4885Q3013J9819
2160A74466M509K3475K2873j5694k9442J3579R3424l9657k6050O8342K8230J7558
2148C35613k8433L7510K1981l0559K1278l022K1851M1433J699p1568M0833K7372
$$ plain form
2136 415988 441683 467416 500408 496283 483173 414607 432278 456264 476882 485184 530013 574549
2124 574549 527810 550364 525871 521523 578366 604945 621440 622707 605383 648498 688424 693491
2112 693491 657106 660499 732501 776275 751153 786347 848881 966411 998217 1035002 1096741 1160059
2100 1160059 1188719 1228570 1324945 1378956 1445161 1517821 1676295 1831602 1926538 2028354 2142829
2089 2142829 2263517 2460979 2695892 2892107 3141643 3378032 3621753 3820555 4095720 4560592
2079 4560592 5054894 5590175 6340635 7298195 8539729 10177603 12376210 15204895 18243568
2070 18243568 20666047 22017797 20709766 17308490 14115952 11497230 9496982 7978072
2062 7978072 6784002 5844811 5136763 4677557 4266762 3986004 3728810 3494583 3272546
$$ packed form
2136D15988K5695K5733L2992m125j3110o8566J7671K3986K0618Q302M4829M4536
2124E74549m6739K2554k4493m348N6843K6579J6495J267j7324M3115L9926N067
2112F93491l6385L393P2002M3774k5122L5194O2534J17530L1806L6785O1739O3318
2100A160059K8660L9851R6375N4011O6205P2660J58474J55307R4936J01816J14475
2089B142829J20688J97462K34913J96215K49536K36389K43721J98802K75165M64872
2079D560592M94302N35281P50460R57560J241534J637874K198607K828685L038673
2070A8243568K422479J351750j308031l401276l192538k618722k000248j518910
2062G978072j194070r39191p08048m59206m10795k80758k57194k34227k22037
$$ plain form
2053 3272546 3069407 2825074 2584218 2403607 2225835 2032099 1889578 1779703 1680923 1649327
2043 1649327 1584611 1473078 1397449 1318632 1271481 1244740 1193709 1157837 1131007 1034088 1005905
2032 1005905 986612 951656 953134 948247 924032 904808 885914 814856 756817 757323 702745 684069
2020 684069 678982 625186 636233 616484 615092 583682 542900 513283 497491 436189 422188 448957
2008 448957 408402 355621 363019 389955 386848 364814 357324 307253 340205 294958 272803 266997
1996 266997 252278 201220 207639 246939 213679 209186 202192 201904 247098 256556 228706 208390 142459
1983 142459 164399 196525 142382 144430 124356 140590 119951 113767 116105 149377 160008 143687
1971 143687 174546 78385 90691 94025 105054 126654 145663 119987 94151 58618 52798 104906
$$ packed form
2053C272546k03139k44333k40856j80611j77772j93736j42521j09875r8780l1596
2043A649327o4716j11533p5629p8817m7151k6741n1031l5872k6830r6919k8183
2032A005905j9293l4956J478m887k4215j9224j8894p1058n8039N06n4578j8676
2020F84069n087n3796J1047j9749j392l1410m0782k9617j5792o1302j4001K6769
2008D48957m0555n2781P398K6936l107k2034p490n0071L2952m5247k2155n806
1996B66997j4719n1058O419L9300l3260m493o994k88M5194R458k7850k0316o5931
1983A42459K1940L2126n4143K048k0074J6234k0639o184K338L3272J0631j6321
1971A43687L0859r6161J2306L334J1029K1600J9009k5676k5836l5533n820N2108
$$ plain form
1959 104906 66278 67153 107340 151987 68735 81068 88254 108460 69866 48023 94337 60976
1947 60976 25529 76825 35488 11979 50493 88349 94435 128371 106837 93059 95606 66115
1935 66115 59130 62106 37676 6064 -18151 -7035 15785 -56417 -7246 -2898 22002 31299 20442
1922 20442 28856 19333 27608 69744 43328 21165 14539 7045 32208 16358 15593 8165 169 47740
1908 47740 70373 -6847 -29886 -3487 26546 89339 73470 59539 32651 20141 19545 80802
1896 80802 53206 -7245 -44505 -51131 23825 -2381 -57681 -35942 -30281 -18951 -4139 19280
1884 19280 9062 -5267 24732 -8558 -25240 -17753 11786 294 -2995 12918 -28649 -67039
1872 -67039 -41064 -42307 -18815 -34261 -69949 -2085 -913 -35563 -48823 15275 -38977 -74002
$$ packed form
1959A04906l8628Q75M0187M4647q3252J2333P186K0206l8594k1843M6314l3361
1947F0976l5447N1296m1337k3509L8514L7856O086L3936k1534j3778K547k9491
1935F6115o985K976k4430l1612k4215J1116K2820p2202M9171M348K4900R297j0857
1922B0442Q414r523Q275M2136k6416k2163o626p494K5163j5850p65p428p996M7571
1908D7740K2633p7220k3039K6399L0033O2793j5869j3931k6888j2510n96O1257
1896H0802k7596o0451l7260o626P4956k6206n5300K1739N661J1330J4812K3419
1884A9280j0218j4329K9999l3290j6682P487K9539j1492l289J5913m1567l8390
1872f7039K5975j243K3492j5446l5688O7864J172l4650j3260O4098n4252l5025
$$ plain form
1860 -74002 -29017 -26551 -80314 -92178 -81035 -9254 -11232 -19211 -24301 -51780 -30798 -65969 -45867
1847 -45867 2113 -35657 -54499 -36741 -12607 -6758 23951 -7093 -33776 -18280 -14361 -69541
1835 -69541 -34870 -26544 -58700 -76624 -4248 -55723 -94312 -23926 -56306 -85197 -59667 -37208
1823 -37208 -48403 48373 18966 19568 56763 54807 2570 -4424 -2816 -8979 -64403 -54533 -20280
1810 -20280 -43328 -61713 -35596 17891 -42181 -15812 7433 56535 34581 1252 58420 84550
1798 84550 143319 81460 88532 63022 29105 18858 31836 17661 -21384 -73786 -41662 -8124
1786 -8124 -13723 16426 -2839 -17731 25688 -60023 -39411 -51416 -51157 -62984 -76857 -101383 -97380
1773 -97380 -112857 -80317 -17253 -17070 28256 -20428 -66453 -44666 -37286 -79108 -84464 -29231 -13997
$$ packed form
1860g4002M4985K466n3763j1864J1143P1781j978p979n090k7479K0982l5171K0102
1847d5867M7980l7770j8842J7758K4134N849L0709l1044k6683J5496L919n5180
1835f9541L4671Q326l2156j7924P2376n1475l8589P0386l2380k8891K5530K2459
1823c7208j1195R6776k9407O02L7195j956n2237o994J608o163n5424R870L4253
1810b0280k3048j8385K6117N3487o0072K6369K3245M9102k1954l3329N7168K6130
1798H4550N8769o1859P072k5510l3917j0247J2978j4175l9045n2402L2124L3538
1786h124n599L0149j9265j4892M3419q5711K0612j2005K59j1827j3873k4526M003
1773i7380j5477L2540O3064J83M5326m8684m6025K1787P380m1822n356N5233J5234
$$ plain form
1760 -13997 -25469 -37448 -34844 -97098 -84768 -57881 -77738 -1803 -53823 -88993 -65251 -59668
1748 -59668 -86108 -98453 -103945 -47635 9867 -54849 -77253 -27242 -91267 -84434 -38822 -81479
1736 -81479 -77476 -44106 -13977 -4295 -63549 -32499 -5670 -29036 -59727 -75765 -60325 -1080
1724 -1080 -35156 -46232 -56791 -43232 -100486 -92146 -55116 -49828 -43589 -50018 -9143 -26212 11818
1711 11818 47798 -5470 -25661 -37963 -14830 -29235 -75874 -52813 -75940 -44913 -69155 -107295
1699 -107295 -22653 -64940 -20545 -19428 -58430 -69459 -99409 -98417 -67423 -37670 -25180 -52209
1687 -52209 -65276 -48487 -62228 -68152 -83763 -77453 -12735 -54454 -45088 -37552 -43774 -27043 -54219
1674 -54219 -56197 -46201 -66818 -81808 -67596 -84225 -77939 -146009 -93987 -55364 -71710 -51929
$$ packed form
1760a3997j1472j1979K604o2254J2330K6887j9857P5935n2020l5170K3742N583
1748e9668k6440j2345n492N6310N7502o4716k2404N0011o4025O833M5612m2657
1736h1479M003L3370L0129R682n9254L1050K6829k3366l0691j6038J5440N9245
1724a080l4076j1076j0559J3559n7254Q340L7030N288O239o429M0875j7069L8030
1711A1818L5980n3268k0191j2302K3133j4405m6639K3061k3127L1027k4242l8140
1699a07295Q4642m2287M4395J117l9002j1029k9950R92L0994K9753J2490k7029
1687e2209j3067J6789j3741n924j5611O310O4718m1719R366P536o222J6731k7176
1674e4219j978R996k0617j4990J4212j6629O286o8070N2022L8623j6346J9781
$$ plain form
1662 -51929 5261 -28256 -41459 -65075 -66934 -101348 -118280 -110584 -51661 -39958 -48728 -53290 -13569
1649 -13569 -17046 -11457 -13973 -27696 -41180 3110 9782 -37684 -58604 -64097 -88578 -71323 -31123
1636 -31123 838 -32509 -49147 -78064 -115250 -144225 -105909 -82875 -89759 -99843 -129394 -95786
1624 -95786 -33935 -51199 -105226 -39565 -78454 -26894 -28138 -37698 -43639 12081 28628 -13649
1612 -13649 -2509 -36735 -69978 -13152 -63930 -89028 -38966 -28878 -73713 -64527 -53512 -72683
1600 -72683 -84410 -62208 -80200 -31540 -35825 -23586 -49688 -49429 -69596 -54642 679 -63753
1588 -63753 -81382 -40910 -18226 -54362 -63892 -75589 -41274 -52781 -51850 -102604 -95227 -50332 -49128
1575 -49128 -59829 -39075 4307 5288 13775 -26937 -22377 -23878 -40925 -21366 -32480 3424 -14027
$$ packed form
1662e1929N7190l3517j3203k3616j859l4414j6932P696N8923J1703q770m562L9721
1649a3569l477N589k516j3723j3484M4290O672m7466k0920n493k4481J7255M0200
1636c1123L1961l3347j6638k8917l7186k8975L8316K3034o884j0084k9551L3608
1624i5786O1851j7264n4027O5661l8889N1560j244r560n941N5720J6547m2277
1612a3649J1140l4226l3243N6826n0778k5098N0062J0088m4835R186J1015j9171
1600g2683j1727K2202j7992M8660m285J2239k6102K59k0167J4954N5321o4432
1588f3753j7629M0472K2684l6136r530j1697L4315j1507R31n0754P377M4895J204
1575d9128j0701K0754M3382R81Q487m0712M560j501j7047J9559j1114L5904j7451
$$ plain form
1562 -14027 9211 -10144 -31645 -47398 -20147 18898 -20376 -42532 -68912 -68618 -24615 -38159
1550 -38159 -23962 -9195 -46410 -91543 -92064 -61184 -74304 -20892 -1973 -19550 -69100 -54582
1538 -54582 -63576 -103654 -101181 -96984 -111209 -81897 -56418 -25640 -26046 -25626 -28939 -4893 -39750
1525 -39750 -38010 -15034 23938 22132 -15638 -24638 -57059 -38932 1110 18628 -5151 -19156
1513 -19156 -60006 -16042 -55411 -22184 -17822 -35048 -22407 -40449 9943 493 -19992 10604
1501 10604 -8339 -39563 -57903 -72307 -72204 2191 -41803 -56738 -54965 -38875 -36777 -38660 -36019
1488 -36019 -2621 30017 15496 -52548 -53343 -41345 -51641 -36659 -30324 -52670 -102506 -66969
1476 -66969 -40932 -65108 -57548 -19825 770 -9431 5129 7283 -29686 -47119 -54422 -11458
$$ packed form
1562a4027K3238j9355k1501j5753K7251L9045l9274k2156k6380K94M4003j3544
1550c8159J4197J4767l7215m5133n21L0880j3120N3412J8919j7577m9550J4518
1538e4582q994m0078K473M197j4225K9312K5479L0778m06M20l313K4046l4857
1525c9750J740K2976L8972j806l7770r000l2421J8127M0042J7518k3779j4005
1513a9156m0850M3964l9369L3227M362j7226J2641j8042N0392r450k0485L0596
1501A0604j8943l1224j8340j4404J03P4395m3994j4935J773J6090K098j883K641
1488c6019L3398L2638j4521o8044p95J1998j0296J4982O335k2346m9836L5537
1476f6969K6037k4176P560L7723K0595j0201J4560K154l6969j7433p303M2964
$$ plain form
1464 -11458 -18756 -35009 -9954 16577 -23765 -18493 -14961 -3246 -42734 -49674 -46726 -20522 -35157
1451 -35157 -48464 -30392 -11382 -14598 971 21970 -42368 -78801 -79629 -29477 -23842 -45324 -64323
1438 -64323 -54611 -58018 -17555 27622 -10439 -15715 -48914 -12906 -38895 -55653 -33403 -47891
1426 -47891 -46614 -70239 -56076 -42002 -50664 -17862 -14802 -542 -33709 -60821 -29003 -54384
1414 -54384 -26297 -5673 -41949 -51099 -16773 -57931 -33486 -39214 -47040 -30681 -6526 -6661 -30457
1401 -30457 -75153 -44548 -26886 -56635 -20402 -46476 -26541 -65121 -71990 -40250 -9841 -13286
1389 -13286 -41607 -37243 -47183 -46292 -99616 -100828 -67572 -46537 15340 44274 -4949 -26072 -19944
1376 -19944 -10540 29394 38922 -12648 -32311 -6258 4409 9431 2559 -14191 -44770 13255 20195
$$ packed form
1464a1458p298j6253K5055K6531m0342N272L532J1715l9488o940K948K6204j4635
1451c5157j3307J8072J9010l216J5569K0999o4338l6433q28N0152N635k1482j8999
1438f4323R712l407M0463M5177l8061n276l3199L6008k5989j6758K2250j4488
1426d7891J277k3625J4163J4074q662L2802L060J4260l3167k7112L1818k5381
1414e4384K8087K0624l6276r150L4326m1158K4445n728p826J6359K4155j35k3796
1401c0457m4696L0605J7662k9749L6233k6074J9935l8580o869L1740L0409l445
1389a3286k8321M364r940Q91n3324j212L3256K1035O1877K8934m9223k1123O128
1376a9944R404L9934R528n1570j9663K6053J0667N022o872j6750l0579N8025O940
$$ plain form
1363 20195 2384 -1824 19491 -34917 -44435 -29619 -66890 -57354 -37268 -50204 -64388 -74458
1351 -74458 -46149 -50732 -52251 -60854 -48525 -34312 -58386 -33365 -33647 -32057 -54828 -27223 -1866
1338 -1866 -23530 2787 -18906 -14283 -16675 -40666 -32483 -59869 -79257 -64643 -25136 -1170 22060
1325 22060 13884 -30402 -35958 -48751 -55788 -30400 -72544 -42894 -20149 -26860 -56545 -38636 -69279
1312 -69279 -67029 -62565 1787 5768 -40298 -22563 -43219 -31230 -49440 -65557 -12463 -51241
1300 -51241 -95576 -72197 -35186 -14616 -47292 -52805 -33146 -80010 -27699 -9750 -28392 -22427
1288 -22427 -10949 -25510 -15568 13336 -12424 -9869 724 -26474 -36140 -23439 -29164 29302 12941
1275 12941 9162 -9123 -46016 -36752 -31954 22995 39578 13526 -16303 -35650 -23393 3513
$$ packed form
1363B0195j7811m208K1315n4408r518J4816l7271R536K0086j2936j4184j0070
1351g4458K8309m583j519q603J2329J4213k4074K5021k82J590k2771K7605K5357
1338a866k1664K6317k1693M623k392k3991Q183k7386j9388J4614L9507K3966K3230
1325B2060q176m4286n556j2793p037K5388m2144K9650K2745o711k9685J7909l0643
1312f9279K250M464O4352L981m6066J7735k0656J1989j8210j6117N3094l8778
1300e1241m4335K3379L7011K0570l2676n513J9659m6864N2311J7949j8642N965
1288b2427J1478j4561R942K8904k5760K555J0593k7198r666J2701n725N8466j6361
1275A2941l779j8285l6893R264M798N4949J6583k6052k9829j9347J2257K6906
$$ plain form
1263 3513 -37185 -77866 -88366 -99456 -60454 -64620 -58113 -58715 -81035 -70747 -63457 -106105 -58267
1250 -58267 -45686 -63399 -39024 -43650 -20198 -14704 -21190 -6919 -9996 -4548 1734 23807 -21611
1237 -21611 -15581 -10659 -21817 -51064 -64749 -127113 -54583 6618 26165 24948 36557 4541
1225 4541 13754 -10081 17808 35980 32020 14522 -54513 8013 36098 40308 -49204 -17724 -26784
1212 -26784 -43201 -28362 -16372 -8092 -7288 -44634 -39651 -67495 -65031 -36558 -42822 -16479 -29798
1199 -29798 -8142 -3090 -3454 -22511 -53726 -2385 5922 -40064 -40376 -10337 -35090 -61261 -71604
1186 -71604 -5254 44170 65415 86857 74042 969 -10857 -4005 -15752 -55595 13658 47741
1174 47741 20109 41639 18323 -15225 -6240 49285 -9773 5647 -13575 -27741 -31839 -25152
$$ packed form
1263C513m0698m0681j0500j1090L9002m166O507o02k2320J0288P290m2648M7838
1250e8267J2581j7713K4375m626K3452N494o486J4271l077N448O282K2073m5418
1237b1611O030M922j1158k9247j3685o2364P2530O1201J9547j217J1609l2016
1225D541R213k3835K7889J8172l960j7498o9035O2526K8085M210q9512L1480r060
1212b6784j6417J4839J1990Q280Q04l7346M983k7844K464K8473o264K6343j3319
1199b9798K1656N052l64j9057l1215N1341Q307m5986l12L0039k4753k6171j0343
1186g1604O6350M9424K1245K1442j2815p3073j1826O852j1747l9843O9253L4083
1174D7741k7632K1530k3316l3548Q985N5525n9058J5420j9222j4166m098O687
$$ plain form
1162 -25152 55104 57226 2611 -53685 -39772 -30398 20244 80665 36152 1953 -49626 -42680
1150 -42680 -19788 -37470 -9928 7063 30876 21005 -56352 -103395 -109337 -61134 -83945 -84634 -35106
1137 -35106 -38378 5060 5192 -31744 -68518 -61765 -48635 -41370 -81851 -58260 -47 41747 -1017
1124 -1017 3600 1456 -20951 -3687 -9744 18050 54619 32177 -19142 -8301 -32567 10530 15727
1111 15727 -24850 -44341 -46579 -16460 -30919 -48396 -42872 -13897 -8996 18294 -13628 -47752
1099 -47752 -7390 -30252 7170 20594 -16813 -23613 -19910 -881 -3854 19173 46420 -2840
1087 -2840 -49372 -74422 -26383 -26852 -37463 14479 30713 13689 18948 1798 13776 7405 15086
1074 15086 9850 -14225 -25431 -13638 559 1508 -36523 -7148 -4647 2927 36194 34425 -36042
$$ packed form
1162b5152Q0256K122n4615n6296J3913R374N0642O0421m4513l4199n1579O946
1150d2680K2892j7682K7542J6991K3813r871p7357m7043n942M8203k2811o89M9528
1137c5106l272M3438J32l6936l6774O753J3130P265m0481K3591N8213M1794m2764
1124a017M617k144k2407J7264o057K7794L6569k2442n1319J0841k4266M3097N197
1111A5727m0577j9491k238L0119j4459j7477N524K8975M901K7290l1922l4124
1099d7752M0362k2862L7422J3424l7407o800L703J9029k973K3027K7247m9260
1087b840m6532k5050M8039m69j0611N1942J6234j7024N259j7150J1978o371P681
1074A5086n236k4075j1206J1793J4197R49l8031K9375K501P574L3267j769p0467
$$ plain form
1061 -36042 -81224 -67564 -54357 -22129 15738 20039 -52719 -35404 -14205 19757 1007 -28
1049 -28 21936 -28725 -34217 -67470 -46972 149 21558 16728 1444 -32801 -37685 -15341 -55829
1036 -55829 -35350 -44648 -28755 -34486 -6533 22631 -15745 -45035 17054 22338 -18391 -48674
1024 -48674 -55900 -65253 -67481 -7579 -5032 43259 20494 -3249 21412 43520 40916 51333 37927
1011 37927 17358 19982 -9344 11589 36329 85722 47382 8372 -22866 -11369 20041 45821
999 45821 7017 -16854 -4963 24896 -19795 -29004 -44425 -30631 -36816 -70831 -35940 -38835 -29418
986 -29418 16767 53486 -32474 -52185 -21096 -46961 -62892 -56220 -39049 -77006 -68847 -44956
974 -44956 -29337 -54259 -70149 -31485 -20755 -43416 -56149 -73124 -48974 -22690 -56006 -26540
$$ packed form
1061c6042m5182J3660J3207L2228L7867M301p2758J7315K1199L3962j8750j035
1049b8K1964n0661n492l3253K0498M7121K1409m830j5284l4245m884K2344m0488
1036e5829K0479r298J5893n731K7953K9164l8376k9290O2089N284m0729l0283
1024d8674p226r353k228N9902K547M8291k2765k3743K4661K2108k604J0417j3406
1011C7927k0569K624k9326K0933K4740M9393l8340l9010l1238J1497L1410K5780
999D5821l8804k3871J1891K9859m4691r209j5421J3794o185l4015L4891k895R417
986b9418M6185L6719q5960j9711L1089k5865j5931O672J7171l7957Q159K3891
974d4956J5619k4922j5890L8664J0730k2661j2733j6975K4150K6284l3316K9466
$$ plain form
962 -26540 -16177 -43514 -48058 23937 31523 25861 -6796 -27084 -23584 -49097 -49624 -35014 -21727
949 -21727 -38970 -32770 -23710 -71356 -24060 -10591 -42901 -69484 -50011 -22574 -21101 11823 31046
936 31046 -13396 -38348 5105 21890 -7914 -27693 -41898 -18895 -17520 7988 -9496 -16890
924 -16890 -11117 -39007 28862 7935 -38522 -6017 -28682 4335 32169 -12490 -21773 -13164 19210
911 19210 10464 30006 78555 47704 4308 -17132 18534 -2037 -5387 -12935 -11908 29134 36558
898 36558 31170 36331 -2307 -33377 13346 -1235 -27901 5304 75977 101704 35901 -9510
886 -9510 -34470 -27344 -26868 959 84587 86865 27720 35439 25383 12712 -10396 -15635 -450
873 -450 30656 30671 -12570 -43633 -57816 19364 15736 48163 10679 20453 -18602 -56475 -35012
$$ packed form
962b6540J0363k7337m544P1995P586n662l2657k0288L500k5513n27J4610J3287
949b1727j7243O200R060m7646M7296J3469l2310k6583J9473K7437J473L2924J9223
936C1046m4442k4952M3453J6785k9804j9779j4205K3003J375K5508j7484p394
924a6890N773k7890O7869k0927m6457L2505k2665L3017K7834m4659r283Q609L2374
911A9210q746J9542M8549l0851m3396k1440L5666k0571l350p548J027M1042P424
898C6558n388N161l8638l1070M6723j4581k6666L3205P0673K5727o5803m5411
886i510k4960P126M76K7827Q3628K278n9145P719j0056j2671k3108n239J5185
873d50L1106J5m3241l1063j4183P7180l628L2427l7484R774l9055l7873K1463
$$ plain form
860 -35012 -22208 -28209 1474 8391 25549 8761 -3708 20504 18069 91084 91265 29013 -17897
847 -17897 -44907 -20936 6063 -13300 -23378 4485 -8240 5560 20678 -47771 -93593 -21844
835 -21844 14968 -279 36517 68220 51099 24420 20463 45822 18125 -14819 33267 26083
823 26083 15767 -30893 18867 10860 358 4084 371 4647 -7761 -33502 -32007 20441 -18557
810 -18557 -19824 25827 45812 -5472 3257 24544 45500 48890 -30252 -27813 24589 36441 37331
797 37331 15498 3434 32040 12881 1569 -4744 23790 61948 6075 18160 53566 25509
785 25509 33721 37697 47928 36520 55415 46956 2849 18023 28551 27189 51256 27244 8131
772 8131 14779 -620 -3163 -18462 -55187 -12973 50157 36022 21664 27320 22242 19262 73998
$$ packed form
860c5012J2804o001K9683O917J7158j6788j2469K4212k435P3015J81o2252m6910
847a7897k7010K3971K6999j9363j0078K7863j2725J3800J5118o8449m5822P1749
835b1844L6812j5247L6796L1703j7121k6679l957K5359k7697l2944M8086p184
823B6083j0316m6660M9760q007j0502L726l713M276j2408k5741J495N2448l8998
810a8557j267M5651J9985n1284Q729K1287K0956L390p9142K439N2402J1852Q90
797C7331k1833j2064K8606j9159j1312o313K8534L8158n5873J2085L5406k8057
785B5509Q212L976J0231j1408J8895q459m4107J5174J0528j362K4067k4012j9113
772H131O648j5399k543j5299l6725M2214O3130j4135j4358N656n078k980N4736
$$ plain form
759 73998 51626 33946 26675 -7740 5521 28257 -23282 -31387 -13556 7437 -23181 -9237
747 -9237 26485 47581 32066 70109 64210 14121 803 -18567 11840 12627 13679 -12843 -37078
734 -37078 -3129 -3928 -8275 -34894 -58956 -72023 -80299 -59717 -14584 -27559 -45215 13209 44378
721 44378 23067 -38609 25727 7136 30979 34346 28792 2330 3199 1295 -2486 -11222 -29523
708 -29523 -74075 -10180 41278 6850 -34136 -11732 29849 35353 4472 -13246 70 28568
696 28568 36806 750 -4663 -2545 21148 54748 87158 67237 49286 19752 13515 29755 51846
683 51846 28873 4619 37833 5861 21315 31521 16198 56303 39779 33203 42593 91300
671 91300 65380 57117 21234 -1507 27048 25318 35379 60753 62092 80197 58103 58707 58519
$$ packed form
759G3998k2372j7680p271l4415J3261K2736n1539q105J7831K0993l0618J3944
747i237L5722K1096j5515L8043n899n0089j3318j9370L0407P87J052k6522k4235
734c7078L3949p99m347k6619k4062j3067q276K0582M5133j2975j7656N8424L1169
721D4378k1311o1676O4336j8591K3843L367n554k6462Q69j904l781q736j8301
708b9523m4552O3895N1458l4428m0986K2404M1581N504l0881j7718J3316K8498
696B8568Q238l6056n413K118K3693L3600L2410j9921j7951k9534o237J6240K2091
683E1846k2973k4254L3214l1972J5454J0206j5323M0105j6524o576R390M8707
671I1300k5920q263l5883k2741K8555j730J0061K5374J339J8105k2094O04j88
$$ plain form
658 58519 44429 28690 20521 86743 91385 71320 19315 43497 -6024 27625 60821 12431
646 12431 26726 -11139 43548 41010 76165 36203 -15456 -39278 -1769 -8937 -14346 -49734 -15434
633 -15434 -564 134 43240 36203 -2049 -13485 34637 41540 30105 20722 -10031 -16737 27339
620 27339 25596 1416 20762 61423 74961 66447 40693 81333 11968 -1827 11897 19224 51913
607 51913 81766 108859 101202 55593 52908 49796 75905 74768 65841 45999 15105 42915 75576
594 75576 100218 92524 42894 37912 61853 51211 41561 73975 64803 27263 21063 66387 61309
581 61309 14931 15314 13676 46935 77985 56020 22801 47466 40520 30610 6694 -5840 -27721
568 -27721 -38458 -8111 9791 37147 21328 -12073 -44697 -19891 38395 6297 -655 5203
$$ packed form
658E8519j4090j5739q169O6222M642k0065n2005K4182m9521L3649L3196m8390
646A2431J4295l7865N4687k538L5155l9962n1659k3822L7509p168n409l5388L4300
633a5434J4870O98M3106p037l8252j1436M8122O903j1435r383l0753o706M4076
620B7339j743k4180J9346M0661J3538q514k5754M0640o9365j3795J3724P327L2689
607E1913K9853K7093p657m5609k685l112K6109j137q927j9842l0894K7810L2661
594G5576K4642p694m9630m982K3941j0642r650L2414r172l7540o200M5324n078
581F1309m6378L83j638L3259L1050k1965l3219K4665o946r910k3916j2534k1881
568b7721j0737L0347J7902K7356j5819l3401l2624K4806N8286l2098o952N858
$$ plain form
556 5203 -5078 -27215 7642 19160 -14703 -13422 -46398 27964 79553 37190 19645 17111 6447
543 6447 -4501 45414 64047 54548 72393 50377 13241 9330 35598 48010 16393 29422 75491
530 75491 17855 27594 56939 29530 -16385 325 24869 14418 32241 34631 29715 18845 69784
517 69784 83772 43501 -11553 10264 16727 41694 27238 41377 53743 33086 81546 65953
505 65953 60846 59029 56815 59791 27824 -9466 -10586 1734 42076 68231 52963 42044 11680
492 11680 -2505 21179 5048 44662 50784 33064 81714 86935 96811 69829 22576 43928 76863
479 76863 66963 26121 83674 63753 23881 30734 35332 66149 78500 57718 66439 100236 74813
466 74813 99931 113345 99347 27548 21737 35062 -8149 14878 10767 14098 -2648 62794 74051
$$ packed form
556E203j0281k2137L4857J1518l3863J281l2976P4362N1589m2363j7545k534j0664
543F447j0948M9915J8633r499J7845k2016l7136l911K6268J2412l1617J3029M6069
530G5491n7636R739K9345k7409m5915J6710K4544j0451J7823K390m916j0870N0939
517F9784J3988m0271n5054K1817O463K4967j4456J4139J2366k0657M8460j5593
505F5953n107j817k214K976l1967l7290j120J2320M0342K6155j5268j0919l0364
492A1680j4185K3684j6131L9614O122j7720M8650N221R876k6982m7253K1352L2935
479G6863r900m0842N7553j9921l9872O853M598L0817J2351k0782Q721L3797k5423
466G4813K5118J3414j3998p1799n811J3325m3211K3027m111L331j6746O5442J1257
$$ plain form
453 74051 -16294 11235 16929 45404 43463 13057 64654 31905 23235 15732 17903 25246 38271
440 38271 47761 35214 21762 41387 86019 99312 74346 49294 56280 23715 21703 37453 54865
427 54865 27498 45129 29861 72226 88292 72580 96831 64116 20249 52392 57298 84887
415 84887 95279 72905 40328 47456 40873 20300 36305 47603 77882 39222 114239 79845
403 79845 46556 83057 83972 59576 50399 23557 6233 18122 -841 -22123 -19169 44877 40004
390 40004 11361 6423 29471 33091 1685 28269 59563 66621 51077 45120 55895 -7352 2643
377 2643 53511 36558 36716 73890 33762 3483 30019 48183 48633 39931 5445 46227 33474
364 33474 19683 42998 50992 68585 49164 82920 62263 45906 46796 59022 44828 25643 23575
$$ packed form
453G4051r0345K7529N694K8475j941l0406N1597l2749q670p503K171P343J3025
440C8271R490j2547j3452J9625M4632J3293k4966k5052O986l2565k012J5750J7412
427E4865k7367J7631j5268M2365J6066j5712K4251l2715m3867L2143M906K7589
415H4887J0392k2374l2577P128o583k0573J6005J1298L0279l8660P5017l4394
403G9845l3289L6501R15k4396r177k6842j7324J1889j8963k1282K954O4046m873
390D0004k8643m938K3048L620l1406K6584L1294P058j5544n957J0775o3247R995
377B643N0868j6953J58L7174m0128l0279K6536J8164M50q702l4486M0782j2753
364C3474j3791K3315P994J7593j9421L3756k0657j6357Q90J2226j4194j9185k068
$$ plain form
351 23575 33869 46025 25360 40290 60960 20249 8642 8848 -5095 42382 92845 14801
339 14801 3675 27266 70619 30743 8639 53240 44677 49236 -14585 10981 42597 86827
327 86827 82252 61608 53106 86109 29175 26436 41516 33318 54371 58989 81503 67957 94723
314 94723 105325 53521 61322 81024 79097 51730 69603 97441 44724 68652 44747 114021
302 114021 75604 74189 66296 10063 44878 -4349 -5615 20323 8725 3983 5364 -12708 9031
289 9031 25433 55359 71747 47610 40076 -571 65032 55776 44538 76172 32380 29355 98188
276 98188 90060 43871 35549 73879 67676 39716 29249 36425 32478 62532 49059 43043 36767
263 36767 26828 23695 20228 2422 -6259 27031 13238 70246 55033 38423 39887 23651 65182
$$ packed form
351B3575J0294J2156k0665J4930K0670m0711j1607K06j3943M7477N0463p8044
339A4801j1126K3591M3353l9876k2104M4601q563M559o3821K5566L1616M4230
327H6827m575k0644q502L3003n6934k739J5080q198K1053M618K2514j3546K6766
314I4723J0602n1804P801J9702j927k7367J7873K7838n2717K3928k3905O9274
302A14021l8417j415p893n6233L4815m9227j266K5938j1598m742J381j8072K1739
289I031J6402K9926J6388k4137p534m0647O5603r256j1238L1634m3792l025O8833
276I8188q128m6189q322L8330o203k7960j0467P176l947L0054j3473o016o276
263C6767r939l133l467j7806q681L3290j3793N7008j5213j6610J464j6236M1531
$$ plain form
250 65182 95820 45894 27040 13061 53892 73221 38771 23068 40550 68726 67042 32986
238 32986 38091 73432 57263 3279 7088 74501 100597 49956 63669 61704 52775 32975 29480
225 29480 -8123 38770 29149 10573 28072 31600 50772 12317 33115 45475 50921 57765 56757
212 56757 41891 32597 -3272 30344 57586 69744 115762 94553 39778 22480 77951 40085
200 40085 69330 74461 66369 58844 58687 60082 16386 26680 70072 45878 80343 127415 56090
187 56090 40902 36147 40993 48257 38465 17380 9596 -2100 15834 16388 48196 64132 55954 15321
173 15321 23530 8983 22183 55445 66645 79222 85956 94702 63442 47002 23423 39055 30531
160 30531 40781 53803 75276 66575 -4749 11647 36458 54144 39287 43075 86117 82687 68186
$$ packed form
250F5182L0638m9926j8854j3979M0831J9329l4450j5703J7482K8176j684l4056
238C2986N105L5341j6169n3984L809O7413K6096n0641J3713j965q929j9800l495
225B9480l7603M6893r621j8576J7499L528J9172l8455K0798J2360N446O844j008
212E6757j4866r294l5869L3616K7242J2158M6018k1209n4775j7298N5471l7866
200D0085K9245N131q092p525j57J395m3696J0294M3392k4194L4465M7072p1325
187E6090j5188m755M846P264r792k1085p784j1696J7934N54L1808J5936q178m0633
173A5321Q209j4547J3200L3262J1200J2577O734Q746l1260j6440k3579J5632q524
160C0531J0250J3022K1473q701p1324J6396K4811J7686j4857L788M3042l430j4501
$$ plain form
147 68186 71877 42034 42647 58067 55940 37464 67947 72643 44138 38619 13232 5041 59574
134 59574 53722 61333 55492 39975 41486 39473 61928 63112 21140 11825 6598 12577 44123 84981
$$ packed form
147F8186L691k9843O13J5420k127j8476L0483M696k8505n519k5387q191N4533
134E9574n852P611n841j5517J511k013K2455J184m1972r315n227N979L1546M0858
$$ [...]
##END NTUPLES=NMR SPECTRUM
##END=
