##TITLE=1H_CA-9138-1
 CDCl3
 8 sc, 
 12.4.2023
##JCAMPDX= 6.0         $$ Bruker NMR JCAMP-DX V2.0
##DATA TYPE= NMR SPECTRUM
##DATA CLASS= NTUPLES
##ORIGIN= UXNMR, Bruker Analytische Messtechnik GmbH
##OWNER= root
$$ XWIN-NMR		Version 3.5
$$ Wed Apr 12 13:55:30 2023 Russian Standard Time (UT+4h)  she@DPX200
##.OBSERVE FREQUENCY= 200.13135
##.OBSERVE NUCLEUS= ^1H
##.ACQUISITION MODE= SIMULTANEOUS
##.ACQUISITION SCHEME= undefined
##.AVERAGES= 8
##.DIGITISER RES= 18
##SPECTROMETER/DATA SYSTEM= spect
##.PULSE SEQUENCE= zg30
##.SOLVENT NAME= D2O
##.SHIFT REFERENCE= (INTERNAL, D2O, 0, 15.9023)
##AUDIT TRAIL= $$ (NUMBER, WHEN, WHO, WHERE, WHAT)
$$ ##TITLE= Audit trail, XWIN-NMR		Version 3.5
$$ ##JCAMPDX= 5.01
$$ ##ORIGIN= Bruker BioSpin GmbH
$$ ##OWNER= she
$$ F:/spectra/data/she/nmr/H-F/1/pdata/1/auditp.txt
$$ ##AUDIT TRAIL=  $$ (NUMBER, WHEN, WHO, WHERE, WHAT)
(   1,<2023-04-12 13:52:12.59 +0400>,<she>,<DPX200>,
      <created by zg, POWCHK disabled, PULCHK disabled
       configuration hash MD5:
       00 E9 B6 7A A2 85 ED C7 34 08 36 98 17 FE 4E 26
       data hash MD5: 16K
       26 BB 4A E4 13 F6 B8 30 AE BD DB 9F 9B 14 CB 2C>)
(   2,<2023-04-12 13:52:16.00 +0400>,<she>,<DPX200>,
      <Start of raw data processing
       efp BC_mod = 2 LB = 0.24 FT_mod = 6 PKNL = 1 PHC0 = -19468.09 PHC1 = 1.400804 SI = 16K 
       data hash MD5: 16K
       22 94 71 3B F4 71 92 8E 4A EB 11 07 C5 DC 10 38>)
(   3,<2023-04-12 13:53:02.18 +0400>,<she>,<DPX200>,
      <pk PHC0 = -153.5467 PHC1 = 0 
       data hash MD5: 16K
       9B 7F 8A 79 6B B6 67 54 C5 4E 9A 7D 49 E8 66 E3>)
(   4,<2023-04-12 13:53:06.89 +0400>,<she>,<DPX200>,
      <abs ABSG = 5 
       data hash MD5: 16K
       F7 F5 4F 72 B4 89 7C 59 E8 4A 41 73 EF 0E 66 C8>)
$$ ##END=
$$ 
$$ hash MD5
$$ 59 B3 49 29 73 3C C7 81 9E B3 30 E7 B5 C4 06 BB
##$RELAX= 
##$RELAX= 
##$RELAX= 
##$RELAX= 
##$RELAX= 
##$RELAX= 
$$ Bruker specific parameters
$$ --------------------------
##$DU= <F:/spectra>
##$EXPNO= 1
##$NAME= <H-F>
##$PROCNO= 1
##$TYPE= <nmr>
##$USER= <she>
##$AMP= (0..31)
100 100 100 100 100 100 100 100 100 100 100 100 100 100 100 100 100 100 
100 100 100 100 100 100 100 100 100 100 100 100 100 100 
##$AQSEQ= 0
##$AQ_mod= 1
##$AUNM= <au_zg>
##$AUTOPOS= <>
##$BF1= 200.13
##$BF2= 200.13
##$BF3= 200.13
##$BF4= 200.13
##$BF5= 200.13
##$BF6= 200.13
##$BF7= 200.13
##$BF8= 200.13
##$BYTORDA= 1
##$CFDGTYP= 0
##$CFRGTYP= 5
##$CHEMSTR= <none>
##$CNST= (0..31)
1 1 145 1 1 1 1 1 1 1 1 1 1 1 1 1 1 1 1 1 1 1 1 1 1 1 1 1 1 1 1 1 
##$CPDPRG= <>
##$CPDPRG1= <>
##$CPDPRG2= <>
##$CPDPRG3= <>
##$CPDPRG4= <mlev>
##$CPDPRG5= <mlev>
##$CPDPRG6= <mlev>
##$CPDPRG7= <mlev>
##$CPDPRG8= <mlev>
##$CPDPRGB= <>
##$CPDPRGT= <>
##$D= (0..31)
0 1.2 0 0 0 0 0 0 0 0.06 0 0.03 0 0 0 0 0.0002 0 0 0 0 0 0 0 0 0 0 0 0 
0 0 0 
##$DATE= 1681293131
##$DBL= (0..7)
120 120 120 120 120 120 120 120 
##$DBP= (0..7)
150 150 150 150 150 150 150 150 
##$DBP07= 0
##$DBPNAM0= <>
##$DBPNAM1= <>
##$DBPNAM2= <>
##$DBPNAM3= <>
##$DBPNAM4= <>
##$DBPNAM5= <>
$$ [...]
##$SUBNAM3= <"">
##$SUBNAM4= <"">
##$SUBNAM5= <"">
##$SUBNAM6= <"">
##$SUBNAM7= <"">
##$SUBNAM8= <"">
##$SUBNAM9= <"">
##$SW= 18.05172834244
##$SWIBOX= (0..15)
0 0 2 0 0 0 0 0 0 0 0 0 0 0 0 0 
##$SW_h= 3612.71676300578
##$TD= 16384
##$TD0= 1
##$TE= 0
##$TE2= 300
##$TE3= 300
##$TEG= 300
##$TL= (0..7)
0 120 120 120 120 120 120 120 
##$TP= (0..7)
150 150 150 150 150 150 150 150 
##$TP07= 0
##$TPNAME0= <>
##$TPNAME1= <>
##$TPNAME2= <>
##$TPNAME3= <>
##$TPNAME4= <>
##$TPNAME5= <>
##$TPNAME6= <>
##$TPNAME7= <>
##$TPOAL= (0..7)
0.5 0.5 0.5 0.5 0.5 0.5 0.5 0.5 
##$TPOFFS= (0..7)
0 0 0 0 0 0 0 0 
##$TUNHIN= 0
##$TUNHOUT= 0
##$TUNXOUT= 0
##$USERA1= <user>
##$USERA2= <user>
##$USERA3= <user>
##$USERA4= <user>
##$USERA5= <user>
##$V9= 5
##$VALIST= <valist>
##$VCLIST= <CCCCCCCCCCCCCCC>
##$VD= 0
##$VDLIST= <DDDDDDDDDDDDDDD>
##$VPLIST= <PPPPPPPPPPPPPPP>
##$VTLIST= <TTTTTTTTTTTTTTT>
##$WBST= 1024
##$WBSW= 4
##$XGAIN= (0..3)
0 0 0 0 
##$XL= 0
##$YL= 0
##$YMAX_a= 635779
##$YMIN_a= -509275
##$ZGOPTNS= <>
##$ZL1= 120
##$ZL2= 120
##$ZL3= 120
##$ZL4= 120
##$ABSF1= 15.67306
##$ABSF2= -2.378787
##$ABSG= 5
##$ABSL= 3
##$ALPHA= 0
##$AQORDER= 0
##$ASSFAC= 0
##$ASSFACI= 0
##$ASSFACX= 0
##$ASSWID= 0
##$AUNMP= <proc_1d>
##$AZFE= 0.1
##$AZFW= 0.1
##$BCFW= 0
##$BC_mod= 2
##$BYTORDP= 0
##$COROFFS= 0
##$CY= -3
##$DATMOD= 1
##$DC= 0
##$DFILT= <>
##$DTYPP= 0
##$F1P= 0
##$F2P= 0
##$FCOR= 1
##$FTSIZE= 16384
##$FT_mod= 6
##$GAMMA= 0
##$GB= 0
##$INTBC= 1
##$INTSCL= 3.70164e-10
##$ISEN= 128
##$LB= 0.24
##$LEV0= 0
##$LPBIN= 0
##$MAXI= 10000
##$MC2= 0
##$MEAN= 0
##$ME_mod= 0
##$MI= 1.114404
##$NCOEF= 0
##$NC_proc= -6
##$NLEV= 6
##$NOISF1= 3.799351
##$NOISF2= 2.8
##$NSP= 0
##$NTH_PI= 0
##$NZP= 0
##$OFFSET= 15.90225
##$PC= 1
##$PHC0= -19621.64
##$PHC1= 1.400804
##$PH_mod= 1
##$PKNL= yes
##$PPARMOD= 0
##$PSCAL= 0
##$PSIGN= 0
##$REVERSE= no
##$SF= 200.129973841933
##$SI= 16384
##$SIGF1= 3
##$SIGF2= 2
##$SINO= 5.538805
##$SIOLD= 16384
##$SREGLST= <1H.CDCl3>
##$SSB= 0
##$STSI= 16384
##$STSR= 0
##$SW_p= 3612.71676300578
##$SYMM= 0
##$S_DEV= 0
##$TDeff= 16384
##$TDoff= 0
##$TI= <>
##$TILT= no
##$TM1= 0
##$TM2= 0
##$TOPLEV= 0
##$USERP1= <user>
##$USERP2= <user>
##$USERP3= <user>
##$USERP4= <user>
##$USERP5= <user>
##$WDW= 1
##$XDIM= 16384
##$YMAX_p= 528223487
##$YMIN_p= -261532
$$ End of Bruker specific parameters
$$ ---------------------------------
##NTUPLES= NMR SPECTRUM
##VAR_NAME=  FREQUENCY,     SPECTRUM/REAL,   SPECTRUM/IMAG
##SYMBOL=    X,             R,               I
##VAR_TYPE=  INDEPENDENT,   DEPENDENT,       DEPENDENT
##VAR_FORM=  AFFN,          ASDF,            ASDF
##VAR_DIM=   16384,         16384,           16384
##UNITS=     HZ,            ARBITRARY UNITS, ARBITRARY UNITS
##FACTOR=    0.220516191357247, 1,           1
##FIRST=     3182.51693454896, 0,            0
##LAST=      -430.199828456821, 0,           0
##MIN=       -430.199828456821, -261532,     0
##MAX=       3182.51693454896, 528223487,    0
$$ Real data points
##PAGE= N=1
##DATA TABLE= (X++(R..R)), XYDATA
$$ [...]
6418I372K6154j018J0042q623l5584K6731M560k5994K0468J3495j308J2257l058
$$ 9372 35526 34508 44550 35927 343 27074 31634 5640 26108 39603 38295 50552 47494
6405D7494J8618J396q001k227n387j5890K8807J0231K1302L489k2894J0014L091
$$ 47494 66112 67508 59507 57280 51893 36003 64810 75041 96343 99832 76938 86952 90043
6392I0043L7736J9173K1559k795k4489k5399p918K8197j6159R424L3273R641J1983
$$ 90043 127779 146952 168511 165716 141227 115828 107910 136107 119948 129372 162645 172286 184269
6379A84269k1087o378j2695N164L8185K3035o485j3008R767l0235n732J6023j1378
$$ 184269 163182 156804 144109 149273 187458 210493 204008 191000 200767 170532 164800 180823 169445
6366A69445l4657L6238j1048q336m524K3071K7813j2424l753J9593j6531k0767
$$ 169445 134788 171026 159978 151642 147118 170189 198002 185578 181825 201418 184887 164120
6354A64120N145J5710P138l844K9216m4242k6573o903J028l2360j0143J4028j3637
$$ 164120 169265 184975 192113 188269 217485 173243 146670 139767 140795 108435 98292 112320 98683
6341I8683J717J5692P51k8966k2248j8907K2813K0618o113j1070J7296k9204q084
$$ 98683 100400 116092 116843 87877 65629 46722 69535 90153 84040 72970 90266 61062 52978
6328E2978J8360K2826N752j9926J2038p367j7084m582J5008o952J7290k3972j4433
$$ 52978 71338 94164 99916 79990 92028 84661 67577 62995 78003 71051 88341 64369 49936
6315D9936J8456k7405j094n426Q612l443J4102k294L504K8447j6479K4935k0433
$$ 49936 68392 40987 39893 34467 43079 39636 53738 51444 54948 83395 66916 91851 71418
6302G1418k0660j1889r560k0070P820P514M1651L4214p52n103J5534M8l412l0498
$$ 71418 50758 38869 29309 9239 17059 24573 66224 100438 99686 94583 110117 110165 106753 76255
6288G6255j4489M9949j9949m2504L0190J694j9695p336p59n346N366P634k85K8157
$$ 76255 61766 111715 91766 49262 79452 81146 61451 54115 53356 48010 53376 61010 60725 88882
6274H8882k0931q701L0752P426k2433K7564p429J0488L7781o701p347k6919K21
$$ 88882 67951 59250 90002 97428 74995 102559 95130 105618 143399 136698 129351 102432 102653
6261A02653k528l590k0909J1743N8109j790j6817K6269j285q512j3236k3662K7113
$$ 102653 100125 96535 75626 87369 145478 143688 126871 153140 151855 143343 130107 106445 133558
6248A33558m1723K5375K2339j6618j557J6937J993O365M771k6783L3479L1892
$$ 133558 91835 117210 139549 122931 121374 138311 140304 146669 151440 124657 158136 190028
6236A90028p076j0660R682J3828m0991k8097M475P61L161P168J4949j8899r802
$$ 190028 182952 172292 181974 195802 154811 126714 131189 131950 135111 142279 157228 138329 128527
6223A28527K0746k9805K889M8610k105l024m424M969j9163j0506J9321L40J7415
$$ 128527 149273 119468 122357 170967 168862 165838 161414 166383 147220 136714 156035 156375 173790
6210A73790J7485l9996k1355K7824K8100m3589O64L3983r515K090K4701j7214
$$ 173790 191275 151279 129924 157748 185848 142259 142923 176906 167391 169481 194182 176968
6198A76968j340M4535k291j9607j3765j4604P009J2615J3516p930K2938J1707
$$ 176968 175628 220163 217872 198265 184500 169896 176905 189520 203036 195106 218044 229751
6186B29751K584J5821J5407K607J1105n061o545o287o666J1942J276K1019J8156
$$ 229751 232335 248156 263563 266170 277275 272214 265669 259382 252716 264658 265934 286953 305109
6173C05109K0228Q258L761N718J4990j5032j3689L7574K0818j5295O29j2671K6870
$$ 305109 325337 333595 337356 343074 358064 343032 329343 366917 387735 372440 373069 360398 387268
6160C87268L2902M368k1856K700M0597K5460O758j1241k5672j0476r421M5837
$$ 387268 420170 424538 402682 405382 445979 471439 478197 466956 441284 430808 421387 467224
6148D67224j4436K326M7782P125P316K4636J8894M63j8557J010M2927n611J8975
$$ 467224 452788 455114 502896 510021 517337 541973 560867 561330 542773 543783 586710 581099 600074
6135F00074K1906o791q965N0872L1413L0636L0669K8013J3861R823K8571N56J1936
$$ 600074 621980 615189 606224 657096 688509 719145 749814 777827 791688 801511 830082 830638 842574
6122H42574O301K9427M1439k5158q839M9044K7876N6328N4243N1548M5162N2954
$$ 842574 848875 878302 919741 894583 885744 934788 962664 1018992 1073235 1124783 1169945 1222899
6110A222899N6577P1791N6245M9334L0277L5571R1644R1948K2236N5210K7144
$$ 1222899 1279476 1351267 1407512 1456846 1487123 1522694 1614338 1706286 1728522 1783732 1810876
6099A810876N7294M3448M8040P6399N0982O5225L3565K3530M0654M2102M4173
$$ 1810876 1868170 1911618 1959658 2036057 2087039 2152264 2185829 2209359 2250013 2292115 2336288
6088B336288O6883N7543J03537L7887P7379Q0667R8340O2872N9302R5863R8734
$$ 2336288 2403171 2460714 2564251 2602138 2679517 2760184 2858524 2921396 2980698 3076561 3175295
6077C175295N8086J07430R9921P5534N2864N6906R4096J36848J22251J47626J89980
$$ 3175295 3233381 3340811 3440732 3516266 3569130 3626036 3720132 3856980 3979231 4126857 4316837
6066D316837J94128K21884K49750K69091K57179K91280K64438K87200K80656L57380
$$ 4316837 4510965 4732849 4982599 5251690 5508869 5800149 6064587 6351787 6632443 6989823
6056F989823L89730M14163L85620M36112M33733M44477N31745O06997O43319P20970
$$ 6989823 7379553 7793716 8179336 8615448 9049181 9493658 10025403 10632400 11275719 11996689
6046A1996689Q70598R75807J119918J293736J527906J813174K167150K662776
$$ 11996689 12867287 13843094 14963012 16256748 17784654 19597828 21764978 24427754
6038B4427754L212537L798405M523548N433461O620468P408838P565074P109434
$$ 24427754 27640291 31438696 35962244 41395705 48016173 55425011 62990085 70099519
6030G0099519N336739N85902n817624r430074r509555q154055o469014n087810
$$ 70099519 75436258 76022160 70204536 60774462 51264907 43110852 36641838 31554028
6022C1554028m072204l281404k686183k255592j869848j567860j305975j073212
$$ 31554028 27481824 24200420 21514237 19258645 17388797 15820937 14514962 13441750
6014A3441750r65683q09135o94094o38233n65296n00218n03212m11926m46444
$$ 13441750 12476067 11666932 10972838 10334605 9769309 9269091 8765879 8353953 7907509
6005G907509l60002l25886k84867k66342k53687k35456k30441k49229k43307j81262
$$ 7907509 7547507 7221621 6936754 6670412 6416725 6181269 5950828 5701599 5458292 5277030
5995E277030k10182j48406j43040j46029j44638j85289j38680j56471j90759j24710
$$ 5277030 5066848 4918442 4775402 4629373 4484735 4299446 4160766 4004295 3813536 3688826
5985C688826j74439j59713j18606o9863j02251j01688n5905p3640m8919n1119
$$ 3688826 3514387 3354674 3236068 3166205 3063954 2962266 2906361 2832721 2783802 2732683
5975B732683l2002m4029n2864l2414k8371l2217n6594p1722q8052o2899m5861
$$ 2732683 2700681 2656652 2603788 2571374 2543003 2510786 2454192 2382470 2294418 2231519 2185658
5964B185658m5826n0891j3709m9045k1801k809j3523o0089j5705J580J9063P825
$$ 2185658 2139832 2088941 2075232 2026187 2004386 2001577 1988054 1927965 1912260 1913840 1932903 1940728
5952A940728j6280k7988k6895q778J6112O814J8775N6148J9828L3591M4636N0487
$$ 1940728 1924448 1896460 1869565 1860787 1876899 1883713 1902488 1958636 1978464 2012055 2056691 2107178
5940B107178O2926R0834P9760J48481Q4817J22325J36021K0043q6354j32153j08063
$$ 2107178 2170104 2260938 2340698 2489179 2573996 2696321 2832342 2852385 2766031 2633878 2525815
5929B525815r8428j17799r570Q9647R6273N5424P1630P4199L8312L6339J5675
$$ 2525815 2427387 2309588 2300018 2389665 2485938 2541362 2612992 2687191 2725503 2761842 2777517
5918B777517N643N0030Q2812Q7972L4768o1523o4216j12945j30471j11493o2169
$$ 2777517 2783160 2833190 2916002 3003974 3038742 2977219 2913003 2800058 2669587 2558094 2495925
5907B495925n7797J8576p335m7429q9341p2428m1444k4767n502O3277P3282R9554
$$ 2495925 2438128 2456704 2449369 2401940 2312599 2240171 2198727 2173960 2168458 2231735 2305017 2404571
5895B404571J18258O2699k3758j70876j72619k54563k03286j49021j17018j05881
$$ 2404571 2522829 2585528 2561770 2390894 2218275 1963712 1760426 1611405 1494387 1388506
5885A388506r4050o2971o1595n9147m6833k6392m7298p089m7583j9469J3358k0216
$$ 1388506 1294456 1231485 1169890 1110743 1063910 1037518 990220 983131 935548 916079 929437 909221
5873I09221l4079k4878L727l3543o2156l6416J7413K7132J1923p7417m4906r819
$$ 909221 875142 850264 853991 820448 758292 721876 739289 766421 778344 700927 656021 646202
5861F46202p904l642K0765M773j9857j0716q406k7031j5473m663l1254j724l1121
$$ 646202 638298 634656 655421 660194 640337 629621 621215 594184 578711 574048 542794 541070 509949
5848E09949l8485J6296M0546J2592m0412k6589K2894J8326l8348R230m347l2307
$$ 509949 471464 487760 528306 540898 500486 473897 496791 515117 476769 485999 481652 449345
5836D49345n463j0012P458J3752l1224m3251R047J7975m5665j1516J3324J4729
$$ 449345 443882 433870 441328 455080 423856 380605 389652 407627 361962 350446 363770 378499
5824C78499j2648k1499J2735R578l1472k1205K3032k521l75K4503R091j0355j3260
$$ 378499 365851 344352 357087 366665 335193 313988 337020 334499 334124 358627 367718 357363 344103
5811C44103m868J5689l0592J5904o413j5163J8757L4275o16n0607k6871N5699
$$ 344103 339235 354924 324332 340236 333823 318660 337417 371692 371076 320469 293598 349297
5799C49297Q480r634K6966K2637K1138j950j3849j8703l661J290j9491J2496L675
$$ 349297 357777 348143 375109 397746 418884 416934 403085 384382 380721 382011 362520 375016 378691
5786C78691j1044l0025J3919K6572J4346K2234p957J3253J8475m3632j0451l1125
$$ 378691 367647 337622 351541 378113 392459 414693 406736 419989 438464 394832 384381 353256
5774C53256k1032J033k5617j7966j6887J5980J1116j3110k5893J5030m845k651
$$ 353256 332224 333257 307640 289674 272787 288767 299883 286773 260880 275910 271065 268414
5762B68414K5236L5228k9014l6614j9647j6356n905K017M9351M596J7438k0737
$$ 268414 293650 328878 299864 263250 243603 227247 221342 223359 272710 277306 294744 274007
5750B74007K42k338l5154J0462k4783k6302L2423Q125Q172j1881J0864j7706l6610
$$ 274007 274249 271911 236757 247219 222436 196134 228557 236682 244854 232973 243837 226131 189521
5737A89521L2482K5943q212j4656K1753J6310l6533M8870M934n6187K0187k1482
$$ 189521 222003 247946 239734 225078 246831 263141 226608 275478 280412 224225 244412 222930
5725B22930j6012M057M03l4596M1489K5836J0695k7157L5857k5441J7041J1739
$$ 222930 206918 210975 211378 176782 218271 244107 254802 227645 263502 238061 255102 266841
5713B66841j3271q086N41n248K1083J1409K3856j1227L5640M5628k6184l0324
$$ 266841 253570 245484 246025 240777 261860 273269 297125 285898 321538 367166 340982 310658
5701C10658m2197J3563k4114N8414q031l317j6178J551J3432L3251Q226k5297
$$ 310658 268461 282024 257910 316324 308293 304976 288798 290349 303781 337032 345258 319961
5689C19961l3635K4032L1994r821M79O376K1823k2285k4730J0565L3857J46k3438
$$ 319961 286326 310358 342352 332531 333010 339386 361209 338924 314194 324759 358616 358762 335324
5676C35324l2096k6271K9821m855J4712k685J3210k662q250l0529K608O7426J1361
$$ 335324 303228 276957 306778 301923 316635 313950 327160 324498 316248 285719 288327 355753 367114
5663C67114L314n119l133o194k0405k6480L4039k6956J5638J998p283M627K1480
$$ 367114 370428 365309 362176 355982 335577 309097 343136 316180 331818 333816 326533 331160 352640
5650C52640k8255o862M7694O330j0735K0298K0026L2835K8063J4569J4803L0811
$$ 352640 324385 317523 365217 371547 360812 381110 401136 433971 462034 476603 491406 522217
5638E22217J4679J3261P570m3572J2999k1188K965k4704O434l2487q919k2526
$$ 522217 536896 550157 557727 514155 527154 505966 508931 484227 490661 458174 449255 426729
5626D26729j0462J182q782j9269Q233Q224L736r087m1954k9058L3913K150j7297
$$ 426729 416267 417449 408667 389398 397631 405855 409591 400504 358550 329492 363405 365555 348258
5613C48258L5478j0866K5212l4938P465N4763m147m8773j9857q980R818J5155
$$ 348258 383736 372870 398082 363144 370609 425372 421225 372452 352595 343615 353433 368588
5601C68588l817j5089K8254k6471J0953n91K9683l651k5059K1130j5482j8685
$$ 368588 364771 349682 377936 351465 362418 361827 391510 387859 362800 383930 368448 349763
5589C49763J4917k6201j5771K811J1025J5391n120J5079j3779L742O263l5516
$$ 349763 364680 338479 322708 325519 336544 351935 346815 361894 348115 351857 358120 322604
5577C22604k4755L3133r162J2660M1624k178j7798R511j9450J9810o095j2534
$$ 322604 297849 330982 321820 334480 376104 373926 356128 365639 346189 365999 359904 347370
5565C47370M448J6584K5574K5160J2116j4555J2801O777N991J2405j3175J239
$$ 347370 351818 368402 393976 419136 431252 416697 429498 436275 442266 454671 441496 442735
5553D42735K5064r830l2700M791J879L0764k6501r788q583n688j0023o613k46
$$ 442735 467799 457969 425269 430060 431939 462703 436202 426414 417831 412143 402120 395507 395261
5540C95261m475J634J7346r70m322j6496l5728j603J1774K3166j2246l4061m216
$$ 395261 390786 392420 409766 408796 404474 387978 352250 350647 362421 385587 373341 339280 335064
5527C35064J6235P235M814J1596k9766L114n160l6088K0854l0692J6j240l6259
$$ 335064 351299 358534 363348 374944 345178 348292 343132 307044 327898 297206 297222 295982 259723
5514B59723j0673L1254j6494m670K2904r42q214K9033j5384L846J5375m1697J8285
$$ 259723 249050 280304 263810 259140 282044 281102 272888 301921 286537 290383 305758 264061 282346
5501B82346K9280k2987n717K8096P798k1027l0407l4938M0391L738j5327m684
$$ 282346 311626 288639 282922 311018 318816 297789 267382 232444 272835 276573 261246 256562
5489B56562J746k2070L369J7730l20p454Q194P626M17k2043k8848J9521l1835
$$ 256562 258308 236238 239607 257337 257017 249563 257757 265383 265800 243757 214909 234430 202595
5476B02595j9639J4360L2379k005L1299j3324k6175M790N6235j6179j3778l896
$$ 202595 182956 197316 229695 227690 258989 245665 219490 224280 280515 264336 250558 246662
5464B46662N982L5938l4260k4403K1633P751j0344r524q330J6797p009J5042l0619
$$ 246662 252644 288582 254322 229919 251552 259303 248959 239435 231105 247902 240893 255935 225316
5451B25316N148J2873p678o233J1389j8442L658m150j6579R905O325J270J2226
$$ 225316 230464 243337 235659 229426 240815 222373 226031 221881 205302 215207 221532 222802 235028
5438B35028j0352J1376J2287O89L2699p782j0425m1316J113J3774r669N392o234
$$ 235028 224676 236052 248339 249028 281727 273945 263520 222204 223317 237091 227422 232814 226580
5425B26580Q766k8188R04J2511K755J9700K9337J9672m4448M342M994J0703p609
$$ 226580 235346 207158 208062 220573 223328 243028 272365 292037 247589 251931 256925 267628 260019
5412B60019K7424K0848J9385K5961J0407N640k5284r73K7223J017j5819m1357
$$ 260019 287443 308291 327676 353637 364044 369684 344400 343427 370650 371667 355848 314491
5400C14491k1737n571J4929p755L0812r743J693n20n80J2843l1090J5394L2102
$$ 314491 292754 287183 302112 294357 325169 315426 317119 316599 316019 328862 297772 313166 345268
5387C45268J7984Q097J0118p4J5728J8977J4224j5050N4366K4722J3106l9302
$$ 345268 363252 371349 381467 381393 397121 416098 430322 415272 469638 494360 507466 468164
5375D68164j3879J113K7720l2668k0684J1024q850J5273K583J0740j8353o985
$$ 468164 454285 455398 483118 450450 429766 440790 431940 447213 449796 460536 442183 435198
5363D35198j8935K4649k4215J9975L0120J1749m636n126K8225k234K8881O560
$$ 435198 416263 440912 416697 436672 466792 478541 473905 468779 497004 494770 523651 530211
5351E30211J5666k5856J0311K6080K5293k5770k5544J574j734R938m02K725L2953
$$ 530211 545877 520021 530332 556412 581705 555935 530391 531965 530231 540169 539767 542492 575445
5338E75445J2394J1411K486L7022L1487K0037K071p098L9040M918K9977O7260
$$ 575445 587839 599250 601736 638758 670245 690282 692353 685255 724295 729213 759190 826450
5326H26450J9057j2164O630L629M790K7232M2171N59o988o465M4473K5327O4135
$$ 826450 845507 833343 839973 843602 848392 875624 917795 918354 911366 904901 949374 974701 1038836
5313A038836K6902J8283L3450K3383L1714O7503N9766J18053P4811J15063J19091
$$ 1038836 1065738 1084021 1117471 1140854 1172568 1240071 1299837 1417890 1492701 1607764 1726855
5302A726855J05488J43713J28837J59932J85184K30920K23722J81612J10234L0431
$$ 1726855 1832343 1976056 2104893 2264825 2450009 2680929 2904651 3086263 3196497 3226928
5292C226928j3905o9040m318O8104P8743J17422J57802J10581N9173J8972q6683
$$ 3226928 3213023 3143983 3139665 3207769 3286512 3403934 3561736 3672317 3731490 3750462 3663779
5281C663779j44636j15675p7428k878K0739J8241N4865J4322m9230j47446j30210
$$ 3663779 3519143 3403468 3326040 3323162 3343901 3362142 3417007 3431329 3382099 3234653 3104443
5270C104443j10116j12976l9415l2301o4508k7532o0884r7400n7159J9175K5617
$$ 3104443 2994327 2881351 2841936 2809635 2745127 2717595 2656711 2559311 2502152 2521327 2546944
5259B546944P5881J12478J26395J12061J39616N0374l8442j73415k13948k30540
$$ 2546944 2622825 2735303 2861698 2973759 3113375 3163749 3125307 2951892 2737944 2507404
5249B507404j91505j51709j26452j30891j13135o2847o4674k9057n732m2026m2386
$$ 2507404 2315899 2164190 2037738 1906847 1793712 1730865 1666191 1637134 1631402 1589376 1546990
5238A546990j7163K0892O0252j211J43P917L9190L7913Q2232Q033K9252k7309
$$ 1546990 1529827 1550719 1610971 1609760 1609903 1617820 1657010 1694923 1777155 1785188 1814440 1787131
5226A787131m9519q9378o3061k92l9027o4350n8107j9067n0315l102m3680j7O678
$$ 1787131 1737612 1648234 1585173 1584881 1545854 1481504 1423397 1404330 1354015 1350913 1307233 1307216 1313894
5213A313894k1878j0495K8100J6027J1681L8267K0930J2442K2705K4008J3345
$$ 1313894 1292016 1281521 1309621 1325648 1337329 1375596 1396526 1408968 1431673 1455681 1469026
5202A469026J0378m4931n9743m7926l7502j6019P117r960l671K3432k8458m3076
$$ 1469026 1479404 1434473 1374730 1326804 1289302 1273283 1280400 1270440 1266769 1290201 1261743 1218667
5190A218667l0355j2194L433k6914q493m62j0319k7462J6794O367P240J1086n011
$$ 1218667 1188312 1176118 1179551 1152637 1144144 1143682 1133363 1105901 1122695 1129062 1136302 1147388 1142377
5177A142377K0340M7966M5986L2995L241K7909L6306J4694M0495K8262P927K1821
$$ 1142377 1162717 1210683 1256669 1289664 1292905 1320814 1357120 1371814 1412309 1440571 1448498 1470319
5165A470319K9263L3123O864L1625K9537L4477O2273M0850Q4460R6181R6141J17129
$$ 1470319 1499582 1532705 1539569 1571194 1600731 1635208 1697481 1738331 1822791 1918972 2015113 2132242
5153B132242J14674J56313J65502J62497K30273K60494K72433K40322K74283J61945
$$ 2132242 2246916 2403229 2568731 2731228 2961501 3221995 3494428 3734750 4009033 4170978
5143D170978K5015j39627j90237k18968j60915j19678p5015l5656k8371K5472
$$ 4170978 4195993 4056366 3866129 3647161 3486246 3366568 3291553 3255897 3227526 3252998
5133C252998O3913O2771N6161J18637J61690K22184K50374L37064L48422L85727
$$ 3252998 3316911 3379682 3435843 3554480 3716170 3938354 4188728 4525792 4874214 5259941
5123E259941M07047L44006K49882N0932r8828k08841l15210l28342l51737l59143
$$ 5259941 5666988 6010994 6260876 6311808 6212980 6004139 5688929 5360587 5008850 4649707
5113D649707l04999k41039j62161j07061j10875n8460O975K2222L195N2457P0447
$$ 4649707 4344708 4103669 3941508 3834447 3723572 3665112 3672087 3694309 3697504 3749961 3820408
5102C820408J34485J56804K31548K35643K12863K05692N5789m7983k12152l01381
$$ 3820408 3954893 4111697 4343245 4578888 4791751 4997443 5053232 5005249 4793097 4491716
5092D491716k70331k27294j93024j37823q4334n0684n5634j08622j17926j13085
$$ 4491716 4221385 3994091 3801067 3663244 3578910 3528226 3472592 3363970 3246044 3132959
5082C132959r6333j11114j03985n0470j6225P866K4960R387J1826J8708K7713
$$ 3132959 3036626 2925512 2821527 2771057 2754832 2762698 2787658 2797045 2808871 2827579 2855292
5071B855292J0359Q6396L4343L3108R6279Q9183N6031N9834O3094N0077O8561
$$ 2855292 2865651 2952047 2986390 3019498 3115777 3204960 3260991 3320825 3383919 3433996 3502557
5060C502557R4689Q7201J05043J13506J23987J79121K04743K28329K49232L12843
$$ 3502557 3597246 3684447 3789490 3902996 4026983 4206104 4410847 4639176 4888408 5201251
5050E201251L56900M25589M98288N57292N78793O62272Q01074R12017R49201Q87566
$$ 5201251 5558151 5983740 6482028 7039320 7618113 8280385 9081459 9993476 10942677 11830243
5040A1830243O42378p2619q61833j104536j039481p83903n83778l88576l18971
$$ 11830243 12472621 12400002 11538169 10433633 9394152 8610249 8026471 7637895 7318924
5031G318924k11632j43763o5045N9551N8658J24784J89732K87193L44510M32454
$$ 7318924 7107292 6963529 6898484 6958035 7016693 7141477 7331209 7618402 7962912 8395366
5021H395366N36037N99404P99183R71743J124628J363140J645087K024803K319615
$$ 8395366 8931403 9530807 10329990 11301733 12426361 13789501 15434588 17459391 19779006
5012A9779006K356408K208594J709434L6910k028900k901974k767122k252094
$$ 19779006 22135414 24344008 26053442 26090352 24061452 21159478 18392356 16140262
5004A6140262j680949j268643r25573o54555m58015k86569j52827M5947K17269
$$ 16140262 14459313 13190670 12265097 11610542 11152527 10865958 10713131 10759078 10976347
4995A0976347M20061O42079Q37780J060340J388380J602317J719761J691931J395229
$$ 10976347 11396408 12038487 12876267 13936607 15324987 16927304 18647065 20338996 21734225
4986B1734225M48988j103085k261142k510376k253655j838730j428786j166614
$$ 21734225 22183213 21080128 18818986 16308610 14054955 12216225 10787439 9620825
4978I620825r20153p30835o53935n30290m56857m15617l35304l52894k99046k43777
$$ 9620825 8700672 7969837 7315902 6785612 6328755 5913138 5577834 5224940 4925894 4682117
4968D682117j96272j98321j94122j86116j70548j47741j05088j49004r4028q6887
$$ 4682117 4485845 4287524 4093402 3907286 3736738 3588997 3483909 3334905 3240877 3153990
4958C153990r6117l9501o9349r9379q4529q9591o3364m3659p3833n7622n5380
$$ 3153990 3057873 3018372 2949023 2849644 2765115 2675524 2612160 2568501 2494668 2437046 2381666
4947B381666o6089q2453J3732o26j8447n9857m0034l4197o7033m6294n8982j5388
$$ 2381666 2315577 2233124 2246856 2246230 2227783 2167926 2127892 2093695 2026662 1980368 1921386 1905998
4935A905998m2722l6591J7631J1383k2678l0332k8942n591l0663l0801j7166R456
$$ 1905998 1863276 1826685 1844316 1855699 1833021 1802689 1773747 1768156 1737493 1706692 1689526 1698982
4923A698982k3372k9159N703n5920j393N271J5382K399k2231Q922j1197K2847
$$ 1698982 1675610 1646451 1652154 1596234 1594841 1600112 1615494 1617893 1595662 1604584 1593387 1616234
4911A616234K1011q683k995o47k8329L4265k7381n9369K5562J7851k7247k986
$$ 1616234 1637245 1628562 1625567 1624920 1596591 1630856 1603475 1544106 1569668 1587519 1560272 1557286
4899A557286K8262j7201n2332j629j727J9269n925j1197J1883j6422p821J9183
$$ 1557286 1585548 1568347 1516015 1514386 1512659 1531928 1526003 1514806 1526689 1510267 1502446 1521629
4887A521629K6409L0083j829q302L4983K6276K2452M0485r392J9022L3411l7924
$$ 1521629 1548038 1578121 1576292 1567990 1602973 1629249 1651701 1692186 1682794 1701816 1735227 1697303
4875A697303M6248O0960L4892J1955l4N212K9401M1347K7868L574K0830l789p471
$$ 1697303 1743551 1804511 1839403 1851358 1851324 1856536 1885937 1927284 1955152 1958726 1979556 1975767 1968296
4862A968296N754L637K188J8005O3314P9635O6561J17379P1620Q9391O3547P1135
$$ 1968296 1974050 1977687 1979875 1997880 2061194 2140829 2207390 2324769 2396389 2485780 2549327 2620462
4850B620462R0909R6163O3988R5742R6186Q8137R2554M1853Q6202P3026P9388
$$ 2620462 2711371 2807534 2871522 2967264 3063450 3151587 3244141 3285994 3372196 3445222 3524610
4839C524610M6392P0064N8237N4601N8543R8756Q4087M6880O2960J24275J26754
$$ 3524610 3571002 3641066 3699303 3753904 3812447 3911203 3995290 4042170 4105130 4229405 4356159
4828D356159Q7306R6878J26289J34838J15991J14025J16537J44663R2419J13886
$$ 4356159 4443465 4540343 4666632 4801470 4917461 5031486 5148023 5292686 5385105 5498991
4818E498991J35059J14163J26618J47597J23869J21300J84134J94744K50666K18032
$$ 5498991 5634050 5748213 5874831 6022428 6146297 6267597 6451731 6646475 6897141 7115173
4808G115173K48341L39822L60982M06415M15939M20040M53671M43321M39061N03210
$$ 7115173 7363514 7703336 8064318 8470733 8886672 9306712 9760383 10203704 10642765 11145975
4798A1145975N38818O02247O36027O19534O30113O80308P75928Q54934R78628
$$ 11145975 11684793 12287040 12923067 13542601 14172714 14853022 15628950 16483884 17462512
4789A7462512J081967J249638J448208J639335J857296K205727K653711L185823
$$ 17462512 18544479 19794117 21242325 22881660 24738956 26944683 29598394 32784217
4781C2784217L861410M621241N554618O619266P798497R439121J1083691J1632482
$$ 32784217 36645627 41266868 46821486 53440752 61239249 70678370 81762061 93394543
4773I3394543J1081597R144888L109347o770057j3779086j4872623j2950520j0360204
$$ 93394543 104476140 113621028 116730375 109960318 96181232 81308609 68358089 57997885
4765E7997885q074017o421449n150200m201781l483309k887550k452181k038117
$$ 57997885 49923868 43502419 38352219 34150438 30667129 27779579 25327398 23289281
4757B3289281j673367j358598j176612r83632q62628p50748p11152o76822o29546
$$ 23289281 21615914 20257316 19080704 18097072 17234444 16483696 15772544 15095722 14466176
4748A4466176n51561m42253l19602k21646j29500n0498J9806J38070K46489L37906
$$ 14466176 13914615 13472362 13152760 12931114 12801614 12751116 12770922 12908992 13155481 13493387
4738A3493387M61506N99522O25262N48155K88787l99134j184661j500307j370234
$$ 13493387 13954893 14554415 15179677 15727832 16016619 15617485 14432824 12932517 11562283
4729A1562283j159206r41322p97484o65496n40015m56371l69343l33089k70756
$$ 11562283 10403077 9461755 8664271 7998775 7458760 7002389 6633046 6299957 6029201
4720F029201k43266j88831j90908j38063j43085j56486j12874j39833j70978j46585
$$ 6029201 5785935 5597104 5406196 5268133 5125048 4968562 4855688 4715855 4544877 4398292
4710D398292j11537j48486j50618j20008j34509r9599p3673r3414q4172p0831
$$ 4398292 4286755 4138269 3987651 3867643 3733134 3633535 3559862 3466448 3382276 3311445
4700C311445n3671o3987p8223p5759m2502k3579q6347n4893j2108m5331j7705
$$ 3311445 3257774 3193787 3115564 3039805 2997303 2973724 2887377 2832484 2820376 2775045 2757340
4689B757340m7799n8574o6046m8549j3396p7913l7098p5217l7167j00247m6292
$$ 2757340 2709541 2650967 2584921 2536372 2522976 2445063 2407965 2332748 2295581 2195334 2149042
4678B149042m2464j7133k7310m3178P438K467j5339m0462q916O452n7791l1465
$$ 2149042 2106578 2089445 2062135 2018957 2026395 2028862 2013523 1973061 1964145 1970597 1912806 1881341
4666A881341r789N595O171n2152k3847m0303m0892J2784k0930m1119j2037j1176
$$ 1881341 1871552 1877147 1883318 1831166 1807319 1767016 1726124 1738908 1717978 1676859 1664822 1653646
4654A653646j7965k5881r50O538k5370j5438k0604k7780Q869n4944l281O877k0137
$$ 1653646 1635681 1609800 1608850 1615388 1590018 1574580 1553976 1526196 1535065 1480121 1476840 1483717 1463580
4641A463580p765l9248j9504j8020r398K0709j2513k1784k4735j1476k9177j7008
$$ 1463580 1455815 1416567 1397063 1379043 1369645 1390354 1377841 1356057 1331322 1319846 1290669 1273661
4629A273661k7856R893l3294j275J1862K7826j0779k05L024m595Q180l0687K1985
$$ 1273661 1245805 1255698 1222404 1221129 1232991 1260817 1250038 1249833 1252857 1248262 1256442 1225755 1247740
4616A247740k862j0970m967J2657r56j4796M7207L1229K108M209j2746l3326j2740
$$ 1247740 1244878 1233908 1228941 1241598 1240642 1225846 1273053 1304282 1306390 1310599 1297853 1264527 1251787
4603A251787l1629o536Q550m822q774P740K3508L3076j8152j8229J906Q542p338
$$ 1251787 1220158 1213622 1222172 1217350 1208576 1216316 1239824 1272900 1254748 1236519 1238425 1246967 1239629
4590A239629j2326j5580J8239K7430k9424j5486J5846l4314L5120K424K3654L781
$$ 1239629 1227303 1211723 1229962 1257392 1227968 1212482 1228328 1194014 1229134 1231558 1255212 1258993
4578A258993o372r994l1872j976j6966L6720l5238q710j2200L7074k668L3992
$$ 1258993 1252621 1242627 1210755 1208779 1191813 1228533 1193295 1184585 1172385 1209459 1206791 1240783
4566A240783j203J2110M2548L2903L5277j155M673K5867M1967L2775J2823M249
$$ 1240783 1239580 1251690 1294238 1327141 1362418 1361263 1365936 1391803 1433770 1466545 1479368 1483617
4554A483617R4412Q1810M3159P1432R0328P9048R2972J30426J09718J45354J46839
$$ 1483617 1578029 1659839 1702998 1774430 1864758 1943806 2036778 2167204 2276922 2422276 2569115
4543B569115J51523K26457K21629K09389J62374J01963l5849j12006j81539k55917
$$ 2569115 2720638 2947095 3168724 3378113 3540487 3642450 3606601 3494595 3313056 3057139
4533C057139k02149j55843j34755j05571r0791p5608l8340m1561m0317J222J6634
$$ 3057139 2854990 2699147 2564392 2458821 2368030 2292422 2254082 2212521 2172204 2173426 2190060
4522B190060J7979J8135m1381L5529J5950p412l6164m2975l5798m8092l360L155
$$ 2190060 2208039 2226174 2184793 2220322 2236272 2228860 2192696 2149721 2113923 2065831 2062471 2065626
4510B065626j6996P522J4896L115r045J7657N6242N8648P522M2672N5912J7722
$$ 2065626 2048630 2056152 2071048 2074163 2065118 2082775 2139017 2197665 2205187 2247859 2303771 2321493
4498B321493L5885P1254O8228N3494Q5811R1556J19394J19967J19221J16349J88017
$$ 2321493 2357378 2428632 2496860 2550354 2636165 2727721 2847115 2967082 3086303 3202652 3390669
4487C390669K89723K65521K92970K92871L36036K71877K10446Q3670o5792j71129
$$ 3390669 3680392 3945913 4238883 4531754 4867790 5139667 5350113 5433783 5367991 5196862
4477E196862k17513j97679j63242r3362n9175O832J5551O1636R4522J21303J21214
$$ 5196862 4979349 4781670 4618428 4525066 4465891 4472723 4488274 4549910 4644432 4765735 4886949
4466D886949J67639K34867L01153L64014M20307M23803M54728M29080L85892L45048
$$ 4886949 5054588 5289455 5590608 5954622 6374929 6798732 7253460 7682540 8068432 8413480
4456H413480K22460R5668m5955k29583l17609k83968k50309j95100j16448j29078
$$ 8413480 8635940 8731608 8685653 8456070 8138461 7854493 7604184 7409084 7292636 7163558
4446G163558j57021j75404k04221k16514j63304j43028p8707L2747O6487J28509
$$ 7163558 7006537 6831133 6626912 6410398 6247094 6104066 6025359 6058106 6124593 6253102
4436F253102J49179J94521J63082P4588K7666j43058k45663k46777k08689j91014
$$ 6253102 6402281 6596802 6759884 6834472 6862138 6719080 6473417 6226640 6017951 5826937
4426E826937j67876j69864r6290r6030j35452j11475r9647o3400l0738k1455J5170
$$ 5826937 5659061 5489197 5392907 5296877 5161425 5049950 4950303 4886903 4856165 4834710 4849880
4415D849880r142r600K6409O0044L4867O9397J17990Q1011R8797J55926J78283
$$ 4849880 4840738 4831138 4857547 4917591 4952458 5021855 5139845 5220856 5319653 5475579 5653862
4404E653862J76990J93392J43603J76104J56337J25992K13589K27969J82544K33366
$$ 5653862 5830852 6024244 6167847 6343951 6500288 6626280 6839869 7067838 7250382 7483748
4394G483748K78659K79840L10703L15528M04358M10158M70908N40007N77575O27945
$$ 7483748 7762407 8042247 8352950 8668478 9072836 9482994 9953902 10493909 11071484 11699429
4384A1699429P20990Q45668R60794J088442J225824J410870J629416J808724K043587
$$ 11699429 12420419 13266087 14226881 15315323 16541147 17952017 19581433 21390157 23433744
4375B3433744K289752K310188K214952J757170R00314m55871j855133k709037
$$ 23433744 25723496 28033684 30248636 32005806 32906120 32450249 30595116 27886079
4367B7886079k856028k666554k324958j883718j594090j343130j094001q77439
$$ 27886079 25030051 22363497 20038539 18154821 16560731 15217601 14123600 13246161
4359A3246161p01652n97802m57167m12629k81207k09482j87284j36042o0327J6987
$$ 13246161 12544509 11946707 11489540 11076911 10795704 10586222 10398938 10262896 10202569 10219556
4349A0219556Q820J2842M9004Q0882J43639J46417J10088J38326P1601J63909
$$ 10219556 10228376 10241218 10290222 10371104 10514743 10661160 10771248 10909574 10981175 11145084
4339A1145084J80186J72248J74984K50634K79318K31044K35349K09585J68674
$$ 11145084 11325270 11497518 11672502 11923136 12202454 12433498 12668847 12878432 13047106
4330A3047106J86521J47864J02254O0985j093r9930j14724j48496k60514l45228
$$ 13047106 13233627 13381491 13483745 13544730 13543637 13443707 13328983 13180487 12919973 12574745
4320A2574745l98410m14371m68580m37725m13713m16303l57075l32221l02611
$$ 12574745 12176335 11761964 11293384 10855659 10441946 10025643 9668568 9336347 9033736
4311I033736k76103k68858k23319k22552k20128k15649k62810l31063k56851k79382
$$ 9033736 8757633 8488775 8265456 8042904 7822776 7607127 7344317 7013254 6756403 6477021
4301F477021k92687k63603k25281k61897k07525j91012j92903j26716j72988j31983
$$ 6477021 6184334 5920731 5695450 5433553 5226028 5035016 4842113 4715397 4542409 4410426
4291D410426j11873j22946j24497r0205j07830q8451o5661r4638r0492q5466o1526
$$ 4410426 4298553 4175607 4051110 3960905 3853075 3764624 3698963 3604325 3513833 3428367 3366841
4280C366841n5638j6776o4037p1357l1027n6048o9521k4400n6910n3588l6416
$$ 3366841 3311203 3294427 3230390 3159033 3128006 3071958 3002437 2978037 2921127 2867539 2831123
4269B831123k3728n3861m3641n4991p6473j9083m3095m9914j5360k5171n0673
$$ 2831123 2807395 2753534 2709893 2654902 2578429 2559346 2516251 2466337 2450977 2425806 2375133
4258B375133n3658Q483q378Q160O802l0214q015m2681j4003l0628M220j3280k2666
$$ 2375133 2321475 2329958 2321580 2329740 2336542 2306328 2298313 2255632 2241629 2211001 2215221 2201941 2179275
4245B179275j0957l4340j8316l0808k1234K6143k6125k8083k2659N589J4677m4391
$$ 2179275 2168318 2133978 2115662 2084854 2063620 2089763 2063638 2035555 2012896 2018485 2033162 1988771
4233A988771l1054J0909L2967j7791j4548j3581n49J3995n1464j7238o638J8983
$$ 1988771 1957717 1968626 2001593 1983802 1969254 1955673 1955124 1969119 1917655 1900417 1893779 1912762
4221A912762R437J9898J6773Q298N3732K4038P5613M0591Q7502O8419P0505R2756
$$ 1912762 1922199 1942097 1958870 1967168 2020900 2044938 2120551 2161142 2248644 2317063 2387568 2480324
4209B480324J52564J51350J06191R0298N0927J429q4775r0066j34427j20643j60587
$$ 2480324 2632888 2784238 2890429 2980727 3031654 3033083 2948308 2858242 2723815 2603172 2442585
4198B442585j46401j26985j11504o5582m5697l0337n1708n9437k2813l8005j6614
$$ 2442585 2296184 2169199 2057695 1992113 1946416 1916079 1864371 1804934 1782121 1744116 1727502
4187A727502j8163K0996n115j3841K0559K4388L230N231R970J4897m841N861l3644
$$ 1727502 1709339 1730335 1725220 1711379 1731938 1756326 1759556 1764787 1774757 1789654 1784813 1790674 1757030
4174A757030l8207J932J3971M673N261J3774N820j3119j1509J7551l3688K195
$$ 1757030 1718823 1720755 1734726 1739399 1744660 1758434 1764254 1751135 1739626 1757177 1723489 1725684
4162A725684K1494J8411j687K3694L4039J8413L9051M4799L5061M7060J7198O043
$$ 1725684 1747178 1765589 1763902 1787596 1821635 1840048 1879099 1923898 1958959 2006019 2023217 2029260
4150B029260j300L464P303L94O1495K8071M8708J6197J4623K9991K3147L3617
$$ 2029260 2027960 2031424 2038727 2039121 2100616 2128687 2177395 2193592 2208215 2238206 2261353 2294970
4138B294970M6184L3332K1588K2835J1098L9794N1243j3192K1884J8176N5631
$$ 2294970 2341154 2374486 2396074 2418909 2430007 2469801 2521044 2507852 2529736 2547912 2603543
4127B603543O3561L5008M1630J1866J0876L9169K3965n64j337K4699k1336K147
$$ 2603543 2667104 2702112 2743742 2755608 2766484 2805653 2829618 2829054 2827717 2852416 2831080 2833227
4115B833227K7022k0528j2913J0173L1237j1599L198l6831L9948N2793O751N986
$$ 2833227 2860249 2839721 2826808 2836981 2868218 2856619 2859817 2822986 2862934 2915727 2922478 2928464
4103B928464O4638O132m573M482L1394j938j6520j3463J3778M054L2828L5943
$$ 2928464 2993102 2999234 2994661 2999143 3030537 3028599 3012079 2998616 3012394 3016448 3049276 3085219
4091C085219k12l605K8053L8602K8309j2823l1919J987k0450n2746J7540L5886
$$ 3085219 3085007 3081402 3109455 3148057 3176366 3163543 3131624 3133611 3113161 3060415 3077955 3113841
4079C113841N6533L9602N6292J5499M3613J16048O7499J16635J21532Q6700L7936
$$ 3113841 3170374 3209976 3266268 3281767 3325380 3441428 3508927 3625562 3747094 3833794 3871730
4068C871730M8579j428n1956j11642m7416k4753n8823l0708n971j4575k166j1224
$$ 3871730 3920309 3918881 3866925 3755283 3707867 3683114 3624291 3593583 3587612 3573037 3570871 3559647
4056C559647l2300O419K6190J8885M2476J8544Q830K3435O5037O7739L1061O4809
$$ 3559647 3527347 3533766 3559956 3578841 3621317 3639861 3648691 3672126 3737163 3804902 3835963 3900772
4044C900772N9926J9324J7490J1030J5975R169o195Q4285J5558O9268J09281M7910
$$ 3900772 3960698 3980022 3997512 4008542 4024517 4033686 4027491 4111776 4127334 4196602 4305883 4353793
4032D353793N1404R3849J02073M4597O9033P6121O8104L1551L8430P2081J08033
$$ 4353793 4405197 4499046 4601119 4645716 4714749 4790870 4858974 4890525 4928955 5001036 5109069
4021E109069Q7702O6552J33789J43561J47351J25908J07206Q0458P8947R1075
$$ 5109069 5196771 5263323 5397112 5540673 5688024 5813932 5921138 6001596 6080543 6171618
4011F171618Q2143O6513O6339N4805R7021J11484N9314J49416J92099K37289K35154
$$ 6171618 6253761 6320274 6386613 6441418 6538439 6649923 6709237 6858653 7050752 7288041 7523195
4000G523195K49407K50022K17513K21127K55166K50689K30198K31976K73661K34269
$$ 7523195 7772602 8022624 8240137 8461264 8716430 8967119 9197317 9429293 9702954 9937223
3990I937223K20774K50611K50467K87566K63018K26527K33663K24830K66772K23562
$$ 9937223 10157997 10408608 10659075 10946641 11209659 11436186 11669849 11894679 12161451 12385013
3980A2385013J76223K34313K32174K22531L04553L07187L14634L17304L45064
$$ 12385013 12561236 12795549 13027723 13250254 13554807 13861994 14176628 14493932 14838996
3971A4838996L75792M14317L64852L55685M41203M02790L90823L38639L47781
$$ 14838996 15214788 15629105 15993957 16349642 16790845 17193635 17584458 17923097 18270878
3962A8270878M04125L93659M04522M06442M54266N70665O82724P91038R07428
$$ 18270878 18675003 19068662 19473184 19879626 20333892 20904557 21587281 22378319 23285747
3953B3285747R96109J066601J212579J219401J215490J234985J204160J357572
$$ 23285747 24281856 25348457 26561036 27780437 28995927 30230912 31435072 32792644
3945C2792644J508398J618002J751355J850715J845883J976251K130338K316071
$$ 32792644 34301042 35919044 37670399 39521114 41366997 43343248 45473586 47789657
3937D7789657K485697K720769L010603L468579L965334M425658N102147N963207
$$ 47789657 50275354 52996123 56006726 59475305 63440639 67866297 72968444 78931651
3929G8931651O955262Q348536J0244783J2599193J5034877J7895144K1444509
$$ 78931651 85886913 94235449 104480232 117079425 132114302 150009446 171453955
3922A71453955K6358210L0698509L1502753L0144322K5151830N384898k5661365
$$ 171453955 197812165 228510674 260013427 290157749 315309579 320694477 295033112
3915B95033112m2692843m1885695l4636379k6551618k0332536j5965563j2694723
$$ 295033112 252340269 210454574 175818195 149266577 128934041 112968478 100273755
3908A00273755j0150221q347066o922653n807595m809720l935838l447827l002528
$$ 100273755 90123534 81776468 74853815 69046220 64236500 60300662 56852835 53850307
3900E3850307k501575k225613j983224j779282j604995j473496j299566j068882
$$ 53850307 51348732 49123119 47139895 45360613 43755618 42282122 40982556 39913674
3892C9913674q61265p18671o28246n65249n30934n75170n67670m85410m49568
$$ 39913674 39052409 38333738 37705492 37140243 36609309 36034139 35466469 34981059 34531491
3883C4531491l47126k40547k07455j72418j10741m5726m1357j6403j3163L1992
$$ 34531491 34184365 33943818 33736363 33563945 33453204 33407478 33366121 33349718 33336555 33368547
3873C3368547P8980J32611K26723L32359M99747N77289O34548P13232P54671Q30869
$$ 33368547 33447527 33580138 33806861 34139220 34638967 35216256 35850804 36564036 37318707 38149576
3863C8149576R24423J043876J103686J151629J225496J335150J369771J442515
$$ 38149576 39073999 40117875 41221561 42373190 43598686 44933836 46303607 47746122
3855D7746122J556694J585155J763857J897435K036857K174817K302182K489793
$$ 47746122 49302816 50887971 52651828 54549263 56586120 58760937 61063119 63552912
3847F3552912K613556K737044K897474L021285L128413L203729L345889L464410
$$ 63552912 66166468 68903512 71800986 74822271 77950684 81154413 84500302 87964712
3839H7964712L509938L543179L620021L678340L735224L750585L816246L872116
$$ 87964712 91474650 95017829 98637850 102316190 106051414 109801999 113618245 117490361
3831A17490361L882346L875544L841719L791228L714578L608269L411957L230275
$$ 117490361 121372707 125248251 129089970 132881198 136595776 140204045 143616002 146846277
3823A46846277L081879K872748K609813K411906K319377K036075J873910J709145
$$ 146846277 149928156 152800904 155410717 157822623 160142000 162178075 164051985 165761130
3815A65761130J537711J376910J091337P93410M39783M4280m14060p87635j159256
$$ 165761130 167298841 168675751 169767088 170560498 171000281 171044561 170630501 169842866 168683610
3806A68683610j511036j847346k043780k205066k327783k462045k612387k754172
$$ 168683610 167172574 165325228 163281448 161076382 158748599 156286554 153674167 150919995
3798A50919995k923825l108924l358599l614473l856894m042387m197219m281297
$$ 150919995 147996170 144887246 141528647 137914174 134057280 130014893 125817674 121536377
3790A21536377m326109m316329m252482m223938m025289l966194l811461l760950
$$ 121536377 117210268 112893939 108641457 104417519 100392230 96426036 92614575 88853625
3782H8853625l753771l697660l647986l592175l517411l437487l296893l208584
$$ 88853625 85099854 81402194 77754208 74162033 70644622 67207135 63910242 60701658
3774F0701658l057075k888665k713074k583806k433169k277347k149062k010394
$$ 60701658 57644583 54755918 52042844 49459038 47025869 44748522 42599460 40589066
3766D0589066j924147j780774j645139j592700j497238j400259j263924j187075
$$ 40589066 38664919 36884145 35239006 33646306 32149068 30748809 29484885 28297810
3758B8297810j187946j028171r55200q86549q27873p67467p59965p34933o43912
$$ 28297810 27109864 26081693 25126493 24239944 23412071 22644604 21884639 21149706 20505794
3749B0505794o29995n66961m64463m36281m15145m80459l68549l20148l55779
$$ 20505794 19875799 19308838 18844375 18408094 17992949 17512490 17143941 16823793 16468014
3740A6468014l48031l30449l08897l12844k63899k21368k19858j63423j60652
$$ 16468014 16119983 15789534 15480637 15167793 14903894 14682526 14462668 14299245 14138593
3731A4138593j41432j69224j41225j17611j01364j24999j49854r2955r9057j65105
$$ 14138593 13997161 13827937 13686712 13569101 13467737 13342738 13192884 13099929 13000872 12835767
3721A2835767j45340j33692j55400j19590j44609j39725j21725j68359j54961
$$ 12835767 12690427 12556735 12401335 12281745 12137136 11997411 11875686 11707327 11552366
3712A1552366j00932j30505j17097j18022j05557j20404j20249j54259r2920j48661
$$ 11552366 11451434 11320929 11203832 11085810 10980253 10859849 10739600 10585341 10492421 10343760
3702A0343760j13570j10629q7038r1317j16727r6936q3583l9148l1013o6232q0833
$$ 10343760 10230190 10119561 10032523 9941206 9824479 9727543 9643960 9604812 9573799 9507567 9426734
3691I426734o0010m2511o537l3461L655K692K8294L2469K0993M4146R0816O8934
$$ 9426734 9366724 9324213 9317676 9284215 9287870 9290562 9318856 9351325 9372318 9416464 9507280 9576214
3679I576214N6336O6929O6096J9237j6234n2810l6114k8073n1669r1948q7372
$$ 9576214 9632550 9699479 9765575 9784812 9768578 9715768 9679654 9651581 9599912 9507964 9420592
3668I420592n3222k3799k2k6611p9854p2905n0853o9332o4297p2618j02976k6385
$$ 9420592 9367370 9343571 9343549 9316938 9237084 9164179 9113326 9043994 8979697 8907079 8804103 8777718
3656H777718n9451p9581n8022o6438o6307k4205k202l7675j8187J7393L2268L0668
$$ 8777718 8718267 8638686 8580664 8514226 8447919 8423714 8421512 8383837 8365650 8383043 8415311 8445979
3644H445979K8470L6629J7318P3300Q2735Q3401R6183P2278P9677J20617J40429
$$ 8445979 8474449 8511078 8528396 8601696 8684431 8767832 8864015 8936293 9015970 9136587 9277016
3633I277016J69869J16879J32222J32608P1058J8317p73q6095j50249j09590j37203
$$ 9277016 9446885 9563764 9695986 9828594 9899652 9917969 9917196 9831101 9680852 9571262 9434059
3622I434059q7275o0566j05360o5373l1972n9106n402k9542k3832k0549k1649
$$ 9434059 9346784 9286218 9180858 9115485 9083513 9024407 9019005 8989463 8965631 8945082 8923433
3611H923433n809K1483j8116K3085P5144J7932j9471J4794K8636M6680Q1418P7557
$$ 8923433 8917624 8939107 8920991 8944076 9019220 9037152 9017681 9032475 9061111 9107791 9189209 9266766
3599I266766M6657P4281P1542N8658Q0452Q1556P2016Q4600J12116R7783J10646
$$ 9266766 9313423 9387704 9459246 9517904 9598356 9679912 9751928 9836528 9948644 10046427 10157073
3588A0157073J19224J03751R5872J52371J08690J07510J56311K06383J58124J79167
$$ 10157073 10276297 10380048 10475920 10628291 10736981 10844491 11000802 11207185 11365309 11544476
3578A1544476J98831J22421J68806J45423J81205J77668J89792J67770J98620
$$ 11544476 11743307 11865728 12034534 12179957 12361162 12538830 12728622 12896392 13095012
3569A3095012K17509K09102K41193K21063K20373K86951K84855K95809K58587
$$ 13095012 13312521 13521623 13762816 13983879 14204252 14491203 14776058 15071867 15330454
3560A5330454K80675L00617L11701L54254L24336L31853L63531L51941L88764
$$ 15330454 15611129 15911746 16223447 16577701 16902037 17233890 17597421 17949362 18338126
3551A8338126L51236L83121L95703L77240L96090L78294M32512M24661M37316
$$ 18338126 18689362 19072483 19468186 19845426 20241516 20619810 21052322 21476983 21914299
3542B1914299M53844M89914N37964N24279N75611N78539N69783O04477O39841
$$ 21914299 22368143 22858057 23396021 23920300 24495911 25074450 25644233 26248710 26888551
3533B6888551P03412P20770P72296Q06744Q85135Q92782R37902J034051J114335
$$ 26888551 27591963 28312733 29085029 29891773 30776908 31669690 32607592 33641643 34755978
3524C4755978J202286J310528J345982J450084J549495J603634J678022J701511
$$ 34755978 35958264 37268792 38614774 40064858 41614353 43217987 44896009 46597520
3516D6597520J762912J771434J754833J694898J710877J715116J730003J761902
$$ 46597520 48360432 50131866 51886699 53581597 55292474 57007590 58737593 60499495
3508F0499495J770411J844196J882561J869295J867774J857138J818032J736459
$$ 60499495 62269906 64114102 65996663 67865958 69733732 71590870 73408902 75145361
3500G5145361J615944J516794J419261J286089J191853J190790J177966J194897
$$ 75145361 76761305 78278099 79697360 80983449 82175302 83366092 84544058 85738955
3492H5738955J262780J254714J312931J288246J198256J194359J100755J064362
$$ 85738955 87001735 88256449 89569380 90857626 92055882 93250241 94350996 95415358
3484I5415358R95343R66008R74850J106017J265726J427186J636859J855128K040975
$$ 95415358 96410701 97376709 98351559 99457576 100723302 102150488 103787347 105642475 107683450
3475A07683450K295004K557262K718744K924084L130183L313304L515464L714405
$$ 107683450 109978454 112535716 115254460 118178544 121308727 124622031 128137495 131851900
3467A31851900L945145M120440M306096M513701M679246M864048N073774N308055
$$ 131851900 135797045 139917485 144223581 148737282 153416528 158280576 163354350 168662405
3459A68662405N676454O022365O433991O851013P324131P788906Q224193Q609429
$$ 168662405 174338859 180361224 186795215 193646228 200970359 208759265 216983458 225592887
3451B25592887Q861684R136333R254840R281424R174863R044358Q926526Q791543
$$ 225592887 234454571 243590904 252845744 262127168 271302031 280346389 289272915 298064458
3443B98064458Q753704Q811902Q906217R088701R249398R357204R319102R172692
$$ 298064458 306818162 315630064 324536281 333624982 342874380 352231584 361550686 370723378
3435C70723378Q725268Q078957P281268O372378N405758M461946L583612K761764
$$ 370723378 379448646 387527603 394808871 401181249 406587007 411048953 414632565 417394329
3427D17394329K067257J490787J019500P02062L11281q9746m91142r74245j318108
$$ 417394329 419461586 420952373 421971873 422673935 422985216 422895470 422404328 421430083 420111975
3418D20111975j675065k071807k476108k842308l085484l122663l080466k923864
$$ 420111975 418436910 416365103 413888995 411046687 407961203 404838540 401758074 398834210
3410C98834210k758584k476955k066127j519547q04845J73671J273471K483820
$$ 398834210 396075626 393598671 391532544 390012997 389208152 389381823 390655294 393139114
3402C93139114L990946N704799P712254R917611J2238922J4343554J5732196J6093111
$$ 393139114 397130060 402834859 410547113 420464724 432703646 447047200 462779396 478872507
3394D78872507J5235992J3357001J0593809P078643L085535q68284m245251o622351
$$ 478872507 494108499 507465500 518059309 525137952 528223487 527355203 523109952 516487601
3386E16487601p720686p705556o917972n825895m847781m184384m147747m955764
$$ 516487601 508766915 501061359 494143387 488317492 483469711 479285327 475137580 470181816
3378D70181816o847109r807708j3366473j6904229j9974606k2199572k3298687
$$ 470181816 463334707 453526999 440160526 423256297 403281691 381082119 357783432
3371C57783432k3517618k2866730k1527804j9569760j7321648j5207756j3224029
$$ 357783432 334265814 311399084 289871280 270301520 252979872 237772116 224548087
3364B24548087j1498658j0014946q712020p590508o543369n615733m887008m232836
$$ 224548087 213049429 203034483 194322463 186731955 180188586 174572853 169685845 165453009
3356A65453009l743638l403114l110105k889644k726924k540708k385521k243535
$$ 165453009 161709371 158306257 155196152 152306508 149579584 147038876 144653355 142409820
3348A42409820k067354j929462j686403j442379j151150q36051n49468j89118
$$ 142409820 140342466 138413004 136726601 135284222 134133072 133297021 132747553 132558435
3340A32558435J88220M84188Q11045J140731J429706J709318K088899K548414
$$ 132558435 132746655 133230843 134041888 135182619 136612325 138321643 140410542 142958956
3332A42958956L010918L478215L962010M441339M967211N424777N757301O077657
$$ 142958956 145969874 149448089 153410099 157851438 162818649 168243426 174000727 180078384
3324A80078384O115536O011236N548822M732507L536649K023407K07151j820486
$$ 180078384 186193920 192205156 197753978 202486485 206023134 208046541 208253692 206433206
3316B06433206l724552n515950o983500q017408q679754q957613q920209q705721
$$ 206433206 202708654 197192704 190209204 182191796 173512042 164554429 155634220 146928499
3308A46928499q309415p832974p317380o790375o258638n803164n309425m883108
$$ 146928499 138619084 130786110 123468730 116678355 110419717 104616553 99307128 94424020
3300I4424020m499476m171468l840340l612758l297147l022039k858772k676115
$$ 94424020 89924544 85753076 81912736 78299978 75002831 71980792 69122020 66445905
3292F6445905k497629k332154k171820k078724j955421j863980j761977j659066
$$ 66445905 63948276 61616122 59444302 57365578 55410157 53546177 51784200 50125134
3284E0125134j595887j552568j464195j287228j303402j218771j181025j084850
$$ 50125134 48529247 46976679 45512484 44225256 42921854 41703083 40522058 39437208
3276C9437208j042691r85825r90447r54858q95146q50176q42321q06057p57129
$$ 39437208 38394517 37408692 36418245 35463387 34568241 33718065 32875744 32069687 31312558
3267C1312558p07170o79385o36408o38369o22195n60621n46730n45827n44198
$$ 31312558 30605388 29926003 29289595 28651226 28029031 27468410 26921680 26375853 25831655
3258B5831655m93395n05970m72162m25150m20398m10207l41908l75854l05108
$$ 25831655 25338260 24832290 24360128 23934978 23514580 23104373 22762465 22386611 22081503
3249B2081503l13837l18062l61641l97877l56434l61934l65645l23247l24803
$$ 22081503 21767666 21449604 21087963 20690086 20333652 19971718 19606073 19282826 18958023
3240A8958023l03374k67519l04885k93196k94834k80483k65341l15526k90650
$$ 18958023 18654649 18387130 18082245 17789049 17494215 17213732 16948391 16632865 16342215
3231A6342215k40201k68267k48299k47645k93433l32404k91608l06731l12463
$$ 16342215 16102014 15833747 15585448 15337803 15044370 14711966 14420358 14113627 13801164
3222A3801164k73664k36527k37339j75332k02024j95312j77161j74436j82315
$$ 13801164 13527500 13290973 13053634 12878302 12676278 12480966 12303805 12129369 11947054
3213A1947054j86961j75136j54533j49140j74436j41708j77318j74995j49784
$$ 11947054 11760093 11584957 11430424 11281284 11106848 10965140 10787822 10612827 10463043
3204A0463043j26527j05568j33641r8943j19052j25484j41242j30664j34322j53479
$$ 10463043 10336516 10230948 10097307 9998364 9879312 9753828 9612586 9481922 9347600 9194121
3194I194121q9638j33822j20129j36789j41936j06047o9547j15241j09192q3244
$$ 9194121 9104483 8970661 8850532 8713743 8571807 8465760 8396213 8280972 8171780 8088536
3184H088536j53824r8150m5204j13241q8106n8715p5396q5192q1040l8127q1399
$$ 8088536 7934712 7836562 7791358 7678117 7590011 7531296 7455900 7370708 7289668 7251541 7170142
3173G170142o3505k6085k9580m3428n4118j4213j9609K505j6241K3456j1202J7216
$$ 7170142 7106637 7080552 7050972 7007544 6953426 6939213 6919604 6922109 6905868 6929324 6918122 6935338
3161F935338J0896K1028O785j3712q088K0728L1863k9047N2877o375K564J1707
$$ 6935338 6946234 6967262 6974047 6960335 6952247 6972975 7004838 6975791 7028668 7022293 7024857 7036564
3149G036564L1785R782J6478j7536m014J7464N066j1514k2996J7631m1612k8074
$$ 7036564 7068349 7078131 7094609 7077073 7073059 7090523 7095589 7084075 7061079 7078710 7037098 7009024
3137G009024n8002p9957j6729l2132n1378n0486k7578o842l2376l0601l8417o1378
$$ 7009024 6951022 6871065 6854336 6822204 6770826 6720340 6692762 6685920 6653544 6622943 6584526 6523148
3125F523148l3884l6099l5246p164j5517l6387M80q153j9024j4328L16Q6449L2119
$$ 6523148 6489264 6453165 6417919 6410755 6395238 6358851 6359331 6351178 6332154 6317826 6318142 6404591 6436710
3112F436710M6543J21650N5906J04723J50936J18113J19643J31329J11632J17586
$$ 6436710 6483253 6604903 6660809 6765532 6916468 7034581 7154224 7285553 7397185 7514771
3102G514771J49192J65934J89653K44240K34290L18004L66551L85157L31981K48259
$$ 7514771 7663963 7829897 8019550 8263790 8498080 8816084 9182635 9567792 9899773 10148032
3092A0148032J587k84619m67297n68254n28472n23809m13447m11376l43522l22790
$$ 10148032 10149619 9865000 9397703 8829449 8300977 7777168 7363721 6952345 6608823 6286033
3082F286033k74722k95557k72604k39843k36002k27747j67214j66689j27929j00513
$$ 6286033 6011311 5715754 5443150 5203307 4967305 4739558 4572344 4405655 4277726 4177213
3072D177213q3028j13894j31217p1741j15676n9168o2692q3299p8482n8083l6977
$$ 4177213 4094185 3980291 3849074 3777333 3661657 3602489 3539797 3456498 3378016 3319933 3282956
3061C282956m8161m1891m4767k9116m7000j9232m3759l8530j3040P095n0242p5836
$$ 3282956 3234795 3192904 3148137 3119021 3072021 3052789 3009030 2970500 2957460 2964555 2914313 2838477
3049B838477n9426m5903m4324o898o8361r1824m2266k1366o273p5388j9621j2682
$$ 2838477 2779051 2733148 2688824 2681926 2613565 2521741 2479475 2458109 2451836 2376448 2356827 2344145
3037B344145j6996j2699k1930l9177k9932l6538k7727l1673m9365p416r461m5965
$$ 2344145 2327149 2314450 2292520 2253343 2223411 2186873 2159146 2127473 2078108 2070692 2061231 2015266
3025B015266k850n051j5607k6618l3535l968m0558L79n3713m6563J5338l2731
$$ 2015266 2012416 2007365 1991758 1965140 1931605 1927637 1887079 1887458 1833745 1787182 1802520 1769789
3013A769789j3488k9270n818k1102r589j1196j9025l1447l0346l3281o264l4363
$$ 1769789 1756301 1727031 1721213 1700111 1690522 1679326 1660301 1628854 1598508 1565227 1558963 1524600
3001A524600m2045m1572j3817k6210O117l6708k1375k5396l2176P322O309J4726
$$ 1524600 1482555 1440983 1427166 1400956 1407073 1370365 1348990 1323594 1291418 1298740 1305049 1319775
2989A319775J0149k9659m0308k2955j0600k2863J0186J7054o133j832J3695j7568
$$ 1319775 1329924 1300265 1259957 1237002 1226402 1203539 1213725 1230779 1224646 1222814 1236509 1218941
2977A218941N9416P37k1437J9530K5722m5701j8244N374o3968m1713l2314L105
$$ 1218941 1278357 1279094 1257657 1277187 1302909 1257208 1238964 1244338 1180370 1138657 1106343 1109448
2965A109448j4876n667l1183L1792j1238m2425j4059J7749J3118l9600J1066J1920
$$ 1109448 1094572 1088905 1057722 1089514 1078276 1035851 1021792 1039541 1052659 1013059 1024125 1036045
2953A036045J4764L2858O776J3137j5975O955k1454N5894L1559J5841J3112K7548
$$ 1036045 1050809 1083667 1090443 1103580 1087605 1094560 1073106 1129000 1160559 1176400 1189512 1217060
2941A217060P065j581j4397o8211p6564m4934j8807l7050q425J0087k0846k8920
$$ 1217060 1224125 1222544 1208147 1139936 1063372 1018438 999631 962581 954156 964243 943397 914477
2929I14477l6836r10n898r823l1664J3244L902L290k1257k6560J7991O174j9421
$$ 914477 877641 876731 870833 861010 829346 842590 846492 849782 828525 801965 819956 826130 806709
2916H06709K4339J4980l3959L7205J9328n502J8544r322p161j39j6015j2601j4743
$$ 806709 831048 846028 812069 849274 868602 863100 881644 872322 865161 865022 849007 836406 821663
2903H21663l5967k6081p129O062J8580m665m6194j4443j0254K2502N819m652K1
$$ 821663 785696 759615 752486 758548 777128 772463 726269 711826 701572 724074 729893 725241 725262
2890G25262r513r616j7538L1887N20l8679m3601Q121j3817m2530j1671j6955r997
$$ 725262 715749 706133 688595 720482 721002 682323 638722 646843 633026 590496 578825 561870 551873
2877E51873J1875k4786m423k4398k5065K0465N282J1386K4052k7548O250M312
$$ 551873 563748 538962 534539 510141 485076 505541 510823 522209 546261 518713 524963 529275
2865E29275J7263l7972j8628r405j6811L0076j2409j4665m811K9905n048O88J2192
$$ 529275 546538 508566 489938 480533 463722 493798 481389 466724 461913 491818 486770 487458 499650
2852D99650L2379M467n079Q842M950Q369k0728k3750o959m556l9387J7046J9660
$$ 499650 532029 536496 531417 540259 545209 553578 532850 509100 502141 497585 458198 475244 494904
2839D94904j0315j0625j707J4871L0613J4723rM89O440j0049j4820L809n548R621
$$ 494904 484589 473964 472257 487128 517741 532464 532455 532944 539384 529335 514515 518324 512776 522397
2825E22397K8828q325j4392r584k02J4419K8169p588k1297j0673K1084q384L3564
$$ 522397 551225 542900 528508 518924 518722 533141 561310 553722 532425 521752 542836 534452 568016
2812E68016j3755j9049l3944j4672M1745l0122k9041r00k033m782L3455K035j7150
$$ 568016 554261 535212 501268 486596 528341 498219 469178 468278 466245 461463 494918 496953 479803
2799D79803j8786L081L5579k8013l025m083l3730J9493J9533J9713k4964j3659
$$ 479803 461017 464098 499677 471664 468639 464556 430826 450319 469852 489565 464601 450942
2787D50942L523K7859r977j6046J1296K6238l170k998K6819q960o668k7958J3392
$$ 450942 454465 482324 472347 456301 467597 493835 490665 487667 514486 505526 498858 470900 484292
2774D84292k0385l0469K8280j356j8481m107L5159j3320J6206J7803l6146q599
$$ 484292 463907 433438 461718 460362 441881 437774 472933 459613 475819 493622 457476 448877
2762D48877K6997k4202m0570k079j182L784j7730J2646o483k2888K7657K1076
$$ 448877 475874 451672 411102 409023 407841 411625 393895 406541 400058 377170 404827 425903
2750D25903K0847n490K2142k8562l2929N63l5301J1668N087j9028Q535k2620m0318
$$ 425903 446750 441260 463402 434840 401911 402474 367173 378841 383928 364900 373435 350815 310497
2737C10497k7379J601K7188m416J7058J3299O926K5424j8266k0631J6855M2152
$$ 310497 283118 284719 311907 307491 324549 337848 344774 370198 351932 331301 348156 390308
2725C90308K4944j7985j0194q885j8426K4811L8258j5714k213K1725l1000l632
$$ 390308 415252 397267 387073 378188 359762 384573 422831 407117 404904 426629 395629 391997
2713C91997m547K8965l7070j3032K898k2654O849K983j7505k3462P334K243K042
$$ 391997 387450 416415 379345 366313 369211 346557 353406 356389 338884 315422 322756 324999 327041
2700C27041J3857J0971l7131l1620n4685k1839M2935j3571m5248k0481N386m610
$$ 327041 340898 351869 314738 283118 228433 206594 249529 235958 190710 170229 175615 171005
2688A71005K384j7703j9393J7276j5126q249k7325J9890J994j363J4047l3188
$$ 171005 173389 155686 136293 153569 138443 130194 102869 122759 124753 123390 137437 104249
2676A04249j1750m12k5907O845Q963m4312m0882K5856L2141j1735j1986P714L6244
$$ 104249 92499 92087 66180 73025 81988 37676 -3206 22650 54791 43056 31070 38784 75028
2663G5028J2735Q323L0299J1221n5185j2927K2830k5324O779j3118k6324J1418
$$ 75028 87763 96086 126385 137606 82421 69494 92324 67000 73779 60661 34337 45755
2651D5755K0335k5959p513O305L173J99n451K3477j4001l9010L6655K4182k3380
$$ 45755 66090 40131 32618 38923 42096 42295 36844 60321 46320 7310 43965 68147 44767
2638D4767l4400n947L2795K2266K798k4417j8185J9660k9782j4255K9084R395
$$ 44767 10367 4420 37215 59481 62279 37862 19677 39337 9555 -4700 24384 33779
2626C3779J5694j1666k2360K272m422j2764R700J2926n145r012k9558N739J0869
$$ 33779 49473 37807 15447 17719 13297 533 10233 23159 18014 9002 -20556 -14817 -3948
2613c948L1031n339q889n873K7704k5076j5741q03R75k0550j0773j350k4228L7103
$$ -3948 27083 21744 12855 6982 34686 9610 -6131 -6934 -5959 -26509 -37282 -38632 -62860 -25757
2599b5757j9793J7954J3769N334r920K986j3914P323J5041L507l1298j0193J169
$$ -25757 -45550 -27596 -13827 -8493 -18413 -15427 -29341 -22018 -6977 -3470 -34768 -44961 -43792
2586d3792K0110j9238l7155K1205M8729k454o269J7450j5184l158o97k6133K4427
$$ -43792 -23682 -42920 -80075 -58870 -10141 -12595 -18864 -1414 -16598 -19756 -20453 -46586 -22159
2573b2159J7125m997J4621O012r118l322J894l4645j0811J1730K2575k1933j5632
$$ -22159 -5034 -10031 4590 10602 1484 -1838 56 -34589 -45400 -33670 -11095 -33028 -48660
2560d8660k6219j880K3061J6275m455J0810j547o060K873L0407P704m0222o568
$$ -48660 -74879 -76759 -53698 -37423 -41878 -31068 -32615 -38675 -35802 -5395 2309 -37913 -44481
2547d4481K4519l379j9438K457J0116r283K1435O482j0152O621O639J8399k0093
$$ -44481 -19962 -23341 -42779 -40322 -30206 -39489 -18054 -11572 -21724 -15103 -8464 9935 -10158
2534a0158l733n7756K2460R648K0218j7841J1338J2612j0052r682k8358K1257
$$ -10158 -13891 -71647 -49187 -39539 -19321 -37162 -25824 -13212 -23264 -32946 -61304 -40047
2522d0047J8088o894J7646R625n1673J4124K1245L1930k0569m2351l868k0097
$$ -40047 -21959 -28853 -11207 -1582 -53255 -39131 -17886 14044 -6525 -48876 -52744 -72841
2510g2841j0480M9118K9053j8420N174k2938J2419P540P13j0329j1345J6534M0054
$$ -72841 -83321 -34203 -5150 -23570 -18396 -41334 -28915 -21375 -20662 -30991 -42336 -25802 14252
2497A4252q580j6094Q496k1298K0323M614J0668J4554M995j2298j9193j4923n084
$$ 14252 5672 -10422 -1926 -23224 -2901 1713 12381 26935 31930 19632 439 -14484 -19568
2484a9568k6011r429O892L6984r462k6153m126L2876J1781k2016k7722J7193L6215
$$ -19568 -45579 -55008 -48116 -11132 -20594 -46747 -50873 -17997 -6216 -28232 -55954 -38761 -2546
2471b546J2312q100j4962K4746J7505j5961J9049J1815p297l89j1936M075k3199
$$ -2546 9766 1666 -13296 11450 28955 12994 32043 43858 36561 36172 24236 28311 5112
2458E112j9949N591J4825J4862j3464o196J3680k2487l7188Q787L3856j4033P134
$$ 5112 -14837 -9246 5579 20441 6977 781 14461 -8026 -45214 -36427 -2571 -16604 -9470
2445i470M942K7739q80J1359j2209J0369K460l1062k4150K1821K9110O960r239
$$ -9470 -4528 23211 22331 33690 21481 31850 34310 3248 -20902 919 30029 36989 27750
2432B7750l2929P113p56q928K2567o814j7171J7624k1909r630j6239O080J1262
$$ 27750 -5179 1934 1178 -7750 14817 8003 -9168 8456 -13453 -23083 -39322 -33242 -21980
2419b1980J0264k1931j283O203L836m434K6325J1654k3581J3636K6102K72l334
$$ -21980 -11716 -33647 -34930 -28727 -24891 -29325 -3000 8654 -14927 -1291 24811 25083 21749
2406B1749j9530k3188k4713R643j4130K7335K8605J7541K098r647j4832k2221
$$ 21749 2219 -20969 -45682 -36039 -50169 -22834 5771 23312 25410 15763 931 -21290
2394b1290l4573Q791q910k1986J6839L5895j0705J5510N930k1991K442m622j5173
$$ -21290 -55863 -47072 -55982 -77968 -61129 -25234 -35939 -20429 -14499 -36490 -34048 -38670 -53843
2381e3843M343L5412q465k1826m7251K3544K3514k1986n454J9952l56r258J0357
$$ -53843 -49500 -14088 -22553 -44379 -91630 -68086 -44572 -66558 -72012 -52060 -52416 -61674 -51317
2368e1317K5147j7000J371l8832L0839q680l4454K8659J8102n1r469l652j0536
$$ -51317 -26170 -43170 -41799 -80631 -49792 -58472 -92926 -64267 -46165 -46216 -55685 -59337 -69873
2355f9873l0024P667J4011R911O913j3378J150L5503K6189J229l6597m9988O884
$$ -69873 -99897 -92230 -78219 -68308 -61395 -74773 -73623 -38120 -11931 -10702 -47299 -97287 -90403
2342i0403K6899j4318k0456K4687L0449j4740L933j0209J9571L2824n237m8661
$$ -90403 -63504 -77822 -98278 -73591 -43142 -57882 -53949 -64158 -44587 -11763 -17000 -65661
2330f5661m361K9230r838k6915k3601J422p197n306K8825r604m481K5086J7307
$$ -65661 -70022 -40792 -50630 -77545 -101146 -99724 -106921 -112227 -83402 -93006 -97487 -72401 -55094
2317e5094k1673J372J697K180K224L315j4477l3866J6790K595J929J09N496o668
$$ -55094 -76767 -75395 -73698 -71518 -69294 -65979 -80456 -114322 -97532 -94937 -93008 -92899 -87403 -94071
2303i4071J0304k6505K0090k2129L318J1325j105J8144m958P030j2460L5757J9050
$$ -94071 -83767 -110272 -90182 -112311 -108993 -97668 -98773 -80629 -85587 -78557 -91017 -55260 -36210
2290c6210j1125k62K3085K538N13r387m497J0658j5876j8425J6853Q307p090n041
$$ -36210 -47335 -47597 -24512 -21974 -21461 -30848 -35345 -24687 -40563 -58988 -42135 -33828 -40918 -45959
2276d5959j5024l2463Q125k989M924n978M72J8686M179j1376L010M3706Q693m309
$$ -45959 -60983 -93446 -85321 -88310 -83386 -89364 -88892 -70206 -66027 -77403 -74393 -30687 -21994 -26303
2262b6303l4509n724j4394j798J189J2232j1863l590p237K6519l7720J9747K5050
$$ -26303 -60812 -66536 -80930 -82728 -81539 -69307 -81170 -84760 -91997 -65478 -103198 -83451 -58401
2249e8401j6317R8m939j1671r510J1667j9056J487J3641l413K7595L0489o651
$$ -58401 -74718 -74620 -79559 -91230 -100740 -89073 -108129 -106642 -93001 -96414 -68819 -38330 -44981
2236d4981o408K8318J4314j4155k4794O913j6696j000k635J0745n644j0752J5494
$$ -44981 -51389 -23071 -8757 -22912 -47706 -40793 -57489 -58489 -61124 -50379 -56023 -66775 -51281
2223e1281L1180j842R894L5343k5027j3954k7675M504o556j2128k8528M559K2127
$$ -51281 -20101 -21943 -12049 23294 -1733 -15687 -43362 -38858 -45414 -57542 -86070 -81511 -59384
2210e9384L3219j7814K4720N100j9161m4098j0136L8819Q275l228m712R454R151
$$ -59384 -26165 -43979 -19259 -14159 -33320 -77418 -87554 -48735 -40460 -43688 -48400 -38946 -29795
2197b9795L0160j3376l3796j979j062J1103J9856k5464k0183j6611J533J012O605
$$ -29795 365 -13011 -46807 -48786 -49848 -38745 -18889 -44353 -64536 -81147 -79614 -78602 -71997
2184g1997q77p80K2223m312j7312J8156J8373q288j1921J4147J3646j0933j2962
$$ -71997 -72874 -73654 -51431 -55743 -73055 -54899 -36526 -44814 -56735 -42588 -28942 -39875 -52837
2171e2837j4971l1857o134L5856K5317J304k4336O303J9192j8561j6819j1198
$$ -52837 -67808 -99665 -105799 -69943 -44626 -43322 -67658 -61355 -42163 -60724 -77543 -88741
2159h8741J645L3394j9729j4915J7093k146J3897j6198K8557J3758j5158k2656
$$ -88741 -87096 -53702 -73431 -88346 -71253 -73399 -59502 -75700 -47143 -33385 -48543 -71199
2147g1199J178k1823L7991J8894j8303j0300k1729K2173k8736M2550J2720Q561
$$ -71199 -70021 -91844 -53853 -34959 -53262 -63562 -85291 -63118 -91854 -49304 -36584 -28023
2135b8023J1807k6756j3919P742q513L0323j5332k7032J5485P177R090J1524m2013
$$ -28023 -16216 -42972 -56891 -49149 -57662 -27339 -42671 -69703 -54218 -47041 -37951 -26427 -68440
2122f8440J7419o861r52J9547K063r987J0444K5244j916J3062n2037J2K3434k7451
$$ -68440 -51021 -57882 -58834 -39287 -37224 -47211 -36767 -11523 -13439 -377 -52414 -52402 -28968 -56419
2108e6419M1153k458J4285n949l1956j3013L1591j2017K5410K1155n8129J8055
$$ -56419 -15266 -17724 -3439 -9388 -41344 -54357 -22766 -34783 -9373 11782 -46347 -28292
2096b8292L688Q612j5074N722k4109J253J7933k4459k025J2451K3394R113p070
$$ -28292 -24604 -15992 -31066 -25344 -49453 -48200 -30267 -54726 -56751 -44300 -20906 -11793 -18863
2083a8863k8395J6926K5507k6717J9852O398J4953m4159J981L6007p647M3069
$$ -18863 -47258 -30332 -4825 -31542 -11690 -5292 9661 -34498 -32517 3490 -4157 38912
2071C8912O31j5699k1324j8949J9078l5550K6933L1170l4424k333Q186Q251j3437
$$ 38912 39543 23844 2520 -16429 2649 -32901 -5968 25202 -9222 -11555 -3369 4882 -8555
2058h555m395K0316K4989k7998m878P265K7436M219M32p96R141n278J4940l4213
$$ -8555 -12950 7366 32355 4357 -521 6744 34180 38399 38831 38035 47176 41898 56838 22625
2044B2625l1946L3354q05K1606k4814J9079k070K0012Q508K0367k8785r90K8404
$$ 22625 -9321 24033 23228 44834 20020 39099 37029 57041 65549 85916 57131 56141 84545
2031H4545N174j0947L732M613L6663l603R216L98Q893J3313j0821K4767r533j4746
$$ 84545 89719 78772 82504 87117 123780 120177 129393 129791 138684 151997 141176 165943 156410 141664
2017A41664J0239J5785l89J9537j1189k266M4688q224L1474j4001J9736j0264
$$ 141664 151903 167688 167299 186836 175647 173381 218069 209845 241319 227318 247054 236790
2005B36790J1057L8314j7444M0603j0990K1342k8168l081M9049K4856J9878J7997
$$ 236790 247847 286161 268717 309320 298330 319672 291504 288423 337472 362328 382206 400203
1993D00203j1513J2613J5047J7490K3603r86K5898N7078L3114M1470N1221R238
$$ 400203 388690 401303 416350 433840 457443 456457 482355 539433 572547 614017 665238 674476
1981F74476N9020K737K2925L7897O4341M0961O1523N6448O2608O9364O8474P1025
$$ 674476 733496 736233 759158 797055 861396 902357 963880 1020328 1082936 1152300 1220774 1291799
1969A291799J26782J34085Q9567Q8836J01598K01142J46690J92818K59395L84234
$$ 1291799 1418581 1552666 1642233 1731069 1832667 2033809 2180499 2373317 2632712 3016946
1959C016946M40710N08635N88760P11531Q41804P95906P56039N27681j82111q74176
$$ 3016946 3457656 3966291 4555051 5266582 6108386 6904292 7660331 8188012 8005901 7131725
1949G131725j157890j030394q13710o34549m50362l51320l24396k89777k44786
$$ 7131725 5973835 4943441 4129731 3495182 3044820 2693500 2369104 2079327 1834541
1940A834541j45010j30414j05188q6958n9773j22919o1819j14903p6577l5606
$$ 1834541 1689531 1559117 1453929 1366971 1307198 1184279 1122460 1007557 930980 895374
1930H95374l8477o2795q8645m8208k7142k2719j8613l9471l3819k7195k7410j7343
$$ 895374 856897 794102 705457 657249 630107 607388 588775 549304 515485 488290 460880 443537
1918D43537j5046l0146P337k2763n0305J551l4631k0173J7075j0880k2168J829
$$ 443537 428491 398345 405682 382919 332614 334165 299534 279361 296436 285556 263388 265217
1906B65217k5248m1639k3181J5032M2528r267m4339k936J6018j8184l8323J5142
$$ 265217 239969 198330 175149 190181 232709 223442 179103 176167 192185 174001 135678 150820
1894A50820K085m444j4011o576P047L751l3556M797j1297m932r684n522r386k958
$$ 150820 152905 148461 134450 127874 134921 138672 105116 109913 98616 93684 84000 78478 69092 66134
1880F6134N194N438j2119l0208q575J5440J6569l2797L0397J5788k5533J748Q098
$$ 66134 71328 76766 64647 34439 25864 41304 57873 25076 55473 71261 45728 47476 55574
1867E5574p693k0242J3978J6897k032r715J8046j4318o246j5537k1189j1559M8608
$$ 55574 47881 27639 41617 58514 56482 46767 64813 50495 44249 28712 7523 -4036 44572
1854D4572k3064o1192L6053K7879k6644j7295K2074n416J1611K578k7919K2247
$$ 44572 21508 -39684 -3631 24248 -2396 -19691 2383 -3033 8578 11156 -16763 5484
1842E484P012l0688o897M8470k9812K2253J3636J3122j9143p160J5096O45k4338
$$ 5484 12496 -18192 -25089 23381 -6431 15822 29458 42580 23437 16277 31373 32018 7680
1829G680P970j6425j1420L5363P481n70m538k745l0370M131k3038k1253k9490
$$ 7680 15650 -775 -12195 23168 30649 30079 25541 22796 -7574 -3443 -26481 -47734 -77224
1816g7224j1631K1812P950N1817J5551l2013p125k2534l070j473N02p59K7182
$$ -77224 -88855 -67043 -59093 -7276 8275 -23738 -30863 -53397 -56467 -57940 -57438 -58197 -31015
1803c1015K2616o933K2095K7939p053l4269q318R747l3941k9142K6320k3716p766
$$ -31015 -8399 -15332 6763 34702 27649 -6620 -14938 -5191 -39132 -68274 -41954 -65670 -73436
1790g3436K7763K6109r61k1841J4392R506k4458N504J0377N153J7817p908k0714
$$ -73436 -45673 -19564 -20525 -42366 -27974 -18468 -42926 -37422 -27045 -21892 -4075 -11983 -32697
1777c2697j6489Q355o090L6674J1895j3235M878k7679J5361p921k9263K9164k0568
$$ -32697 -49186 -40831 -46921 -10247 1648 -11587 -6709 -34388 -19027 -26948 -56211 -27047 -47615
1764d7615L3352jj0945p283O04O793O374j2048R435j7971J4599J3045j7375j44
$$ -47615 -14263 -14264 -25209 -32492 -31888 -25095 -18721 -30769 -21334 -39305 -24706 -11661 -29036 -29180
1750b9180j1226k5837K4575J1530M456J5325j5343j2986N453J7596o779j2447
$$ -29180 -40406 -66243 -41668 -30138 -25682 -10357 -25700 -38686 -33233 -15637 -22416 -34863
1738c4863q781K8297N140j4609j5863k3113K1728L37Q614J9208J090j0385k0066
$$ -34863 -43644 -15347 -10207 -24816 -40679 -63792 -42064 -41727 -33113 -13905 -12815 -23200 -43266
1725d3266K653j6767m019K1465j059o05o589K3657K1322j1046j1921J0805K221
$$ -43266 -40613 -57380 -61399 -39934 -40993 -41598 -48187 -24530 -3208 -14254 -26175 -15370 -13149
1712a3149j0016k4342l3231Q493N256J3997N646J6253L134j3042J193J5388j6338
$$ -13149 -23165 -47507 -80738 -72245 -66989 -52992 -47346 -31093 -27959 -41001 -39808 -24420 -40758
1699d0758j0345j134J9812p722Q412P089O446m855p524M4898j2537k7064j3309
$$ -40758 -51103 -52237 -32425 -40147 -31735 -24646 -18200 -23055 -30579 14319 1782 -25282 -38591
1686c8591K5835K272o401R400O477o700j5135P184k0898j8526K5987k7126m647
$$ -38591 -12756 -10484 -16885 -7485 -1008 -7708 -22843 -15659 -36557 -55083 -29096 -56222 -60869
1673f0869Q799J4688K3336l2380K1714J6149j8836k7887R237K4613K5373n641
$$ -60869 -52070 -37382 -14046 -46426 -24712 -8563 -27399 -55286 -46049 -21436 3937 -1704
1661a704m0380j4736N146J051j4233P241n917R204N0002O284k5450p474P603j6091
$$ -1704 -42084 -56820 -51674 -50623 -64856 -57615 -63532 -54328 -4326 1958 -23492 -30966 -23363 -39454
1647c9454k9339L1644K9254k366l8938r153L2374l667J5620j9979r093n734J651
$$ -39454 -68793 -37149 -7895 -10261 -49199 -58352 -25978 -29645 -14025 -34004 -43097 -48831 -47180
1634d7180Q288K5297N952j0851L508j6279j6922K777J6322j9027J8604J2265m0497
$$ -47180 -38892 -13595 -7643 -18494 -14986 -31265 -48187 -45410 -29088 -48115 -29511 -17246 -57743
1621e7743l1072m86J5509q832O436J4697M0564K2547j5774k7568m0526k6050O931
$$ -57743 -88815 -89301 -73792 -82624 -76188 -61491 -20927 1620 -14154 -41722 -82248 -108298 -101367
1608a01367J244K8214K5174J0621q868j7600k1267J7813j6479q093K2598j1766
$$ -101367 -100123 -71909 -46735 -36114 -44982 -62582 -83849 -66036 -82515 -90608 -68010 -79776
1596g9776q496J0047R59o623R675J3813k6508K4246J2400j4134J6125M4k4989
$$ -79776 -88272 -78225 -77266 -83889 -74214 -60401 -86909 -62663 -50263 -64397 -48272 -48228 -73217
1583g3217J0808J178K9287j2605k1122k534j457J0021q323j7450J9856L7871j8607
$$ -73217 -62409 -61231 -31944 -44549 -65671 -68205 -69662 -59641 -67964 -85414 -65558 -27687 -46294
1570d6294L580j716J8913J8740j5222j3082j6348q275M7322k5895j7230K510q40
$$ -46294 -42714 -44430 -25517 -6777 -21999 -35081 -51429 -59704 -12382 -38277 -55507 -52997 -53837
1557e3837j4077j5758J2701K8602l2916j2846P779M6876k6148K831Q897q91J2090
$$ -53837 -67914 -83672 -70971 -42369 -75285 -88131 -80352 -33476 -59624 -56793 -47896 -48787 -36697
1544c6697M515P70K910K979n128J208k0169l086K736o489J3740K6017R896m646
$$ -36697 -32182 -31412 -28502 -25523 -30651 -29443 -49612 -52698 -49962 -56451 -42711 -16694 -6798 -11444
1530a1444M353r666o324J1329k9814N086J780J494N204l2063j9746J4660K1632
$$ -11444 -7091 -16757 -23081 -11752 -41566 -36480 -34700 -33206 -28002 -60065 -79811 -65151 -43519
1517d3519o825l4351N0181J7060j8789J3840J1393n093J4428k309j4563J9928
$$ -43519 -50344 -84695 -34514 -17454 -36243 -22403 -11010 -16103 -1675 -3984 -18547 1381
1505A381j3691k1270k8188k3063K9601K9078l1985J8888M213r99m6733L701K701
$$ 1381 -12310 -33580 -61768 -84831 -55230 -26152 -58137 -39249 -35036 -36035 -82768 -79067 -76366
1492g6366K7250l543k1377M02L9689J5123J168J4375m3828J8688R531j7207q854
$$ -76366 -49116 -52659 -74036 -73634 -33945 -18822 -17654 -3279 -47107 -28419 -18888 -36095 -44949
1479d4949K6304l0734j7263M6975K733k3172l0753p236r542L6001l6j0771J1356
$$ -44949 -18645 -49379 -66642 -19667 -16934 -40106 -70859 -78095 -87637 -51636 -51672 -62443 -51087
1466e1087N524J7069r929j624j5014n273L2654l241l1212M5434J9524l3916m1538
$$ -51087 -45563 -28494 -38423 -40047 -55061 -60334 -27680 -30921 -62133 -16699 2825 -31091 -72629
1453g2629P077n789K6681j950r694l084M2946R1K860j4433j305l0157j2767J237
$$ -72629 -65552 -71341 -44660 -46610 -56304 -59388 -16442 -16351 -13491 -27924 -29229 -59386 -72153 -70916
1439g0916R866j6645L3361O841M451Q535j195k04O628J0762p755p697j5514L4010
$$ -70916 -61050 -77695 -44334 -37493 -33042 -24507 -25702 -25906 -19278 -8516 -16271 -23968 -39482 -5472
1425e472j4289K5003l3448J0635n316P901R801r909J2878j2567J8144L8075o8330
$$ -5472 -19761 5242 -28206 -17571 -22887 -14986 -5185 -15094 -2216 -14783 3361 41436 -26894
1412b6894m2427K8181K649o125j819J1303n19j8122L013L5803j9454p95L320N49
$$ -26894 -69321 -41140 -38491 -44616 -46435 -35132 -35651 -53773 -50760 -14957 -34411 -35206 -31886 -31337
1398c1337K660M892q818o99Q8J79N549R285k3208J3895j2348k8221K2186L123
$$ -31337 -28677 -23785 -32603 -33302 -33214 -33035 -27486 -18201 -41409 -27514 -39862 -68083 -45897 -42774
1384d2774R572k7761J3723K188r144q487j650l578N647L1303k798j0294L4010
$$ -42774 -33202 -60963 -47240 -45052 -54196 -62683 -64333 -67911 -62264 -30961 -33759 -44053 -10043
1371a0043p842L837j546r696P029L07R645K901K4580l3047m1743K7956m984N727
$$ -10043 -17885 -14048 -15594 -25290 -18261 -17954 -8309 -5408 19172 -13875 -55618 -27662 -32646 -26919
1357b6919J6251p773N574k0155j5252n069J6911L1498K708k2943J0206k0572o913
$$ -26919 -10668 -18441 -12867 -33022 -48274 -53343 -36432 -4934 -2226 -25169 -14963 -35535 -42448
1344d2448j3247K738m112P130L1825o344M0420k116l1053l085K6762j3539m9367
$$ -42448 -55695 -52957 -57069 -49939 -18114 -24458 15962 13846 -17207 -20292 6470 -7069 -56436
1331e6436k5884L0552J8574R164n012L573k3433N465P835j4764r230j5625L2860
$$ -56436 -82320 -51768 -33194 -24030 -29042 -25469 -48902 -43437 -35602 -50366 -59596 -75221 -42361
1318d2361N844J1691k2368k6483L0579L1300N916j413k5592N853K0711l2648Q532
$$ -42361 -36517 -24826 -47194 -73677 -43098 -11798 -5882 -7295 -32887 -27034 -6323 -38971 -30439
1305c0439L1610K6381o3072l8428L2507Q548j297O831K1484o900j0152q100j0054
$$ -30439 1171 27552 -35520 -73948 -41441 -32893 -34190 -27359 -5875 -12775 -22927 -31027 -41081
1292d1081R784K204Q367o284k471j2509M099j2828J0749Q259j0749J392n803J2851
$$ -41081 -31297 -29093 -20726 -27010 -29481 -41990 -37891 -50719 -39970 -31711 -42460 -41068 -46871 -34020
1278c4020P404P953O502J0079K1599L384m5629k3285O97J9177j2101J5816J6203
$$ -34020 -26616 -18663 -12161 -2082 19517 22901 -22728 -46013 -45316 -26139 -38240 -22424 -6221
1265f221k5620l486j923j1409K4616p732p095q584K1697K3657l4448j400K833
$$ -6221 -31841 -35327 -37250 -48659 -24043 -31775 -38870 -47454 -25757 -2100 -36548 -37948 -35115
1252c5115l0731K241L2985R226p887k0170K0164k066K1220j0098j8601K9906j2187
$$ -35115 -65846 -63605 -30620 -21394 -29281 -49451 -29287 -31353 -10133 -20231 -38832 -8926 -21113
1239b1113k7784R529j8072o213J6319k690J6830q898j330J790J8129L3499j0937
$$ -21113 -48897 -39368 -57440 -63653 -47334 -50024 -33194 -42092 -43422 -41632 -23503 9996 -941
1226i41l9259r557m2864J0110L8006J5980j9983n174j2492M9149L613N605K1598
$$ -941 -40200 -49757 -92621 -82511 -44505 -28525 -48508 -53682 -66174 -17025 -13412 -7807 13791
1213A3791o1663M848M3075j7726l94J4308l1670k2692K1758J4645j458K5721j4791
$$ 13791 -47872 -43024 51 -17675 -18069 -3761 -35431 -58123 -36365 -21720 -23178 2543 -12248
1200a2248k5795J3825n26r173N34j1023O818m277k804J2703Q139j111J6269k4100
$$ -12248 -38043 -24218 -24744 -33917 -33383 -44406 -37588 -41865 -44669 -31966 -23827 -24938 -8669 -32769
1186c2769L671J7141L0250l4820j6608J1223L9275o628k6319M8933J2008q233
$$ -32769 -29098 -11957 18293 -16527 -33135 -21912 17363 10735 -15584 33349 45357 37124
1174C7124k5547k7685n26k070j2379j3431J7982K8760r953j9255r327K5114K1498
$$ 37124 11577 -16108 -16634 -18704 -31083 -44514 -26532 2228 -7725 -26980 -36307 -11193 10305
1161A0305l221n29o599n767o689L724L4535j294O835k6863K150P593j7031Q946
$$ 10305 7084 6555 -44 -5811 -12500 -8776 25759 24465 31300 4437 6587 14180 -2851 6095
1147F095j7892j4928k5962L570K0159J2652j0891j0694L8894J0218l5608K606
$$ 6095 -11797 -26725 -52687 -49117 -28958 -16306 -27197 -37891 1003 11221 -24387 -21781
1135b1781O392j8424j978L0589K6592j0985R871j2845N183K84j9648j8756j6615
$$ -21781 -15389 -33813 -35791 -5202 21390 10405 20276 7431 12614 12898 -6750 -25506 -42121
1122d2121J6556P91o294L5678L3643k5626k0062q57J3076J2297k1566J4214O512
$$ -42121 -25565 -24774 -31068 4610 38253 12627 -7435 -8292 4784 17081 -4485 9729 16241
1109A6241k751k6337J4953J8171r201m0042J763N778P802R584j366K143p715J6507
$$ 16241 13490 -12847 2106 20277 11076 -28966 -27203 -21425 -13623 -4039 -5405 -3262 -10977 5530
1095E530k1725L724j8567J5412j5021r747l206L8687J2110k7912J7568M759j4472
$$ 5530 -16195 -12471 -31038 -15626 -30647 -40394 -43600 -4913 7197 -20715 -3147 1612 -12860
1082a2860p16K039l044j872k5284K410K3804K3611l7133r452P229P487K4336k705
$$ -12860 -13576 -11537 -14581 -16453 -41737 -39327 -15523 8088 -29045 -38497 -31268 -23781 555 -2150
1068b150o921J4576O686L6298j7185n1468k8326j7638M4572j2052j2658J7974
$$ -2150 -9071 5505 12191 48489 31304 -20164 -48490 -66128 -21556 -33608 -46266 -28292
1056b8292L9615r106l0433J2982L9960k7769j334r469q147J3170j5173r93J1912
$$ -28292 11323 2217 -28216 -15234 24726 -3043 -4377 -13846 -21993 -8823 -23996 -24989 -13077
1043a3077o958o688m286K0044k6560n653L8761K9190M884J753q132k7009P892
$$ -13077 -20035 -26723 -31009 -10965 -37525 -43178 -4417 24773 29657 31410 23278 -3731 4161
1030D161j3530k226j3532P207K2373j4576j5115p809j0318L0347J103Q330L861
$$ 4161 -9369 -11595 -25127 -17920 4453 -10123 -25238 -33047 -43365 -13018 -11915 -3585 276
1017B76j9740r731K9815l8050j1653K8625K2144k9307j4648O933J1535n419j342
$$ 276 -19464 -29195 620 -37430 -49083 -20458 1686 -27621 -42269 -35336 -23801 -29220 -30562
1004c0562L9143j8622j9836R382j6221r769L3905j1783M383o374j2118K698J7918
$$ -30562 8581 -10041 -29877 -20495 -36716 -46485 -12580 -24363 -19980 -26354 -38472 -35774 -17856
991a7856K4918M976J5058j3714j621Q433j1593J2295l8169l5551J0572J6761M0205
$$ -17856 7062 12038 27096 13382 11761 20194 8601 20896 -17273 -52824 -42252 -25491 14714
978A4714k8816m79J8819p760j138K844M202n137K694j7155M5164j7779j4388K7522
$$ 14714 -14102 -14581 4238 -3522 -4660 -1816 2386 -2751 -57 -17212 27952 10173 -4215 23307
964B3307l9214k9469n890J3396J0892o83J495o643R152J1852R43k8979N864J9283
$$ 23307 -15907 -45376 -51266 -37870 -26978 -27661 -26166 -32809 -23657 -11805 -10862 -39841 -33977 -14694
950a4694J4193k7355j860M2136J2182L472k9191K2915j4055k923J684j8781q702
$$ -14694 -501 -27856 -29716 12420 24602 28074 -1117 21798 7743 4820 6504 -12277 -20979
937b0979L6706k24J5389J324p422j3362m726k0232j6355L3100l9661P427M3211
$$ -20979 15727 15503 30892 32216 24794 11432 6706 -13526 -29881 3219 -36442 -29015 14196
924A4196j5914m072j462J0789M6995j1497j7998p338p061J1607n553k5313j5079
$$ 14196 -1718 -5790 -7252 3537 50532 39035 21037 13699 6638 18245 12692 -12621 -27700
911b7700L4335M464l6242L7922j7592k3815K3170M399l583N91J0891j3198Q654
$$ -27700 6635 11099 -25143 12779 -4813 -28628 -5458 -1059 -4642 -4051 6840 -6358 2296
898B296m538j2394J3956j8531k334J2311j2163J7664k63N773O26l5538K4185m493
$$ 2296 -2242 -14636 -680 -19211 -21545 -9234 -21397 -3733 -3996 1777 2403 -33135 -8950 -13443
884a3443K002K0297J669j2269L226m801L1965j1415j2277K8485K943m5833r855
$$ -13443 -11441 8856 10525 -1744 1482 -3319 28646 17231 4954 33439 36382 -9451 -19306
871a9306K2643M175K4354l0303j813J4343j9502o875K0604j225k5729L2072l25
$$ -19306 3337 7512 31866 1563 -250 14093 -5409 -12284 8320 7095 -18634 13438 13113
858A3113j6872K5715j9118J657O054L126O690l8850J0359K4767K213l7195j0064
$$ 13113 -3759 21956 2838 4495 10549 13675 20365 -18485 -8126 16641 18854 -18341 -28405
845b8405P544p210L4250r279M043K9782J8036J7846m3013J039P932n2772K1917
$$ -28405 -20861 -28071 6179 -3100 943 30725 48761 66607 23594 24633 32565 -20207 1710
832A710N135l804q976j5677l0145N3817J1633J2662N239m6777o116L91K7180j3256
$$ 1710 6845 3041 -5935 -21612 -51757 2060 13693 26355 31594 -15183 -21299 -20908 6272 -6984
818f984L5474j400k5930j1503K145K0539j3739J3873J4948l071j7k0124n040m470
$$ -6984 28490 27090 1160 -10343 -8198 12341 -1398 12475 27423 24352 24335 4211 -829 -5299
804e299L4905J8669j1726l9731L3528N254j769m713l8778r292J2877J4687J965
$$ -5299 29606 48275 36549 -3182 30346 35600 33831 29118 -9660 -18952 -6075 8612 10577
791A0577K229j8124K5454l1099P225k0001k998J3918J5109P707M348k6460K918
$$ 10577 12806 -5318 20136 -10963 -3738 -23739 -26737 -12819 2290 9997 14345 -12115 -9197
778i197L6917k2369k8939j5664K5633J0279j9775L4126j4465k2631J5105J0591
$$ -9197 27720 5351 -23588 -39252 -13619 -3340 -23115 11011 -3454 -26085 -10980 -389
766c89J1934P332k1407l892R622L6490k12k3365j5137L586j2477j7792J3327j476
$$ -389 11545 18877 -2530 -6422 3200 39690 39478 16113 976 4562 -7915 -25707 -12380 -13856
752a3856K5664p607J4890j8973n973J8180J0563o474j5218J5013L392q13J2090
$$ -13856 11808 4201 19091 118 -5855 12325 22888 16414 1196 16209 19601 18788 30878
739C0878k4944j0272P78r757k9353J0075L385K6024j5826J6890j5341m483j913
$$ 30878 5934 -4338 -3560 -13317 -42670 -32595 -29210 -3186 -19012 -2122 -17463 -21946 -23859
726b3859j1764J0575L5087L2146j0586o933k7256L2576j9122l498k894p92j8042
$$ -23859 -35623 -25048 10039 42185 31599 24666 -2590 29986 10864 7366 4472 3680 -14362
713a4362O619j2522j549M721P151j5823J6901J3534j8900J1190J1993P336j7671
$$ -14362 -7743 -20265 -21814 -17093 -9942 -25765 -8864 4670 -14230 -3040 8953 16289 -1382
700a382K8869P11l0782j1982L8797O646j4701j6330K7570p633J1459k3339k4477
$$ -1382 27487 28198 -2584 -14566 24231 30877 16176 -154 27416 19783 31242 7903 -16574
687a6574J7024k2526L0379J4103q625Q878j9757r788J6727J634J3240k6747N065
$$ -16574 450 -22076 8303 22406 13781 22659 2902 -6886 9841 11475 24715 -2032 3033
674C033K0090k065j6183j9409R697M8558k6225r98k0521k1685K7837J4075J8420
$$ 3033 23123 21058 4875 -14534 -4837 43721 17496 16498 -4023 -25708 2129 16204 34624
661C4624N225o070l4975K9230j5769J9389L460p094k0576N5k0485K2715m536l0831
$$ 34624 39849 33779 -1196 28034 12265 31654 35114 28020 7444 7499 -12986 9729 5193 -25638
647b5638O572M594L1423R042j0231J3827j2095j9803K325r353M5059O87m6929
$$ -25638 -19066 -14472 16951 25993 15762 29589 17494 -2309 16 -9337 35722 36409 -10520
634a0520k4276N5208m509K3895j9440q988J4827j8642l847L0228k0748j0652K6446
$$ -10520 -34796 20412 15903 39798 20358 11370 26197 7555 3708 33936 13188 2536 28982
621B8982j2032P158N396k7179J524K0168j1366k44o25n423M046J1234j3032j0705
$$ 28982 16950 24108 29504 2325 3849 24017 12651 12407 11782 6359 10405 21639 8607 -2098
607b098J678L2599r163j9386J6064k3950J4247l3674L2566J1429J5162j3877K3477
$$ -2098 -420 32179 23016 3630 19694 -4256 9991 -23683 8883 20312 35474 21597 45074
594D5074J3601m0429k6411R316K5622k2348j8422K3020J1404N562P683q107j016
$$ 45074 58675 18246 -8165 1151 26773 4425 -13997 9023 20427 25989 33672 25565 24549
581B4549k1576L0274J0736k1113j5597K1838j6598n361O067J3215j6944k2392
$$ 24549 2973 33247 43983 22870 7273 29111 12513 7152 13219 26434 9490 -12902
569a2902N47L0255J1799j4669j7725m065m726l301n401K3334k2067L6971N998
$$ -12902 -12355 17900 29699 15030 -2695 -6760 -11486 -14787 -20188 3146 -18921 18050 24048
556B4048k711K5840k5979p393j446M9294j7022k2975N962l6722p483M82K8855
$$ 24048 21337 47177 21198 13805 12359 61653 44631 21656 27618 -9104 -16587 -16105 12750
543A2750R689j8419j0487k482r875K3980O942R37l931q160K9657J3605l3348J1027
$$ 12750 22439 4020 -6467 -8949 -18824 5156 12098 13035 9104 944 30601 44206 10858 21885
529B1885J1485J757m2479K2461L8126p570j4607l5338J8218J5418p5m041J3089
$$ 21885 33370 35127 -7352 15109 53235 45665 31058 -4280 13938 29356 29281 25240 38329
516C8329N831j8695k9698K8735M5766j4916p647l064j8972j8768m191N811L4415
$$ 38329 44160 25465 -4233 24502 70268 55352 47705 44641 25669 6901 2710 8521 42936
503D2936k4751k2011J9215j7699K4645j3041O067J4154J7337j18o458o040k7298
$$ 42936 18185 -3826 15389 -2310 22335 9294 15361 29515 46852 46734 40276 34236 6938
490F938M348K8343J2072M274k1661N640K2565m8302O494j0977k3113L1795J5039
$$ 6938 11286 39629 51701 55975 34314 39954 62519 14217 20711 9734 -13379 18416 33455
477C3455k362q15j7733j357K5207J6607k4377J321L0936J6858J772j7937l103
$$ 33455 31093 30278 12545 11188 36395 53002 28625 29946 60882 77740 79512 61575 58472
464E8472p020j2450m0093J943j1695J452L2413q454k4751K8029O227l10K0969
$$ 58472 51452 39002 -1091 852 -10843 -9391 23022 14568 -10183 17846 24073 23763 44732
451D4732J5216k8652J3438k8848L944J3791r599R098K575J9195j8398K2716J3260
$$ 44732 59948 31296 44734 15886 19830 33621 24022 33120 35695 54890 36492 59208 72468
438G2468j0761k6561l7678K6983l3373K1426M7131n317J0696k6935k0464K6995
$$ 72468 61707 35146 -2532 24451 -8922 12504 59635 54318 65014 38079 17615 44610
426D4610Q291R802l3608L100M351n770l912m107J2795J3279j1889l2136K3127
$$ 44610 52901 62703 29095 32195 36546 30776 26864 22757 35552 48831 36942 4806 27933
413B7933J4877k1266n3j3835o926N744Q526N267p558j8317K973J3661P185J2900
$$ 27933 42810 21544 21491 7656 730 6474 15000 20267 12709 -5608 -2635 11026 18211 31111
399C1111k489m632j4288J9104K461k4489N108Q124k7232J3351L190n872k775J9093
$$ 31111 28622 23990 9702 28806 31267 6778 11886 20010 -7222 6129 9319 3447 672 19765
385A9765j8564N318J3632R483l1818J7272n891O673N620q522L684K966N014q021
$$ 19765 1201 6519 20151 29634 -2184 15088 9197 15870 21490 12968 16652 19618 24632 16611
371A6611l7036P266J2484J5229pk181J1538p34p668K0216K212k1642J791K4053
$$ 16611 -20425 -13159 -675 14554 14547 12366 23904 23170 15502 35718 37930 16288 18079 42132
357D2132J9470l5686R692J3212l1720j9677K8963P641j4494N412N539l0194m730
$$ 42132 61602 25916 35608 48820 17100 -2577 26386 34027 19533 24945 30484 290 -4440
344d440M594M5664O628j1503J3196P522l6877q256K6768k0374m6268K1129K6296
$$ -4440 154 45818 52446 40943 54139 61661 24784 16528 43296 22922 -23346 -2217 24079
331B4079l4720M343P420O963M2187K2251l0779r203k5211J5115j0058J3942j1870
$$ 24079 -10641 -6298 1122 8085 50272 72523 41744 32541 7330 22445 12387 26329 14459
318A4459Q864O0484k1256l9794J2521N41K1021n775k4294J635l537K2260J896
$$ 14459 23323 83807 62551 22757 35278 35819 56840 51065 26771 28406 24869 47129 49025
305D9025j6382p254R500n209q15l1283Q81J8687j4802q159M7717R507J5452j7146
$$ 49025 32643 25389 34889 29680 28865 -2418 -1537 17150 2348 -5811 41906 51413 66865 49719
291D9719j6556R764n366Q978j4767p743j912j1860J8149L0359j2670J5790k6171
$$ 49719 33163 42927 37561 46539 31772 24029 22117 10257 28406 58765 46095 61885 35714
278C5714R549K3325l7114J3725j3026J2900M796k2415k884m041J7493o582l4058
$$ 35714 45263 68588 31474 45199 32173 45073 49869 27454 24570 20529 38022 31440 -2618
265b618J7341K1043J0212P449k6208m243L778K5612L2k2258j0323R917J3545q763
$$ -2618 14723 35766 45978 53427 27219 22976 26754 52366 52398 30140 19817 29734 43279 34516
251C4516k10k1261n577J25J8536J3680k8086j3017M839L5011J3186m1077N644
$$ 34516 34306 13045 7468 7593 26129 39809 11723 -1294 3545 38556 51742 10665 16309
238A6309K5142k8109j108L5488j4320J9162J707K8659k5172K843q560l4609p745
$$ 16309 41451 13342 12234 47722 33402 52564 54271 82930 57758 60601 52041 17432 9687
225I687K0813K1705P158n0722k2856K4673k6810J2989M3447m144j1835K4773q183
$$ 9687 30500 52205 59363 8641 -14215 10458 -16352 -3363 40084 35940 24105 48878 40695
212D0695q598j1965N086J181N956M567M96J3388L0213j322j7866l3221K6j1521
$$ 40695 32097 20132 25218 26399 32355 36922 37418 50806 81019 79697 61831 28610 28636 17115
198A7115K6099j2726k9369Q385J2893J8932K1475l713j945P895m8950L271J9609
$$ 17115 43214 30488 1119 9504 22397 41329 62804 59091 57146 65041 16091 19362 38971
185C8971J0910M075J1735j6700r344k2784Q912J4040l0127j3196K5924J8631n276
$$ 38971 49881 53956 65691 48991 39647 16863 25775 39815 9688 -3508 22416 41047 35771
172C5771k6787O363n155P823q387J7493r222j6718J6388K736J3996Q912l1083
$$ 35771 8984 15347 10192 18015 9628 27121 17899 1181 17569 20305 34301 43213 12130
159A2130J4269n018n759J7321j9419l631j6550L0367j053J0725l6767K4586M484
$$ 12130 26399 21381 15622 32943 13524 9893 -6657 23710 22657 33382 -3385 21201 25685
146B5685J4481j9942j5124l3548N091J7879K1868J9889j941j0154R327l0600k6068
$$ 25685 40166 20224 5100 -28448 -23357 -5478 16390 36279 34338 24184 33511 2911 -23157
133b3157J1015J2746K342P558j0133O217p335j1901J5213j5139J4762O059K8597
$$ -23157 -12142 604 2946 10504 371 6588 -747 -12648 2565 -12574 2188 8247 36844
120C6844k0271j5220M295j4910O683J2162O437k7005J7815k727L936Q820j624
$$ 36844 16573 1353 5648 -9262 -2579 9583 16020 -10985 6830 4103 8039 16859 15235
107A5235n2722J8755Q994J0176M1263k0388J29o962k4719j3652K5943j5018J9426
$$ 15235 -37487 -18732 -9738 438 41701 21313 21442 14480 -10239 -23891 2052 -12966 6460
94F460l310j4710L570J1870m775l471k2035k51J5538o7j3498j8326M395P382j5833
$$ 6460 3150 -11560 -7990 3880 -895 -4366 -26401 -26652 -11114 -11181 -24679 -43005 -38610 -31228 -47061
79d7061o431P080J3066L527R253k7506O511j7036J0890J1656J1140l976K149J0997
$$ -47061 -53492 -46412 -33346 -29819 -20566 -48072 -41561 -58597 -47707 -36051 -24911 -28887 -26738 -15741
65a5741j2856k8296K587K4337n807k3434K1911N805O344M189k1617j246J7673
$$ -15741 -28597 -56893 -54306 -29969 -35776 -59210 -37299 -31494 -25150 -20961 -42578 -43824 -26151
52b6151j1595r082q741N83j7263Q98N106K4700K6844j3115o93j4889J4474N057
$$ -26151 -37746 -46828 -55569 -54986 -72249 -71351 -66245 -41545 -14701 -27816 -28509 -43398 -28924 -23867
38b3867j5625j9689J5048j0980j3490j4372p965J2232N443N772o421p029K33J0918
$$ -23867 -39492 -59181 -44133 -55113 -68603 -82975 -90940 -78708 -73265 -67493 -73914 -80943 -80710 -69792
24f9792L783j9599J9404k0276J421J5541j122J1063J5261j7882j5825M0R458o009
$$ -69792 -66009 -85608 -66204 -86480 -85059 -69518 -70640 -59577 -44316 -62198 -78023 -77983 -68525 -74534
10g4534j806l473j653J9116j0023j5313K312k9092O696N799
$$ -74534 -76340 -79813 -81466 -62350 -72373 -87686 -85374 -114466 -107770 -101971
0a01971
$$ -101971
$$ Imaginary data points
##PAGE= N=2
##DATA TABLE= (X++(I..I)), XYDATA
16383b698312L6049L0501L2276M0920J9921K5785K5799J5195M0389N0808Q156
$$ -2698312 -2662263 -2631762 -2599486 -2558566 -2538645 -2512860 -2487061 -2471866 -2431477 -2380669 -2372513
16372b372513N2636K9406P918L4441L7392K4152M1639M6849K5754L1815L5778
$$ -2372513 -2319877 -2290471 -2282553 -2248112 -2210720 -2186568 -2144929 -2098080 -2072326 -2040511 -2004733
16361b004733K3812J6404L5767J3260K9867O2822L6254K5945J1070L5261K7645
$$ -2004733 -1980921 -1964517 -1928750 -1915490 -1885623 -1822801 -1786547 -1760602 -1749532 -1714271 -1686626
16350a686626K7829M3465L0729K0029K9159K0554M4042M5410K9383O743M5685
$$ -1686626 -1658797 -1615332 -1584603 -1564574 -1535415 -1514861 -1470819 -1425409 -1396026 -1389283 -1343598
16339a343598M0668P574K6830K5733M1796K4295L6190J0473K7080J2526M7016
$$ -1343598 -1302930 -1295356 -1268526 -1242793 -1200997 -1176702 -1140512 -1130039 -1102959 -1090433 -1043417
16328a043417K4605N5092M878K1250L5654K0759L5189K1777L1879K2367K0327
$$ -1043417 -1018812 -963720 -958842 -937592 -901938 -881179 -845990 -824213 -792334 -769967 -749640
16317g49640K3022L0865J4179M2458M3288M8287P483K5923M7119Q357P273K9153
$$ -749640 -726618 -695753 -681574 -639116 -595828 -547541 -540058 -514135 -467016 -458659 -451386 -422233
16305d22233M0738K6773L2971K4971K9831J0807O1743K0900r144K8143M9681J7054
$$ -422233 -381495 -354722 -321751 -296780 -266949 -256142 -194399 -173499 -182643 -154500 -104819 -87765
16293h7765j2947K8496L1301L1223M4609j4218K4143K7073K0224N9441J3697K4814
$$ -87765 -100712 -72216 -40915 -9692 34917 20699 44842 71915 92139 151580 165277 190091
$$ [...]
##END NTUPLES=NMR SPECTRUM
##END=
