##TITLE=1H_CA-9123
 CDCl3
 8 sc, 
 11.1.2024
##JCAMPDX= 6.0         $$ Bruker NMR JCAMP-DX V2.0
##DATA TYPE= NMR SPECTRUM
##DATA CLASS= NTUPLES
##ORIGIN= UXNMR, Bruker Analytische Messtechnik GmbH
##OWNER= root
$$ XWIN-NMR		Version 3.5
$$ Thu Jan 11 13:54:32 2024 Russian Standard Time (UT+4h)  she@DPX200
##.OBSERVE FREQUENCY= 200.1313
##.OBSERVE NUCLEUS= ^1H
##.ACQUISITION MODE= SIMULTANEOUS
##.ACQUISITION SCHEME= undefined
##.AVERAGES= 8
##.DIGITISER RES= 18
##SPECTROMETER/DATA SYSTEM= spect
##.PULSE SEQUENCE= zg30
##.SOLVENT NAME= CDCl3
##.SHIFT REFERENCE= (INTERNAL, CDCl3, 0, 15.5365)
##AUDIT TRAIL= $$ (NUMBER, WHEN, WHO, WHERE, WHAT)
$$ ##TITLE= Audit trail, XWIN-NMR		Version 3.5
$$ ##JCAMPDX= 5.01
$$ ##ORIGIN= Bruker BioSpin GmbH
$$ ##OWNER= she
$$ F:/spectra/data/she/nmr/H-F/1/pdata/1/auditp.txt
$$ ##AUDIT TRAIL=  $$ (NUMBER, WHEN, WHO, WHERE, WHAT)
(   1,<2024-01-11 13:52:57.65 +0400>,<she>,<DPX200>,
      <created by zg, POWCHK disabled, PULCHK disabled
       configuration hash MD5:
       00 E9 B6 7A A2 85 ED C7 34 08 36 98 17 FE 4E 26
       data hash MD5: 16K
       6D 71 0B 56 1B A1 72 2A F1 07 18 D6 C8 2A 27 D5>)
(   2,<2024-01-11 13:53:20.64 +0400>,<she>,<DPX200>,
      <Start of raw data processing
       efp BC_mod = 2 LB = 0.24 FT_mod = 6 PKNL = 1 PHC0 = -24588.25 PHC1 = 9.85273 SI = 16K 
       data hash MD5: 16K
       F4 F0 4B 5B 63 22 4E 35 0D 35 27 10 03 67 B9 E7>)
(   3,<2024-01-11 13:53:39.92 +0400>,<she>,<DPX200>,
      <pk PHC0 = -1.17875 PHC1 = -1.6 
       data hash MD5: 16K
       40 F4 D5 65 28 64 AB 68 17 39 09 13 23 CD BB 74>)
(   4,<2024-01-11 13:53:44.26 +0400>,<she>,<DPX200>,
      <abs ABSG = 5 
       data hash MD5: 16K
       8B 15 79 C8 B2 CC 20 24 C0 FA B1 20 3A 12 71 F0>)
$$ ##END=
$$ 
$$ hash MD5
$$ 4F 2F 84 C1 7F 0E 23 46 FF 94 24 86 AA 24 3C 94
##$RELAX= 
##$RELAX= 
##$RELAX= 
##$RELAX= 
##$RELAX= 
##$RELAX= 
$$ Bruker specific parameters
$$ --------------------------
##$DU= <F:/spectra>
##$EXPNO= 1
##$NAME= <H-F>
##$PROCNO= 1
##$TYPE= <nmr>
##$USER= <she>
##$AMP= (0..31)
100 100 100 100 100 100 100 100 100 100 100 100 100 100 100 100 100 100 
100 100 100 100 100 100 100 100 100 100 100 100 100 100 
##$AQSEQ= 0
##$AQ_mod= 1
##$AUNM= <au_zg>
##$AUTOPOS= <>
##$BF1= 200.13
##$BF2= 200.13
##$BF3= 200.13
##$BF4= 200.13
##$BF5= 200.13
##$BF6= 200.13
##$BF7= 200.13
##$BF8= 200.13
##$BYTORDA= 1
##$CFDGTYP= 0
##$CFRGTYP= 5
##$CHEMSTR= <none>
##$CNST= (0..31)
1 1 145 1 1 1 1 1 1 1 1 1 1 1 1 1 1 1 1 1 1 1 1 1 1 1 1 1 1 1 1 1 
##$CPDPRG= <>
##$CPDPRG1= <>
##$CPDPRG2= <>
##$CPDPRG3= <>
##$CPDPRG4= <mlev>
##$CPDPRG5= <mlev>
##$CPDPRG6= <mlev>
##$CPDPRG7= <mlev>
##$CPDPRG8= <mlev>
##$CPDPRGB= <>
##$CPDPRGT= <>
##$D= (0..31)
0 1.2 0 0 0 0 0 0 0 0.06 0 0.03 0 0 0 0 0.0002 0 0 0 0 0 0 0 0 0 0 0 0 
0 0 0 
##$DATE= 1704966777
##$DBL= (0..7)
120 120 120 120 120 120 120 120 
##$DBP= (0..7)
150 150 150 150 150 150 150 150 
##$DBP07= 0
##$DBPNAM0= <>
##$DBPNAM1= <>
##$DBPNAM2= <>
##$DBPNAM3= <>
##$DBPNAM4= <>
##$DBPNAM5= <>
$$ [...]
##$SUBNAM3= <"">
##$SUBNAM4= <"">
##$SUBNAM5= <"">
##$SUBNAM6= <"">
##$SUBNAM7= <"">
##$SUBNAM8= <"">
##$SUBNAM9= <"">
##$SW= 18.0517328524113
##$SWIBOX= (0..15)
0 0 2 0 0 0 0 0 0 0 0 0 0 0 0 0 
##$SW_h= 3612.71676300578
##$TD= 16384
##$TD0= 1
##$TE= 0
##$TE2= 300
##$TE3= 300
##$TEG= 300
##$TL= (0..7)
0 120 120 120 120 120 120 120 
##$TP= (0..7)
150 150 150 150 150 150 150 150 
##$TP07= 0
##$TPNAME0= <>
##$TPNAME1= <>
##$TPNAME2= <>
##$TPNAME3= <>
##$TPNAME4= <>
##$TPNAME5= <>
##$TPNAME6= <>
##$TPNAME7= <>
##$TPOAL= (0..7)
0.5 0.5 0.5 0.5 0.5 0.5 0.5 0.5 
##$TPOFFS= (0..7)
0 0 0 0 0 0 0 0 
##$TUNHIN= 0
##$TUNHOUT= 0
##$TUNXOUT= 0
##$USERA1= <user>
##$USERA2= <user>
##$USERA3= <user>
##$USERA4= <user>
##$USERA5= <user>
##$V9= 5
##$VALIST= <valist>
##$VCLIST= <CCCCCCCCCCCCCCC>
##$VD= 0
##$VDLIST= <DDDDDDDDDDDDDDD>
##$VPLIST= <PPPPPPPPPPPPPPP>
##$VTLIST= <TTTTTTTTTTTTTTT>
##$WBST= 1024
##$WBSW= 4
##$XGAIN= (0..3)
0 0 0 0 
##$XL= 0
##$YL= 0
##$YMAX_a= 45726
##$YMIN_a= -61122
##$ZGOPTNS= <>
##$ZL1= 120
##$ZL2= 120
##$ZL3= 120
##$ZL4= 120
##$ABSF1= 15.41084
##$ABSF2= -2.641007
##$ABSG= 5
##$ABSL= 3
##$ALPHA= 0
##$AQORDER= 0
##$ASSFAC= 0
##$ASSFACI= 0
##$ASSFACX= 0
##$ASSWID= 0
##$AUNMP= <proc_1d>
##$AZFE= 0.1
##$AZFW= 0.1
##$BCFW= 0
##$BC_mod= 2
##$BYTORDP= 0
##$COROFFS= 0
##$CY= -3
##$DATMOD= 1
##$DC= 0
##$DFILT= <>
##$DTYPP= 0
##$F1P= 0
##$F2P= 0
##$FCOR= 1
##$FTSIZE= 16384
##$FT_mod= 6
##$GAMMA= 0
##$GB= 0
##$INTBC= 1
##$INTSCL= 3.70164e-10
##$ISEN= 128
##$LB= 0.24
##$LEV0= 0
##$LPBIN= 0
##$MAXI= 10000
##$MC2= 0
##$MEAN= 0
##$ME_mod= 0
##$MI= 1.114404
##$NCOEF= 0
##$NC_proc= -9
##$NLEV= 6
##$NOISF1= 3.799351
##$NOISF2= 2.8
##$NSP= 0
##$NTH_PI= 0
##$NZP= 0
##$OFFSET= 15.53645
##$PC= 1
##$PHC0= -24589.43
##$PHC1= 8.252729
##$PH_mod= 1
##$PKNL= yes
##$PPARMOD= 0
##$PSCAL= 0
##$PSIGN= 0
##$REVERSE= no
##$SF= 200.129997049833
##$SI= 16384
##$SIGF1= 3
##$SIGF2= 2
##$SINO= 5.538805
##$SIOLD= 16384
##$SREGLST= <1H.CDCl3>
##$SSB= 0
##$STSI= 16384
##$STSR= 0
##$SW_p= 3612.71676300578
##$SYMM= 0
##$S_DEV= 0
##$TDeff= 16384
##$TDoff= 0
##$TI= <>
##$TILT= no
##$TM1= 0
##$TM2= 0
##$TOPLEV= 0
##$USERP1= <user>
##$USERP2= <user>
##$USERP3= <user>
##$USERP4= <user>
##$USERP5= <user>
##$WDW= 1
##$XDIM= 16384
##$YMAX_p= 297202331
##$YMIN_p= -2896497
$$ End of Bruker specific parameters
$$ ---------------------------------
##NTUPLES= NMR SPECTRUM
##VAR_NAME=  FREQUENCY,     SPECTRUM/REAL,   SPECTRUM/IMAG
##SYMBOL=    X,             R,               I
##VAR_TYPE=  INDEPENDENT,   DEPENDENT,       DEPENDENT
##VAR_FORM=  AFFN,          ASDF,            ASDF
##VAR_DIM=   16384,         16384,           16384
##UNITS=     HZ,            ARBITRARY UNITS, ARBITRARY UNITS
##FACTOR=    0.220516191357247, 1,           1
##FIRST=     3109.30976992454, 0,            0
##LAST=      -503.406993081244, 0,           0
##MIN=       -503.406993081244, -2896497,    0
##MAX=       3109.30976992454, 297202331,    0
$$ Real data points
##PAGE= N=1
##DATA TABLE= (X++(R..R)), XYDATA
$$ [...]
14803 91860 107792 -271814 -1106599 -1919961 -850772 -284270 -460862 -281331 122977 351460
14793 351460 -121683 -565179 -311170 -277609 211055 380813 -148571 289309 -141473 -868597
14783 -868597 -361160 -733834 -709242 -227510 78999 -408078 -273497 -133859 -387433 -881097
14773 -881097 -381299 -305848 261234 223009 374634 92172 -488216 114851 574016 675183
14763 675183 2462 173256 229763 531357 -223510 541543 218806 -225826 356250 550311
14753 550311 -397448 -981596 -764342 -408229 384065 41864 -774694 -478242 -377077 316455
14743 316455 752265 -168886 94175 160309 246878 362721 237905 197857 167915 225309
14733 225309 197997 -107774 -289349 -658437 157193 1312 553056 315197 404281 537255
14723 537255 1152761 480668 -742535 200525 -68667 249775 691441 281680 -248462
14714 -248462 -637374 86573 -71325 -442093 -610031 -887198 -825844 -418301 256609 122898
14704 122898 906963 321569 -704412 -788687 -383251 154288 -375387 159098 -44006 1470
14694 1470 -235184 -358205 -1030912 -395559 57770 -798249 -346633 -1354591 -556188 -1091858
14684 -1091858 -446885 -238769 -10169 70838 272419 529786 596714 334539 -76670 -221478
14674 -221478 737696 -243153 -529594 -503697 -28822 525397 -132666 -189286 -503919 -525058
14664 -525058 262705 82336 430871 151873 -531074 -513703 219712 512227 88329 -338235
14654 -338235 -898619 -464043 46266 -300413 -246819 24783 -129692 -951903 -87460 -659601
14644 -659601 -1027960 -648093 35329 781644 391920 610190 44726 -116218 -291856 -679841
14634 -679841 -668258 57796 -277185 191794 206482 771416 -266008 -27905 -125685 634440
14624 634440 219152 -114452 79385 126111 254764 191971 -104980 -448472 -568200 -162511
14614 -162511 -200292 -576402 -551096 -1152717 -1344449 -1300934 -2609 499356 153496 351659
14604 351659 -484290 -75615 -637829 -728394 8643 -58620 -373349 198865 -6100 295753
14594 295753 706129 -505163 -594163 -689425 -344244 -500222 163030 37049 -60275 -269156
14584 -269156 -481413 133866 72851 -699696 -200684 130874 -243369 -547827 -302233 -428798
14574 -428798 247817 -323779 -606295 -345309 -446150 -290158 79137 252170 1147124 572184
14564 572184 -8722 -507863 -482986 445398 215522 -173602 440167 319069 -645896 -17686
14554 -17686 -88102 197624 -701788 135146 176464 209853 427144 274284 482751 217617
14544 217617 141137 -202931 -461225 -216063 547971 1415112 330274 340399 133835 1170938
14534 1170938 427612 -547321 -407663 -243044 416778 374553 -125595 34247 186720 -75512
14524 -75512 760583 499471 516639 316862 22131 -270113 -190463 404088 928821 567707
14514 567707 1009098 544640 319874 250361 -156979 94452 -63444 353080 -209268 -956011
14504 -956011 -275862 429163 810644 674802 28570 -649451 -477994 -174270 165516 -407323
14494 -407323 -962084 -998174 -349601 22075 394990 303135 -447869 -108492 -261586 -797730
14484 -797730 -664763 -1001811 -668778 -750022 -57434 -440 -566596 -453395 172701 336067
14474 336067 -580385 -1043965 -198455 -428807 -498442 -245931 -851972 -306613 -603509 -385213
14464 -385213 -335822 -21156 185352 695893 800395 261407 279885 514740 175391 942274
14454 942274 804598 268982 401708 187844 211529 805899 1005914 757372 577100 56247
14444 56247 -184109 -515938 -203807 -134269 -133065 -363735 310180 521936 122788 -27899
14434 -27899 -195504 -475386 335356 348150 -60362 -93248 -18961 -62250 -182587 253551
14424 253551 878665 26201 -845683 -973586 -112229 -24705 263747 242356 142740 579033
14414 579033 147135 -367700 -537520 63854 -14233 -818180 -1022736 23497 171304 387973
14404 387973 47527 213935 266366 37311 293708 296872 -412238 -130741 102723 -419439
14394 -419439 -496341 -796046 -823500 -382956 375913 998901 293938 -614159 2143 -206500
14384 -206500 -650212 -937810 -1097312 -470592 501630 832699 451065 608976 224528 -759396
14374 -759396 -914759 198996 -253943 -706112 -391606 -713746 -783520 -424553 -318469 -538738
14364 -538738 -445333 628303 807296 -118516 -99637 -248054 -305736 -197876 -553696 -360886
14354 -360886 111346 -198383 -563805 -522451 -807209 -856197 72274 42203 44144 342091
14344 342091 -267058 51403 216155 702466 246611 220352 -129180 -544728 -369214 -881567
14334 -881567 -945169 -829212 -247905 -379595 -914457 -789823 225418 588407 -154720 -125857
14324 -125857 299992 370623 -168213 -919875 -747192 -1204744 -598821 377687 -216951 -390422
14314 -390422 -298888 506381 691640 252276 -282676 -965391 -715007 68975 -351616 -536274
14304 -536274 -29346 267695 -49674 -219137 632917 569234 -1036 501032 482171 3682
14294 3682 -121926 434235 -105066 -530991 476801 663641 656184 342092 12514 161404
14284 161404 789328 364750 -471100 -61960 -492090 -1045680 -394246 148725 47969 557234
14274 557234 10637 -1125853 -956002 -320656 -246095 -396427 -174349 -73211 -541199 -136975
14264 -136975 302539 -332512 -210235 -649757 -490106 -211493 -75669 -498835 -615901 383368
14254 383368 480885 255101 -536390 -1138698 -807163 -180663 -283413 -486809 -534690 -890787
14244 -890787 -815416 -414940 -508361 -649628 -773292 -1674577 -1197032 -99244 771575 1021814
14234 1021814 316771 468215 248472 178605 701974 -632729 -1112603 -1677695 -741076
14225 -741076 -468341 -303318 -162035 -72374 -499189 110832 635966 -491579 -785664 19469
14215 19469 1075714 422951 -997126 -1390620 -1090382 -356918 -98344 -128274 -190676 -1195075
14205 -1195075 -859622 -604378 193980 -134180 328599 242066 -106617 -87438 -255286 119110
14195 119110 146669 98526 356227 350274 -589256 -959772 -137905 731072 903366 421043
14185 421043 -121140 311724 -709051 354091 470266 625141 -303914 -257085 423299
14176 423299 520787 827062 617168 470981 -132066 -145143 -718330 -387400 -55355 461506
14166 461506 124537 379479 123079 3113 -447734 -67825 275115 611883 513416 -243818
14156 -243818 -278670 -124406 177447 181789 -87988 -41739 -163839 -478495 -47149 -436516
14146 -436516 -14227 -210410 -335882 -594970 -970911 -951455 -1343608 -274755 -88961 127785
14136 127785 -508845 -715986 -904170 -1734225 -689963 138096 -17786 826093 110614
14127 110614 240947 419892 -580545 -687171 -850931 -1066187 -809761 -232054 240719
14118 240719 54674 420043 417588 248985 802813 316103 -364667 -491945 -708293 -850833
14108 -850833 107236 903282 777752 876143 340986 -237027 296877 68892 -253394 -558082
14098 -558082 -268496 414345 496376 796201 613430 -153887 5637 174010 347758 -174016
14088 -174016 -388396 -909677 -754632 -348958 -375117 384683 -357927 -750693 -385856 -90450
14078 -90450 -292566 4956 641067 904824 620072 299353 -478779 171618 391311 -32415
14068 -32415 -17195 -363599 -930108 -741262 -96815 723407 42270 -394245 -283416 -343617
14058 -343617 229067 355821 419460 -635229 -612423 145791 -512060 -823163 -1095043 -811210
14048 -811210 -965966 -235315 598851 965709 74695 57627 -274410 -545934 172287 -112289
14038 -112289 302997 -241039 59142 62275 100992 -426851 -99390 -155595 28806 11603
14028 11603 73190 -814405 -242182 -35813 -343395 184281 417613 683790 584517 -203322
14018 -203322 -74587 132837 -11811 -1216656 -909599 -517101 -290623 -36293 38216 -813307
14008 -813307 -419533 -74895 -422200 381210 1025265 1016510 -169983 -578610 -112523 92787
13998 92787 -9588 -132799 183752 269231 191558 595509 -170564 -483341 -50652 -278705
13988 -278705 -421183 -30839 -135810 -216810 -687990 -924237 -364631 -3005 -1094801 -1035551
13978 -1035551 -394817 309210 485692 114945 -500939 -229081 305978 1125261 1088741 793587
13968 793587 65905 -440371 762217 455352 1198725 1225588 -242339 -418409 83383
13959 83383 575007 -123401 -998845 -1028387 -132433 180980 -609837 -168973 -316570 468935
13949 468935 739174 92035 -90402 -205962 32820 275789 -207881 8373 451409 -168981
13939 -168981 402517 443545 519894 383377 -263561 -506530 -426925 -1257806 -238426 224197
13929 224197 121279 -329134 33112 -190285 -460716 -1120773 -778755 -611999 -610166 525594
13919 525594 78043 -231106 -338734 -486104 -675449 -1012494 -608335 -396010 -158033 -9688
13909 -9688 -4459 399085 648026 328667 2515 367241 -496169 -914129 -178247 -36751
13899 -36751 320150 354796 144561 -87240 112974 591761 200200 -619238 -743346 -675732
13889 -675732 -1025478 -172486 -54935 -128156 -443250 -392319 -226571 140921 132473 209875
13879 209875 -162350 -333001 180928 -138287 -9374 -86413 178285 246270 -250928 -103725
13869 -103725 547171 135553 210487 -880087 -552816 731123 338858 255324 207963 486446
13859 486446 601500 68184 -178299 563094 624082 699410 839927 292513 -101333 301884
13849 301884 -348750 -103796 17044 -34308 186891 10211 472439 1028236 161035 -709973
13839 -709973 178217 195601 -67891 -399237 -752873 175787 -6708 -708014 -59440 2066
13829 2066 160147 70168 -150628 41275 -66464 -438507 -781398 67912 -656289 -273827
13819 -273827 22334 -446593 -129315 411640 626421 107292 -121612 19148 646561 1116818
13809 1116818 -83162 -968969 -590321 -129909 474991 359502 -130310 -81131 358463
13800 358463 183094 -44903 138514 45294 -67634 121984 -425176 -379036 196592 391323
13790 391323 353759 -423606 -508184 69610 965357 503663 -1061766 -899466 506663 236549
13780 236549 -634046 -690859 119966 -707080 -658864 309356 461558 -171920 -78629 485768
13770 485768 495801 -80229 -172949 -289492 344359 683847 916295 1287122 711492 1108401
13760 1108401 -304688 -355268 -642429 -1236001 -1181749 -733270 -913382 1009 -214104 -10360
13750 -10360 998408 1248778 -290730 203770 -179560 39966 750524 230384 -37886
13741 -37886 183578 317555 133007 387226 -1213266 -758501 -580643 -152898 250071 676422
13731 676422 -413980 -639207 -250599 20311 -681284 -297920 436865 327371 -485517
13722 -485517 -617381 -681477 -910517 -993517 -1387029 -525160 41588 218216 -540483 -588738
13712 -588738 -852093 -1497436 -557339 -59932 -761109 -17796 -659943 185051 104793 -526053
13702 -526053 -476512 -759961 50896 527772 -91529 82026 -286177 -409226 -252564 -516978
13692 -516978 -655864 -809023 455070 1061184 12192 -944225 -475858 439576 33183
13683 33183 83858 155200 161696 224016 198463 -73532 -1098533 -210903 274947 -394699 -396191
13672 -396191 -217553 -930289 -550561 -169193 -795072 -1339584 -648217 -515482 -94003 424221
13662 424221 454043 143933 -391658 -197291 124559 -25677 -816542 -1588383 -670120 -742714
13652 -742714 -916013 -4102 -499179 -163984 68871 -331528 -749370 -861791 -352839 -587187
13642 -587187 -455267 -57454 358306 449257 259281 87688 264646 23900 405333 1030537
13632 1030537 152851 561456 -150078 -361046 -692097 -552159 -706268 -916814 398331
13623 398331 1202724 892067 632841 1080013 330288 78274 145818 -36454 -232657 -639961
13613 -639961 -283079 447353 -33580 -260985 -225139 113585 -184618 -539101 -400498 -381128
13603 -381128 -282295 -562763 151833 -104204 -353780 -586236 94947 -403116 -985663 -415184
13593 -415184 -395765 -694890 -477947 -554674 -415533 -669029 -60300 439881 31364 -18914
13583 -18914 -62326 -291014 -266158 -741903 -1044835 -442451 -8756 1150444 -384516 33685
13573 33685 -194799 -459121 -36389 249341 -247213 -461410 -328387 -943278 -619512 -113814
13563 -113814 554272 919654 18825 802409 1130863 -319189 -1238558 -11798 514737
13554 514737 -280402 -349067 -2245 -538454 -397878 -1073964 -609407 442697 86214 -421467
13544 -421467 -608039 -661134 -623591 -786402 -1113163 -494243 -224971 234677 -2999 347896
13534 347896 -63501 -502546 5716 -589588 -404148 249870 -675743 -955382 -1132488 -178877
13524 -178877 825622 242197 -58714 662695 -31254 -54079 -247998 -646514 -240907 256443
13514 256443 -43066 -262033 338490 422519 598010 -419968 -537659 -484330 -458120 -250523
13504 -250523 -521816 -941571 -864086 80071 920009 617648 -126403 -316567 -407111 65677
13494 65677 382765 860806 151956 -85743 -25693 -44239 -112481 -827691 -617489 -547258
13484 -547258 133979 422263 -534478 -643433 -386030 -104350 -524848 -190602 403921 401185
13474 401185 196643 644165 658863 626565 -180144 -645853 -428344 -142324 719658 859071
13464 859071 -119131 -713679 -364015 -342345 -533825 -184564 165245 95064 -904334 -892259
13454 -892259 151815 170217 -26737 637462 848466 216973 -350158 -519948 -704030 -623075
13444 -623075 -779835 -467752 159975 -114151 -1212133 -454998 -342009 -541674 55679
13435 55679 202992 267760 265657 -95521 -1158197 -896149 -172191 576358 1148558 381485
13425 381485 -164838 -492108 -210828 -325940 -1056237 -879358 -846900 -178722 -157370 149916
13415 149916 -863863 -1094264 -438998 12344 406902 593118 239933 641560 -819989
13406 -819989 -1604129 -686110 -633076 -171951 -552246 211801 829632 -207350 -902731 -378425
13396 -378425 764436 351531 -414990 415065 493552 994748 1234813 6643 141558
13387 141558 -43537 -269519 -313991 -614982 -335279 470627 1331395 1203527 942146 862051
13377 862051 221651 399049 201207 127576 -379421 -12572 349604 325144 193161 -111769
13367 -111769 -304299 -145769 -760692 -125167 369936 430239 60340 805218 418959 392334
13357 392334 -387299 -769013 -325124 -438778 -735114 -1239450 -641526 -663710 -84104 117767
13347 117767 -479647 -552333 409799 49791 -217226 -138046 -203227 -259560 -111214 411203
13337 411203 519965 -477009 -421190 295230 227030 205165 715167 800041 26121 438464
13327 438464 892942 563107 941933 456871 -281782 -905487 -241802 -665205 -239873 -882621
13317 -882621 -176191 272288 -316619 -796353 -317760 313165 123875 390533 390086 30378
13307 30378 -796213 -20937 617521 -424714 -832207 -851216 -179585 -256696 97746 588116
13297 588116 -254334 -831722 -535808 -237946 761430 739452 632307 743754 1384764 1351188
13287 1351188 817779 181000 -247331 -91624 335360 521492 1063790 1008010 484873 474906
13277 474906 819646 163814 -245392 145489 115203 288389 328145 826348 857824 535793
13267 535793 563210 510867 622710 330428 170582 859312 841078 607386 -58454 -466404
13257 -466404 -193318 -2082 -280973 51021 -907948 -335486 -154995 -58521 -460197 -1252949
13247 -1252949 -1206163 -65964 -153053 -734222 -546482 -90581 345433 1164596 613647 53049
13237 53049 426275 -34274 312416 219524 446062 571049 107674 517657 137912 325436
13227 325436 399883 767773 161991 45589 -284478 231699 -268626 -58557 -341128 -1170230
13217 -1170230 -68400 226156 -223822 -201958 -73264 -320690 -538954 587517 -97109
13208 -97109 -521037 -473301 -1099987 -968051 -446251 -605149 -543624 -591347 -838613 -221955
13198 -221955 -1264385 -643384 166047 293818 -894021 358537 661921 -122416 -256465
13189 -256465 618135 208101 -95929 -749784 -74929 -326617 408526 747571 -287718
13180 -287718 31229 216687 555321 386678 -284232 -287253 741779 712723 219750 -16847
13170 -16847 -46040 -108 -365794 -882902 -22722 161504 -20732 -219428 -149941 -129764
13160 -129764 -116973 -413228 -2121527 -1534907 -979322 -61778 -64245 -800414 -449604 -171515
13150 -171515 -446475 -654132 -362132 -154621 108904 193458 638027 221483 585672 183056
13140 183056 484201 231140 264961 116122 121374 557929 1136439 922117 349942 131357
13130 131357 248641 44046 -29575 106142 614552 255198 -223620 -108330 -487467 73210
13120 73210 -168259 577830 355925 -995011 -790256 324861 -641729 -762570 -469489
13111 -469489 -515291 778306 609867 -276654 427572 21758 -276686 -10107 -256284 -155073
13101 -155073 237694 557483 165342 -25300 -247421 465432 188064 -12933 686714 93668
13091 93668 -669537 -748996 -676486 257938 102826 -384733 287321 -835525 -764775 -89663
13081 -89663 -266488 -654631 -331060 -1143920 -1018291 -205058 244560 431255 -106724 -251674
13071 -251674 -157301 124784 256072 -203321 -326462 336825 406050 -199224 -4312 10201
13061 10201 -487593 -55768 217639 528276 258064 851867 -635349 -290345 691876 154370
13051 154370 22919 214559 981463 700315 348613 -467324 -45238 -248248 -887942 289514
13041 289514 570272 1070421 485719 592049 -59421 906127 331978 -121358 189133 43563
13031 43563 824722 151499 -893487 -801948 -13464 237406 -192117 -540480 -366015 77035
13021 77035 433487 524402 437864 260467 311978 -35743 -343965 -749384 287854 272620
13011 272620 1040377 955219 522092 542253 337267 -559288 130021 47630 439868 133321
13001 133321 -538613 -444131 -1048926 -724111 -406619 18520 394117 218234 199920 -724427
12991 -724427 -1454517 -861452 -393630 -934315 -754891 -215223 348941 636136 308781 23590
12981 23590 -262580 -349954 854716 1343940 308318 392090 -355868 -236684 397586 275597
12971 275597 -654675 -760625 -804318 -227590 -398110 -1450350 -1303997 -1146770 -429803 -420038
12961 -420038 -679228 -1245878 -158205 -895670 -273819 358395 -390528 -580005 -230965
12952 -230965 449351 407437 718749 398358 19427 -451580 -134514 -260293 362957 -291076
12942 -291076 130209 -257883 198720 83416 150062 969266 424208 -482373 -786614 46245
12932 46245 -822271 -615970 -137907 -67135 -317468 -1015516 -459785 -485292 -294393 252713
12922 252713 -716850 -1220257 -961568 -1116703 -674109 -453881 -759178 -723693 -943213 -1287455
12912 -1287455 -641953 -614907 -292908 -348819 -282327 327019 172693 -441271 363625 479962
12902 479962 1241752 1194964 411636 437608 228937 -212246 70932 -269121 135673 160152
12892 160152 -133383 456476 195884 -379774 -336930 332414 -142218 576214 -24811 -235266
12882 -235266 343284 364117 359101 167758 125964 -256448 -605367 381200 -114538 -391952
12872 -391952 -902138 -566759 143412 34332 642067 732920 456936 -443761 -466797 -525974
12862 -525974 -470070 -593542 -723865 1038058 898405 -943115 -1379639 -1365292 -863665 -528767
12852 -528767 -678885 -537817 -741835 301745 -75783 -383263 -839359 -190203 648510
12843 648510 412937 110443 -18789 593840 873227 -319781 400984 702894 -121486
12834 -121486 -1433505 -887838 -104163 -184557 192003 -98408 136823 -19941 174036 -413233
12824 -413233 -1017381 -354042 444512 622820 477802 561656 848135 633947 371598 599176
12814 599176 1000069 2112 -718184 -108657 -666852 -707523 -566657 -563870 -816184 -291380
12804 -291380 176298 159651 227932 -105068 938182 292473 50924 294865 651682 -50819
12794 -50819 -45065 279343 -86418 346123 372781 -70927 497823 347793 340916 286529 -186630
12783 -186630 205890 865696 226499 204897 150937 346674 56314 -136402 273569 -751477
12773 -751477 -1069583 -489556 -118168 697485 1011406 836745 312270 -143352 -836466 -790930
12763 -790930 71072 600589 376972 102569 179269 -68687 54820 -505185 -571379 -1020103
12753 -1020103 -965220 22257 123798 156624 -904227 -952957 464435 -512993 -554378 -177037
12743 -177037 -604741 369773 373131 313821 129325 236260 620568 261787 -277595 120802
12733 120802 578147 629264 818681 657508 449664 388240 -30577 -162872 -931672 -1159393
12723 -1159393 -689869 -391183 -169754 -425455 -153028 -127767 221720 228078 -1426424 -1459715
12713 -1459715 -262275 -349251 -523436 -96516 686244 134939 -43584 -830323 -923901 -235243
12703 -235243 -479290 -18249 198727 -266775 -290545 98152 90852 -360405 420158 315924
12693 315924 252569 776778 157552 2125 227454 -902869 184574 230597 -978798
12684 -978798 -1252859 -1295332 -1080405 -654533 -531759 265027 836301 405906 114657 -272144
12674 -272144 -503134 -1216734 -899951 32279 11893 -605635 -335510 -122580 -222294 -241966
12664 -241966 243433 374552 -191551 -47324 -41925 -312399 -576503 -505137 553810 494635
12654 494635 -78397 -178973 -178463 -75137 808180 698212 562187 748643 219424 -44906
12644 -44906 -25840 191873 -15104 -303137 -209281 -59915 -800661 -1219828 -440670 394114
12634 394114 -418606 -320843 -169780 4898 -494654 290570 429437 -129540 -854317 -637367
12624 -637367 -54133 -987509 -844067 -284688 302689 369321 854435 1271964 1105491 76101
12614 76101 -14486 628433 734578 890755 740954 -141016 -691158 -440996 -586897 -13454
12604 -13454 212061 539175 36433 -439514 180124 180495 549221 582133 -54677 -371530
12594 -371530 457508 -41049 -71046 -190587 -24810 -109302 672416 473456 427421 639832
12584 639832 46876 -1113136 -722576 -821533 -628252 294305 662493 232397 564111 1039927
12574 1039927 990718 606427 -130403 158253 -67832 145246 -428727 -696417 -812079 -663978
12564 -663978 -1311583 -679201 230050 -137247 -388408 -602888 194619 -100841 -181517 187318
12554 187318 83914 53744 -1006848 -1256750 -708380 -165512 -193978 468007 852784 158086
12544 158086 -572513 -53609 -677464 -419057 -222409 -517192 479273 -476990 -434008 -280901
12534 -280901 -338345 -693799 -168680 476462 1061228 450049 14618 -265961 -480724 -160817
12524 -160817 334416 69247 44303 -63502 -317046 464152 884153 501699 291816 -612918
12514 -612918 -781447 -1173508 -652492 121911 -211968 -752517 -263785 417900 -920264
12505 -920264 -808818 -1231583 -732021 -494466 20066 -440543 -602089 -599004 -620480 98713
12495 98713 -288758 -521429 338267 763276 1222643 443992 -185736 -203682 320401 153836
12485 153836 26302 336708 42887 -403707 -1210757 -923415 530137 -475309 249502
12476 249502 -181444 -995769 -849949 -904194 -1002827 -1162516 -1343738 -588770 142915 -679845
12466 -679845 -568132 -10694 141291 -161631 235244 692436 786964 102255 5195 -42464
12456 -42464 356440 468127 29761 280541 660409 56103 -449944 -310639 -213149 144950
12446 144950 -217907 -142159 -197354 -282175 -1000272 -613918 571847 452345 654788 251101
12436 251101 202429 553245 -84147 -595860 92042 -345029 -153975 -39149 -37972 -286365
12426 -286365 221141 -106966 486231 -74677 -746618 -456810 -697326 604343 517466 89156
12416 89156 -237722 -1100835 -271054 218673 -339905 -296050 817428 -151624 -442560 -246088
12406 -246088 -465241 222773 714231 604379 670517 1309732 205571 -403872 -192079 -258014
12396 -258014 -857481 -793968 319893 -453591 -114233 350433 -408680 -350765 -1095039 -787510
12386 -787510 -846556 -1545654 -735714 -473515 -800878 45171 -3796 -353276 -268605 298511
12376 298511 141012 -152823 -1170986 -990480 -328027 138108 1137423 807367 198133
12367 198133 -1075754 -296473 -182045 -765310 64424 313262 -177143 -464005 231586
12358 231586 176908 -203542 -499590 -297344 -465226 -418787 325137 286730 245205 -715393
12348 -715393 -598221 148674 66152 -591572 -673472 -881872 -763055 -604316 -236304 289858
12338 289858 661022 520170 465288 -114970 -435468 -236782 -77696 403342 -160735 -257811
12328 -257811 -327905 -246622 566431 956566 -59876 23262 -65954 665474 1014152 105149
12318 105149 -182409 -79910 603531 387294 -94843 381402 646234 663109 100720 -633303
12308 -633303 -133836 -65901 -140396 613457 206613 840693 594208 -129740 236393 831721
12298 831721 91751 -1010192 -74650 23286 -309394 -457573 -93248 -204345 -407842 -342411
12288 -342411 -884357 84382 -197563 -695015 340668 560027 -260797 -94630 645153
12279 645153 580544 -45492 -614891 -357962 143980 457915 -210859 -179316 221086 157251
12269 157251 504298 219689 78638 267295 660825 129965 -586869 -378163 786420
12260 786420 1222098 784925 1386274 1056356 -284981 -878402 -542778 88677 316965
12251 316965 1844327 1229544 254507 -15577 -152375 -193309 -663303 705570 281183
12242 281183 138060 -88369 -89312 59768 692883 559391 166348 -80601 30586 -23788
12232 -23788 -411066 -69176 573810 1227263 22662 232566 498490 583431 237803 -173441
12222 -173441 -207355 617968 282220 547589 817589 -96050 -66843 -334436 -77952 -927350
12212 -927350 -692847 -224133 109556 125807 529078 262259 410907 556289 -217338 406061
12202 406061 714232 461706 454850 -246203 -480607 109566 151788 -124525 496268 496582 331922
12191 331922 735652 -176934 -358020 317933 -156086 144723 381618 1141820 910007 592369
12181 592369 656971 -264371 269884 117053 -395650 -90206 -753887 -67390 -395371 -545610
12171 -545610 -171297 -263741 183073 170142 366191 100432 854173 138731 13998 157096
12161 157096 73202 958 -95600 -98688 732332 727034 419108 99016 8233 -28173 -997169
12150 -997169 -847391 -1149843 -1003558 -495318 -556472 -296154 -326499 344491 378298 -683791
12140 -683791 -165340 -958488 -898472 -175110 -337747 -19097 396610 967616 614458 397845
12130 397845 715479 1327132 859949 887946 898959 58318 295591 504540 483703 696878
12120 696878 1022356 1214207 204469 144212 675212 1142674 861734 832546 559777 361258
12110 361258 -447931 -1093158 -617661 -571813 -137804 110130 218715 -787301 -840706 -809094
12100 -809094 -407381 -48444 214217 -132015 -622806 -616104 -625223 -732545 -626024 -1081169
12090 -1081169 -915082 -658893 -476396 253456 -157654 -195065 -411274 -11543 -139513 -260505
12080 -260505 -125618 -551329 -1150085 195954 586304 212911 246935 -43471 -615234 90727
12070 90727 332165 -153691 506755 -110526 737625 1059985 476237 379083 359826 -321688
12060 -321688 -70922 -550398 -313773 1425717 1266888 806915 1126715 1490039 453729
12051 453729 -243092 -24099 295281 325491 555381 776570 9104 -856994 -855157 -436202
12041 -436202 -1064441 -80284 358727 -180575 -357379 -390004 -182114 187537 96687 419675
12031 419675 244440 881883 464069 -297429 213016 213079 810966 1428985 709299 -103981
12021 -103981 20100 -352645 -122215 230668 -175749 -665326 -471522 -150877 -382857 129878
12011 129878 495371 20022 16957 169674 545206 1296886 1219210 957514 800853 -114168
12001 -114168 38669 19608 -264860 -409973 -70467 -26399 444785 -433250 -829477 -696782
11991 -696782 -354384 -437135 -695850 -958981 -776649 -424184 253303 -600816 -742242 140244
11981 140244 671082 398576 -323177 -29310 616015 1321362 927075 748168 850927 725281
11971 725281 315158 81721 -1159314 -460285 -76933 -452912 -416973 111480 189983 -569482
11961 -569482 276779 261316 -311956 -210521 262784 -102591 -154217 -674864 -820762 -8035
11951 -8035 -167886 82515 -232639 -1103518 -734623 -473111 -289300 -197031 -83622 60472
11941 60472 566229 -136998 -397335 318576 366513 844304 93905 714600 1156354 150717
11931 150717 -362165 -1020344 -748352 -382736 -525099 261832 13390 77713 113083 -327993
11921 -327993 183294 -239668 -467374 609083 518589 -106035 -1174056 -108017 -197729
11912 -197729 -35999 560811 6421 81299 502070 541358 500589 -311569 -469371 -523702
11902 -523702 -615844 -654635 -807218 -478781 -7219 654356 745607 1052680 1170294 618218
11892 618218 759358 72693 -87625 -208991 194102 357105 365178 1123652 1429880 919348
11882 919348 -129931 -123766 -78394 13960 604805 1166519 575961 186918 -195420 427161
11872 427161 171946 305195 578063 994290 853265 1405139 1633180 589272 281938
11863 281938 580071 895432 1008957 970492 550059 -386864 -366335 806606 639637 508452
11853 508452 -73404 170320 6609 -94998 203861 120151 288741 358060 618937 667599
11843 667599 1461694 407986 -76252 432564 605006 1406459 688182 131772 37226 341029
11833 341029 799461 17513 166613 398188 778769 632531 9484 -283056 419050 535330
11823 535330 161686 945445 962351 -207107 -223633 42803 -86925 -7563 -212963 -762566
11813 -762566 288976 -34152 -114031 293546 299832 252311 -119856 -380859 -18684 -183561
11803 -183561 -200493 -326344 60493 553950 1077967 895884 477572 414289 -355 -15118
11793 -15118 269771 1008667 1135964 504843 192263 814172 333222 52563 842438 1143974
11783 1143974 673674 235418 370069 943768 1209262 1392009 544315 756695 975063
11774 975063 707141 685690 582162 364175 -471455 -700114 -402630 11027 894136 521904
11764 521904 627638 566640 1129620 804999 323095 -686540 -42101 123020 -60862 290365
11754 290365 -177899 552527 982752 902633 167397 -254062 219804 2642 122708 196262
11744 196262 776317 717832 660746 378435 340847 960867 443499 515495 942558 710916
11734 710916 761394 694317 780683 448903 1058642 1391550 1673340 829891 134864 938312
11724 938312 716649 453829 516266 1008793 854051 743083 -552157 -66715 48206 329183
11714 329183 242120 408938 1017814 750981 399776 -195235 198949 407241 1066448 1560022
11704 1560022 760783 200588 -124980 210484 823358 774855 912084 573502 23025 450330
11694 450330 773658 1674616 1393816 563321 374836 677771 189764 -205811 500871 842149
11684 842149 961284 731939 348351 769958 1049769 1145540 1030816 789753 23603 -64101
11674 -64101 205883 -18351 171815 818510 -262958 -817990 322571 884627 -194427
11665 -194427 199836 1408889 1172048 981302 623862 -117213 -171827 497886 947839 1346689
11655 1346689 1021243 659227 69364 589791 1136790 973163 1319113 881154 315893
11646 315893 482597 312200 201192 836452 1192093 286654 575247 811936 1048778 814049
11636 814049 98300 386266 1132288 890198 1005481 849084 963888 1507736 1830691 1872381
11626 1872381 1386078 1883188 1550041 601211 155422 -34214 808999 930621 1021961 822451
11616 822451 167715 643452 973445 1810735 2198712 1072842 169474 -221034 820261
11607 820261 1410692 1341820 1566171 721302 320556 1898910 1520502 1478271 2331003 1867023
11597 1867023 1465812 997969 1249089 1353838 1817122 1405420 1613725 2203611 2088587
11588 2088587 1273600 727721 1628401 2330428 1154864 1458290 1577756 229092 312459
11579 312459 -25988 687709 1672857 2064118 1649678 1445345 1816416 1883996 2604111 1570431
11569 1570431 761091 896058 1639964 2104137 1901014 2121745 1184997 903184 921682 1985935
11559 1985935 2093580 1768753 2148542 2103185 1814935 1486316 1806970 1787835 2228031 1743861
11549 1743861 1580717 1667454 2188532 2085122 1288604 1453016 1433751 965292 2204025 2725905
11539 2725905 2631872 2527169 2234758 2218755 2756517 2984806 2276711 2013536 2453062 1704621
11529 1704621 1416528 1640730 2228179 2452207 1918403 1865892 1763513 2235100 2395315 2245410
11519 2245410 2535607 2397554 2329505 1981886 2314037 2494999 2808369 2829436 2582583 3081605
11509 3081605 2021573 2422140 2466735 2519677 2936423 2717884 1822950 2425717 2615707 2442771
11499 2442771 2108975 2207643 2033252 2698517 2948582 2689833 2295076 2599960 3654793
11490 3654793 2744165 2775010 3159828 2836829 2574697 2809810 3200767 2794319 3132007 3150481
11480 3150481 2767280 3175095 2815228 3633236 3807703 3073158 2983987 3447723 3600140 2850265
11470 2850265 2312138 2909948 4015261 3781614 3860507 4365337 4491374 4520231 4291961 3532003
11460 3532003 3306192 4018840 4042334 4165952 4286301 4498712 4559889 4302152 4667439 5324122
11450 5324122 5378946 4334213 4205861 4992799 4750247 4507036 4701448 4273843 4637308
11441 4637308 4908359 5200399 5246529 5620661 6063979 5247058 5394762 6864131 6595681
11432 6595681 6173381 5989279 5957009 7176958 7403330 7242921 6708901 6403742 6609601
11423 6609601 7298742 7497400 7751009 7088711 7489218 7839573 7729662 8589764 8028262
11414 8028262 7704395 8649750 8772821 8409557 8534942 8835314 9157069 9996267 10204938
11405 10204938 10139344 11102434 11451618 10618656 11013365 11045972 10986785 11419279 11410850 12407272
11395 12407272 12581375 13389113 13007584 13264878 13646111 13779855 15022246 14531409 14665643
11386 14665643 14785601 15610390 15799356 14871197 14862610 15854784 17744955 18163083 18155783 17784465
11376 17784465 19261968 20047334 20741751 20613315 19891973 20674453 21607255 22941878 23348083
11367 23348083 24040767 24056362 25241223 26117582 27169854 27812659 28680261 28131254 28289006
11358 28289006 29248689 30027706 30811027 32346769 33094495 34057428 35485788 35892446 36499767
11349 36499767 37302228 39375419 40571017 42168021 43184061 44315320 46837743 47124676
11341 47124676 48364745 50096322 52146840 54523623 56293684 57976367 59749522 61813225
11333 61813225 63332432 65951105 67236961 69045898 71793978 73581246 75367324 77366362
11325 77366362 79412715 80866187 82114926 83590221 84695272 85483186 85040197 86096746
11317 86096746 86353577 86373135 85595377 84522992 83309819 81982441 80847777 79856084 78972763
11308 78972763 77169146 74050564 71664933 70613970 67894525 65563702 63919407 61485284
11300 61485284 59817852 57843081 55755799 53649167 51533239 49404112 47474765 46512791
11292 46512791 45459042 43520060 41803099 39908980 38248043 36459025 35950476 35959663 34388412
11283 34388412 33481155 32261756 30632099 29108994 28104070 27374634 26833488 25681207
11275 25681207 25022807 24030678 23123877 22399846 21523410 21920181 21092788 20568066 20028628
11266 20028628 18950548 18743956 18216693 17529215 17450998 16704590 15144483 15007274 13628207
11257 13628207 14439153 14784911 14091001 13523338 13340748 13600560 13384885 12449161 12091338
11248 12091338 11510002 11321427 11835476 11803370 11262513 10514445 10019007 9493811 10905581
11239 10905581 10327225 9026598 9175375 8763576 9096543 9202051 8589591 9245151 8479583
11230 8479583 7880344 7446635 7416288 7292507 6930650 7564210 6922481 6154524 6416104 5662256
11220 5662256 5598334 5937564 6347976 7232948 6589499 6563411 6284618 5955419 5535460 5553569
11210 5553569 5444230 4615057 4723476 5281535 5218959 5154413 5055876 5035449 5407977 5487031
11200 5487031 5388397 4513296 5062835 5317881 5498945 4357648 4142941 4769988 4928491
11191 4928491 4275013 3827323 4068673 4996845 4984526 4557770 4501484 4596442 3642136 3620395
11181 3620395 3748982 3016366 2828059 2881279 3885256 3656166 3639729 3285228 2564062 2716806
11171 2716806 2378743 2696154 3400306 3081690 3511033 3564917 3591701 3143456 2489266 2548302
11161 2548302 3239977 3022683 2784035 3026087 3291564 3046121 2941958 2978178 2426786 2133255
11151 2133255 2008488 2143141 2749317 2308049 1890220 2534824 2433865 2447311 2959510 2719690
11141 2719690 3168490 3558304 3405232 2363821 1938830 1779924 2349214 2091892 1837465
11132 1837465 1597135 1836686 2411453 2648028 2791525 3297063 3136210 2535412 2057348
11123 2057348 2082820 1514645 1573741 2127742 2821840 1961182 2270379 2779209 3002463 2813668
11113 2813668 2202032 2160277 1769129 2337563 2220602 2176410 1856690 2060713 2150648 1705050
11103 1705050 1581439 1566202 2537299 2374886 2284242 1518525 1353295 2780330 2207530 2572256
11093 2572256 2099805 1823312 1475907 2447778 2865086 2737453 2520256 2194485 1885087
11084 1885087 2231792 2301245 2301645 2138106 2018441 1824269 1192549 1617206 1946403 2060753
11074 2060753 2100407 2078051 1958310 2432592 2810154 1894173 1993870 2144488 2215433 1133289
11064 1133289 1311810 1067408 1719643 1869142 1414562 1674613 1824643 1888573 2290249 2211894
11054 2211894 2049404 2052675 2005686 2296365 2241355 2051031 1569925 1700404 2173348 2370503
11044 2370503 1838093 1654147 1338318 1974223 2183196 2355518 1993583 2226819 1993205
11035 1993205 2114238 2587181 2319564 2023703 2113944 2379701 2505637 3287234 3022299 3417662
11025 3417662 3069492 2731099 2174372 2276671 3472085 3508008 2322968 1832294 2128457
11016 2128457 2861342 3453302 3407094 3599210 4032541 4238246 3764701 3675876 4207332 4301170
11006 4301170 4127849 4053608 4481377 4035061 3524525 3861900 4004898 4582252 4670285 3799543
10996 3799543 3821938 4501704 4289502 3920394 4994589 5336687 4835486 5115594 4553815
10987 4553815 3952057 3854245 4234479 4815431 4163710 3467832 4670675 4803425 5029987
10978 5029987 3202494 3188647 3263867 3021074 3193449 3417661 2277780 2731913 2750901 3130472
10968 3130472 3421485 3324846 2480522 2097004 2200515 2393911 2272896 2108266 2397420 854026
10958 854026 1135783 1504245 1363721 1785327 2789357 2414769 1926695 2515883 3253714
10949 3253714 1582757 1378707 1258262 1478600 1651530 2272515 2439835 1983144 1486494
10940 1486494 257177 950289 1507850 1440634 1346720 1170909 811101 800555 474004 941177
10930 941177 1512562 1352485 1252139 978827 370229 642217 209105 917235 1659763 924978
10920 924978 1136193 1326420 1090176 945136 1691806 1862211 1960905 1020164 1760396 2272468
10910 2272468 1884157 647980 187294 602839 600096 438401 1093626 730630 -49589 676190
10900 676190 1450348 1823650 1272433 423805 -301459 -22201 891692 508186 1067928 841407
10890 841407 -187568 -733296 -1120102 30735 470280 745557 392981 380909 96590
10881 96590 600660 648082 236825 890592 701321 525753 1053881 832639 178407 -372890
10871 -372890 83097 -425386 53205 998671 181237 -343280 -193882 -419214 436378 772371
10861 772371 -225036 163738 1158666 1695593 868534 845447 986622 526233 709752 441146
10851 441146 654039 581473 938503 897792 -116517 -638781 407266 551466 1609423
10842 1609423 910988 659584 602906 32287 696420 1273799 1248888 275101 654836 566078
10832 566078 1745369 596459 598857 -32158 -217320 234717 1393201 954626 -192969
10823 -192969 -12378 113404 640573 1101787 709681 1083431 435538 909173 491456 144091
10813 144091 1113353 1688748 1024213 593672 727031 998565 1248342 1079282 411305 185147
10803 185147 131242 171527 641542 1144671 -74128 886156 1427853 115074 -292415 -94115
10793 -94115 1044608 604403 734125 -212673 -372083 236149 693119 762515 1343907 1129456
10783 1129456 655552 1059030 1267625 712398 322289 400793 1439530 1902328 1784945
10774 1784945 942281 1463179 374504 -432635 -169731 1172596 991762 -29062 303019
10765 303019 558282 -66077 -44935 38303 1167797 1072192 832789 1361322 774632 1246436
10755 1246436 240553 -181965 -522381 -330858 407635 336949 660682 34274 807909
10746 807909 772301 171024 95048 -176056 -127965 835723 938328 745597 97397 220635
10736 220635 523526 184133 736971 1436782 946019 903499 386146 354288 257952 395510
10726 395510 536098 521501 645043 522608 397075 -80631 -545611 273800 592943 432343
10716 432343 491090 56560 -147280 142628 606751 304228 708962 1053522 993711 1153524
10706 1153524 532419 706422 1124077 -653046 -850664 54200 745098 -126713 -366240
10697 -366240 -475636 515728 898428 1041330 178246 238044 416392 -98703 319496 621957
10687 621957 1318928 1655314 1141483 888380 1167257 1210559 942721 673451 -489928 -456021
10677 -456021 -302936 462760 440327 67384 43405 489080 335455 1205018 229965 438681
10667 438681 88447 -367522 155169 285034 842128 124918 137416 -591474 -997639 -110489
10657 -110489 1031027 724303 886064 828001 1165236 630464 518851 1125063 1127462 501072
10647 501072 681558 548701 328209 394412 -51181 183258 554766 1099180 805731 43383
10637 43383 111979 1177308 929477 906777 1519924 1146583 399880 307841 232912 269241
10627 269241 477380 987303 685622 899253 623117 532719 65825 -887521 -4711 693118
10617 693118 1116514 -143591 562103 592482 849141 1333327 817743 884497 547122 38340
10607 38340 951118 292070 -422533 -100484 -610058 -289784 678491 601945 -245662 -718034
10597 -718034 -564166 -293217 -82497 366422 -400986 -79562 416214 511127 431547 816969
10587 816969 641231 1471979 1402889 498219 745995 829186 452463 466700 745895 228853
10577 228853 1100015 1123933 486717 -85639 -413672 85799 1408282 1026106 1185211 949804
10567 949804 -110183 -158254 -688087 339500 1072926 1053587 1235051 853238 1310097 1634901
10557 1634901 1065525 528664 -278419 -595116 -185766 -434230 -646251 -182337 791017
10548 791017 1029962 1012228 1258625 678933 327787 553892 287456 540703 701656 356877
10538 356877 150362 309724 40639 242573 3680 -26516 136335 739491 232847 274366
10528 274366 441506 358996 317912 159761 988680 1113405 1419414 1652647 330865 -209141
10518 -209141 233321 1090745 1269851 -305095 179783 293532 -107437 546704 1315118
10509 1315118 1538850 495988 175311 508441 604653 685413 249876 -198251 40001 601366
10499 601366 959571 181358 202767 -345747 100734 1317590 993765 734005 661780 732189
10489 732189 691675 438412 890693 1304425 749904 439126 40384 -114997 -92403 594812
10479 594812 1068700 816009 105089 -8173 -55786 159855 -221506 513537 1282025 609593
10469 609593 328905 220434 416846 587051 1028100 643849 502666 719769 419952 691184
10459 691184 996335 991316 729748 605745 728078 393262 -264860 615256 1558899 1141486
10449 1141486 364035 1098461 1181338 1060917 759688 973890 1077117 1137827 722284 931163
10439 931163 -48788 -125460 1080404 640398 675086 967195 691466 -23535 -69143 611388
10429 611388 1156729 1171041 1200301 1439250 782931 817456 426259 981115 644415 -91634
10419 -91634 -263861 -65568 406234 555087 531135 409854 511641 150050 163618 478009
10409 478009 487816 324079 92054 -5408 642113 1471131 1019086 144816 717099 -142866
10399 -142866 -171677 -187197 -629517 -466859 -579263 591760 568505 304598 1127043 297256
10389 297256 429336 890554 397619 414168 373117 648834 125286 -731394 -469569 487315
10379 487315 91552 -299939 48191 873076 909450 1177510 1135004 1030850 876794 642819
10369 642819 624619 -193508 -144173 697429 1353665 1698181 1794314 555617 1113073 1213466
10359 1213466 1065094 599268 1166748 772903 1023007 339354 666517 1624986 1690396 1339597
10349 1339597 1217867 1840056 2093446 2496361 1690043 472345 713178 1774644 1411168
10340 1411168 540844 1378217 1183783 1412076 696459 110093 1268073 1458403 1430715
10331 1430715 1527482 1056904 1509906 1875234 2031992 1308214 788333 483303 792928 664758
10321 664758 982221 1161625 1536223 2313654 1346892 1056119 917125 906545 795043 469414
10311 469414 264700 930674 1241055 1362885 1157536 565541 167692 1258100 1510957
10302 1510957 1092572 1568730 1045735 766574 550774 983453 1944402 2055367 1490621
10293 1490621 1216200 987997 1482337 1855131 1304090 287974 575169 1407067 2044149
10284 2044149 2225705 1698032 1246009 -338800 -166433 269238 290614 664362 1650366
10275 1650366 1417393 2074637 2038860 1378357 1821102 1756838 1269984 1533460 995786 1353295
10265 1353295 1235705 1631977 1976615 1615911 1025289 1546167 2912679 2690802 1368614
10256 1368614 762735 1865285 2712712 2185564 1505489 1816081 1583561 2171436 1829762
10247 1829762 1549396 2019152 1965919 1707682 2006296 2802726 1901680 2286010 1892327 1725222
10237 1725222 1293239 1083996 1018763 1861725 2026839 1754229 1805387 2031933 2476637 2967991
10227 2967991 3072529 3790444 3639564 4150026 3851149 3792755 4000594 4090300 4027249 4329099
10217 4329099 4554230 4092040 3678936 3854693 3969092 4212066 3601577 2658261 4217250
10208 4217250 4225029 3786811 2525425 3515060 2948391 2008122 2072562 2474320 2440549 2860712
10198 2860712 3343319 3880662 4175478 3365759 2810173 3494795 3626474 3247981 3216405 2993965
10188 2993965 2816082 2991762 2847560 2976524 2431662 2132885 2937470 3881792 3481866
10179 3481866 2735114 3415378 3581224 3171191 2873776 2517126 2364608 2614430 3342111
10170 3342111 3534566 2834140 2748808 3464679 3988487 3950234 3423805 3272715 4045276 4561706
10160 4561706 4516885 5246816 4588108 3447620 3425990 4038138 4816817 4239584 3637460 2657811
10150 2657811 2891925 2749747 3007242 3030291 2583092 3176082 2922792 3334971 4117613 5057207
10140 5057207 4316658 3728532 3251525 2877469 3633451 3314303 3489562 4604803 4606111 3874409
10130 3874409 3454214 3940581 3637939 3955363 4006002 4251595 4475705 4728821 4273407 4087728
10120 4087728 3597183 4197543 4606963 5109867 4453658 4715077 5554136 5086744 5162568 5086645
10110 5086645 4459848 4449851 4842075 5167672 4837396 5853474 6154375 6063096 7604341 7561273
10100 7561273 6927418 7579774 8624439 7970755 7851289 8110270 9047478 9525916 9839092
10091 9839092 10119674 9424412 9757051 9741622 9667886 10170337 9438628 9106624 9143254 8490787
10081 8490787 7952383 8974574 8366403 8186598 8122440 7936433 7945660 8305361 7907164 7915145
10071 7915145 7845524 6924737 6255467 6585964 6549106 5777926 5242718 5336644 4431802 5066360
10061 5066360 5040555 5007626 5075066 4740011 5198023 4428953 5055833 4705571 4152859 4512048
10051 4512048 4488998 4390667 4123207 3696262 3541459 3452584 3955276 4452443 3437173 3312383
10041 3312383 3460721 3293082 3262163 3280967 2798884 2566128 2866853 3204057 3541078 3796935
10031 3796935 3829480 2911268 2739167 2974914 3724511 4004128 3615343 3371021 2815338 3329395
10021 3329395 4013221 4426239 3612069 3998140 4199505 4227467 3698962 4558743 3907522 4334688
10011 4334688 4746215 5549108 5574251 4802311 4551556 4789615 3818480 3376310 4081364 4318148
10001 4318148 4442630 3491066 3736171 3151235 3064822 3250936 3923879 3945992 2392451 3076803
9991 3076803 3569830 3025406 3187757 2981211 2944210 3068388 3312185 2280456 2922123 2777257
9981 2777257 2560270 2303789 2435806 2025376 2499978 2544415 2429562 2374991 3050013 3362926
9971 3362926 3100808 3783191 3380285 2715570 2771633 2390088 2855661 1743972 1261933 2287974
9961 2287974 2403612 2219732 2358804 2296262 1683070 2231659 2572300 2323937 2989260 2836151
9951 2836151 2848885 2959709 1709029 1810719 2433652 1884570 2237160 2610415 2597262 2570734
9941 2570734 3625384 3027410 2304292 2165052 2737982 2513889 2676820 3836122 3236224
9932 3236224 1880388 2028273 2054624 2098141 2420426 2464341 3358863 3242049 2127105 1563857
9922 1563857 2050738 2351124 2677565 2627417 2842888 3533200 2974279 3924089 3398561 2552507
9912 2552507 2867371 2244647 1563398 1594024 1960159 1846689 2329055 2756504 1953858 2332459
9902 2332459 2469386 2137511 1830508 2236399 2200593 1814803 1572728 996459 1738928 2256551
9892 2256551 3179665 2531152 3139476 3174482 3078197 2525210 2880623 2648351 2549117 2892818
9882 2892818 2939358 2648261 2942926 2724743 2927552 2726516 2641288 2860442 2502621 2822829
9872 2822829 2209438 2260724 2447198 1966298 2576479 3161040 3891030 4541126 4471894 4496313
9862 4496313 3823629 3970708 3877647 3769546 3631370 3022284 3167818 2791086 2590284 2789359
9852 2789359 3592208 4385649 4265362 2692095 2329517 3306215 3124831 3422452 4206273
9843 4206273 4619472 4372189 4306065 4732049 4758401 5375922 4663517 3988305 3974816 4370516
9833 4370516 5153071 5046159 4678720 4972819 4999081 5048417 4641845 4805993 5454923 5237541
9823 5237541 4819197 4871856 5810122 5992595 4990246 4931057 5725169 6743204 6773654 6900667
9813 6900667 6965193 6341061 5282351 5747756 6540800 6014856 6834307 7152193 7302079 7604856
9803 7604856 7132057 6356756 5883571 5312133 5250700 6325039 6639564 7072444 7112356 6285785
9793 6285785 6793275 7180189 7500004 6858570 6642985 7102095 7607212 7833795 7689818 7280502
9783 7280502 7542140 8151794 7198080 6746293 6388656 6070148 5797401 5726069 5265880 4913047
9773 4913047 5854777 6508408 6823285 6242634 6588216 7038619 6674489 7130347 7198182 6830224
9763 6830224 6998014 7826796 8483860 7906108 7968871 7128699 6939533 6917142 8144235 7620650
9753 7620650 7133940 8287707 9279224 9081320 8989013 8825134 8989650 8496097 8346395 9512812
9743 9512812 9778978 9756178 10035213 10128320 10040338 10747988 10551994 10829399 11479944 11203034
9733 11203034 12069344 12346313 11842093 12561285 12378040 12673206 12646629 12166783 13131657 14656295
9723 14656295 14884778 14387313 14082239 14507591 14584401 14920215 15441215 15361196 16823773 18105123
9713 18105123 17732989 17684171 17690120 18481021 19772074 19768099 20085471 20416444 20656047 21811760
9703 21811760 21759575 22591756 22768831 23024945 23667696 25465733 26902037 26231133 26965673
9694 26965673 28243546 29565113 30925079 31050540 31462941 32308313 33466738 34477300 34977759
9685 34977759 35861342 36503776 37571498 38283882 38570687 40055052 40928109 41737924 42748500
9676 42748500 43732196 44527109 45652917 46842557 47939711 50178378 51256605 52525617
9668 52525617 53415262 55660633 57334830 58306899 60089938 61973571 63855458 65891931
9660 65891931 68797934 71689758 73114390 75908210 78381491 82616785 86486584 90398668
9652 90398668 95726594 100023843 106556227 112602892 119461728 127122362 136943286 147780164
9644 147780164 160181458 175169146 192390512 211179852 230803486 249502113 264563836
9637 264563836 276348309 285127182 290002371 291760866 293499023 295569346 297202331 297155960
9629 297155960 294362675 287665340 275736021 260059111 241063412 222068253 204084335
9622 204084335 187756384 172545640 158929528 147750507 138092017 129519603 122188411
9615 122188411 116266865 110886000 106244439 102262448 97747657 93693487 91534361 88198162
9607 88198162 85099053 82393376 79654832 76562267 73364989 70566440 67752561 64468033
9599 64468033 61112257 59266279 56554276 54769802 53192594 51170565 49542181 48378656
9591 48378656 47561982 47144252 47131015 46947521 46353251 46614857 46884431 48028225 49104784
9582 49104784 50547161 52142877 52850777 52783931 52859337 52845098 52699078 52591373 52810172 52980749
9572 52980749 51665531 50756576 49393507 47800316 46500428 44610219 43789619 44127494 43565465
9563 43565465 43224683 42695172 43668710 44704118 46252715 47773418 49055695 49397573 49359710
9554 49359710 49659107 48752751 47858921 48573475 48813084 47741919 46037280 43853736 41855245
9545 41855245 39817036 37485254 34375077 31987016 29937176 28372557 26932116 25549384
9537 25549384 24851625 24076071 23262334 21513950 20884302 20443995 19981321 19258135 18711065
9528 18711065 18898613 18138233 17510089 16410645 16332144 16094144 16393206 15810558 14835430
9519 14835430 13939041 13645119 13660301 13129256 12896676 12201648 12493652 12418511 12491024 11907803
9509 11907803 11893951 12053442 12260323 12811950 12326946 12332786 12033108 11670471 11006319 10862065
9499 10862065 10495829 9510223 9238060 9276180 9596039 9860935 9482514 8723048 8171062 8027031
9489 8027031 8754194 8234990 8522161 7346187 7068586 7782964 7596440 7808577 7760983 8037244
9479 8037244 8327063 8138718 8054749 8295479 8669409 8415955 9058697 9350990 9946057 10206633
9469 10206633 9849561 10294619 9474572 8904828 9645427 8842520 8753548 8635570 7703811 7813065
9459 7813065 7999620 7737954 6980348 6643820 7346863 7628656 7362066 7472432 6670476 6763525
9449 6763525 6538331 5921410 5747564 5985915 6033107 5252250 5629184 5741976 6000234 6029361
9439 6029361 5393861 5390107 6053852 6930258 6432732 6435963 6164470 6108306 6154442 6567079 6648393
9428 6648393 6347986 6217226 6287907 6041141 6303753 7044177 6965423 6846559 6631115 6834597
9418 6834597 6716371 6574492 6989940 6246767 5841524 5510068 5478063 5414922 5855623 5969550
9408 5969550 6113834 6280845 6821911 7171133 7620766 7300987 5911178 6120190 7153437
9399 7153437 8155789 8149176 7917728 7832307 7944910 7829165 8356241 9681927 9034051 8465617
9389 8465617 9691291 10503262 10112371 10546248 10723007 11488397 10599149 10581213 11210418 11474592
9379 11474592 10827616 10380647 10293635 10105671 9538165 9201626 9002234 8913878 8563302 8338973
9369 8338973 9188815 9107725 9600170 9283989 9192755 8838801 9025428 9134999 10124211 10979775
9359 10979775 10421300 10758649 11044940 11313646 11319517 11184386 11371962 11646920 11461435 11731344
9349 11731344 11407647 11236845 11591698 11260921 11581580 11405925 11396188 11468288 11699418 11445378
9339 11445378 11391167 10685099 11534779 11746664 11907458 11617247 11223320 11072399 11303687 12141649
9329 12141649 12513817 11935799 11485115 12423740 12654101 13251185 13537600 13342803 14089200
9320 14089200 13079974 12307852 12396913 12623118 13421569 14266604 14926415 15352458 15556649
9311 15556649 16050641 16784052 17543321 18408831 19429548 19964782 20952474 21649465 22867783
9302 22867783 24052156 25417051 27902831 30042287 31989066 34827033 37819980 38533933
9294 38533933 39085198 39360661 38838683 38650665 39076452 40760450 41443909 39674187 36707948
9285 36707948 35153741 33096620 30153827 28615868 26418949 25389094 24732136 22812706
9277 22812706 21320539 21097569 20316112 19974974 19448238 19024722 19261032 18884752 18988278
9268 18988278 18830323 18963296 19575903 19910434 20247649 19897237 19695356 20848430 21379535
9259 21379535 22141448 22727435 23628425 25058398 25576605 26333835 28149194 31182660 33798413
9250 33798413 33561224 33705329 34009655 33244390 33694808 33562867 34066589 34378553 33285902
9241 33285902 30737600 29104554 27152990 24873071 23389081 22580245 20931118 19708862
9233 19708862 19748662 18663951 16696576 16941262 16506961 15584478 15065492 15320505 15274222
9224 15274222 14673087 14816288 14363363 14064025 13399651 13514148 14077601 13232081 12654104
9215 12654104 12520868 12575994 12280047 12441484 12849921 12580138 12561656 12900330 13268269 13778535
9205 13778535 13099065 12986825 13899741 13304354 13632521 13362770 13146487 13300769 13509985
9196 13509985 13350376 13539381 14081520 14587478 14240539 14447764 14005581 13703180 13915542
9187 13915542 13920259 14222410 14576476 15126865 15510472 15696542 15761227 16374308 16580729 17442553
9177 17442553 17900270 18275378 18169289 18507526 18153026 18295442 18788563 19240130 20192067
9168 20192067 19531061 19415317 19568265 19905697 20051787 20339513 20687866 20947438 21156089
9159 21156089 21737391 21668841 22191038 23127344 23612582 23696468 23208919 24079952 25021368 25510633
9149 25510633 26271987 27034675 27763166 28605700 29322711 31103187 32168110 32804466 33269480
9140 33269480 34393258 35376449 36327646 37244011 38672157 39945615 41242616 42269773 43046767
9131 43046767 44094110 44255103 44649074 44955421 45525467 46966137 47686830 48449438 49051959
9122 49051959 49814408 50945083 51317208 52356017 53851502 55541184 56315074 57209025 58861166
9113 58861166 61202088 63248834 65170061 67073992 71414936 75137636 78289310 81510443
9105 81510443 85778128 91003150 97270756 104364760 113858294 124299603 134741613 145294913
9097 145294913 153918947 159059310 159307243 158087158 158394389 158876173 160899809 164991105
9089 164991105 167322663 167864885 163518570 156448060 148307726 140894409 134228314 128288940
9081 128288940 123296226 119139561 115828677 113085174 110896527 108921845 108161663 108458890
9073 108458890 108194850 108083774 109423593 110597096 113671539 116912290 121683434 127958292
9065 127958292 134677068 142416959 151926849 162872423 176625038 191677201 205694778
9058 205694778 216277397 221466128 221584035 218386333 216008391 217346780 220880505 224621859
9050 224621859 228228404 227431084 221696719 209728242 196859935 185172337 174706020 165670262
9042 165670262 158205089 149823068 139942909 131143350 121416567 114285855 106389754 100629875
9034 100629875 95777177 90346317 85506933 81437548 78241060 74444403 70595733 67369156
9026 67369156 65403660 63620790 62331241 59626906 57775681 57317952 56671765 55601140
9018 55601140 55371473 53310861 52802914 52160071 52357571 52822167 52539267 52122043 51894695
9009 51894695 52828602 53942007 54530043 54950947 55616623 55935032 56018165 56187851 56199863 56140549
8999 56140549 55169863 54234169 53340142 52809618 52409861 52473163 53046144 52893240 52328113 52808422
8989 52808422 52454361 52563917 54200686 54928708 54961125 55913993 56766002 57193005 59610599
8980 59610599 61363758 62577235 64388269 66235411 67644558 69756364 72242219 74605082
8972 74605082 76516683 78626449 81758016 84616311 87804679 91981347 96552285 101763668
8964 101763668 106586917 112080244 118721003 126543305 135517277 147369559 161191488 176084654
8956 176084654 193439473 214431057 236443268 258089581 275161075 284963454 286140989
8949 286140989 277841194 262382232 244070382 225447081 207239324 191907335 178412493
8942 178412493 166446919 156641607 147208340 139950877 133979168 130117641 127771167 126125831
8934 126125831 126593297 127603795 130492868 135699723 141984021 148935954 154771567 157610423
8926 157610423 155613374 151029215 145906755 141217866 137731355 136424896 137124510 139102458
8918 139102458 141663855 147440480 155887734 165687594 174030958 180848147 184514908 182378699
8910 182378699 175701784 165425265 152684794 139481006 127868512 116272926 105826174
8903 105826174 96865207 89442577 82594844 76581291 70962128 64953513 59983311 56015686
8895 56015686 52526096 49902618 47667024 45127632 42880380 41617082 40188859 39176821
8887 39176821 37129713 34911949 33096782 32876349 31849815 30802959 29587870 28378791
8879 28378791 27193913 26584327 25582029 25124452 24046173 23374449 22483879 21700726 20905102
8870 20905102 20546544 20617268 20637260 20025378 19576128 19047646 18033064 18365862 17985447 17414614
8860 17414614 16445856 16228307 16055686 15661731 15047472 15313861 14476126 14472242 14104802 14006664
8850 14006664 14077386 13610139 13022046 13258461 12921070 12181174 12759351 13181631 12432068 12248702
8840 12248702 12695367 12151510 11774094 11081105 11169683 11779841 11045908 11132874 10881294 10865027
8830 10865027 11162843 10950462 10984431 10416386 10182794 10776740 11297774 10229270 10630171
8821 10630171 11098989 10948221 10171228 9450977 9586645 9161697 8293047 7733774 7400388
8812 7400388 7679792 8316554 8230437 7887638 7414714 7115062 7316554 6645801 6788232 6311756
8802 6311756 5799213 6558770 6621453 6265602 6819553 7549414 7903236 7612541 6790981 5860560
8792 5860560 5640119 5454558 5479258 5963562 5932506 6385889 5491959 5443690 5205931 5238768
8782 5238768 4838266 5125196 5377994 6077044 5598503 4900936 4810550 5154902 5567254 5110811
8772 5110811 4996663 4504002 4663167 4628283 4846932 4685708 4972055 4978021 5635864 6750952
8762 6750952 7126862 6525777 5714385 5556965 5862804 5217667 4727892 5098958 5196325 4442669
8752 4442669 4115912 3815518 3575762 4452941 3895447 4006783 2995018 3143221 3523116
8743 3523116 3725084 4820778 3900943 3599347 4315513 3615706 3754596 3719206 3212383 3948671
8733 3948671 4233434 4713236 4941502 5253858 5727434 6140047 5746707 5321976 5063244 5157342
8723 5157342 4828573 4512495 4732619 4304955 4358859 4868205 4271008 3490187 3885174 4611875
8713 4611875 4773596 3671237 3259231 4065191 4170295 3119271 3194238 3800221 3478734
8704 3478734 3543145 3721885 3509433 2758672 3516638 3699398 3120498 2675994 3265445 3781729
8694 3781729 3782979 2973163 3086488 3803143 4688934 4647492 3885316 2962150 2422210 1998225
8684 1998225 1240546 2166843 1940004 2460455 3392361 4041115 3581780 2902390 2719052 3020996
8674 3020996 3235712 3397138 2648553 1395963 1419292 2262756 2691918 1903949 1984754 2819062
8664 2819062 2287271 1900231 2347918 2314713 1807222 1891623 1862113 1687255 1871482 1938686
8654 1938686 2248552 2042005 1912745 1829968 2237129 2055573 1449303 1331306 1487777 1886251
8644 1886251 1117672 1281583 2078640 1771698 1255937 1160437 750044 911754 1358635 1434698
8634 1434698 1134601 289619 1086271 1492947 793807 128863 13139 176035 625244 650649
8624 650649 1251805 1642901 1458960 1308173 1471450 1064698 992852 625636 645316 1210825
8614 1210825 1607486 28922 -83027 374745 418787 505163 806429 776696 685171 1911731
8604 1911731 1106026 571805 -230458 -33929 160730 -57687 342169 444380 674954 489665
8594 489665 229874 1152465 832520 677337 318437 1237235 1629110 1430800 1157109 2301919
8584 2301919 1966743 1879099 2321046 1669332 1387401 1132342 1180073 1557070 563069 948439
8574 948439 1538826 1743661 1364855 846481 1225265 1162679 1339640 701045 1093022 306661
8564 306661 528123 1053670 943619 655894 213166 -116220 559180 302575 463726 846224
8554 846224 1073557 1419956 2253397 2422885 2348348 2676068 1914431 1215133 837459 1491625
8544 1491625 2001734 1253457 1368494 975251 543053 340905 458339 1084126 916257 1284207
8534 1284207 1972192 439861 177278 973327 463206 -277020 -310163 -285538 -832033 87904
8524 87904 678468 987306 600936 -56177 760523 1066341 116022 394835 225136 288245
8514 288245 128098 -82658 242201 90080 -674074 -213041 598412 -60875 245411 34027
8504 34027 -360788 -289085 -89326 882880 1080815 294402 -22773 -59865 -321422 181560
8494 181560 -499561 -127680 28852 -641783 -678238 -208758 514126 832092 224500 243542
8484 243542 -191 -616733 -413646 -875639 241847 1002317 111737 -617604 -1178166 -1271612
8474 -1271612 -478005 -383733 -114043 386211 629941 -119843 -311584 -168117 40052 251407
8464 251407 -319160 -68625 1068940 1510001 256256 -134938 262042 1059309 1360803
8455 1360803 297854 501371 1023196 1106444 1125500 1457097 1032577 348126 718573 789436
8445 789436 745820 642541 908561 1311455 546387 222220 551123 429892 -556418 -249786
8435 -249786 209756 248477 384803 1059274 683046 -162598 116773 426365 379290 -40254
8425 -40254 336340 58791 138945 -82289 20300 -357952 -486207 275685 -383433 27248
8415 27248 122743 431370 -471240 -701576 -853788 -1424435 -880353 -714470 -306277 -171931
8405 -171931 -448198 -537419 -187049 -860720 -1648497 -1186810 -943633 -554566 -961837 -817350
8395 -817350 -629598 -567200 -700923 -1276348 -913124 -743671 -369758 -549337 -228291 67847
8385 67847 242460 1236688 1351540 73907 -250292 -194886 -407618 271556 628675 -818589
8375 -818589 -594341 -108650 223607 -243035 -675919 -150520 4939 -288457 -75501 205250
8365 205250 -64531 -91963 76231 -63955 351076 -135320 -1119794 -798695 -644984 -43442
8355 -43442 765768 224332 -552243 -1114546 -446781 -194308 398 -883412 -1267942 39298
8345 39298 181972 -220399 -150151 -164988 -481997 -196912 248039 185500 573058 630224 749476
8334 749476 1485281 319668 -80780 409087 1293143 1202623 218231 -570652 -183084 582530
8324 582530 572828 816705 -704241 156769 570713 -546760 -347975 658356 800614 230647
8314 230647 -256530 -394022 -442137 65690 53782 117231 723431 79324 215162 592541
8304 592541 396922 -560300 611874 216556 -160382 -361354 -579245 -528469 -177928 -801166
8294 -801166 -769272 -66207 -211123 242302 530780 517310 285632 630914 275963 -624731
8284 -624731 -753903 -806185 79723 133806 -34078 -228615 7280 -98659 131021 -740402
8274 -740402 -1160001 -289056 -153596 -390864 -641887 -204190 -467845 -853149 133879 -89064
8264 -89064 -667571 -867643 -807474 -702608 -289663 -496044 -681795 -455283 -186509 -374457
8254 -374457 -101443 -186639 49353 128559 -45284 99604 -122292 416998 -369742 -180551
8244 -180551 -317945 545941 178830 -286922 -1250955 -800759 -1287312 -824281 -209177 -966128
8234 -966128 -1327957 -629165 -694910 -88995 107784 -73340 -373883 -627606 -17453 -52218
8224 -52218 -108436 -416405 72542 161425 -273011 670877 538203 -46925 -933161 -935392 -1426506
8213 -1426506 -1389775 -704159 -1040077 -1503997 -880161 301247 -63082 154529 -8804 -535017
8203 -535017 -861052 -377614 -549262 -709733 -321796 -606061 -1145060 -1544824 -1082765 -1052210
8193 -1052210 -1898783 -444453 375989 -146675 -604183 -83526 -712514 -737876 -318091 -122978
8183 -122978 -671144 -15248 469659 35893 -121214 412430 408723 -357028 -374966 625436
8173 625436 -275388 10593 -442289 -792719 -691116 -667308 -697734 -396870 242220 -288589
8163 -288589 -616814 -125758 1079843 914377 860494 935172 541562 -299287 -837947 -692661
8153 -692661 -1389222 -717394 -601198 -802471 -251128 -251412 16334 -527640 -421249 262829
8143 262829 973275 331389 140783 379959 218873 -302057 -420569 -849617 28031 729799
8133 729799 1166783 179278 -734942 -652043 -212304 -1006240 -549735 -1030379 -726792 -393394
8123 -393394 -230456 227885 191196 -451107 -806475 -444019 -54830 132334 -311022 165052
8113 165052 699273 612863 281955 498073 119569 637182 1022093 -11431 -358976 -168477
8103 -168477 74684 7521 -785458 -912752 -841751 -820055 323107 679710 -307928 -694664
8093 -694664 69963 328130 783576 1739820 211708 -557305 -444528 43336 -209051 -65199
8083 -65199 206870 215702 -257024 -736070 -869985 -761725 -1017676 -678982 -398094 -43819
8073 -43819 -262439 427328 38269 95653 242062 508290 903456 209076 31382 -422663
8063 -422663 117638 492518 202102 -305574 -4558 -243038 426206 93197 -408681 -309743
8053 -309743 -698612 -634523 -1134935 -1379738 -1001391 -75538 -418364 80600 451504 -331045
8043 -331045 -124334 -182961 219968 253284 223594 279769 36720 -271367 -836364 -1144171
8033 -1144171 -2535463 -1915142 -868099 -573089 -720920 -628140 32215 -377067 -571373
8024 -571373 -908537 384289 584922 -18544 -775107 -912028 -56886 -282038 -699177 -272222
8014 -272222 -659131 -653288 -395528 -301671 -364335 -321928 -776683 -504284 -557032 157507 58259
8003 58259 -611095 -911294 -354361 -498878 -988176 -651170 28618 -453734 -1271341 -660088
7993 -660088 -578648 -584776 -532533 -434142 -132821 -64845 -276727 -439740 -551092 -18853 -67543
7982 -67543 -187010 -276211 -26204 -955136 -1326523 -595933 218953 511961 930186 639052
7972 639052 375096 262535 -347589 -115668 110136 -497159 -1144437 -1132607 -1403436 -1352506
7962 -1352506 -646293 -708659 -503578 -337592 91488 177476 -89234 -989682 -143501 -513011
7952 -513011 -248144 -791262 -877505 315733 584387 1172502 672256 1111225 622829 466731
7942 466731 -110392 186526 480512 -814530 -190917 336190 847420 884785 688961 547214
7932 547214 321970 363906 437960 -61054 -665199 -1325239 -627770 -492705 -1095835 -1335
7922 -1335 -463259 -1171654 -128069 394039 -83814 -274848 -181632 -784330 -903408 -636344
7912 -636344 -344863 -568001 -377420 -339000 -340072 -359691 -623620 -638913 -624634 284469 101350
7901 101350 -677418 -1609601 -848766 -491568 -416893 -619093 -18797 -376358 -675971 -479389
7891 -479389 -441823 -24293 -404772 -30562 470124 -159937 -34704 -774131 -278081 551660
7881 551660 499053 506589 -320248 -1042250 -410163 -317148 -421537 -110687 418472 -154647
7871 -154647 643619 669709 -71033 -122815 -986320 -1298863 -971614 -838941 -480521 -486163
7861 -486163 -77565 -31081 346829 152236 -479199 -698052 -196811 269777 281905 107621
7851 107621 -429401 -668796 -798140 -887735 -1098945 -410876 -19612 -393839 -457807 -327578
7841 -327578 -869065 -55232 -541060 -316401 -516071 31568 -473009 -179713 532973 143887
7831 143887 -321349 -551086 -901344 -696129 -421949 528763 -159521 -170689 -468285 111144
7821 111144 1005819 219017 -302725 -269380 -1013339 -389416 314668 326354 673647 458422
7811 458422 -314328 291356 107443 -558773 -889430 -542349 201389 -606457 -573990 238688
7801 238688 630940 869821 160468 -2896497 -1293153 -524464 -1080749 -1667019 -1660170 -1394112
7791 -1394112 10417 -77025 -69011 -195555 -513780 -265311 -441184 -380172 495417 671385
7781 671385 -343071 -1172509 -1607728 -761951 -1527062 -1229710 -1228463 -921030 -643548 -740862
7771 -740862 36253 -373567 -478116 -1047284 -863274 -816785 -345426 -321272 -18509 -66072
7761 -66072 -342068 -1163721 -730349 -12886 -816055 -274921 -74665 -530687 -771126 -1102468
7751 -1102468 -1013672 -621607 -1045560 -1013937 -628213 -807887 -34172 -614787 -1125351 -242802
7741 -242802 -370683 -364743 -871599 -785733 -62580 443576 -6624 858199 168498 -881809
7731 -881809 154412 190522 -641806 -878000 -650906 -407469 -441234 -587529 -1166525 -530769
7721 -530769 -203300 134120 -8590 -548020 -420835 640388 432875 -283598 -52084 273091
7711 273091 94268 -741093 -544898 -73320 -169255 -305703 -243137 625071 -306588 -38929
7701 -38929 724837 93275 -4119 -483770 -857979 -343191 -299631 -156868 848876 582055
7691 582055 527973 194613 173040 -329917 -787238 -354006 -797620 -293788 434017 -466821
7681 -466821 -853772 -761759 -818094 -862261 -241346 88498 251544 477832 420201 -85787
7671 -85787 -493514 -790032 -489638 -242912 388530 -66135 -621171 386506 253442 433266
7661 433266 -424857 33596 193414 -197395 -397543 107965 1105339 606381 224998 327532
7651 327532 753188 -4677 604955 687822 624100 463610 460281 -179959 -286919 -64598
7641 -64598 539330 433433 696420 298774 206657 183628 710313 259713 -202763 120179
7631 120179 525302 185119 -90120 309267 -277015 -308557 -18026 -227664 -1040975 -1136125
7621 -1136125 -983949 -994225 -1057538 -449724 -375877 -504532 -1019505 -1290078 -590252 -284893
7611 -284893 -616324 -346070 -530961 -15682 -51529 -352478 223658 85300 -45775 111147
7601 111147 -28826 77436 384264 184777 -832116 -306002 -970494 -487253 -912998 -478330
7591 -478330 302364 -628366 -710301 128389 322702 -84438 -115068 401697 486643 69707
7581 69707 -1002469 -782573 -833162 -1320212 -1114770 -911356 -527357 -30954 848770 343096
7571 343096 260162 599436 240163 -749533 -372656 -609271 -1239426 -878892 -657696 -46101
7561 -46101 -99928 -859429 -494438 -967369 -1079754 -257525 -461391 64106 264704 44648
7551 44648 165431 -318767 -430552 -781729 -1638286 -1117983 -629394 -874006 -253064 185602
7541 185602 -337154 -1025104 -784948 -914300 -409149 -180577 -607376 -1635025 -1401808 -524787
7531 -524787 153415 147158 -251162 -702393 -711608 -427027 -430139 -829431 -1430206 -814947 250675
7520 250675 -458681 -875876 -566955 -387755 -249095 56228 182964 98491 21029 254641
7510 254641 317153 -168869 -31225 -563316 93526 -982910 -1044029 -315909 -592151 -935964
7500 -935964 -1323151 -705854 -1179639 -823833 -308887 -382405 -951473 -450216 -1001686 -755229
7490 -755229 250562 -273097 -669166 -691712 -675509 -398389 -41467 -490293 -383960 -759515
7480 -759515 -71058 416892 207334 -236761 -1526 -808372 -1276154 -1206659 -783069 -1122143
7470 -1122143 -1717498 -1528563 -677103 -901346 -795722 -246452 -403551 433791 812571 720810
7460 720810 470457 584811 450202 -107412 66579 -473656 -954003 -753232 -546932 -729531
7450 -729531 -1047783 -1280076 -635588 -1359081 -1758412 -1188084 -284594 -685400 -1320190 -141797
7440 -141797 89847 -532133 -607707 112926 69641 195399 -508344 -428299 -601008 -57806
7430 -57806 -6412 -695927 -1170469 -669846 -383410 -752873 -490036 -121832 -170514 52340
7420 52340 -665634 -478420 -523893 -471291 -1439603 -1072176 -672270 -368113 -319482 -807131
7410 -807131 -906929 -728056 69350 235411 -654919 -764738 -41369 -230915 -626298 -210773
7400 -210773 469564 483147 605604 391394 -394963 -410998 72671 -355904 137173 -84162
7390 -84162 -288465 -523596 -501722 -950531 -587655 -1037531 -910479 -900827 -908302 -1116817 -1302249
7379 -1302249 -725626 -1140748 -919888 658832 970506 528017 -145899 -872175 -577087
7370 -577087 -916566 -680681 -668550 -117577 120288 -462445 -786229 -604665 -88123 371079
7360 371079 366068 592254 228310 -376250 -321112 -508782 151781 -96760 246719 761533
7350 761533 368400 416845 1184534 -29688 -354857 33601 -285828 -214656 -744879 -731869
7340 -731869 -684127 -463081 -420463 111665 -515346 -535804 -768705 -615506 -420483 -1459849
7330 -1459849 -845548 -863382 -99531 -162945 78122 -180627 -855391 -462410 -330906 -533056
7320 -533056 -794820 -814530 -664556 -671403 -752610 691992 713867 744775 -169079 -936873 -1120272
7309 -1120272 -938503 156028 -280451 -442571 -423399 -48086 310725 560474 296784 -184274
7299 -184274 -43502 274367 6898 252220 548088 446392 -348225 -1058376 108684 55756
7289 55756 -286613 -526082 53116 -515673 -16599 106249 -94533 -1149707 -1513356 -917166
7279 -917166 -735607 -457038 -1231649 -793600 -1106199 -653460 -654923 -44635 -184139 -1034472
7269 -1034472 -1447592 -463361 -485699 -1132441 -37737 -15593 -1270280 -957943 212135
7260 212135 -345579 224705 -185877 -43646 -377538 -625086 -291544 -479726 -622795 -888782
7250 -888782 -656865 -765299 -408926 -1148222 -905350 -138398 -51764 175997 -160410 -464709
7240 -464709 133825 -300417 -212572 101137 -851258 -645235 -707221 -1519529 -1869314 -1007486
7230 -1007486 -1026 245165 329694 -367382 152388 422574 -56362 -419502 371254 -362679
7220 -362679 -612094 -689356 32560 51579 -274323 -487107 78184 226350 -811142 -604484
7210 -604484 132876 472462 -258447 -612042 -1025426 -1918893 -1864836 -1124093 -841940 -951648
7200 -951648 -1255346 -1297928 -1784587 -564611 -254164 -434849 -428342 -708897 -815876 -473008
7190 -473008 -972376 -259796 95665 -260293 -908755 -1159838 -1538184 -645875 -756797 -1052700
7180 -1052700 -1652802 -901874 -18249 85118 17672 330052 632948 490785 432133 566524
7170 566524 1263721 994509 291264 478910 201299 -197236 137473 218372 -391960 -461298
7160 -461298 410754 -3952 -614770 -340939 263094 37129 -940316 -286564 -167422 -667091
7150 -667091 -1157906 -546602 -169805 -181206 -149756 -636139 -774888 -869454 -705937 -308523
7140 -308523 432113 -14588 113748 -89331 745091 1742124 1828895 628150 345330 377899
7130 377899 329714 -14826 660886 343184 93472 -261200 -168234 -307759 -543734 -802016
7120 -802016 -44283 216142 -233970 -704556 -830593 -292318 -550805 -399517 -377568 -1037433
7110 -1037433 -1389816 -430595 -329731 -400362 -757277 -469971 100866 -213536 -492217 -659242
7100 -659242 -1081382 -22201 376179 290829 881839 148531 218744 217838 49861 196620
7090 196620 -40043 -381111 8772 493046 466044 646813 834879 -51051 376311 368751
7080 368751 138070 -13620 -455771 -580592 -1399939 -567419 -262597 -439172 -417497 -1018390
7070 -1018390 -315478 -693645 -738373 -1039796 -980360 -93484 -844509 -725487 486272 454839
7060 454839 -332747 105827 -369440 -520067 -130289 -387588 -759300 -932327 -1480877 -826854
7050 -826854 -911856 -634277 -1075592 -721519 -632704 -505957 -48726 -539076 -1042664 -841738
7040 -841738 -833079 -1204375 -1609027 -1947774 -441196 -265252 -269656 -233796 113972 462941
7030 462941 -598618 -488635 -397701 -369794 -523119 -1377988 -785075 38021 428786 -591877
7020 -591877 -533571 -25326 231139 -473977 -1051163 -644451 -422721 -526614 -258282 -534563
7010 -534563 240463 717021 -308003 -345594 -194223 -160822 14729 -692345 -1138007 -829708
7000 -829708 -640582 -175325 -2449 -183357 12048 248755 33912 -977530 -541325 222175
6990 222175 -280342 -196482 -548439 35994 102948 758455 -23236 72421 -349799 -801711
6980 -801711 -508681 90089 -555774 -641772 381298 -91023 -321785 670933 495277 757636
6970 757636 341853 -1015348 -580297 -426234 -474225 -238292 -49399 131405 397938 -939498
6960 -939498 -1310331 -445229 -556634 -967259 -1315314 -1008959 -991262 -691801 -620954 -537740
6950 -537740 -342578 -617203 -350356 -56440 350397 -354510 -555001 -818677 -670011 -462991
6940 -462991 -748883 -267921 -218696 -796298 -237375 -493360 -867808 -1047812 -490572 334649
6930 334649 -104668 -84893 203340 -430741 -884 66008 947156 644464 -389373 1705
6920 1705 30584 -82243 -570163 -506525 -564316 -170145 -219381 -972832 -686052 -391075 -688948
6909 -688948 -937064 -939878 -1245345 -726658 -679726 -871994 -656759 -584565 -831411 -824964 -779551
6898 -779551 -515679 55069 -213049 146147 409174 -27772 -145726 235199 2066 100515
6888 100515 -318821 -221334 -617491 -525773 -141582 -499536 -280468 -455824 -324841 -139090
6878 -139090 -287440 127173 536203 221254 838200 -4616 -451710 586209 158066 168716
6868 168716 -845082 -1277119 -939738 -368003 -98462 -352512 -299250 -256517 -497269 -843107
6858 -843107 -440345 388624 -142828 -326170 231697 -338613 -605952 -1053603 61270 615044
6848 615044 -237362 -499419 -843416 -844709 -630272 -751072 -1111639 -638469 -418145 -507021
6838 -507021 -529114 -224098 690463 248831 -123896 -627934 533139 412563 3576 163236
6828 163236 381050 -8960 645786 277900 373369 378069 -143019 -114406 -396521 194212
6818 194212 -296614 -692904 361876 661640 368978 7438 243726 46905 194847 805738
6808 805738 77954 11193 -782466 -1096661 -733334 -632469 -860950 -957170 -1027989 -374828
6798 -374828 303875 188846 -8928 -568201 -985393 -1192032 -1402352 -770004 -776706 -256248
6788 -256248 251390 282143 -315606 -585558 -253029 115797 -187492 -182266 -536549 -789131
6778 -789131 5662 358474 316290 110217 -152011 587881 581309 -352778 -1010573 73881
6768 73881 34134 -538190 -968258 -288552 -209042 -483730 -974674 -1010218 -924482 -244078 -82188
6757 -82188 -197706 473308 576957 -355487 -440439 101311 69418 -572349 -501820 -500140 -38098
6746 -38098 -873773 -942848 -255040 -488833 457859 328685 136745 -594366 -1099225 -1269961
6736 -1269961 -708761 -653050 -86441 -529675 -718833 -1113824 -305950 291763 457993 713411
6726 713411 -976237 -1104221 -669320 -452087 -86112 -235608 -471337 -259664 54192 688020
6716 688020 574536 -506831 -1148512 -1079771 -463258 -648551 451413 236753 380952 659910
6706 659910 -374588 -609587 33458 -494218 -1401584 -990714 -530908 -310609 111606 278702
6696 278702 3044 123423 -232816 243976 724621 672064 -311742 -250422 -74774 391671
6686 391671 550218 -334436 -357170 -757889 -618649 154607 103914 258148 713724 735367
6676 735367 -672506 -775376 -656294 -1513243 -60909 -332494 -6263 -701106 -562932
6667 -562932 -570792 680878 496063 826927 -11484 -923693 -542662 -698536 -1261359 -1178085
6657 -1178085 -704439 -497206 174057 -739744 231683 441231 -347497 -571923 -538797 -6998
6647 -6998 -82457 -262486 -205103 112939 -141919 288619 -679262 -1006498 -1088014 -496421 -102399
6636 -102399 -171748 -723196 -553681 -70138 -1257107 -1853857 -1612515 -1320417 -1394287 -1294684
6626 -1294684 -1327449 -337822 83096 -283244 -22658 130031 -447925 201878 -172982 202530
6616 202530 -181584 -195164 -577895 306122 -50328 -347086 -229957 739409 675374 297153
6606 297153 -498268 273836 -627018 -565078 -438987 -404558 -222606 -110714 357146 533107
6596 533107 76729 -119477 -403572 -626749 -352881 -459955 -191186 220699 -20774 -712060
6586 -712060 490291 13736 -464352 -602549 -371768 359834 539934 -311528 -244507 -55511
6576 -55511 -744218 -747268 -195648 -157374 -120264 -353861 -85842 -85266 -119586 -1033728 -651884
6565 -651884 -1171206 -1168484 -701443 -185461 -199809 -326573 -557834 -1021509 -760856 -562715
6555 -562715 -600390 -1220357 -664402 -742466 -223474 23325 -162466 -248730 -331029 -590786
6545 -590786 -117747 522343 255999 -88052 73788 -166795 -128453 -418945 -234322 -300394
6535 -300394 -196375 -616202 -191589 12324 45800 22610 -283968 -153706 -508559 -30654
6525 -30654 464435 -199262 -60772 479381 -70101 31211 122569 779404 185722 84975
6515 84975 60036 618363 -236984 -104745 -329969 -472032 -668808 -695541 -734810 -429402
6505 -429402 -735415 -705163 -941368 -498101 40421 150960 -35264 -315564 199063 399890
6495 399890 -82829 -512473 -234975 72328 -679442 -923051 -611543 -1367194 -646701 -271182
6485 -271182 -141056 453027 627630 1496345 1894309 1345394 280962 342450 7657 -585861
6475 -585861 -328611 38478 447666 376364 9306 -691807 -384477 -814571 -502676 -146348
6465 -146348 -156963 -348423 -81501 -1119822 -865338 -76221 -605716 -1282042 -915191 -164784
6455 -164784 -332855 -787739 -905730 146645 -12105 -962979 -275171 931391 658383
6446 658383 -456618 -675128 -453649 -81944 -1154991 -1637891 -880764 -492952 649767
6437 649767 974195 8225 -714064 -1102848 -300988 377578 -102398 -1177690 -1022640 -1065018
6427 -1065018 -749830 -92777 -815827 -829783 -732109 -101989 347377 298447 40364 -87947
6417 -87947 293591 346975 -329063 -496481 -54906 312361 70559 -360218 658468 -55841
6407 -55841 44814 -402024 -1174865 -905132 -555217 -470318 -471939 -217078 415951 -553907
6397 -553907 -636941 -286852 -503470 333776 178017 -1240286 -863598 -515081 -719961 -642301
6387 -642301 -682592 261082 226291 440571 -370010 -784376 -538060 -144864 -44436 -33263
6377 -33263 -500076 -183795 -557708 -845678 -502870 -247203 232979 290188 18013 -33859
6367 -33859 -527946 514718 580259 388931 809917 115433 -373451 -154045 362618 558019
6357 558019 -102795 -49794 163488 105775 81653 153528 88205 -496017 -787492 -467176 -1069957
6346 -1069957 -945251 -225402 -856185 -633893 282000 276087 -659903 -581125 -647470 -86052
6336 -86052 156122 -641874 -1371260 -687641 802284 733778 300743 -963342 -48259 126112
6326 126112 -740698 -1004219 -740939 -245009 -971147 -53763 -431932 -1539247 -709677 -119587
6316 -119587 541358 481204 -545258 -470746 -182468 366074 -13946 86827 472296 1101518
6306 1101518 -476956 -247190 422835 422740 -130318 -236647 108710 -157029 -214670 -28687
6296 -28687 211085 -21700 -127683 -289364 761478 -162559 -1674841 -1266205 -927100 -577604
6286 -577604 -144810 191814 -104232 -919199 -1063198 -1232039 -1354543 -176952 279918 292327
6276 292327 164212 309631 -474045 -1036051 -386281 -557872 -534615 153940 43867 -769923
6266 -769923 -890932 -863420 -449569 597075 777169 -77869 -573463 -1007745 310820 740241
6256 740241 943697 141206 -118310 -1191912 -1126663 -1331853 -1237823 -782417 -514186 877929
6246 877929 973568 -154165 -90346 -63507 179858 -335520 -441744 -128836 -1548568 -1408261
6236 -1408261 -159648 -481836 -530237 -464100 -440110 -371160 -854418 40747 -170268 -1288161
6226 -1288161 -1261742 -12367 -245014 -627609 -43355 -226004 -563892 -35414 467270 666468
6216 666468 -205432 -424773 -115987 -96364 52071 -6594 -359133 -1702271 -1660946 -345234
6206 -345234 -285829 -283944 -233941 244790 -828668 -954897 -948 895556 -178731 -1045313
6196 -1045313 -638083 -967202 -226002 -10454 194215 875345 656100 -528067 -956871
6187 -956871 -895220 -763998 -344106 -192202 -359879 33915 912987 467590 1126669 1035154
6177 1035154 -97688 -211587 14860 -204090 -627286 -522131 34887 -44206 22154 -332151
6167 -332151 34660 282345 -295723 -438954 -625727 182768 353082 -728499 -1851212
6158 -1851212 -601518 -641642 -1230766 -777025 -93645 104888 -108906 38651 -680902 -313111
6148 -313111 -106861 140561 166642 43989 727286 752969 328013 -489302 -1067900 -1071928
6138 -1071928 -258619 269266 -165878 -145900 -57641 -63107 -545627 -3221 -48268 -212223
6128 -212223 -79846 79347 436937 764292 28535 -473303 563961 -340851 -290077 314801
6118 314801 290815 583637 37715 -512552 -534907 -692824 -597300 -24638 54509 700907
6108 700907 1309620 661352 76742 -44808 -370463 108747 94629 -692909 -388729 -331290
6098 -331290 -636093 -1196387 -270057 -765472 -1583462 -850033 -965237 -409935 312994 204926
6088 204926 86329 -35803 315661 -190054 -637123 -369493 -816357 -374641 641219 7291
6078 7291 92289 -430709 -1223308 -1011501 -263274 -214168 -42930 33638 24733 -669197 -93711
6067 -93711 675016 -458087 -641363 -324716 -836206 -549171 -62767 552756 -111789 -88055
6057 -88055 -126204 -283596 -39400 -371325 -271898 -448275 232431 291539 415989 713247
6047 713247 -77224 -152036 227801 253764 68662 -254856 47619 278260 419304 199352
6037 199352 657498 199401 456512 229180 -726872 -541821 -78443 -336409 116949 -218214
6027 -218214 -448601 329311 -156426 -536622 -435045 115994 899003 235847 -277162 85311
6017 85311 702027 1349071 1511971 905888 149765 -356672 -711565 -67316 420625 393446
6007 393446 756446 340049 -347508 80767 -175774 -233739 -178395 -547377 34588 285500
5997 285500 321258 488406 735501 538054 410249 185111 -326471 308199 297372 1005229
5987 1005229 1511021 887041 956422 1193944 1241069 -62485 743930 717940 507891 626360
5977 626360 867359 629979 630261 827923 1249901 1327929 530659 546486 603612 515609 509842
5966 509842 1335353 1503011 742269 1160849 1251176 1160391 995152 611923 339165 193324
5956 193324 496848 1111146 1486033 996598 705035 657735 1383611 1131415 6128 58510
5946 58510 788103 1016991 589455 475588 190116 216383 527700 3449 -531684 319712
5936 319712 1275919 721072 20523 186695 857117 459045 468080 496131 553017 392242
5926 392242 -45630 342984 -573952 -327049 359035 -351878 162461 -596688 -195077 -47219
5916 -47219 108121 -275209 -283454 554415 -48784 -112231 -54227 161639 799465 1068379 591280
5905 591280 67251 -186848 -519145 2607 425374 -398455 -1135904 -744270 -589566 -739506
5895 -739506 516614 1568089 694683 591912 601556 234164 -610020 -471829 -99811 -544194
5885 -544194 -754922 -295916 -66638 336922 400724 613665 320450 -666288 -210546 231837
5875 231837 383135 269185 -215539 -109940 240080 918929 -68245 -368132 61981 194282
5865 194282 604724 552386 565274 619204 705151 399617 312108 424104 246084 143566 235986
5854 235986 478394 83926 25747 -260101 83082 87081 47368 790921 1094089 1184838 351769
5843 351769 502003 866245 1328187 1011241 692951 240522 -112100 576579 592676 449955
5833 449955 1715382 1066593 637120 1269804 791723 1364240 1906077 848122 1329964
5824 1329964 1389701 1706098 1597625 1279620 1746952 1549429 1674122 1595666 2445831 2157738
5814 2157738 3070550 2538862 1711142 1784568 708368 586140 1111255 1151785 712559 409087
5804 409087 -30540 817821 487456 243734 -583491 -8960 41890 570639 3447 689615
5794 689615 772846 758960 847298 638008 662730 691675 -115883 118905 164859 -137478 -274360
5783 -274360 47933 835436 988081 1044409 693013 -80697 -209039 340891 -287760 689557
5773 689557 637413 -151312 -494826 -234862 32669 9580 -994708 -260655 233205 990557
5763 990557 1450478 711121 301040 711344 1009925 566478 932994 642549 156096 312490
5753 312490 120011 190610 -822810 -932769 306319 322327 83022 152664 -137340 611182
5743 611182 516679 199530 823834 401320 217001 744683 254824 126772 502609 -215245
5733 -215245 35001 481701 126665 379953 541642 407011 864232 1378344 975366 1090341
5723 1090341 756879 -95415 -389846 112741 -64607 504153 770630 109622 580486 363693
5713 363693 27129 -191650 -499457 -529438 -118305 423572 -1316714 -1095942 -775237 -467162
5703 -467162 701783 492156 -622960 -171517 630330 207459 104684 -195417 -305064
5694 -305064 415735 171416 -201592 -361067 382123 904264 886540 818181 1104146 1433211
5684 1433211 769675 1034996 882662 -179392 206132 -111384 -458806 -410257 232203 532382
5674 532382 512788 454697 96421 727797 1361300 2281237 1730876 1207547 453843 748862
5664 748862 229443 1124856 1344176 619386 1116855 989860 556846 397166 160235 92126
5654 92126 584850 1103573 1313684 1376711 1175744 1276179 1240971 1165813 1171505 408600 449272
5643 449272 290815 676635 486761 353717 541140 36996 -306526 46477 263839 241903
5633 241903 -119896 -552756 752657 852084 923680 267209 292063 706487 1797802 2010007
5623 2010007 2214091 2221106 1969394 2135884 1998494 1195742 1586114 1836081 1720800 2271290
5613 2271290 1232645 1090370 860280 686998 935204 664461 542054 277139 532479
5604 532479 134800 364949 955833 421243 597552 77639 568875 592373 594786 838072
5594 838072 421019 278381 1443806 1125258 1458443 2067988 439967 -543260 315360
5585 315360 -583868 -901885 88619 -108443 249760 419135 203685 881754 1312193 1329943
5575 1329943 1065381 317044 854457 945636 1007420 427816 556030 694468 279381 659365
5565 659365 1097690 407480 342995 100719 -336556 -142173 210508 322476 738476 1251613
5555 1251613 961671 521891 482762 610400 599334 249772 893211 1302599 637514 -44318
5545 -44318 25042 232092 32916 467468 684767 624279 350196 414472 306845 217018 886867
5534 886867 822948 1531242 1648773 613243 327056 171910 249980 203523 658107 769360
5524 769360 93383 -183574 -113403 -404745 669307 841044 585970 603471 676380 109440
5514 109440 -311655 -1157969 -930067 109452 267036 464782 1355226 743087 -53679 896857
5504 896857 1394265 490982 363995 476464 -416006 -338522 -15300 857834 499890 -287962
5494 -287962 -586795 433563 -93173 222612 605974 338841 1246022 525145 -182496 586886
5484 586886 1380470 896761 982043 895428 808175 1189696 569044 -404087 209452 268024
5474 268024 865889 702157 478102 866591 776146 887472 716219 688240 301770 485479
5464 485479 1068798 824144 916040 619916 510596 150566 -222837 704974 1084106 866782
5454 866782 167767 849280 448913 960600 1326583 714904 193261 -74965 -43712 -266201
5444 -266201 354894 70121 685888 628101 -270780 64621 38203 -22067 188663 177131
5434 177131 -295437 -509682 432010 -42423 -328695 715416 693456 55624 466276 416381
5424 416381 755192 159776 102798 263594 -278829 463910 960484 785707 576228 -43394
5414 -43394 804596 1097728 739528 123316 393683 306160 922085 743913 817944 277611
5404 277611 -315569 890290 292647 735964 753748 176952 749541 579553 255163 545443
5394 545443 -557338 -9878 -345377 -463584 -481184 51741 -312279 -24022 4001 -346371
5384 -346371 -582785 365357 868346 -134793 -132393 -10245 -60478 -336090 506045 356015
5374 356015 -245857 -44447 548777 559605 1017367 983757 901284 1388156 209626 -699206
5364 -699206 -918144 -395440 167376 312495 -20251 -27405 95181 1005901 -123444 -470133
5354 -470133 -578871 -446215 200015 -137540 37768 103259 382528 233806 223037 1243490
5344 1243490 1091895 844756 262599 -132766 -176131 -243803 -220403 -424571 -520321 -401078
5334 -401078 -782910 -257787 -144324 -418621 -1172927 -843260 293544 142796 -541162 -27424
5324 -27424 101067 -468157 360797 530827 150174 -456759 -257153 -547091 -375066 -559520
5314 -559520 -452127 107037 335680 -538880 -422475 185637 151625 402231 259179 397386
5304 397386 431930 365740 204768 288016 536109 208612 -352812 -946781 -199666 -630388
5294 -630388 -409257 -139741 136258 -644259 -508345 -750314 97442 849431 240307 -317930
5284 -317930 -387783 -277431 419783 312422 612315 254409 93932 97892 -504238 918441
5274 918441 608209 -469797 -234106 141288 -645039 -587022 318286 532882 170345 730239
5264 730239 1513847 1252953 -114497 -283400 38766 397070 636530 46490 540865 10561
5254 10561 -231476 -892232 -226545 323101 -241115 -112045 -337428 -374893 -595136 -430163
5244 -430163 86486 -244431 -336510 216945 -177234 -380262 -564004 -402272 124906 -97810
5234 -97810 218306 -79007 -508058 67584 64180 552672 28088 -266521 192036 74311
5224 74311 32148 -405397 -342817 -647973 -225638 -767821 475278 564887 -208261 205500
5214 205500 310757 1013852 955812 772748 -460519 649782 551071 966296 772181 1255749
5204 1255749 1226002 -44857 -334090 237193 742863 1605945 538643 -21639 359093
5195 359093 1206720 746578 61650 -179019 487140 913324 107759 689591 627351 171232
5185 171232 559148 247660 249520 1053549 185523 -528461 -698788 -336399 -137075 542258
5175 542258 597635 894349 1067544 432029 307638 333755 528174 297594 277984 304390
5165 304390 -95624 -48136 -197295 -375874 -636835 -139345 167536 238813 807455 45509
5155 45509 -878790 368435 1049795 513904 153943 253791 907302 199434 -123752 546093
5145 546093 947389 1136207 1177765 1582682 1048950 704364 365934 -60777 -77854 499599
5135 499599 676484 732850 -183264 -250460 100890 150526 762324 234161 570728 457910
5125 457910 640299 -14848 -400930 -885838 -389303 -780478 410695 999588 -36714
5116 -36714 189673 160062 343200 252094 -71103 349596 832117 -136973 -138383 -183437 -667922
5105 -667922 -1024805 -6637 -405737 -10706 -83533 -91300 116931 -717135 448031 919817
5095 919817 496939 1269240 667292 109237 73938 423075 -282070 -654503 35940 599564
5085 599564 983350 318971 334736 1150231 925526 276380 322464 68421 901874 424157
5075 424157 634688 846371 -88402 -792197 -549536 -820089 -102855 564121 442291 1315230
5065 1315230 1118433 1140360 1354463 846453 145226 -422884 -97277 575154 256252 174476
5055 174476 199705 890193 869630 441193 408803 873367 569717 757408 1045401 680516
5045 680516 346045 671043 221867 11332 897664 1124712 997628 942254 453526 288843
5035 288843 368366 577396 365696 260945 -62692 -419670 28341 -418617 171639 -41935
5025 -41935 -640309 239750 752097 853269 994575 1794591 630207 387135 138527 590381
5015 590381 830101 480454 653748 592504 522589 916512 886680 1683622 1663674 884747
5005 884747 1066052 248552 655199 1199157 1226369 525335 916770 483628 1113888 404017
4995 404017 -5413 911637 1422448 1952692 2063173 2024121 747659 1173192 1364761 1144156
4985 1144156 1401726 1987523 1413939 1715357 861356 654767 1440819 1778655 1925425 1261693
4975 1261693 1323054 1551017 1789714 1463382 1667210 933196 1351293 1178874 1777595 2014996
4965 2014996 2603724 2857821 2749003 1564869 878496 1381829 1190417 1192739 1318120 886699
4955 886699 1434265 1032314 1411935 1685865 2054506 1922436 1418144 1702388 1571776 1306737
4945 1306737 1424017 1756361 1623099 1645696 1025915 1605579 1600519 1525778 1076454 1077421 1285878
4934 1285878 368622 321557 1317836 748739 487259 908363 396339 -202610 -26483 822465
4924 822465 532250 349553 476930 378672 248727 -360376 -489514 -333419 -71905 433112
4914 433112 86399 479453 628414 302486 204437 1230076 920458 452173 139247 227433
4904 227433 576066 987212 1007652 1080148 415204 -354458 38119 -142695 562561 328059
4894 328059 190360 333147 562481 861643 1180876 904615 416396 181364 -208025 -335055
4884 -335055 156733 22784 146238 472458 414068 862940 295510 657116 173117 -192576
4874 -192576 619570 678076 147452 -80270 867822 420100 555556 772019 -37234 62504
4864 62504 480995 666437 770311 1259108 1460986 619275 1606236 1281865 1006041 809679
4854 809679 652112 1337745 1323171 690651 717559 796185 1150727 584331 826999 713135
4844 713135 283990 -127025 104211 111178 -169821 -277220 -449385 -619268 -398439 -784989
4834 -784989 -142265 36935 633963 303117 -456541 -233323 157275 22639 101690 550874
4824 550874 641314 144369 -681175 -441743 288596 910187 410886 -410856 41133 475418
4814 475418 582363 1355159 589387 411540 375985 637819 659896 229307 955962 1583997
4804 1583997 1745352 1121198 803536 1386573 1351136 1364427 610263 670207 314221 -144831
4794 -144831 296836 363864 220816 -372603 126964 -435090 -256774 236512 430294 830828
4784 830828 1092833 1068801 712857 1179357 26770 371846 569184 850642 237911 854461
4774 854461 1267331 1677779 983218 952824 468654 597565 1193616 1754674 1517049 794547
4764 794547 308276 579429 1352692 1580882 813346 1063949 945399 892987 1413180 1678584
4754 1678584 1370370 871787 1252506 1492149 2391002 2347476 922423 2013671 2395137
4745 2395137 1474178 1626179 1766379 1862406 1462533 1928347 1604404 1674542 1543748 1789974
4735 1789974 3076024 3294083 1878236 1405362 1296385 703762 611127 774004 1824133
4726 1824133 2317557 2083724 1882961 2462343 2946817 1943137 1704560 1946524 2092696
4717 2092696 1531734 1670047 1836255 2747789 2846912 2274913 2047702 1738724 1283633 1834265
4707 1834265 1965383 2039403 2735627 2317803 2110588 2268103 2454577 2540115 2279098 1955015
4697 1955015 2361108 2021082 2152713 2377016 2048748 2576546 2921401 2405394 2002163 1770090
4687 1770090 1662505 2600922 2858566 2859392 3076027 3436059 2761014 2917929 3567184 4305876
4677 4305876 3789842 3313427 2985877 3778267 3088840 3955111 3828086 3832984 3818215 3564064
4667 3564064 3799768 3702338 4232556 3967497 4294796 4189602 4197341 4060549 4462438 4772142
4657 4772142 5073973 5352739 5667038 6255426 6157943 5232384 5634930 6694210 6686922 6459115
4647 6459115 7070498 7568859 8572238 7896521 7175540 7153157 7136741 8425924 8509962 8691258
4637 8691258 9789180 9479247 11047049 11163387 11477798 11494052 11241241 11697623 11312884
4628 11312884 11533455 11268693 10681426 11282250 11288977 11367102 11005114 10429481 10585707 10901798
4618 10901798 10634252 10033447 9746089 9589565 9153252 8839753 8768823 8276510 8021623 8298504
4608 8298504 9114325 9020264 7988776 8670403 8790913 8226082 7958801 7362988 7917721 8063320
4598 8063320 8620252 8826237 8583874 8649450 8984609 8255238 8005532 8680197 9639869 9704827
4588 9704827 10127534 9366871 9239171 9839612 10066242 10510674 10053055 9998688 10564698 10938896
4578 10938896 10804346 10501650 10903909 11258563 11693227 12796099 12447308 11653668 11701809
4569 11701809 11977246 13214491 13146491 12751873 14333846 15071614 15432243 15196581 16036479
4560 16036479 17139474 17214420 16591056 17389386 17456759 17595453 18825243 19376804 19411961 19720708
4550 19720708 20854883 21996750 22556342 22486349 23557713 24722418 25263193 25727248 25564044
4541 25564044 26647964 27022517 27174086 28213470 28614281 30198424 31178848 31910811 32016450
4532 32016450 32742893 33883535 35172553 35973343 37315766 39399577 40492281 41321140 43092255
4523 43092255 44412895 46937153 48796057 50192653 53078086 54937497 56944711 58588858
4515 58588858 62027160 65350555 68781005 72160847 75766836 80074464 83774218 88242950
4507 88242950 94229735 100858006 107020093 113051147 121519892 130297345 140348832 151384073
4499 151384073 163065012 175936510 189081566 201453302 212836221 221485456 226109657
4492 226109657 227621014 223541432 214835467 204448375 192769769 180441544 167372265
4485 167372265 154953125 143671835 132549636 122785796 112487078 103065422 95800070
4478 95800070 89757235 83707110 77767650 72186461 67322697 63628882 59699114 55648031
4470 55648031 52305270 50425701 48301599 45437887 43890114 42201259 39481556 37978087
4462 37978087 36353850 33933943 32165466 31430948 30413191 28603763 27713030 26975409 25399284
4453 25399284 24295116 24274352 23586448 22330282 20148591 19552531 19489732 18890898 18477106
$$ [...]
##END NTUPLES=NMR SPECTRUM
##END=
