##TITLE=1H_CA-9122
 CDCl3
 8 sc, 
 10.1.2024
##JCAMPDX= 6.0         $$ Bruker NMR JCAMP-DX V2.0
##DATA TYPE= NMR SPECTRUM
##DATA CLASS= NTUPLES
##ORIGIN= UXNMR, Bruker Analytische Messtechnik GmbH
##OWNER= root
$$ XWIN-NMR		Version 3.5
$$ Wed Jan 10 14:04:32 2024 Russian Standard Time (UT+4h)  she@DPX200
##.OBSERVE FREQUENCY= 200.1313
##.OBSERVE NUCLEUS= ^1H
##.ACQUISITION MODE= SIMULTANEOUS
##.ACQUISITION SCHEME= undefined
##.AVERAGES= 8
##.DIGITISER RES= 18
##SPECTROMETER/DATA SYSTEM= spect
##.PULSE SEQUENCE= zg30
##.SOLVENT NAME= CDCl3
##.SHIFT REFERENCE= (INTERNAL, CDCl3, 0, 15.4274)
##AUDIT TRAIL= $$ (NUMBER, WHEN, WHO, WHERE, WHAT)
$$ ##TITLE= Audit trail, XWIN-NMR		Version 3.5
$$ ##JCAMPDX= 5.01
$$ ##ORIGIN= Bruker BioSpin GmbH
$$ ##OWNER= she
$$ F:/spectra/data/she/nmr/H-F/1/pdata/1/auditp.txt
$$ ##AUDIT TRAIL=  $$ (NUMBER, WHEN, WHO, WHERE, WHAT)
(   1,<2024-01-10 14:03:08.85 +0400>,<she>,<DPX200>,
      <created by zg, POWCHK disabled, PULCHK disabled
       configuration hash MD5:
       00 E9 B6 7A A2 85 ED C7 34 08 36 98 17 FE 4E 26
       data hash MD5: 16K
       F8 6F 09 D7 0C 6F BE 6D 6E 01 D5 47 AF CC 08 B8>)
(   2,<2024-01-10 14:03:11.67 +0400>,<she>,<DPX200>,
      <Start of raw data processing
       efp BC_mod = 2 LB = 0.24 FT_mod = 6 PKNL = 1 PHC0 = -24594.51 PHC1 = 10.05273 SI = 16K 
       data hash MD5: 16K
       FC 2B A9 AE 9B 95 48 6A 65 35 9D 02 B1 38 49 DC>)
(   3,<2024-01-10 14:03:30.40 +0400>,<she>,<DPX200>,
      <pk PHC0 = 5.356963 PHC1 = 0.2 
       data hash MD5: 16K
       FC 6C C6 45 BC AD 92 0F B1 39 3C B0 B1 E8 E6 5B>)
(   4,<2024-01-10 14:03:34.32 +0400>,<she>,<DPX200>,
      <abs ABSG = 5 
       data hash MD5: 16K
       5A BC 4F E8 AC 32 8E E7 DB 5D 47 41 5C 86 16 30>)
$$ ##END=
$$ 
$$ hash MD5
$$ AE 2A 2D FF E2 DA 75 F0 21 D8 F2 45 4C 94 70 3F
##$RELAX= 
##$RELAX= 
##$RELAX= 
##$RELAX= 
##$RELAX= 
##$RELAX= 
$$ Bruker specific parameters
$$ --------------------------
##$DU= <F:/spectra>
##$EXPNO= 1
##$NAME= <H-F>
##$PROCNO= 1
##$TYPE= <nmr>
##$USER= <she>
##$AMP= (0..31)
100 100 100 100 100 100 100 100 100 100 100 100 100 100 100 100 100 100 
100 100 100 100 100 100 100 100 100 100 100 100 100 100 
##$AQSEQ= 0
##$AQ_mod= 1
##$AUNM= <au_zg>
##$AUTOPOS= <>
##$BF1= 200.13
##$BF2= 200.13
##$BF3= 200.13
##$BF4= 200.13
##$BF5= 200.13
##$BF6= 200.13
##$BF7= 200.13
##$BF8= 200.13
##$BYTORDA= 1
##$CFDGTYP= 0
##$CFRGTYP= 5
##$CHEMSTR= <none>
##$CNST= (0..31)
1 1 145 1 1 1 1 1 1 1 1 1 1 1 1 1 1 1 1 1 1 1 1 1 1 1 1 1 1 1 1 1 
##$CPDPRG= <>
##$CPDPRG1= <>
##$CPDPRG2= <>
##$CPDPRG3= <>
##$CPDPRG4= <mlev>
##$CPDPRG5= <mlev>
##$CPDPRG6= <mlev>
##$CPDPRG7= <mlev>
##$CPDPRG8= <mlev>
##$CPDPRGB= <>
##$CPDPRGT= <>
##$D= (0..31)
0 1.2 0 0 0 0 0 0 0 0.06 0 0.03 0 0 0 0 0.0002 0 0 0 0 0 0 0 0 0 0 0 0 
0 0 0 
##$DATE= 1704880988
##$DBL= (0..7)
120 120 120 120 120 120 120 120 
##$DBP= (0..7)
150 150 150 150 150 150 150 150 
##$DBP07= 0
##$DBPNAM0= <>
##$DBPNAM1= <>
##$DBPNAM2= <>
##$DBPNAM3= <>
##$DBPNAM4= <>
##$DBPNAM5= <>
$$ [...]
##$SUBNAM3= <"">
##$SUBNAM4= <"">
##$SUBNAM5= <"">
##$SUBNAM6= <"">
##$SUBNAM7= <"">
##$SUBNAM8= <"">
##$SUBNAM9= <"">
##$SW= 18.0517328524113
##$SWIBOX= (0..15)
0 0 2 0 0 0 0 0 0 0 0 0 0 0 0 0 
##$SW_h= 3612.71676300578
##$TD= 16384
##$TD0= 1
##$TE= 0
##$TE2= 300
##$TE3= 300
##$TEG= 300
##$TL= (0..7)
0 120 120 120 120 120 120 120 
##$TP= (0..7)
150 150 150 150 150 150 150 150 
##$TP07= 0
##$TPNAME0= <>
##$TPNAME1= <>
##$TPNAME2= <>
##$TPNAME3= <>
##$TPNAME4= <>
##$TPNAME5= <>
##$TPNAME6= <>
##$TPNAME7= <>
##$TPOAL= (0..7)
0.5 0.5 0.5 0.5 0.5 0.5 0.5 0.5 
##$TPOFFS= (0..7)
0 0 0 0 0 0 0 0 
##$TUNHIN= 0
##$TUNHOUT= 0
##$TUNXOUT= 0
##$USERA1= <user>
##$USERA2= <user>
##$USERA3= <user>
##$USERA4= <user>
##$USERA5= <user>
##$V9= 5
##$VALIST= <valist>
##$VCLIST= <CCCCCCCCCCCCCCC>
##$VD= 0
##$VDLIST= <DDDDDDDDDDDDDDD>
##$VPLIST= <PPPPPPPPPPPPPPP>
##$VTLIST= <TTTTTTTTTTTTTTT>
##$WBST= 1024
##$WBSW= 4
##$XGAIN= (0..3)
0 0 0 0 
##$XL= 0
##$YL= 0
##$YMAX_a= 227348
##$YMIN_a= -181895
##$ZGOPTNS= <>
##$ZL1= 120
##$ZL2= 120
##$ZL3= 120
##$ZL4= 120
##$ABSF1= 15.50009
##$ABSF2= -2.55176
##$ABSG= 5
##$ABSL= 3
##$ALPHA= 0
##$AQORDER= 0
##$ASSFAC= 0
##$ASSFACI= 0
##$ASSFACX= 0
##$ASSWID= 0
##$AUNMP= <proc_1d>
##$AZFE= 0.1
##$AZFW= 0.1
##$BCFW= 0
##$BC_mod= 2
##$BYTORDP= 0
##$COROFFS= 0
##$CY= -3
##$DATMOD= 1
##$DC= 0
##$DFILT= <>
##$DTYPP= 0
##$F1P= 0
##$F2P= 0
##$FCOR= 1
##$FTSIZE= 16384
##$FT_mod= 6
##$GAMMA= 0
##$GB= 0
##$INTBC= 1
##$INTSCL= 3.70164e-10
##$ISEN= 128
##$LB= 0.24
##$LEV0= 0
##$LPBIN= 0
##$MAXI= 10000
##$MC2= 0
##$MEAN= 0
##$ME_mod= 0
##$MI= 1.114404
##$NCOEF= 0
##$NC_proc= -7
##$NLEV= 6
##$NOISF1= 3.799351
##$NOISF2= 2.8
##$NSP= 0
##$NTH_PI= 0
##$NZP= 0
##$OFFSET= 15.42737
##$PC= 1
##$PHC0= -24589.15
##$PHC1= 10.25273
##$PH_mod= 1
##$PKNL= yes
##$PPARMOD= 0
##$PSCAL= 0
##$PSIGN= 0
##$REVERSE= no
##$SF= 200.130018878943
##$SI= 16384
##$SIGF1= 3
##$SIGF2= 2
##$SINO= 5.538805
##$SIOLD= 16384
##$SREGLST= <1H.CDCl3>
##$SSB= 0
##$STSI= 16384
##$STSR= 0
##$SW_p= 3612.71676300578
##$SYMM= 0
##$S_DEV= 0
##$TDeff= 16384
##$TDoff= 0
##$TI= <>
##$TILT= no
##$TM1= 0
##$TM2= 0
##$TOPLEV= 0
##$USERP1= <user>
##$USERP2= <user>
##$USERP3= <user>
##$USERP4= <user>
##$USERP5= <user>
##$WDW= 1
##$XDIM= 16384
##$YMAX_p= 323929342
##$YMIN_p= -1526129
$$ End of Bruker specific parameters
$$ ---------------------------------
##NTUPLES= NMR SPECTRUM
##VAR_NAME=  FREQUENCY,     SPECTRUM/REAL,   SPECTRUM/IMAG
##SYMBOL=    X,             R,               I
##VAR_TYPE=  INDEPENDENT,   DEPENDENT,       DEPENDENT
##VAR_FORM=  AFFN,          ASDF,            ASDF
##VAR_DIM=   16384,         16384,           16384
##UNITS=     HZ,            ARBITRARY UNITS, ARBITRARY UNITS
##FACTOR=    0.220516191357247, 1,           1
##FIRST=     3087.47986364395, 0,            0
##LAST=      -525.23689936183, 0,            0
##MIN=       -525.23689936183, -1526129,     0
##MAX=       3087.47986364395, 323929342,    0
$$ Real data points
##PAGE= N=1
##DATA TABLE= (X++(R..R)), XYDATA
$$ [...]
10276 41568 -166575 -129774 -92959 1856 -31599 -255630 -136352 106258 103259 100151 156736
10265 156736 41959 -53526 -91950 -59673 -119553 -90383 87725 26975 74952 -67426 -87908
10254 -87908 -26082 -144225 -216042 -46082 263 95459 62958 92747 -63077 -142078 -235650
10243 -235650 83855 109040 163732 37832 -13538 114166 -23914 105235 202688 182633
10233 182633 205504 191243 97272 103418 28221 -47335 1943 -101486 -122681 -12520 17120
10222 17120 67605 8824 71499 195071 102408 207659 203456 204220 350143 158548 224719
10211 224719 189384 -17727 98109 286868 376515 250187 219266 241358 153938 187317 8328
10200 8328 -198318 -36620 -97952 -45195 65289 103759 218640 163744 200024 173900 208694
10189 208694 162176 22508 63788 46316 7127 147084 124594 111440 98486 101678 76806
10178 76806 184766 310263 126043 153260 -5944 63476 357750 246360 189168 26836
10168 26836 98742 274950 156368 148964 166669 259769 423588 345648 71825 88778 161399
10157 161399 178619 262257 93274 85399 -20294 -6760 -255 54990 159246 43238 -84910
10146 -84910 -19588 211257 273901 315190 213264 109335 38824 99937 -837 180586 169764
10135 169764 115557 -19149 -21889 30653 18265 -58955 7262 135563 134192 255412 291200
10124 291200 285728 15584 49055 -1909 141801 327782 114535 253898 223878 276843 267498
10113 267498 222431 208666 -154508 -77091 -49540 -84885 -248941 -235746 -86409 110983 152955
10102 152955 135000 214952 242437 93727 99705 123514 115690 117469 151086 158792 123419 149395
10090 149395 115181 41359 -56187 154473 281021 -28987 -317970 -54687 204751 -4944
10080 -4944 53533 97949 -3175 129705 100051 154921 110245 106529 33410 -105223 -264955
10069 -264955 -55696 1082 -171655 -151800 -137933 32681 23233 171181 256030 298501 266543
10058 266543 91013 89017 225022 259071 157360 343969 227532 279028 102479 37544
10048 37544 181015 227252 49803 16297 89673 15636 74146 219116 226149 242613 187514
10037 187514 104585 153588 80046 130631 83542 133637 440638 480566 455859 418849 148393
10026 148393 153089 96451 339640 428763 262523 173508 171193 369047 292816 279454 265186
10015 265186 249087 197082 23376 100435 256311 219191 32861 24585 38431 77530 53865
10004 53865 127527 182891 -22945 34681 152080 71896 -152456 177414 316587 160600
9994 160600 209312 252326 139272 95462 39892 47779 70387 -21719 215988 -8477 122608
9983 122608 49439 135351 201986 343824 276218 -6702 82402 56017 -11754 212775 265554
9972 265554 206626 89718 -51550 263950 53487 47982 190974 10732 46983 -106300
9962 -106300 101209 -57068 -1881 139620 124674 117653 316686 457983 168909 30848
9952 30848 286934 204308 -27833 202858 133390 35976 -4184 -9715 149866 118057 -34559
9941 -34559 74229 121934 -44253 -12384 71954 197550 377080 225281 289294 600060 475310
9930 475310 329231 402175 147922 235680 373263 225995 71239 130822 123144 231768 360996
9919 360996 288124 173702 219373 125586 233347 292254 267475 374043 319687 295647 293373
9908 293373 101728 87074 11613 71112 263727 171125 102735 152747 114785 99546 221169
9897 221169 356484 261230 210939 321514 166906 36073 1472 253989 314377 268069 411489
9886 411489 384516 406327 216170 130674 157945 193972 123887 314766 466721 268033 310089
9875 310089 301242 111364 164442 248229 571396 621311 510311 337158 453206 347613 419110
9864 419110 548761 393528 418614 395363 213989 327496 300751 98458 283585 517903
9854 517903 301735 373887 486467 270301 292186 174876 239840 188265 153139 159609 370963
9843 370963 353766 533233 326543 85637 223829 324530 372422 609033 558704 209839
9833 209839 365722 303864 413082 358003 374896 482968 423034 589442 493760 431951 340582
9822 340582 382223 266281 299603 490289 415290 343798 338760 334349 262431 426684 481246
9811 481246 378080 359801 86242 258709 263509 463593 430242 523145 568649 553248 489377
9800 489377 643888 619106 598802 650696 528414 780645 653154 467493 474885 556917 602628
9789 602628 403758 462706 405883 341607 405052 338561 577565 642075 618130 509339 350201
9778 350201 395436 547307 628470 471600 384417 352851 487851 787957 699228 461354 575926
9767 575926 743280 724677 510859 509377 627430 635753 601815 427778 526156 623064 700637
9756 700637 582662 660458 545847 618397 665399 762067 853410 719564 562220 653758 656261
9745 656261 788450 804398 744438 826011 624022 631262 541951 591745 883227 949446 892467
9734 892467 633511 772948 985139 815117 696005 657674 795274 613593 396980 706717
9724 706717 1126145 1014730 502053 531104 468554 590510 578202 768562 649484 505533
9714 505533 576737 546370 772962 839662 899605 845505 748848 565412 605190 852091 822746
9703 822746 1004757 1113749 865864 735199 730687 912589 814516 880679 924011 885046 826266
9692 826266 815033 835578 690591 761486 894926 677928 668571 602622 606288 536108 728978
9681 728978 809674 830790 816602 595837 508662 657303 793498 863959 853364 747480 762049
9670 762049 787478 806625 897469 836717 891157 705607 724157 711616 578294 589018 661721
9659 661721 757661 876309 816758 787896 979367 791918 623932 522205 483029 711061
9649 711061 589933 727657 637624 516678 545002 567506 899099 815352 854705 808569 742878
9638 742878 631317 897213 949552 1040821 994140 967370 884844 881139 727437 680703 879462
9627 879462 727413 529163 829494 1015764 1018054 836684 656270 659268 618606 677598 765231
9616 765231 840599 794077 597316 673979 754175 633845 731287 959284 1052207 908732 734937
9605 734937 827063 795911 667685 639035 601239 871620 903615 982802 796063 873806 899404
9594 899404 833275 1039275 1006803 1058549 1006294 874352 896805 848755 939455 1110483 1047627
9583 1047627 1155049 1218384 1030635 1148267 1082937 1019347 933249 828942 1040969 1049286 951752
9572 951752 1150465 1117133 1270089 1199036 947992 942933 789500 1042282 1176626 1319746
9562 1319746 1012176 1056636 1236846 1074427 1173533 1265562 1237630 1142898 1039777 1300130
9552 1300130 1291280 1251646 1233921 1132643 1075311 1173313 1246943 1287925 1190305 1162306 1231942
9541 1231942 1390799 1409944 1128723 1324308 1368358 1410868 1444905 1421435 1405084 1420164 1186940
9530 1186940 1394437 1392157 1508529 1522499 1464639 1628314 1777297 2052538 1964494 1921196 1898762
9519 1898762 1877445 1826919 1772353 1662324 1775603 1910650 1737457 1802919 1774234 1783701 1660488
9508 1660488 1529433 1558723 1640564 1819213 1969701 1849981 1760380 1695571 1746485 1721041 1803983
9497 1803983 1916101 1890397 1913821 1763165 1827840 1938136 2050885 2025542 2024015 2152626 2014916
9486 2014916 2101374 2160795 2266521 2439627 2346628 2293185 2264759 2053426 2092688 2256784 2197518
9475 2197518 2058622 2066218 2109148 2175508 1999871 2090663 2294514 2042621 2250495 2177078 2195011
9464 2195011 2315480 2381666 2472599 2311933 2496839 2517725 2469280 2433874 2385518 2254153 2232205
9453 2232205 2316841 2388495 2444674 2587671 2575281 2237885 2359151 2143213 2431469 2844314
9443 2844314 2813993 2632088 2741949 2836000 2746662 2708076 2699435 2564981 2666692 2677694 2799288
9432 2799288 2672531 2757251 2828340 2849088 2951625 2928940 3013020 3135811 3166388 3121238 3164961
9421 3164961 3191654 3269117 3141677 3291689 3316510 3401247 3533664 3538805 3551882 3481204 3496854
9410 3496854 3456607 3555478 3705952 3822204 3718977 3738790 3802625 3900261 3962848 3878647 3992838
9399 3992838 4122059 4231336 4289648 4329790 4140678 4321386 4320712 4444930 4416607 4542417 4436404
9388 4436404 4381865 4613043 4697601 4797471 4882052 4898960 5089374 5046017 5147274 5280460 5230655
9377 5230655 5285027 5196839 5422292 5638315 5826592 6017319 6131236 6000391 5960963 6094753
9367 6094753 6204220 6369119 6440121 6567836 6616604 6762130 6729149 6897604 6983253 7139625
9357 7139625 7245017 7334835 7506747 7596330 7567919 7506842 7757374 7989637 8198152 8072118
9347 8072118 8229125 8277550 8436679 8522088 8738460 8725532 9010430 9413254 9409469 9362009 9509983
9336 9509983 9703632 9907591 9916501 10213512 10429921 10445277 10803572 10862315 11148914 11351840
9326 11351840 11496351 11852519 11854382 12105729 12365467 12563147 12780821 12957816 13036203 13260477
9316 13260477 13345179 13532202 13817327 14036774 14337818 14860001 14979689 15216458 15560978 15569910
9306 15569910 16184655 16360547 16827177 17107198 17530789 17808908 18097851 18198358 18477089
9297 18477089 19041728 19366730 19889960 20494705 21034307 21324111 21949703 22228241 22573415
9288 22573415 23051915 23585919 23936342 24678814 25409396 25667915 26042978 26645499 27295264
9279 27295264 27970239 28725449 29250141 29882011 30289668 30806944 31347059 31962017 32722137
9270 32722137 33599681 34121745 34733457 35490934 36212068 36905525 37610560 38259759 38925771
9261 38925771 39542717 40253633 40895064 41443358 42200250 43001568 43324797 43823390 44517688
9252 44517688 45060203 45425796 45902222 46173343 46375230 46707724 46928636 47348678 47365628 47183043
9242 47183043 47019358 47072900 47053010 46947974 46924279 46786918 46391613 45915326 45650035 45427652
9232 45427652 44863829 44487981 44127714 43620573 43234947 42699449 42074717 41377328 40721742
9223 40721742 40033171 39597943 38836112 38075476 37551363 37006292 36408553 35822175 35245052
9214 35245052 34773856 34377320 34030471 33620141 33298323 33136651 32966652 32712663 32573263
9205 32573263 32507692 32263988 31978595 31996155 32099364 32006048 32006683 32245987 32506294 32412913 32421947
9194 32421947 32411957 32568900 32473710 32683028 32831231 32987146 33169491 33597690 34243608 34866077
9184 34866077 35343866 35993015 36633655 37056894 37638700 38441714 39359943 40619212 42471643
9175 42471643 44685302 47333628 50944111 55260383 60343648 65004485 69168686 73159741
9167 73159741 76072380 76899394 76924142 76612359 76046667 74669539 72327577 69854313 67447604
9158 67447604 64830325 61946712 59921561 58845426 58752484 59421307 60395761 60835676 60771279
9149 60771279 60338702 59226873 57825304 56970248 56951292 58151728 60614034 64358976 68559094
9140 68559094 72637021 76206366 78433821 78767550 77204478 75040373 72518338 70145184
9132 70145184 69057343 69347181 71120716 73354041 75267019 76861265 77283511 75150079
9124 75150079 71086552 66198162 60368843 54196362 48724907 43801257 39396022 36086248
9116 36086248 33754532 31860589 30460285 29059507 27887726 27485752 27177500 26620066 26055345
9107 26055345 25400985 24499686 23398858 22295665 21174060 20090366 19049579 18272565 17649828
9098 17649828 17347744 16888766 16794158 16797763 16733507 16719432 16742239 16574266 16445278 16284363
9088 16284363 16168177 15945728 15759952 15543447 15065370 14916529 14886480 14759023 14606331 14280624
9078 14280624 13765692 13545096 13199266 12987726 12859436 12646262 12193732 11897959 11709943
9069 11709943 11362117 11286973 11067324 10882192 10627602 10566123 10437159 10531344 10432491 10321253
9059 10321253 10289024 10168426 10054685 10031893 10036215 9935337 10005138 10219268 10271922 10339730 10586006
9048 10586006 10671713 10953693 11016779 11025157 11050800 11009184 10967565 10848701 10745195 10726196 10537890
9037 10537890 10584996 10598708 10605743 10653091 10737614 10754234 10738961 10899069 11019960 11093510 11150182
9026 11150182 11218214 11234074 11131193 11242461 11444489 11496097 11495232 11679559 11773269 11926385 11797083
9015 11797083 11800848 12057453 12358872 12473418 12684084 12611906 12840792 12939635 13185274 13381378
9005 13381378 13693356 13881063 13899729 14424754 14777098 15107403 15456063 15998553 16256875 16468079
8995 16468079 16850501 17316442 17834224 18505954 19098832 19932281 20396661 21226789 22085753
8986 22085753 22710140 23104220 23491589 23848406 24174453 24926570 25645578 26446137 27603020
8977 27603020 28944051 30336192 31998075 34495236 37657659 41475920 46032081 51389196
8969 51389196 56297166 58970038 60721016 61840507 61277962 59470828 57809237 56775291
8961 56775291 57440033 59943405 63988040 68346325 70830309 71511282 70451548 66612573
8953 66612573 61876227 57398048 53593275 51124085 49896458 49756113 50359100 51990996
8945 51990996 54508489 58039061 62128925 65958563 67679449 67057983 65229158 63744439
8937 63744439 63869714 65758105 69838328 75528342 83807207 92467197 98807916 103449819
8929 103449819 108938001 115634622 121273087 123339792 120811839 114526486 103730642 90789817
8921 90789817 78469639 67853031 59692214 53638020 49230576 46250173 43613773 41894059
8913 41894059 40672201 40045548 39889177 39462566 38032325 35959249 34099814 32197584 30371683
8904 30371683 28978269 27824365 26981095 26665216 26208481 25674086 25356570 25044336 25055910
8895 25055910 24641067 24390462 24672522 24866136 25308013 25552215 25765044 26026559 25952111 25767184
8885 25767184 25598166 25386636 25329170 25586360 25653362 25887666 26478418 26987447 27872805 28496483
8875 28496483 29471116 30751310 32276971 34202189 36619472 39391020 41893827 42971484
8867 42971484 43203918 43181315 43399417 44685644 46980260 50003792 53021395 54615760 54057939
8858 54057939 51708765 48760028 46289087 44688075 43530553 43016417 43104421 43596146 44575232
8849 44575232 45986733 47469293 49395832 51665263 54123799 57595625 62009581 67552176
8841 67552176 74231255 82709277 93007399 104449290 112777935 114209051 110837031 105802157
8833 105802157 102494199 102723966 106615621 113431966 121635948 127263265 129217954 129930959
8825 129930959 131516705 133343545 128492666 118703300 107737961 97584184 90885523 86824654
8817 86824654 85202144 85937948 88970070 94328672 101950355 113007083 127387990 142172479
8809 142172479 146003057 136463963 121905303 106032268 93169333 84570601 78959155 75984734
8801 75984734 74459144 74626975 76823175 80639628 86473279 94238375 102906448 109639899
8793 109639899 113460371 116015323 113500844 105623013 96404118 87905572 82300319 80121257
8785 80121257 80664021 82856646 81908259 75441937 67512156 58797486 51614166 46334728
8777 46334728 42339988 39089065 36491609 34269688 32396333 30703502 29485966 28588182
8769 28588182 27641414 27153485 26947612 26689870 26441234 26850711 27422446 28387095 29855971
8760 29855971 31588835 31651383 30349827 28276851 26226178 24822664 23966991 24111144 24164631
8751 24164631 23405851 21839571 20177115 18254711 16741011 15692222 14771075 14058537 13434640
8742 13434640 12852379 12489959 12286509 11732456 11222562 10803487 10427870 10157639 9943772
8733 9943772 9650072 9344078 8847560 8501186 8236303 8185841 8069498 8012271 7797293 7514868
8723 7514868 7293991 7195260 7055038 6758750 6723095 6590039 6387134 6258450 6407829 6487603
8713 6487603 6396415 6205786 6164061 6059001 5924894 5749691 5771051 5803907 5770478 5448749
8703 5448749 5175595 5191745 5092308 4997380 4888327 4928310 4816780 4513812 4498178 4301344
8693 4301344 4338302 4220393 4082097 4059548 3948168 3923720 3913390 4112902 4098449 3999563 3881302
8682 3881302 3687684 3649529 3849769 3783080 3623554 3545222 3750456 3771350 3723105 3558324
8672 3558324 3549094 3531449 3426742 3330877 3289360 3295017 3117482 3238521 3386600 3325312 3059100
8661 3059100 2973069 2957586 2905850 2790465 2522072 2478023 2692555 2948463 2997086 2835975
8651 2835975 2770364 2706742 2510192 2353573 2364133 2409083 2543464 2613702 2753411 2770309 2676126
8640 2676126 2791062 2934481 2847797 3022402 3036062 2995480 3028810 2898672 2970300 2996448 2936332
8629 2936332 2904215 2594464 2707166 2671864 2510860 2448579 2359333 2466453 2446282 2441928 2430832
8618 2430832 2379048 2297034 2144687 2154665 2157873 2139845 2150021 2202120 2334726 2444727 2346163
8607 2346163 2418453 2575860 2606579 2735963 2728950 2837940 2724534 2720674 2639463 2704214 2439554
8596 2439554 2447774 2503680 2578910 2389684 2527535 2406990 2311131 2263023 2339076 2288455 2379626
8585 2379626 2472482 2045344 1989344 2016259 1782503 1955455 2008448 1888128 2018302 1961288
8575 1961288 1954800 1952484 1876818 1758555 1795781 1727593 1813922 1897964 1926559 2045451 2045695 1968073
8563 1968073 2082921 2143142 2184894 2150612 2161948 2213523 2001931 1898245 1960807 1714681 1584348
8552 1584348 1574196 1461162 1436280 1415957 1244505 1126504 984892 1199338 1185943 1225825
8542 1225825 1135418 1312604 1304144 1405670 1304368 1011245 1011550 1043280 1078805 984359 1053526
8531 1053526 1167643 1181179 1114064 1125243 1028267 1048603 1278537 1161278 990863 1171344
8521 1171344 1157137 1309561 1128938 1037914 1081063 881116 676270 706310 568183 713971
8511 713971 768521 826055 1007478 976427 960365 801579 829623 702824 944071 1056417 877610
8500 877610 648992 626153 746106 884973 865186 899008 807032 677988 581298 819080 934573
8489 934573 1017909 1030590 860766 934792 838591 791206 1053553 1047647 908523 836188 1037738
8478 1037738 1168240 918283 848696 978309 795277 865268 1030184 1132991 1337449 1534458
8468 1534458 1431133 1284298 1339900 1396760 1281061 1380418 1296618 1013406 1093059 1258283
8458 1258283 1164294 747454 790148 755607 829541 765724 728491 835156 853453 718463 669686
8447 669686 497623 678143 695362 865447 959680 957738 848274 950830 1124002 1154535 1230273
8436 1230273 1280950 1135333 1109238 1021082 925157 993450 988182 1125362 1152330 925935 815753
8425 815753 718703 532068 680416 540800 410472 424146 445578 459406 528896 717383 731495
8414 731495 576141 516751 494803 733812 548742 433696 353654 619109 747251 637642
8404 637642 508855 579618 630793 542695 631573 422760 676245 840987 868323 599588 683069
8393 683069 747959 722312 625021 589055 538098 444851 534607 369419 438024 374160 517621
8382 517621 538007 451664 568974 371874 157797 371470 436526 398660 606268 620204 681392
8371 681392 588810 324801 347654 558376 615762 603836 661509 532765 287726 443511 481153
8360 481153 387034 460021 549333 268358 282044 238168 151660 119952 120551 90528 389204 411114
8348 411114 371549 342137 369288 389347 317020 451734 501060 583386 584129 699276 520698
8337 520698 529987 577850 528877 413022 393261 513360 605532 430409 396898 343815 148424
8326 148424 218273 209204 238150 396985 467055 525722 426197 321588 153710 141389 202054
8315 202054 267337 224225 131045 103604 219615 -577 103191 186156 307798 13890 136976
8304 136976 60180 171733 190344 14082 -12623 173552 234224 24593 159333 211398 308195
8293 308195 180793 197864 144341 220380 106211 108251 268066 235184 97657 281751 315101
8282 315101 175803 -27675 10344 57792 175372 213296 155182 49696 -102739 -127537 139435
8271 139435 103599 148794 -28607 55119 394621 26711 -93082 -36927 -21160 44536 203154
8260 203154 131545 -5050 -65621 -52148 -39513 180800 40864 -93314 -84165 -52557 -180635
8249 -180635 -53822 28864 -56635 -64965 -108836 -70127 -77835 17250 241046 184010 -32704
8238 -32704 156432 -7705 -15013 -73138 -87550 90174 -7532 -48822 -55343 -105201 -22272 -65100
8226 -65100 -6452 21347 60948 91909 -41936 -223993 -33678 -52267 -103915 14798 -38202
8215 -38202 -71967 -43330 -222467 -343706 -298246 -323141 -355212 -121458 -21126 -33494 -181774
8204 -181774 -275280 -204421 -200288 -293520 -328455 -383425 -176071 -202382 -85096 -488088 -778951
8193 -778951 -1526129 -1349961 458082 358202 394866 249002 246115 152585 66252 -37913 140915
8182 140915 154766 136587 166878 140026 79106 -5577 -65910 -41745 100093 49172 -110592
8171 -110592 -104941 -187227 -195219 -173449 -21862 110239 -29116 32565 -70367 -84225 -91492
8160 -91492 -145274 -221894 -207599 -248803 -392770 -245718 -101044 -106326 -147962 -134602 -23069
8149 -23069 29667 25152 43710 -76043 -87617 64528 -116250 63683 162794 293722 2657
8138 2657 -5537 -80408 -94248 -32531 289049 221246 263325 111965 95503 216548 147106 131322
8126 131322 85569 80133 -22022 -26626 -39714 -66796 -76522 -122911 -66215 12390 128756 27771
8114 27771 135491 193300 102454 135500 12994 108081 -140482 -242354 -49828 4196 -8692
8103 -8692 164516 -4073 111752 76281 -19067 122861 193125 -39756 112572 281967 304671
8092 304671 339392 186543 154211 111072 -200949 -167820 33582 162332 -14132 -114218
8082 -114218 -60086 12977 105972 44210 -49816 -134586 -204574 -212613 -291184 -8196 141135
8071 141135 161172 -59875 -134678 -119345 -36795 -118018 -149940 -54995 7244 -166950 -79251
8060 -79251 -28594 -93854 -57861 -150570 10796 -133444 -35549 -19161 48910 144734 180024
8049 180024 107401 198860 17579 -120381 -278467 -180686 -48752 -235973 -65034 4296
8039 4296 -160967 -42792 -11015 -93750 82627 340091 312920 128791 125221 -65247 -64830
8028 -64830 -177228 -165392 -17581 -1908 -189932 -39963 127166 1211 29633 -197408
8018 -197408 -149358 -164025 -128836 -231547 -148028 -177662 -346425 -6127 -111815 105357 77743
8007 77743 -95803 232520 217025 248062 76170 108644 -57691 -173203 -134310 96508 -84216
7996 -84216 -194616 169132 146742 -44402 -85890 -137114 -200431 -145499 -290597 -121936 -125717
7985 -125717 -185523 -21130 199835 -12086 134980 -10759 -102731 21220 21144 68053 -231169
7974 -231169 -395214 -259904 -71319 13348 -88905 -179314 -159273 -141653 -150961 -191530 -197569
7963 -197569 -180659 81156 -2647 -78434 -174539 -100628 -112413 -250274 -190302 603 -61695
7952 -61695 -74289 -40518 -26614 -33529 85571 -104550 -166499 -192446 -64240 -31207 19750
7941 19750 221215 118758 119721 -62448 -71690 -246960 -401597 -24743 49862 -1350 -70611
7930 -70611 4862 -2623 -31415 -75836 37284 -53032 -248917 -250501 -269493 -109872 -171658 -98675
7918 -98675 -66368 -83782 -141453 -83105 64472 83998 48190 -89505 -243081 -182883 -58105
7907 -58105 79401 -13172 -159021 -49577 115310 26056 -84455 -144874 8692 -132288
7897 -132288 35276 151190 -63563 -143136 -140492 -119206 32002 -10616 -99739 -64824 11237
7886 11237 -29166 -357950 -346007 -149644 -18760 108637 -3772 -55349 -78840 -220017 -148333
7875 -148333 -194003 -153080 69365 1970 -4001 -126468 -32650 31603 -233057 -170079 -19376
7864 -19376 -184416 -239007 -95140 -145311 -172238 62627 57917 133036 -53237 -15973 -101224
7853 -101224 -353501 -276236 -230486 -245324 -56210 77873 44892 8756 124665 128718 8537
7842 8537 21212 -269138 -274144 -347385 -301078 -298123 -261802 -218545 -234309 -107939 -97186 14021
7830 14021 112773 -66494 -79771 21207 7893 20798 -97382 -275858 -211122 2695 133458
7819 133458 -178216 -232703 -284446 -251783 -4198 -18904 -58767 -186023 -32844 2352 86088
7808 86088 10913 -254005 -341834 -309669 -242557 -402357 15414 -40191 -18852 -83901 92174
7797 92174 52801 -101586 -147768 -6723 -133602 -255601 -148493 -93912 -202507 -190933 -197798
7786 -197798 -253506 -112473 -153087 -186593 -306547 -83494 -237410 7298 143963 -172280
7776 -172280 -373971 -249930 -324403 -133221 17064 89080 23955 -41859 -119894 -150973 -294656
7765 -294656 -48282 117743 39114 93979 122536 -31589 84836 48716 -227680 -86809
7755 -86809 -40603 197238 105819 56492 44244 -131898 -253235 -36468 -40156 -230960 -267122
7744 -267122 -152504 -129619 -338471 -242311 -272180 -223030 -100280 -105763 -70360 -86938 12099
7733 12099 95862 -142619 -62470 -181943 -182212 -216177 -314272 -104819 109446 59965 -128237
7722 -128237 -186333 -355994 -341947 -219417 21391 62355 -54599 -85881 105538 -152273
7712 -152273 22622 -115741 2623 -108452 -203643 -33611 -42196 -337044 -370035 -44542
7702 -44542 -72505 -128966 -6029 113063 -127949 -121548 -58822 -113326 -211040 104904 196501
7691 196501 171313 52811 17291 -43078 -47055 -110557 -84233 137725 -41289 -212101 104917
7680 104917 62344 -82355 53314 -158101 -177622 -176520 -93243 -22507 5672 -76917 -221055
7669 -221055 -195880 19503 -100677 -247997 -158375 -212948 -66444 -127064 -201315 -323369 -141447
7658 -141447 190736 158087 -101949 -120094 -317626 -129505 -191942 53093 -4246 -121226
7648 -121226 19104 18636 -112475 -222781 44162 -46893 -57457 38384 54234 -194832 -195625
7637 -195625 -211254 -198494 -196587 -176721 -122063 199177 219880 207650 -8011 81548 -14510
7626 -14510 -93478 -17241 -88094 -210399 -31349 -163591 -23053 4949 -160218 -46060 -124445
7615 -124445 -145951 -158595 -103420 -104291 51194 -185543 29819 26940 -42355 -213230 -165272
7604 -165272 110594 110670 57641 139932 -43345 9029 157427 191228 184993 125266 144827 62131
7592 62131 -172720 -137262 -193187 -240426 -104481 -111192 -137972 112850 121231 5810 122673
7581 122673 107416 -139635 -232180 10598 45179 -243755 -313807 -179833 -120765 -92089 -144610
7570 -144610 -267384 -299099 -221260 -274050 -134499 -221985 -305426 -232437 -235237 -166459 -57109
7559 -57109 -103153 43397 -41439 -95738 -278702 -109082 -201061 -161640 -39389 -229559 -33042
7548 -33042 -101451 -60786 -25064 29650 -74574 -171671 -335033 -171323 133738 74773 15135
7537 15135 -1007 6546 -193866 15710 26911 -127470 -119487 -56662 -66791 -106780 -183622 -302135
7525 -302135 22644 179216 57741 -29671 32416 145064 58818 -89974 -17427 92357
7515 92357 163038 -81616 -122386 -187133 -336935 -254354 -100757 -191008 -354220 -144594 -205700
7504 -205700 -216947 -144307 15296 -45389 -218630 -368312 -283181 -250612 -108950 -24949 -118412
7493 -118412 -95200 -110029 -225846 -90737 -214647 -315365 -156080 -98361 -138635 -15535
7483 -15535 -157896 -259946 -71051 -167234 -39565 -42060 161166 217372 32798 -170591 -29545
7472 -29545 -151511 -373735 -250060 -283151 -44802 -186248 -174565 -86038 -86807 -35305 -189343
7461 -189343 -6597 -63121 -134668 -97951 -157704 -160273 -42033 -25695 20921 -154460 -99340
7450 -99340 -126610 -42712 -108429 63570 76221 81532 125426 50660 97841 87639 178422 29661
7438 29661 -66360 -128188 -72084 -132202 -203691 -158063 24827 87660 -85814 -202903 -158535
7427 -158535 -259326 -287888 -248387 -392379 -351645 -251809 -385865 -365514 -220814 -270300 -145784
7416 -145784 -170043 -103434 -21929 56318 41244 14379 2279 -121603 -80827 74858 -76583
7405 -76583 -215761 -195519 -141838 -181141 -129453 30242 -42741 -86638 -285391 -269671 -93364
7394 -93364 -53779 -146187 -79593 -225863 -264545 -368111 -15905 38697 -168528 -360802 -162122
7383 -162122 87559 64729 -118504 -60160 -154033 -47667 18678 -69571 60712 -88230 -186580
7372 -186580 -112339 -51913 -135138 -99622 -155113 -198155 -237969 -57378 -213316 -230927 -361725
7361 -361725 -116786 -177291 -204754 69628 25255 -165515 -283558 -211744 -229209 -157227 -284058
7350 -284058 -105868 880 -152245 -14768 -231581 -147096 -235873 -218622 -250543 -98316
7340 -98316 24421 -282386 -176227 -165452 -82388 -123098 -300404 -555268 -582835 -378656 -245833
7329 -245833 -118284 -196071 -227735 -213528 -190748 -80413 -328625 -320683 -81366 5388 -161416
7318 -161416 -117978 -42385 102457 25032 23498 -194649 -167282 -155285 82036 209851 -6579
7307 -6579 -127139 -267644 -184713 -386535 -111280 -3305 -166001 -126925 -98847 -295667 -98730
7296 -98730 44577 -248168 -121634 164060 101767 206167 138716 24470 42797 -187627
7286 -187627 -190123 -39255 -203563 -166444 -69433 -67630 -17924 -55060 32942 -75896 -73745 32231
7274 32231 -70877 -173525 -194707 -183976 -162144 -111671 -20796 25079 132298 130091 -167201
7263 -167201 -24082 -56046 -294658 -130235 -1753 92355 -66385 -129847 -151495 3868
7253 3868 45624 44578 -217574 -185357 -4803 -15112 77704 -37166 -108336 -285967 -484405
7242 -484405 -397925 -286081 -253237 -145609 -155358 -176464 -96664 -149798 -193534 -121853 -26054
7231 -26054 -165346 -292762 -263001 -218463 26055 127074 -42323 -195957 134720 -77506
7221 -77506 -143691 11131 74020 180944 54481 -132742 -127397 -185757 -127738 -135505 -225479
7210 -225479 -267748 -120247 -149443 -139249 -15588 5107 -62018 54604 -16992 -218943 -217078
7199 -217078 -108789 -125025 -197823 -83553 53644 13741 -106768 -157091 -81734 80978 33334
7188 33334 34191 16238 35573 -17314 -42806 94177 85132 101287 13818 -9142 -30756 19167
7176 19167 92429 4336 -5068 -15606 -278480 -502080 -282931 -215496 18056 -69581 -236606
7165 -236606 -131389 -132178 -190374 8234 -23916 -37617 -248053 -247911 -91527 -209381 -82049
7154 -82049 -133039 -265186 -56916 94745 19753 49194 -72771 -160576 20681 -161563 -52486
7143 -52486 -31892 -108632 -172401 -332353 -194477 57444 -91058 -185875 -103111 -62059 -77841
7132 -77841 -97998 -101626 -44963 -172612 -286462 -55752 53668 58965 43365 -124768 -187394
7121 -187394 -159133 16882 75100 -111140 -86248 -150423 -148564 -220688 -49218 -30949 3404
7110 3404 -36273 -30097 91484 -167316 -142328 -287530 -38276 28892 77696 184748 175450
7099 175450 -46605 -59643 -87843 -277050 -67278 -156806 -205567 1430 35059 -143179 -124283
7088 -124283 2714 71238 -70417 -57780 -227591 -133638 54946 -137704 -330173 -153402
7078 -153402 -14527 -67601 52615 134466 67300 40486 -81807 -52207 -24747 -218999 -161696
7067 -161696 111383 -18637 -169644 -315523 -128006 -147816 -172297 -113489 -49816 -134902 -170999
7056 -170999 -100668 -91398 54523 -56557 -158133 -205375 -195765 -266926 -112295 -28136 -169299
7045 -169299 -173814 -218624 -15527 161417 97910 47032 20391 -191278 -150256 -104913 -120305
7034 -120305 -121880 -272800 -90523 -30405 -81903 -42302 -206178 -79580 95964 -55370 -44770
7023 -44770 62116 -168998 -230926 -283654 -250523 -316974 -249619 -409956 -222069 67619 80745
7012 80745 121 -88600 -208133 -238273 -131904 -196558 -123870 12250 -42255 -131345 -32056
7001 -32056 89763 -4675 -343580 -44622 -9630 -52508 -148128 57671 -89119 -261076 -318013
6990 -318013 -312481 -170947 -307710 -189870 14823 -57034 -18695 -103181 5936 -23511 89932
6979 89932 107711 -65047 -144007 -252177 -272666 -214536 -88128 -55792 10841 28586 -43644
6968 -43644 -175443 -171994 -161657 -261175 -247651 -163049 -165845 -73332 -102200 -308027 -229117 -163190
6956 -163190 -141851 -275097 -236270 -156614 -51961 152473 133346 -36007 40850 70666 -36474
6945 -36474 15461 76169 4953 398 122239 69969 -41027 12983 -70799 -257450 -413425
6934 -413425 -226584 -73408 67638 87143 -87214 -223578 -22377 -56576 -52053 -258655
6924 -258655 -244816 -59873 -245218 -77836 -196035 -164926 -54040 -121043 -187460 -239687 -276654
6913 -276654 -212800 -278646 -262438 -147388 29111 -4439 39411 -148507 -146823 -132721 -104653
6902 -104653 -226364 -98512 20646 -56694 -101558 -105381 -140183 -51780 -69228 -12984 -54652
6891 -54652 -40968 -122600 -45526 -78010 -209951 -161811 -212662 -197542 -65166 -103950 42132
6880 42132 -111983 -195591 -125180 -50292 34756 -46152 -97140 -73315 -2740 115870 196647
6869 196647 -237852 -129798 -180827 -208312 -138905 -286578 -223329 -301522 -283974 -40781 -7610
6858 -7610 -125714 -378610 -291532 -229271 -2135 173855 5408 -390373 -303914 -93140 -151341
6847 -151341 -133675 -141365 -86903 -140074 -14584 -4788 -144637 -153527 -25918 71309 121940 -127535
6835 -127535 -94416 83536 102829 -86784 -264980 -479026 -469477 -392126 -189122 171467 291087
6824 291087 154737 71689 29618 -142196 27303 116718 92417 -89039 -135040 -255866 -53210
6813 -53210 139583 230085 168917 136635 90750 85545 108863 -22776 -253916 -102098 -3349
6802 -3349 -137715 -80235 -234655 -254616 -181701 -94 271358 33751 -1973 25973 -273237
6791 -273237 -254313 9908 -1446 -112550 -50743 19777 36893 -13828 -139026 47590 -96424
6780 -96424 -353403 -300537 -82428 -171669 -138104 -33717 -75858 -89735 -179207 -225693 -194728
6769 -194728 -86439 90619 119986 27976 -92804 -253538 -285971 -93196 9528 -184446
6759 -184446 -119323 -195111 -251923 -220849 -13713 -96708 6642 -226810 -116825 69307 -10387
6748 -10387 -137570 -242318 -228521 -82889 70514 49725 -33943 -161843 -237734 -250826 -168501
6737 -168501 -168964 -246492 -212239 -88211 -76418 -142925 -227643 -147635 -286180 -154457 -168595
6726 -168595 -333003 -301461 -97992 -27047 -57799 16386 -124928 -201739 -134915 -210312 -358077
6715 -358077 -361334 -321001 -304424 -257336 -218213 -186019 -123885 -83290 -241716 -276344 -16424
6704 -16424 101244 -25800 -111214 -85134 -184810 -146815 -26990 31534 -82439 -57297 26325
6693 26325 -119085 -43354 -110364 -129011 11442 158112 10124 52318 91659 -98379 21057
6682 21057 17832 83385 11399 100796 99648 205867 151807 -46588 84245 137706 174644 -23824
6670 -23824 -113806 -79695 -133423 -105598 -185131 -105659 -44977 -204917 -203509 -13840 -80459 -187080
6658 -187080 -136800 -24843 7865 65326 -28637 19432 -18803 -4078 36680 472 13569
6647 13569 -71542 -22003 102204 150941 -185189 -49530 52634 -162187 -249324 -134413 -34057
6636 -34057 -55564 9204 182132 -62309 -24428 -174865 -229011 -202511 -193640 -118622 22946
6625 22946 226567 178298 -40592 -138720 -222012 -189181 -47343 -285282 -197797 -63490 -280558
6614 -280558 -226101 -26582 -58994 155199 248115 178279 -25481 -77728 -89737 -21212 -66049
6603 -66049 3973 18022 194890 24847 -150619 -48881 -112025 168891 181510 88470 102185
6592 102185 24308 1022 187067 132062 -58282 -129766 -153381 -261724 -149272 148406 137740
6581 137740 22325 2153 130540 50860 -2867 55830 70204 35335 187154 66694 -13812
6570 -13812 -53136 -338844 -370150 -82203 -11077 97979 151338 -10541 73308 87146 150975
6559 150975 22433 -178998 -229610 -60697 -148591 -171378 -43858 -134791 -32055 -2026 16154
6548 16154 197302 98887 -11655 3634 -64866 -59671 137138 -31102 -114745 -75724 -70924
6537 -70924 83665 -72300 96256 119041 -139612 -90117 -10980 61872 21563 116231 43030
6526 43030 -46832 -141073 -203730 -212962 -226319 -245727 -173032 -103368 -124000 -44974 135929 -30438
6514 -30438 -178008 -50783 -125803 -23623 -48605 -176121 99071 -98437 -143035 -135795 -53883
6503 -53883 120889 148595 93854 28275 -94286 -28117 95821 -36996 -197089 -28269 120359
6492 120359 -19603 163388 95654 -41917 -65181 -115757 -120736 -200415 -230227 -230835 -142444 181087
6480 181087 294920 339180 -35201 -91068 -187699 -135451 -83597 -16018 61434 -71771 3252
6469 3252 109253 -26133 59890 -135029 -337614 -141816 -26339 -221824 -253698 -14347
6459 -14347 -75574 -137876 -183338 -63507 -75397 -95900 -177650 49684 22327 -106811 -149917
6448 -149917 -134356 -299140 -302506 -30006 -151544 -218576 -268747 -65403 136902 127670 56302
6437 56302 -120981 -161493 -27783 21189 -75542 -40342 -87927 21091 -25939 -39476 -306307
6426 -306307 -371586 -63529 -106933 -74899 60942 -100768 -264238 67078 109971 88206 82917
6415 82917 9207 -55423 66287 -86440 -22379 132423 103148 134295 45907 -245104 -200725
6404 -200725 -177678 -102088 -81789 54213 -130353 -61384 -55836 -14290 230774 99118 85336
6393 85336 -12738 -115906 -25227 -60565 14139 86922 73250 51589 -55153 30313 54297
6382 54297 16378 69762 8361 72309 -67394 -180099 45609 -148388 -173360 -203337 -5178
6371 -5178 183959 75786 29084 89786 -121005 -83314 -108786 -57354 -118575 -35282 -60690
6360 -60690 22800 42651 60936 -53583 118809 158730 82848 -34474 -68667 17392 -163746
6349 -163746 -92814 -68924 -199224 -335306 -220574 -93728 -40382 34146 -89444 -3258 109526
6338 109526 -99996 -197964 -44488 -182269 -104551 79673 163064 19940 8771 117492
6328 117492 -108438 -166 -91701 -124899 97463 188535 208625 265635 76952 245136 215884
6317 215884 97446 24849 1561 46030 251940 110377 -98865 -103652 86702 213781 -36815
6306 -36815 -123564 -106322 49631 52715 65006 208253 311974 335379 221599 10128 -92675
6295 -92675 14646 138040 175164 289381 283918 251892 129257 106556 63999 171760 89392
6284 89392 -151530 -83113 172017 291022 281930 278517 312541 377363 363902 370017 427944 349750
6272 349750 283701 294707 358138 348951 558690 480829 309547 399831 292287 244761 257963
6261 257963 349405 208484 279050 217028 410787 574301 283076 46776 371428 473383
6251 473383 413108 364502 481223 405860 365087 381835 319065 284698 354635 361073 357738 257885
6239 257885 101970 58871 80457 -33674 -46611 339042 444791 457029 62042 76632 334188
6228 334188 147636 152850 97760 137216 146669 160937 157468 129598 134497 418034 260244 23731
6216 23731 142075 152521 194078 245916 389237 102118 55589 -15052 71134 -131330 -20469
6205 -20469 12623 126106 323530 234010 58676 3497 176732 126363 209515 173694 73063
6194 73063 28920 166536 191558 75814 198595 359583 149980 47989 15751 110944 167208
6183 167208 133202 -39405 55836 41228 -29997 41552 227694 114777 236489 315906 260274
6172 260274 249905 86596 41867 182755 204508 -116162 -80850 50002 32686 163744 149951
6161 149951 92576 237651 255876 381940 166985 339035 197367 -12778 22823 81601
6151 81601 -36550 -130452 -42398 133576 101715 -161796 3422 241322 167632 153917 2959
6140 2959 164939 371834 364387 377785 140743 442867 510638 169443 35384 -158751 -206879
6129 -206879 -230874 115047 275863 219471 53760 61997 191754 331328 162124 323905
6119 323905 32554 -131266 117737 261180 188486 27394 50816 -100869 -7035 -47714
6109 -47714 95996 91122 182536 319671 206197 -15161 3337 169529 248853 284380 126278
6098 126278 142862 196712 137685 -44817 -195894 -228239 -169138 5931 -25701 20780 9603
6087 9603 156483 132866 34147 8541 129417 169776 276854 151421 143954 224558 100621
6076 100621 100988 159205 76120 245029 167359 114613 374534 223311 231096 428537 424631 141202
6064 141202 77394 12243 -9699 50613 106455 153229 221480 362061 129479 383421 326768
6053 326768 217962 90889 65596 165043 58982 146760 150000 88572 28387 -60302 132967
6042 132967 139849 77684 -38975 11444 196385 290417 328148 293564 399721 458748 441650
6031 441650 306422 231639 119604 5360 256170 387486 196677 321819 162863 231602
6021 231602 398673 347352 192733 183394 202258 89618 -101816 -11067 59394 108944 198066
6010 198066 98175 164814 187986 219618 180290 136474 76889 139047 205635 274179 176064 192601
5998 192601 72331 -48007 46580 5930 180421 103011 -76545 -95691 -62995 297503 473578
5987 473578 272533 27263 103214 108914 -26120 118916 179873 288072 296072 254831 386197
5976 386197 399940 214988 118405 252392 167448 98120 200179 346942 251559 -17965 34542
5965 34542 126555 93414 124009 360105 360628 315990 222491 81811 230736 328514 4059
5954 4059 -103319 -47915 193791 158179 144040 105505 74325 -7524 -53822 196270 334357
5943 334357 196499 241228 117278 -27316 25690 -49825 -8374 48756 213226 12120 30782
5932 30782 184095 24444 -7282 66049 99439 205938 213833 28149 92536 110478 -10327
5921 -10327 151928 -33779 -157839 134507 244402 450362 313418 166221 -4786 60094
5911 60094 -32631 112822 32387 64320 -53626 -105752 7014 -69287 32055 130792 111137
5900 111137 -64488 -69400 -105918 106150 109818 199852 281920 179398 98377 67536 45432
5889 45432 -6262 25241 -52505 -93836 -95520 -753 42515 -10817 94062 18901 -74943 -13938
5877 -13938 49731 108885 231171 117477 106419 81253 287485 35425 68357 251638 258783
5866 258783 53194 144099 144250 26095 -18610 141739 58298 -28123 10073 69404 166885
5855 166885 78927 167615 241758 98924 -7223 220079 207258 44937 -7174 46369 184312
5844 184312 -52523 50874 123746 -51892 -169390 -237323 -88728 12504 -149934 -99666
5834 -99666 -18863 75201 162823 15837 139464 239217 222309 123701 -19683 -59415 38847
5823 38847 212577 161553 9868 -33022 -102136 -160472 -97027 141165 43681 88625 185859
5812 185859 180314 305548 20433 -78330 158653 137824 -131277 182179 211570 72144 201087
5801 201087 199472 579730 218951 -129289 -60661 -138171 -15043 209896 170715 164786 88753
5790 88753 123664 86808 255321 311667 212614 120867 266128 192096 285101 581458 165876
5779 165876 -4571 345230 410692 229801 149356 205384 80616 230143 196230 138561 264062
5768 264062 341668 387861 310648 336116 415266 197175 209638 284440 442052 365577 262101
5757 262101 457445 515666 524450 556232 478072 452183 419576 313943 223322 -3050 151425
5746 151425 316003 208232 89350 170726 419892 491294 439108 475553 380281 264870 217914
5735 217914 238031 260867 514589 445431 307184 201137 232827 386469 328001 217485 289361
5724 289361 249517 274075 481816 352581 270272 239606 262892 478581 404465 541917 417557
5713 417557 170322 155528 66782 123914 437492 384165 252315 240148 241183 271010 112635
5702 112635 59537 170790 400807 271575 120107 39628 214252 204210 220183 244629 90643
5691 90643 22665 178177 290671 197932 298541 365576 297008 433932 513663 390951 182619
5680 182619 50182 209345 389843 467274 272682 -34566 52768 240704 369984 369039 303363
5669 303363 309183 248766 308148 228480 281022 312941 320876 246444 237088 317090 451773 301055
5657 301055 391039 399585 296197 253909 62096 172257 176470 235071 238738 39264 -59693
5646 -59693 136390 456421 352014 270631 205933 70215 48197 213467 103616 -89776
5636 -89776 -23644 -39143 12332 -109437 -20389 -109333 -49842 42363 193076 173041 128249
5625 128249 104911 -157054 19451 187489 322877 249226 170487 150395 89224 -19429 70223
5614 70223 292138 172684 189604 269251 137291 243740 227581 199728 -35981 155367 136978
5603 136978 116455 301407 93565 -11326 -143490 -23011 80906 107348 143960 201987
5593 201987 158996 197913 149651 83904 -204207 -56091 98458 18476 240544 191522 351524
5582 351524 156826 56834 243179 227289 275045 137954 331896 271005 34465 165002
5572 165002 313306 68896 86005 125552 332024 547534 192150 169647 199125 103053 -57136
5561 -57136 -104506 -76297 165463 216405 251245 228639 267658 404083 345446 362215 278481
5550 278481 154924 104493 48746 21973 252106 371853 262564 243171 29248 -51608 172812
5539 172812 97792 62769 290128 254151 217915 200189 272053 342693 354521 321096 207891
5528 207891 405890 489237 438765 346820 127084 102343 181541 241755 375192 368992 474270
5517 474270 231465 90472 71387 273281 204419 34406 67529 292294 166729 152166
5507 152166 244810 319506 244305 143449 -56020 -143365 -156462 128687 211883 286798 352642
5496 352642 290906 231010 16172 68650 86852 227164 170095 238354 335133 270673 239363
5485 239363 280307 407942 279044 244223 18284 52548 309692 275712 194764 101227 205561
5474 205561 86980 27691 -156180 4634 -24130 102130 66534 219582 205604 58324
5464 58324 125405 22042 24544 220436 212042 222821 424760 382345 237510 198720 230652
5453 230652 257892 103327 127777 -17844 63153 206939 278316 208880 170653 106029 195047
5442 195047 30886 -32477 87734 153273 208431 37118 221552 74754 162352 305583
5432 305583 140051 -83492 44570 115531 37763 95780 112650 224153 187457 274413 336907
5421 336907 203803 44130 165501 64838 132634 164088 385152 340651 291063 413430
5411 413430 348786 356366 91296 4640 215466 276706 198177 233807 117066 -104711 122515
5400 122515 149127 37566 115522 66391 102492 138374 265 -81782 61883 103992 78470
5389 78470 -25031 -149516 -226365 -123304 12822 252915 443148 615345 564521 207189
5379 207189 3501 6480 15281 172543 2036 193232 127883 20901 87015 157578 821
5368 821 140137 231893 264836 275769 218468 155452 252827 154093 56612 58343 140570 422680
5356 422680 426399 384154 246450 301053 414698 407014 328071 368833 354702 192463 92398
5345 92398 169985 286237 390105 372993 226342 300624 249417 285821 188371 241856 198848
5334 198848 316379 460242 193578 145397 181772 242105 401504 320161 313788 -2 -140704
5323 -140704 -139023 97641 159013 86346 247309 109808 64709 18484 -98778 -1238 281074
5312 281074 375475 481585 508536 653476 471332 279510 345536 455666 342990 272093
5302 272093 156210 284917 317511 352329 122848 83102 8160 44451 12969 108727 224807
5291 224807 374310 390859 426053 496354 367080 238186 222637 210063 218586 240532 436565
5280 436565 245669 405613 297237 139307 115099 -40498 121491 329417 468569 200959
5270 200959 296213 222050 72543 134722 127811 13881 36308 167886 484881 531414 395274
5259 395274 487174 574215 437774 429864 293399 348150 358881 484140 523946 453516 501703
5248 501703 438890 523077 387694 372163 396157 501501 599526 728293 679544 417124 357860
5237 357860 420772 627012 720766 829205 763759 683397 557345 622466 560025 445334 494555
5226 494555 693713 853620 711671 733718 794473 713654 903317 691363 724257 589216
5216 589216 549117 714089 850866 875249 976268 904325 751118 867469 682722 829413
5206 829413 762789 835892 745749 726592 883562 949308 952071 1130241 903846 787647 663007
5195 663007 808127 1164301 1006859 947945 833640 776552 783394 1096491 971977 1117988
5185 1117988 1098232 1136733 988898 865133 821071 1012238 1104935 1018976 1060517 1038906 1083131
5174 1083131 1163968 1345352 1395707 1378494 1403939 1271640 1139092 1185207 1116642 1228690 1274426
5163 1274426 1436005 1272090 1183040 1307023 1493963 1425243 1530934 1576616 1558975 1491759
5153 1491759 1746323 1728774 1702439 1832905 1918039 1985352 1994135 1949505 1874174 1831877 2040549
5142 2040549 2030070 1915382 2251306 2223055 2074130 2145471 2127261 2221295 2235590 2250721 2184890
5131 2184890 2262413 2268010 2359687 2621552 2587136 2669563 2532980 2577555 2722531 2919863 2943903
5120 2943903 2981166 3082336 2998932 3012105 2968282 3036652 3125285 3034690 3027029 3063998 3169465
5109 3169465 3266686 3254137 3198383 3177762 3079733 2926894 3034650 2995272 2923621 3095306 3060393
5098 3060393 3023400 3180058 3085514 3007606 3093321 2938676 2976140 2859181 2739232 2849423
5088 2849423 2880638 2687209 2549666 2720269 2909783 2579190 2636587 2744676 2709039 2805318
5078 2805318 2609871 2564541 2546937 2689148 2677536 2443849 2350503 2482308 2489351 2385734 2584451
5067 2584451 2769674 2735280 2891497 2941515 2633831 2574343 2534844 2687424 2771655 2825972 2781922
5056 2781922 2640841 2884509 2952510 2856768 3038600 3149243 3190974 3041963 2990691 3038509
5046 3038509 3108675 3227790 3137403 3418091 3461903 3367265 3361667 3368071 3438136 3482548 3481058 3302334
5034 3302334 3569061 3766446 3892512 3734096 3780045 3806121 3814381 3879906 3858322 3914127 3972810
5023 3972810 4068467 4192055 4401432 4300443 4250898 4457925 4543498 4603492 4766273 4700611
5013 4700611 4735228 4750225 4856902 4808146 4852403 4917194 5041523 5106272 5056327 5091017 5163014
5002 5163014 5237441 5289291 5623083 5626564 5535219 5514599 5678303 5921604 5952586 5797155 5818577
4991 5818577 5803712 5933444 6180190 6379542 6473499 6525101 6643589 6723171 6680214 6872873
4981 6872873 6984761 6899248 7229367 7218076 7455528 7362089 7426186 7651768 7702318 7808168
4971 7808168 7768760 7903885 8182556 8242602 8387271 8479276 8594242 8733371 9076507 9202438
4961 9202438 9310465 9482296 9616596 9708976 9841259 9983495 10198172 10360492 10662641 10968357
4951 10968357 11119670 11322275 11442220 11746969 11991464 11973569 12022893 11996394 12051200 12300269
4941 12300269 12193151 12346038 12513087 12610764 12772392 13140026 13599979 13631165 13854712 14087503
4931 14087503 14490455 14654598 14978192 15460947 16170439 16454787 16621659 17288873 17545979
4922 17545979 17803170 17921025 18303150 18719408 18872764 19230668 19694599 20040347 20524250
4913 20524250 20845100 21246668 21932164 22342689 22749714 23173335 23528669 24187080 24887363
4904 24887363 25583437 26124410 26879442 27377197 28191746 28915628 29570475 30307101 31241894
4895 31241894 32357894 33511722 34238253 34997295 35916564 36946552 38240554 39151658 40180840
4886 40180840 41505581 42734594 44141984 45544144 46622767 47831265 49374295 50992345
4878 50992345 52763692 54592958 56345587 58335295 60752784 63250570 66073459 68953370
4870 68953370 71872208 75075454 78552004 82692480 87069449 91540551 96439434 101454833
4862 101454833 106221477 110712584 115467146 120864556 126709651 133389922 140828550 148375327
4854 148375327 155872976 161737825 165764136 168601045 170250894 171881096 174358689 178253978
4846 178253978 183082491 188457191 194950915 202900480 211961587 222133993 232188615 241211624
4838 241211624 249029049 254944465 259149875 261843596 263850811 266141037 269413553 274529595
4830 274529595 281101311 288080509 295241157 303207249 312255732 320027710 323929342 323278495
4822 323278495 318187276 310278203 301752070 294141282 287582232 282077478 277054574 272545592
4814 272545592 269307316 266992969 264780259 261145610 255528381 248560972 239726118 230006954
4806 230006954 219841401 210008781 200863230 192858485 185767461 179495837 173946225 169331111
4798 169331111 165754752 162937793 160215135 157018475 153120410 148071149 142063742 135268404
4790 135268404 127960782 120681239 114178803 108226328 102988732 98224944 93479706 88545870
4782 88545870 83582700 78412789 73819733 69747204 66217300 63093161 60167897 57532758
4774 57532758 54984528 52500761 50255568 48324634 46549162 44695822 43015649 41539680
4766 41539680 40006125 38456134 37036245 35640853 34132550 32881264 31781174 30754863
4758 30754863 29659428 29045707 28034559 27068184 26484253 25713850 25114635 24243384 23471608
4749 23471608 23111136 22407735 22070113 21551658 20991415 20404141 19696110 19383360 18817101
4740 18817101 18341145 17820224 17575236 17204009 16944455 16590713 16102999 15798070 15429987
4731 15429987 14964423 14602330 14251361 13973244 13338992 13293810 13327649 12818829 12612175 12323992
4721 12323992 11964477 11866408 11915990 11425056 10935077 10726199 10662694 10527928 10260763 9981833
4711 9981833 9850494 9609298 9559318 9391039 9383092 9215870 8700924 8531635 8392003 8340345
4701 8340345 8378416 8352825 8134273 7796905 7859678 7689664 7591059 7284803 7086864 7099759
4691 7099759 7096298 7220716 7006946 6878596 6692151 6698443 6738142 6559187 6331720 6163220
4681 6163220 6116925 6130169 6091930 6336201 6231672 5913063 5957246 5888036 5914973 5736574 5673069
4670 5673069 6062095 5998183 5890781 6059442 6081053 5957426 5844434 5507223 5549697 5621695
4660 5621695 5587167 5263329 5364058 5378763 5362009 5242819 5287999 5262735 4874400 4667609
4650 4667609 4540962 4588583 4495892 4569786 4567854 4480280 4236039 4162962 4520803 4622886 4335118
4639 4335118 4477244 4393351 4248734 4204850 3948182 3863947 3688126 3885242 3905026 3776720
4629 3776720 3689934 3546640 3832122 3641508 3288068 3519029 3426707 3448651 3552466 3517918
4619 3517918 3483391 3487752 3447484 3380896 3327072 3154037 2958250 3137838 3166871 3055929 3197544
4608 3197544 3231163 3121087 3010846 3077206 3007458 2925542 2812631 2925661 2786215 2959340
4598 2959340 2964841 3001355 3051802 2864907 2697759 2901402 2712989 2590985 2570902 2656979 2724677
4587 2724677 2788169 2977254 3188399 3144198 3020884 2998078 2726539 2719983 2546104 2671978
4577 2671978 2883748 2656543 2711641 2890483 2799166 2723196 2871733 2889168 2825372 3052824
4567 3052824 3209272 3204860 2887501 2862525 3106111 3115661 3113962 2998699 2785869 2803436 3137886
4556 3137886 3349223 3199299 3204669 3273117 3390566 3229681 3578533 3551527 3571555 3547949 3414659
4545 3414659 3532769 3650695 3597750 3448122 3356115 3509356 3598058 3630416 3638236 3532126 3555083
4534 3555083 3587125 3548912 3503367 3667894 3648784 3552299 3487799 3492591 3527769 3486123 3397178
4523 3397178 3417810 3432310 3755107 3278329 3138710 3052467 3166517 2951081 2881123 3036329
4513 3036329 2993127 2983867 2893485 3093846 2987545 2948366 3134398 3043033 2974159 2748882 2618382
4502 2618382 2636310 2621884 2612882 2600295 2545948 2481513 2508786 2728910 2681008 2495415 2616619
4491 2616619 2601149 2540717 2374487 2449119 2457218 2263289 2186806 2448958 2486238 2557097 2597836
4480 2597836 2608494 2370555 2183301 2206992 2415272 2421290 2238479 2142977 2052868 2266895 2360721
4469 2360721 2172195 2108465 2130953 2198445 2245383 2191426 2151943 2293730 2009632 2181196 2157847
4458 2157847 2386581 2156656 1931507 2111880 2163246 2337362 2244029 2440344 2459472 2364418
4448 2364418 2526835 2510745 2485980 2541045 2424646 2520387 2441171 2505820 2643293 2549851 2343437
4437 2343437 2345311 2620122 2797632 2909220 2767387 2629109 2651460 2713769 2890674 2713277
4427 2713277 2913410 3093729 3027800 2950133 3115758 3226088 3424800 3380517 3457468 3455640 3498439
4416 3498439 3510197 3315517 3305218 3423569 3358490 3575626 3778627 3688482 3808554 3628044
4406 3628044 3781260 3826424 3757995 3901353 3978339 4023438 4141316 3932040 3832068 3965057
4396 3965057 3994235 4132067 4058410 3910321 3890984 3930630 4067680 4260044 4168678 4036295
4386 4036295 4173949 4173907 4157136 4159682 4282115 4434408 4639352 4674382 4641446 4538393 4558106
4375 4558106 4496614 4527720 4452845 4434000 4446696 4431960 4793006 4792021 4634878 4633390 4624618 4559919
4363 4559919 4592770 4685056 4540001 4691655 4979437 4762936 4722339 4745484 4799685 4792427 4908270
4352 4908270 4911679 4856508 5036659 5108546 5056802 4907651 4744254 4952031 5149032 5246453 5287455
4341 5287455 5196023 5242107 5584921 6010340 6097045 5929659 5702298 5489064 5205775 4899236
4331 4899236 4812865 4863820 4794591 4740180 4586195 4768200 4910869 4755358 4654578 4699259
4321 4699259 4671315 4576759 4677703 4566312 4442008 4449876 4512024 4533783 4496665 4550051 4490653
4310 4490653 4389658 4071148 3971965 4200773 4416148 4517249 4663215 4658712 4686183 4811296
4300 4811296 4648084 4526895 4625201 4639373 4545780 4630447 4778214 4836016 4757689 4502586 4725199
4289 4725199 4912242 4752386 4905636 5015603 4919343 4713800 4753220 4934194 5090459 4840818
4279 4840818 5002135 5061345 5116255 5229825 5264944 5208777 5170720 5504786 5663645 5658727 5746223
4268 5746223 5780431 6053977 6108915 6044767 6286106 6269712 6322248 6208794 6162796 6327158 6400832
4257 6400832 6524487 6516713 6646912 6568976 6634180 6855883 6972462 7041261 7154403 7210268 7141948
4246 7141948 7301882 7439592 7525451 7429461 7329919 7442730 7595285 7640412 7799854 7984931
4236 7984931 7877199 8009387 8298029 8437614 8448194 8417261 8351304 8492718 8736191 8920020
4226 8920020 8977755 9049307 9279329 9387892 9493533 9551563 9903097 9973431 10266032 10615222
4216 10615222 10623218 10661668 10799869 10798475 11002902 11313991 11612295 11743999 11957909 12209137
4206 12209137 12501978 12778724 12844752 13030436 13467757 13670681 14120051 14410392 14827629 15188277
4196 15188277 15278504 15470149 15993569 16381253 16493619 16877311 17421450 17622943 18122892 18668038
4186 18668038 19212714 19917662 20329116 20844230 21195632 21681190 22313217 22898784 23578753
4177 23578753 24272938 25023010 25733831 26496767 27289796 28394986 29528733 30592061 31725358
4168 31725358 33099030 34329179 35624180 37048761 38280014 39866044 41203791 42693634
4160 42693634 44240091 46161791 47402226 48188854 48937624 49454326 50010203 50962079 52401637
4151 52401637 53990753 55178379 56196399 56977521 57706418 58596086 59668079 60952321 62575885
4142 62575885 64241325 66138319 68286448 70381698 72475643 74681314 76838440 79384274
4134 79384274 82124965 85432022 88934067 91919700 94728554 97178266 99372403 101914464
4126 101914464 105121652 109181815 113758528 118307571 122755206 126728270 129774756 132292416
4118 132292416 134379461 136705208 139474359 142215419 145284074 149466836 155176864 162234945
4110 162234945 170015816 177077457 182907090 188415693 193655112 199112511 204916988 211684622
4102 211684622 219309968 227488920 235723853 242099564 245342952 246243057 247436406 249773510
4094 249773510 253041260 256789199 260942088 264640600 267862301 270566761 271024346 267855917
4086 267855917 262738662 258183345 256116794 257141651 259993442 261655184 261714208 260769311
4078 260769311 258544270 254997065 250583699 246047936 241737378 238235802 235539336 232835398
4070 232835398 227867955 220422859 212411103 204075694 195800546 188235580 181516757 175728882
4062 175728882 171292164 167185902 162323300 156428040 149397819 142348626 136051055 130666017
4054 130666017 126321708 122704947 119608134 116902035 114471630 111722354 108811460 105219466
4046 105219466 100932756 96103640 91630903 88002391 85166031 82975085 81147395 79309049
4038 79309049 77099252 73789092 70278076 66817669 64151901 62275703 60158821 58431413
4030 58431413 56484070 54530938 52641436 51061844 49666862 48279933 47143480 46211714
4022 46211714 45676271 45451072 44618702 43479899 42263358 40952457 39860909 39026895 38536420
4013 38536420 37994460 37306855 36132730 34421444 32873463 31379010 30047201 29018924
4005 29018924 28087365 27337971 26726364 26008083 25022517 23931424 22792558 21855924 21176843
3996 21176843 20553956 19543393 18742236 18238819 17614287 17131381 16447089 15927692 15476328
3987 15476328 15203248 14731883 14388717 13926604 13527360 13332118 13248681 12923618 12494887 12330645
3977 12330645 12081454 11660203 11311404 11211578 11219897 10906345 10760903 10368002 10235571 10149434
3967 10149434 9997968 9820161 9521693 9359171 9209765 9204741 9017506 9036268 8969920 8867405
3957 8867405 8736591 8556875 8220613 8234508 8417614 8360872 8413417 8503141 8224572 7888529
3947 7888529 7857037 7657189 7670372 7558916 7470652 7631853 7746779 7615837 7345390 7173181
3937 7173181 7395317 7473681 7270391 7158889 6928947 6871124 6769146 6846867 6915120 7009110
3927 7009110 7031514 7020045 6898524 6825546 6796866 6658997 6566418 6340996 6411877 6513282 6393126
3916 6393126 6339710 6521648 6512142 6464226 6412559 6345068 6389415 6458381 6492468 6463723 6559137
3905 6559137 6710906 6685319 6298790 6429795 6593973 6657263 6631663 6639588 6605793 6562547 6661408
3894 6661408 6669664 6516457 6455163 6482811 6522877 6435509 6509794 6557128 6626281 6687384 6739516
3883 6739516 6746657 6756454 6839708 6655671 6510283 6629700 6842317 6801659 6736214 6689703 6777185
3872 6777185 6961524 6947623 6944989 6992968 7038117 7054358 6874850 6741332 6958351 6848418 6807181
3861 6807181 6919306 6864068 6984974 6961189 7137357 7195050 7261942 7257912 7091226 6954423 7125271
3850 7125271 7266638 7256515 7250381 7315635 7610649 7364520 7338783 7347546 7644728 7889416 7672407
3839 7672407 7656723 7896301 8085826 8048277 8144392 7851343 7627186 7829552 7776221 7850180
3829 7850180 7947444 7872787 7910356 7774785 7581428 7612859 7622584 7487050 7410647 7453241 7495682
3818 7495682 7518398 7496902 7424185 7356391 7191451 7285008 7562160 7371138 7167725 7271812
3808 7271812 7138548 7161144 7151299 7258463 7181213 7062455 6975335 7119552 7076859 7015423 6896370
3797 6896370 6868101 6925791 6754393 6692716 6569707 6593856 6591703 6393957 6380591 6320512 6385491
3786 6385491 6357930 6346228 6347003 6307190 6315485 6087048 6289716 6129128 5999285 5997783 5985230
3775 5985230 6074648 6123969 6212816 6269076 6079759 5882122 5785338 5779623 5559921 5528090 5511721
3764 5511721 5459215 5309641 5529222 5732989 5664629 5659598 5415757 5373761 5254845 5172166 5167197
3753 5167197 5145956 4997428 4902958 4873454 5049305 5022304 5007638 4872764 4573778 4862559
3743 4862559 4760684 4710071 4721668 4500150 4528811 4588699 4821305 4614060 4734349 4807920
3733 4807920 4587697 4442601 4404547 4326586 4266148 4139824 4191668 4312511 4270078 4333409 4399141
3722 4399141 4143118 4250558 4464486 4469797 4498514 4509364 4555770 4546959 4639551 4589728 4497936
3711 4497936 4224179 4068275 3987507 3713581 3718504 3781751 3905321 3865532 3814604 3642926 3652556
3700 3652556 3769127 3782065 3856343 3572572 3578741 3585249 3489967 3489262 3596565 3686103 3627489 3631506
3688 3631506 3694319 3668572 3587747 3577743 3763602 3593289 3454937 3412072 3446246 3458579 3609551
3677 3609551 3479040 3490640 3578148 3567046 3339699 3080160 3096044 3287014 3355590 3366352 3405829
3666 3405829 3284373 3261431 3509009 3643804 3439491 3479813 3546445 3590126 3774889 3802417
3656 3802417 3754997 3784681 3672902 3589169 3505209 3267553 3126688 3191877 3072953 2998478 3038146
3645 3038146 3066226 3000809 2999733 3056629 3005775 3051302 3112341 3372604 3256562 3287855 3245199
3634 3245199 3072037 3120918 3100601 2992748 2674495 2756402 2923840 2746708 2654991 2655174 2878183
3623 2878183 2713509 2576936 2588953 2500872 2414130 2501636 2546262 2423494 2298405 2177902
3613 2177902 2066026 2049280 2244810 2443403 2358417 2304192 2258448 2393034 2507413 2446716
3603 2446716 2530479 2368055 2133127 2397557 2451092 2503228 2723743 2754788 2971893 2946065
3593 2946065 2981197 3095445 3122346 3092015 3025096 2999076 3103514 2802024 2589920 2488217
3583 2488217 2681856 2458296 2641384 2693843 2883398 2878068 2770218 2648949 2823349 2977135
3573 2977135 2715674 2649784 2774198 2806185 3045842 3139755 2832267 2758532 2546454 2426701
3563 2426701 2414250 2353764 2144796 1922802 2059872 1970273 1798693 1903956 1998015 1971818
3553 1971818 2008445 1875428 2031607 2193994 1872635 2058341 2059032 2138604 2207212 2110298 1943258
3542 1943258 1961886 1886043 1777249 2118111 2025021 1857382 2134256 2168188 2041177 2011193
3532 2011193 2358551 2518168 2416977 2707911 2805652 2968146 3127780 2969747 2883716 2936384
3522 2936384 2811619 2670928 2769446 2783682 2826219 2763069 2751473 2809848 2693742 2656518 2627188
3511 2627188 2404557 2180979 2165548 2364878 2437156 2447984 2548270 2621834 2455002 2254277
3501 2254277 2104715 1966050 2013743 2058341 2105252 2350758 2396296 2396608 2327964 2111070 2011803
3490 2011803 1899314 1790269 1743270 1457650 1347813 1519247 1610345 1602076 1497410 1262969
3480 1262969 1219506 1270276 1418826 1204002 1361818 1106728 1057773 1313110 1358865 1263761
3470 1263761 1220256 1233369 1194607 1229554 1364994 1474053 1207026 1241302 1468066 1559507 1439579
3459 1439579 1302739 966165 840595 786362 889339 776922 633954 774145 949852 1015635
3449 1015635 772356 632767 746998 1016384 937731 760473 811475 893980 1010707 1154310
3439 1154310 1075339 908214 781904 799255 711659 406360 475656 740548 577129 464380
3429 464380 598768 693997 639254 633284 649497 494505 372869 514035 550872 649655 787655
3418 787655 594819 311410 410823 609106 698708 537763 348087 553406 652473 459682
3408 459682 251275 392903 466944 554562 576304 598756 409686 237389 224757 402352 529514
3397 529514 550862 579223 623586 445801 485776 523607 426575 419933 528173 379547 268928
3386 268928 345529 374455 373508 600100 468893 386009 333814 284295 495509 504084 243035
3375 243035 114926 173418 177715 363130 481295 451550 480173 416905 468860 417966 374800
3364 374800 447336 333352 316882 442799 276063 297820 378156 406100 478528 432546 430760
3353 430760 392840 527392 399712 374578 244714 356241 271927 234253 244448 337689 270612
3342 270612 385915 475742 271278 379876 426895 213386 185093 433669 403067 132545
3332 132545 111182 145526 88580 228560 110843 420058 413518 291595 206062 273910 142830
3321 142830 34406 176739 244308 280788 376600 318725 46132 199293 355146 60310
3311 60310 -47128 150316 120599 354076 542189 407916 398255 503347 412310 256048 249454
3300 249454 182622 125011 123755 181355 194052 164819 242309 192955 260997 390951 342020 170188
3288 170188 211226 67801 167839 250176 276991 38424 125528 311072 224301 230802 263569
3277 263569 450471 100493 78226 190654 205654 66447 168225 129993 -88922 225796
3267 225796 45574 220451 104033 76886 60250 -108225 -30935 79390 128772 139486 218846
3256 218846 232353 336920 205228 90867 226106 205719 28498 5516 205709 143283
3246 143283 32671 -196636 -187246 161645 205155 277270 237368 56122 -5019 109920 162370
3235 162370 7735 75362 -18934 -4940 161960 123506 247660 145031 89846 107199 319432
3224 319432 535764 338194 29152 90189 260391 225458 165734 366841 318736 227674 285854
3213 285854 241141 251657 369467 350360 342988 367558 217386 355183 228374 192158 214617
3202 214617 376192 268234 127677 342989 406529 297975 169929 184808 293818 314175
3192 314175 110800 165072 174071 135028 93969 74388 215287 378113 434262 443266 289300
3181 289300 317087 269260 390963 194543 212346 398355 405921 304541 228893 222125 397222
3170 397222 418554 483630 211078 86172 220734 83169 94380 25275 12577 -8734 -52314
3159 -52314 -95332 -7106 52155 152806 8191 5154 504581 384246 240772 329892 161786
3148 161786 44059 46160 70642 231753 357055 334966 441307 234662 312968 268880 68598
3137 68598 228726 301410 288347 217674 134634 152367 46168 -55212 -79198 -125633 -54181
3126 -54181 29384 -158303 -104106 110204 179897 26227 40274 33676 -52334 173700 -9375
3115 -9375 134973 329917 159257 326779 77195 65816 180627 201284 1631 -8706 17278
3104 17278 37660 10443 -64951 -188094 -215504 -150485 -149978 -172772 39277 247853 169101 69541
3092 69541 -1897 -70466 -159409 39614 111910 216889 331906 146510 -44949 7367 -61573
3081 -61573 131599 164760 34302 -121475 -44100 -47079 99218 50866 -41965 36466 -76701
3070 -76701 -66835 -51306 -26336 85079 -90430 -5961 14525 -1715 -228248 -59620 -22049
3059 -22049 -221857 -290600 -117814 25091 -258648 -290245 -103524 15399 1915 -16055 -132111
3048 -132111 -6623 -86338 -51936 -245043 -11695 -93427 -134785 128111 -132897 -189662 -115689
3037 -115689 -102543 -103061 -109754 -165652 -4954 182756 -111277 -15348 56472 118520 144889 243115
3025 243115 -81012 -108797 35455 251565 172864 -78549 -197223 -270071 -61419 51709
3015 51709 -5106 -125706 118075 90850 111183 47477 93505 12050 -162076 -167401 -260812
3004 -260812 -209864 -140058 -112102 -66727 -75637 -213504 -218857 -188441 -190300 -190535 -144531 -168665
2992 -168665 -453114 -226076 16696 -66945 -114011 60793 -118111 -199538 -16541 -29392
2982 -29392 -105951 -105963 -92340 -203535 -100579 -53737 -228755 -119533 68751 -82215 -130632
2971 -130632 -120561 -117424 -115338 -76641 4855 -63207 -47529 -73343 -171814 -234049 -147995 -151385
2959 -151385 -125684 141418 178006 -43795 -49987 167489 199228 82795 62809 54499 -71586
2948 -71586 -68490 -95597 133455 252084 193236 97565 197280 109029 72819 155475 41659
2937 41659 -140515 -128673 131133 -122397 -30296 -25787 -110130 -199147 -135653 -7215 139168
2926 139168 130540 20665 34769 -85614 -310866 -169556 -543 152903 -26314 -70416
2916 -70416 75532 31038 -222593 -322269 -125800 -87475 63139 -142945 -217209 -151048 28136
2905 28136 89889 137423 85415 5417 -13520 -164185 -218629 -123314 -70224 -290739 -246985
2894 -246985 -239011 -168312 32048 15158 4710 -175835 -99503 -27884 -63433 92900 106137
2883 106137 57762 -7927 1221 40737 -2905 -58320 -73726 -16291 -280931 -105655 -49656
2872 -49656 153061 310271 216221 -130156 -166422 182583 202308 245812 218820 207677 124741
2861 124741 10456 29067 66442 -146221 7069 -190627 -149646 -70862 -91941 -201114 -164189
2850 -164189 -241879 -106762 -86356 -81695 16089 -14154 -114146 -254698 -463977 -328914 -236888
2839 -236888 -151625 73156 -121514 -86037 -223514 -231117 -260342 -192555 -114105 -111873 188861
2828 188861 146858 -192696 -85314 -188372 -279574 -415075 -120297 15225 -201245 -302946
2818 -302946 -331606 -133897 -117494 -147290 189 -39725 -41320 -22828 -13164 -77175 -274123
2807 -274123 -228359 10961 -111085 -285266 -196468 -223344 25925 118229 -49736 -186817
2797 -186817 -142284 29661 -36054 -115646 -99120 -22147 -139450 -65001 -23118 -116640 45809
2786 45809 325911 160117 136891 112792 -87163 -364648 -175497 -32311 -118320 -145926 -99680
2775 -99680 130558 106499 -213946 -401652 -185130 -64544 -156619 -97028 -151791 -302369 -90355
2764 -90355 69651 170296 166619 232468 24612 31663 -61149 -60297 9992 22596 -104735 46719
2752 46719 -19044 1515 44059 -65128 39786 -29427 -199380 -216556 -63446 -132992 253606
2741 253606 202101 -159865 -221615 -7702 -40680 -327713 -83611 21615 3536 87512 -72450
2730 -72450 -23972 32163 16134 82309 158120 42011 -89548 -233386 -337964 -291412 -151661
2719 -151661 -103438 -4019 37476 -73375 -186542 14435 -80581 37066 -52827 -176735 -100708
2708 -100708 27709 160181 -142277 -151099 -65682 -291310 -275375 181429 220788 284355 191535
2697 191535 -166403 -126077 5757 -61146 -74210 50169 117245 18190 -133869 -125906 -80944
2686 -80944 -170781 -194026 -268706 -137846 -99327 -78310 -95975 -28140 -191707 36031 -147452
2675 -147452 -106935 25267 35514 -29203 -47499 32199 6930 8196 90546 47756 172964
2664 172964 205985 200541 145956 -20623 177319 248147 81061 2852 216501 29327 -25927
2653 -25927 46404 203910 208818 -46841 82033 154591 122959 248389 244414 46584 -152287
2642 -152287 -199854 -118286 37106 206561 170856 18813 -121120 -24998 33244 -4377 99261
2631 99261 93153 14777 -156486 -163453 -98258 -84672 -243492 -188155 20468 211892 118500
2620 118500 55817 -130606 -212814 -224639 -25170 -179126 -168429 -321496 -244196 9606 -7350
2609 -7350 64430 6862 -77246 -38959 269062 147839 190186 66260 66786 151231 13647 55244
2597 55244 13310 102 -1851 60681 87843 10854 106633 140337 146622 -37313 -115390 81221
2585 81221 176106 196644 15440 -49643 72585 149129 68072 158556 191522 292610 287138
2574 287138 204205 334033 306109 182681 84459 120685 181093 157411 36112 180938 127573
2563 127573 176382 64876 162154 73125 -4475 72277 -709 120819 170554 161215 22344
2552 22344 -39030 -118753 172841 135443 35665 246524 309365 116353 205000 162465 61555
2541 61555 64491 151119 43111 89591 149859 222431 144131 128647 -123379 215850 435706
2530 435706 365085 345379 131003 56232 -102651 1455 318020 214664 61892 47953
2520 47953 31109 67403 187004 358698 332624 347796 290569 188032 -39588 193311 118666
2509 118666 156398 271848 243197 189372 92206 229495 277109 333813 391192 118892 184814
2498 184814 155183 289721 225169 371861 402688 358687 359733 359418 375700 586423 606376 357961
2486 357961 228235 283978 285072 212146 580077 765761 482831 352057 378567 287379 319947
2475 319947 467733 497923 591486 659033 621708 599065 425957 555093 839902 932882 924639
2464 924639 885879 803903 784196 744689 928910 877988 877541 894906 812929 924316 1018966 1041709
2452 1041709 759235 859252 1083003 1002040 1080397 1052023 1062085 1174573 1244270 1212487 1248268
2441 1248268 1309323 1249641 1256017 1331305 1271293 1347305 1565377 1707947 1757061 1852502 1717312
2430 1717312 1865130 1598034 1735881 1957592 1882159 2177177 2240089 2556297 2448422 2598053
2420 2598053 2718532 2854483 3008067 3167511 3028601 3309578 3398258 3633310 3779584 3912841
2410 3912841 4004345 4097134 4335183 4459535 4858200 5091483 5276414 5581288 5780157 6043818
2400 6043818 6451442 6902702 7254659 7637741 8239017 8746873 9181836 9666310 10320768 11480371
2390 11480371 12661616 14254140 16676837 19837391 23521062 28503839 34973430 43000796
2382 43000796 49401078 47485370 41309164 33708346 26511544 21171633 17419491 14899469
2374 14899469 13043784 11492387 10115721 9013562 8235777 7681574 7422692 7101587 6861408
2365 6861408 6338281 5696576 5242873 4752889 4527590 4469320 3964156 3710817 3350072 3046432
2355 3046432 2828655 2771396 2752830 2480864 2493950 2384476 2329954 2104749 2033505 1871610
2345 1871610 1836509 1836225 1914447 1829554 1600989 1649417 1650991 1804460 1558484 1454401 1551479
2334 1551479 1438800 1397722 1252188 1078124 890815 1043411 888813 1006589 981948 1020482
2324 1020482 891309 721953 865448 884851 807691 684254 536362 596938 798310 729148
2314 729148 715149 700597 720519 746980 877768 719232 553727 580943 332541 286087 518089
2303 518089 487975 565004 565005 366051 244830 272328 284126 463529 563581 621533 676033 485404
2291 485404 305817 330025 244946 218244 303885 428827 378410 295208 72449 302416 525958
2280 525958 365887 519794 633148 644095 597563 430177 228912 441389 538282 436453
2270 436453 419018 359418 301669 251963 141156 148440 40578 197841 222935 402618 130469
2259 130469 6309 131485 363302 589582 371643 162879 83374 277336 297043 -68796
2249 -68796 -186322 108139 113154 -46615 133484 86726 274310 413294 196094 145272 -57143
2238 -57143 -94269 158199 121573 159610 111889 209220 200086 59683 144800 206308 98285
2227 98285 178456 103162 -35826 -168728 -952 254194 50423 122052 277993 150687
2217 150687 -93582 -155652 15125 -64802 -87605 -219951 -155330 -3838 101872 42451 211455
2206 211455 138361 -1381 -33734 -7198 -87613 -232125 -92192 -105446 63244 35525 -155521
2195 -155521 -190458 -216509 -156066 -173030 -137776 46056 -5320 -40360 -97804 -46270 -121744
2184 -121744 -121742 -255807 -48192 -47343 -84540 -61962 76744 108370 8206 -85209 -40773 5400
2172 5400 215431 126870 335699 374466 44650 -53192 87817 191584 207349 245738 200061
2161 200061 138703 36124 -77426 -46024 205011 71182 -85449 294919 118892 69729
2151 69729 60859 -57473 -68734 174562 131468 75345 75850 137898 42985 138702 173462 187797
2139 187797 139789 95399 11886 -163557 -20039 63624 70314 -75496 -180928 -22648 30710
2128 30710 -193441 -207763 -159946 -178205 -173820 -67777 39679 17683 -25603 103233 -34963
2117 -34963 -11948 116804 400872 517021 358338 247040 165419 151111 214137 29421 -27696
2106 -27696 38525 64181 -75257 97067 113672 -47600 -33144 -44141 -220700 -195713 -164099
2095 -164099 -183895 -52487 1947 -49854 -16406 -24050 66904 172887 198709 50456 117273
2084 117273 30543 77879 53435 -24644 -82571 -141774 89581 95117 25718 67671 118957 75977
2072 75977 46587 -74591 -270720 -264340 -271912 -87559 -229049 -291725 -266310 -200844 -115893
2061 -115893 16010 25167 190549 21550 -34290 -37639 50097 -17588 -395739 -169208 -156294
2050 -156294 -147111 -58866 -32836 -116636 -265637 -215491 -46178 63141 -32860 -25116 -20927 -81655
2038 -81655 153069 -116449 -242540 -132157 110771 244320 196713 16828 15791 -48093 -104783
2027 -104783 -108678 -132098 -306424 -313592 -290169 -153187 -37007 86342 148577 97502 155929
2016 155929 32582 -69990 -108808 -103872 -123297 60998 67313 5669 -119704 -297175 35664
2005 35664 103258 -38724 -165197 -160023 -124963 -221813 -280139 -236868 -147429 -45069 -118682
1994 -118682 17311 113039 86620 24377 135274 114066 -117259 5926 -381 -276683 -186707
1983 -186707 -21464 -130006 -197858 -220330 -1092 -93436 -247058 -329730 -275863 -153098 -82158
1972 -82158 -131220 -252465 -281694 -18677 83018 -37932 -213838 -71878 -193690 -408003
1962 -408003 -213151 -333248 -290195 -101853 -164970 -302196 -399870 -124667 -152320 -341234
1952 -341234 -161095 -144169 -173310 -211220 -111472 -215345 -164698 -69101 -144858 -132654 -226139
1941 -226139 -203855 -227955 -269108 -148422 124343 -47738 -155721 56852 38274 -31259 -62785
1930 -62785 -109097 -155105 -91847 -39047 -24206 144445 -154101 -152398 106739 201196 165090
1919 165090 64831 86166 172657 72465 -285822 -109153 -154768 -38767 22441 -180359
1909 -180359 -93870 -28163 -171839 -90812 -261819 -231937 -191871 -3684 86733 61020 -13084
1898 -13084 -129302 -70541 -125201 -75143 -29759 -59475 6320 -109624 -17810 -48374 -128486
1887 -128486 -10916 -138640 -139892 -133192 -61655 -115706 -128851 27584 64406 194964 92867
1876 92867 -172524 86181 89825 -97280 -163712 6821 -94297 -87191 -135182 -150289 -91665
1865 -91665 -128999 -265278 -219273 -77016 -66102 -113878 43305 20489 -50633 81271 -15796
1854 -15796 -76214 71679 128113 -72281 13856 -96629 -185141 -274209 -234480 -141241 -39643
1843 -39643 5306 50723 121201 259848 243651 68652 48565 -75980 -185904 -54110 151084
1832 151084 96232 63987 63397 38379 -50424 -156484 72837 240926 -7052 -59731 -192734
1821 -192734 -320076 -369513 -267641 -171028 -259920 -226525 -38296 29975 -30881 -38131 -205547
1810 -205547 -229239 -163708 -100334 -23954 -325811 -193077 -233298 -295500 -172980 -89680 5653
1799 5653 74922 84184 76120 77422 -152116 -72185 -194136 -123825 36094 -134916 -297845 -109378
1787 -109378 -67030 -174035 -81407 71277 -70231 16521 921 198870 70525 -164548
1777 -164548 -69943 -210701 -329814 -302619 -204681 -235336 -138318 -397620 -348751 -99244 49024
1766 49024 -92666 -131014 -137394 -42508 -109420 -161716 -85072 -258085 -34145 21858 125126
1755 125126 24774 -45918 -23972 -97680 42878 -163032 -224014 -3328 134883 80786 110984
1744 110984 31483 -42409 -163493 -154881 -213935 -486043 -420506 -264502 -35748 -88588 -101367
1733 -101367 -105738 -165782 -34701 36954 121602 -9403 43375 177663 119552 -25761 86054
1722 86054 47706 176346 282901 160449 60334 -54652 -61325 -13228 50774 132252 220567
1711 220567 284222 -9217 -102979 78546 107120 -64042 -93665 11935 -156251 -118268 -54748
1700 -54748 51967 -71693 66746 -19530 -99386 -35118 17388 31224 -18130 79589 151051
1689 151051 -22104 -60748 -12788 -72631 -109159 -216854 -75120 68737 -117438 -111252 -95660
1678 -95660 17734 215323 101351 -83891 -40286 174740 309782 158243 -107364 -77215
1668 -77215 -59011 -152617 10426 -157488 32251 -51024 -313410 -30562 -79755 -202451 -240670
1657 -240670 -122971 -132030 -211172 -34752 105607 38684 17418 12754 -140996 -107686 119322
1646 119322 210440 143101 -122197 -249475 -193603 -213540 -164112 -8392 26061 -182904 -281394
1635 -281394 -173025 -88530 22030 63061 212442 198722 168241 -71353 -33893 -195875 -279272
1624 -279272 100505 -25724 -38861 -38199 -230852 -67541 -67930 -191268 -195650 -108796 -124897 -287704
1612 -287704 168982 240019 239189 142517 106350 22023 -57062 -68101 35137 -303256 -225094
1601 -225094 -47158 -101584 -188530 -169909 -237603 -218647 -122987 -190419 89664 23445 63263
1590 63263 -178258 -335362 -317665 -159320 -139176 30690 159051 151721 103358 6689 -21070
1579 -21070 -114211 -121471 -37048 -16020 17369 -108460 107577 -70775 -59746 -132908 -164613
1568 -164613 -263219 -157740 -155088 -166960 126712 254822 46311 -37123 52906 -55356 7435
1557 7435 63959 -107428 21305 -97126 24750 10084 -201295 -270787 -87976 9857 -70953
1546 -70953 211055 259991 269991 178957 214370 184974 151523 -108977 -190696 10249 -11946
1535 -11946 14833 84504 -143613 -129303 -121529 145131 -176803 -126447 -64873 124336 72130
1524 72130 -124138 -128594 16566 -87515 -284976 -20119 131302 87909 60096 -104841 -288565
1513 -288565 -334245 -425846 -96448 151376 191679 90081 232087 231146 211406 -39494 102739
1502 102739 124654 -58517 -117379 66754 227836 73204 -16135 -86413 -135578 -53288 -78588
1491 -78588 18367 170808 13284 -160366 -7986 -184921 -232770 -58815 -23333 87477
1481 87477 31460 82391 217951 257532 68801 -37980 -79868 -21682 180300 282068 124383
1470 124383 66194 -5956 294 -89178 90934 -117621 -313910 -85699 -31238 -227964 -78649
1459 -78649 -368250 -234147 -49408 20974 -256150 -96843 83634 199320 205944 -102536
1449 -102536 -132257 -148492 -200281 84518 201112 -104687 -151820 -293337 73504 154591 73878
1438 73878 276268 105364 -279976 -142508 68187 33776 -237313 -315511 -26415 96282
1428 96282 31288 109493 54633 6952 -155419 -141518 -93402 -12661 -185138 -277607 -157254
1417 -157254 -123366 -116151 -33029 -43743 -182632 -206796 6325 67701 -75681 -253482 -238847
1406 -238847 -165311 -14987 -165226 42823 40915 -4241 -44320 -67680 -31547 -61358 -87010
1395 -87010 -148050 -47046 -117641 -243683 -206705 -213741 -91483 -56963 -203472 -199783 -29486
1384 -29486 164077 54711 -82579 72816 83517 -124720 -139220 -196791 -39774 141979
1374 141979 62279 -131747 -226710 -79247 -111971 -33505 144832 -125546 -131642 -169608 -14481
1363 -14481 112192 26854 15386 72300 29653 -31458 9723 195904 74469 175289 213747
1352 213747 119197 58060 27911 -98146 -85728 -5379 -115024 4334 -74280 -9500 152192
1341 152192 90099 255934 199138 -25273 86805 -118394 -64852 -141751 -150595 -258708 -208486
1330 -208486 -120163 -84873 47993 52677 103578 -70972 -105753 -175743 -101545 -59692 -145961
1319 -145961 40997 -35108 -25921 102951 161836 205361 175625 145310 -42683 48387 -134773
1308 -134773 -45407 -144687 -238811 -231277 -84970 205468 298084 319646 195035 208807 57227
1297 57227 51677 -75147 93555 174635 -205032 -207230 15218 125935 95241 192518 6086
1286 6086 -11738 71610 -62598 -3992 -48465 -137430 -84388 -31679 76935 88409 -83201
1275 -83201 -144794 28079 33149 -119595 -96222 -2578 103194 45874 -181053 -338445 -219590
1264 -219590 -205595 -45398 -29520 -87585 7438 140716 -67195 -127871 -47930 -223475 -160650
1253 -160650 -11738 -76102 -4033 174838 306314 262615 -66064 -205209 -16588 -9065 -189767
1242 -189767 -275480 -142372 -151721 -220264 -98091 -152718 -298256 -370503 -255220 -164012 -151705
1231 -151705 -136190 -36230 42684 12395 104845 -60202 -108341 -45267 -122910 73233 16949
1220 16949 -70885 55068 132872 78383 -4873 124525 -13907 -58033 -30312 -80574 -221119
1209 -221119 -251117 -89540 -151760 -184700 -179362 -188297 -320447 -201343 97577 269974 95951
1198 95951 76013 98791 31930 58623 -131004 -129578 -130702 109871 124709 -268799 -80446
1187 -80446 -196763 -215878 -118071 -98659 -128801 -119555 -382443 -261834 -131887 -26912 -78686
1176 -78686 -116615 -92204 -144784 -84716 -67131 -53290 -87314 -96784 -113538 -101207 -1563 34097
1164 34097 89123 -91401 -125408 -50627 -111106 -104551 -123310 -54994 188698 67932 65232 -5721
1152 -5721 839 26854 -188812 -36913 -79958 -17082 16545 84299 303271 333690 38188
1141 38188 173904 87553 164589 298548 241276 178004 96447 -11155 36796 94595 43978
1130 43978 -1716 122324 -114317 -217883 -67721 180423 143616 69783 80279 -34257 -130837
1119 -130837 88224 245968 214943 19347 96136 101539 104435 248364 138957 162467 -66367
1108 -66367 -180830 35057 83248 143519 82667 96928 144547 209522 175948 249693 145711
1097 145711 -21844 -114407 -9156 -31655 -206092 -234362 -109071 -15350 78484 97027 -65818
1086 -65818 76559 38823 -8070 36952 102080 779 157145 141382 80669 133445 -26433
1075 -26433 -166575 -162168 -130973 -63446 -98767 -76485 13425 123479 277817 134057 -43465
1064 -43465 83109 40357 1618 -99062 -33098 9440 98449 94822 -54917 -36289 -91393
1053 -91393 -69216 -37210 -228949 -120083 -166982 -122315 -62425 -93936 86114 184907 116846
1042 116846 -161939 -145176 117323 151433 102447 27304 183792 236001 87222 204147 274749
1031 274749 13825 -160746 -105365 -128960 -231001 -251017 -244460 -257667 110607 52126 -132220
1020 -132220 90728 99432 11912 -80453 -87218 -195417 66839 78739 109238 89570 139857
1009 139857 55398 -92410 -6893 -78337 -95160 -163217 -94273 17388 35828 27938 -6136
998 -6136 -122680 -167458 4169 49024 -93774 51966 192094 127221 -123687 23331 -78681
987 -78681 -195378 -32554 25415 51690 60548 125488 131836 7496 -132569 17031 -852
976 -852 234155 112071 46618 54264 117058 241580 72710 -66402 -221443 -145538 -30876
965 -30876 170921 52560 -148513 -207859 -78360 171007 192479 1928 15960 59804 148543
954 148543 121486 -1131 -9839 -156380 -68809 74227 -169498 -786 -67506 -198919 -396474
943 -396474 -461174 -158056 107553 50077 -22922 -127370 -61676 -141789 -112283 24412 -663
932 -663 -10174 -23708 12223 -109374 -73170 -103964 -168210 -39279 -44411 7959 -47782 2425
920 2425 -91293 -87862 -105374 -57820 139207 164387 73400 -64688 86709 -216882 -166271 -20447
908 -20447 5342 2062 -8561 -124589 104613 -88107 -315184 -151536 -33604 73380 2989
897 2989 96368 170778 65837 184206 57161 -246913 -268536 -190093 -85599 14126 -58447
886 -58447 -64192 96808 226754 177704 276825 166154 150387 -6029 -71376 228557 -28989
875 -28989 14223 -54661 -132096 -76578 -11464 -133018 35166 46032 94422 -86988 -72834
864 -72834 -23601 -214502 12508 42317 151874 -103037 -72870 -69328 -16149 54325 -29156
853 -29156 24962 51486 232776 4612 4149 94028 115275 -34949 -89404 55718 156475
842 156475 127657 21102 89403 171973 150835 171631 76593 91938 -144060 -144714 102755 66953
830 66953 34945 -32253 -92946 -18178 -143111 -188280 -239720 -119136 27047 37766 71779
819 71779 -1064 24556 83766 247605 94412 78964 138400 208517 244674 79423 -114836
808 -114836 37586 -133960 -20100 -31522 -84280 -334668 -211151 -14569 -83633 -108263 -198853
797 -198853 -204294 -76529 -8497 -95175 -205146 -28951 48824 -65762 -132105 -134762 -140661 -121040
785 -121040 56 -87468 31799 11265 -167324 14198 95702 226054 101367 -127136
775 -127136 -73866 114674 251987 -43078 8830 -2060 -264510 -178433 -267752 -286297 -92066
764 -92066 -69044 -219485 -114457 14137 -181157 2172 91554 -50202 -6579 81990 80941
753 80941 159303 185429 145242 72083 59561 -19880 -52136 -5819 151614 102956 -46562 52177
741 52177 130728 256217 403985 338593 257702 164778 -154819 -146393 -165011 -97879 95936
730 95936 67440 194257 118860 162840 56174 211297 215915 167406 95462 199446 178917
719 178917 -31652 -6001 25762 83977 -11090 -66131 196308 198952 95230 332172 242867
708 242867 -2453 -56115 -40435 -138498 101845 141294 -47710 -113942 49708 119847 142812
697 142812 108250 68090 159097 200853 -7070 -193087 63279 129589 77975 20858 -40588
686 -40588 -6400 48710 12963 122266 89867 143877 71207 -73001 -130825 140658 174590
675 174590 4659 -13286 181855 109169 220731 282850 266096 152599 66690 198542 48686
664 48686 -47053 -210527 -88188 103083 135217 134903 211676 -48906 -37218 102325 316427
653 316427 154016 -98819 95875 21468 80367 89049 142780 131643 25430 -32075 185395
642 185395 212260 39854 116875 119625 212433 169568 54308 -96748 -5819 -29457 151485
631 151485 113642 77064 -74254 -266669 -247763 -144569 -111971 -29160 152747 242237 195065
620 195065 191929 92781 -12911 4823 -32991 39188 124348 99671 -74240 16237 3383 -93196
608 -93196 133284 -64636 -59788 112532 138636 100098 82154 140092 88963 -8356 159890
597 159890 230555 313224 170891 -33417 123450 102776 378350 348914 121048 133208 25803
586 25803 -83244 -182359 59934 89124 -150083 -202792 -184452 -16298 146886 44800 45566
575 45566 88921 -34148 -34162 -34667 -74853 137282 237383 86707 -41105 -2524 -2869 -22778
563 -22778 81479 91377 97910 -97146 -45630 -59424 -105206 -94384 -65745 15098 27252 197079
551 197079 209565 32104 -114521 -139069 -191342 -58041 38971 -24822 90099 54711 225269
540 225269 34815 61174 66977 35540 106963 13629 118447 277498 35479 2756 54075
529 54075 68681 119611 75017 39615 143314 175795 79717 -58438 -141543 27218 51557
518 51557 78401 84263 203954 247448 68323 85692 164493 70464 73435 371210 277775 117430
506 117430 -38060 115847 120121 102909 156793 163031 138639 77476 -118159 -82602 178453
495 178453 334026 -24460 -53904 49620 10485 310757 -120003 -86180 6767 -110763 -12469
484 -12469 252760 187783 143643 74750 -59551 -226158 -23950 -95620 7978 155368 81428
473 81428 8613 244780 73513 128082 73651 -1929 14846 -212820 34574 -62490 -209252
462 -209252 107610 187116 -68994 194307 174198 93891 -121401 -188480 13475 140336 130739
451 130739 121738 -328 -56233 182325 339643 234883 2161 60854 -26296 -113380 -78903
440 -78903 -217047 -8454 129734 93523 182034 76159 312000 319283 197032 167766 136915
429 136915 115693 16640 -67387 -218440 -55159 18317 -69859 -21177 170208 121624 89000
418 89000 -110907 -194821 -55894 58069 4942 -75664 -38125 48747 28240 19963 72978 152759
406 152759 209505 56311 28886 39780 -40107 -53712 162944 180114 14655 -35240 4823
395 4823 -120400 -162247 -48234 155813 239477 215128 135043 123813 -38389 -57684 132976
384 132976 83875 177858 312965 369563 320545 180179 224094 112468 -90145 96782 100328
373 100328 136345 107107 204038 317818 141084 53959 370822 235771 153700 -7163 -91495
362 -91495 52115 130126 365331 199976 154516 119044 34354 85819 119617 218287 137734
351 137734 127296 308337 88395 -26654 208399 342574 186812 64575 78898 133469
341 133469 89342 195364 37388 93908 19704 -139501 -120436 -162297 -152885 99555 114217
330 114217 87291 36683 24353 82902 -142588 -107399 41556 77215 24632 144209 131703
319 131703 114545 220578 178142 151888 288084 250247 125176 73037 136300 -52062 -160368
308 -160368 -80872 -24420 -106952 -90764 33012 118858 -14173 -117998 -172365 43096 71548
297 71548 201372 221855 17063 -68336 -70214 126137 -64267 153717 158712 -87445 176541
286 176541 323818 222634 48841 -15828 131959 219622 308936 260975 328911 252244 59575
275 59575 118724 -28819 12361 96375 -86909 362585 371453 188274 100040 37918 -19714
264 -19714 298202 304313 111026 108443 172821 202806 16452 14592 162528 186672 155796 210717
252 210717 339798 394882 192721 203972 155066 -4206 21066 273378 13872 164315 108679
241 108679 19067 -53644 147161 70815 186012 167121 47647 12060 -89050 84829 -19624
230 -19624 -25365 161227 238359 171271 74644 122855 101360 -50054 717 -117689 -67483 -18046
218 -18046 41805 -82470 -14411 221115 303595 114885 213556 229351 276593 350337 277002
207 277002 59627 106831 201630 176498 213017 268034 404475 177772 124984 -73456 -189130
196 -189130 -13958 2761 23770 133394 -39349 22801 143066 58416 226291 336358 331759
185 331759 256881 168527 268760 295406 211484 149619 138421 37174 41113 217609 79794
174 79794 18209 97198 82048 70401 3209 175653 305568 118588 23659 28309 184464
163 184464 48507 40421 42087 -124218 35102 -121032 -167111 -26059 -29782 13718 157657
152 157657 298829 222102 133875 231869 273616 6708 -169624 -23405 125024 92511 233813
141 233813 206164 -97387 -19346 187501 -15112 -3967 89325 170517 230012 64574 -93022
130 -93022 -111510 44389 204410 226509 249760 166013 241902 344496 227310 240579 115872
119 115872 167203 212625 107182 164073 252253 208310 63904 46622 170061 156520 210000
108 210000 263230 63141 120122 84296 -52674 -95085 124292 271990 150710 64327 28775
97 28775 199266 302968 323350 219411 71767 251002 151626 169590 201046 64761 61274
86 61274 -50397 72743 204213 118033 77541 184729 48780 -22506 -304611 -223496 70379
75 70379 135263 74361 105289 -15833 -24337 95485 35125 188502 103990 83751 61664 2578
63 2578 102749 178688 139523 99073 199218 328197 273196 364800 367083 432200 167520 -93970
51 -93970 19220 -116692 -71014 92956 26408 -17613 10024 41819 100438 73393 143811 16487
39 16487 56020 150311 331614 314125 173872 53367 158456 139983 117092 117004 122208 176199
27 176199 229935 185688 159313 240575 232396 89096 55832 231726 363627 309829 316873 373362
15 373362 112954 1312 83188 175968 219341 62109 8516 160003 113864 77012 28329
4 28329 -96576 -55787 65746 109056
0 109056
$$ Imaginary data points
##PAGE= N=2
##DATA TABLE= (X++(I..I)), XYDATA
16383 -1189978 -1137321 -960021 -925194 -902912 -912528 -827534 -808205 -789297 -660971 -676130 -754839
16372 -754839 -772937 -716481 -723093 -763759 -629304 -606871 -706446 -646234 -584599 -557901 -472117
16361 -472117 -549249 -542927 -503790 -391249 -297461 -404818 -262614 -385123 -521069 -491836 -414058
16350 -414058 -366860 -376347 -129119 -125167 -175111 -142553 -126578 -124478 -96697 -28377 20311 56410
16338 56410 -46117 -17739 57658 146399 207643 165315 183492 57260 132751 172265 131812
16327 131812 226642 178176 190408 199856 198239 323255 323207 234368 419134 403849 386574 490024
16315 490024 672673 585108 522199 470092 418683 547192 485962 421527 440510 579575 643418
16304 643418 851859 761557 820711 817397 862883 915597 886456 876443 936476 1050105 913681
16293 913681 961364 948372 856995 1073237 1066110 1046802 1024872 1069860 1118932 1117959 1027298 1069931
16281 1069931 1162140 1039105 1132086 1199530 1178019 1145297 1090759 1146238 1272559 1236004 1318096
16270 1318096 1445286 1364838 1379445 1137217 1291179 1487813 1368065 1429856 1650904 1471903
16260 1471903 1322095 1308814 1347402 1302568 1316734 1430067 1641388 1710908 1716213 1666786 1802742
16249 1802742 1824148 1687718 1734410 1662720 1769917 1637003 1627908 1611527 1705484 1789262 1841016
16238 1841016 1773566 1752239 1736225 1685575 1713601 1921815 1909630 1812000 1817311 1882164 1850267
16227 1850267 1781068 1755693 1667748 1704585 1660701 1799737 1770446 1882054 1908277 2005154 2020018
16216 2020018 1867412 2033730 2108770 2094461 1796118 1915981 2190760 2175041 2019221 2064768
16206 2064768 2058893 2008208 2004194 2057315 1946740 2206119 2319630 2084131 2188962 2327641
16196 2327641 2312692 2068353 2073478 2140150 2243237 2304761 2161123 2308129 2371185 2400369 2160050
16185 2160050 2196862 2293841 2418005 2355847 2315188 2356234 2429058 2513745 2365497 2221031 2258237
16174 2258237 2185932 2321886 2264724 2292292 2464417 2318894 2363385 2347962 2317620 2258953 2370544
16163 2370544 2392417 2398069 2503702 2403953 2325597 2359421 2122810 2337231 2350943 2211546 2347589
16152 2347589 2408776 2315880 2576966 2622208 2412786 2479026 2581253 2465065 2368911 2350041
16142 2350041 2484475 2458733 2415832 2588656 2487149 2383199 2459701 2635515 2850587 2814830
16132 2814830 2759366 2819187 2692656 2720523 2680018 2621395 2656061 2541592 2394570 2535937
16122 2535937 2684159 2672691 2660976 2473970 2473937 2437176 2538649 2564372 2673361 2705855 2485260
16111 2485260 2503804 2472562 2512388 2558676 2460155 2439266 2618351 2530081 2497622 2690597 2641416
16100 2641416 2786501 2872700 2648892 2588323 2650232 2725859 2752323 2707891 2672086 2734103 2804448
16089 2804448 2847135 2615296 2511336 2767617 2826616 2849207 2434150 2608025 2722136 2732689
16079 2732689 2796876 2699445 2715096 2664733 2317739 2325870 2587528 2629162 2484826 2379866 2521288
16068 2521288 2644643 2881991 2837223 2631107 2699800 2682458 2672736 2644001 2694291 2808004 2785155
16057 2785155 2786590 2597942 2616096 2559334 2680384 2747862 2836482 2745595 2597477 2483714 2520579
16046 2520579 2646602 2612674 2447675 2535749 2444991 2470740 2609072 2604843 2649885 2653821 2618642
16035 2618642 2499419 2560262 2647915 2415649 2472051 2507576 2624426 2762704 2855284 2799853
16025 2799853 2578878 2560143 2645616 2649668 2716285 2553372 2530188 2747465 2685010 2673780 2640228
16014 2640228 2596396 2653013 2814100 2768871 2654073 2469414 2587490 2656077 2757782 2644432
16004 2644432 2690274 2496903 2455317 2475036 2418322 2436081 2415204 2351558 2329647 2392916 2434035
15993 2434035 2720129 2752569 2728244 2841946 2796634 2792196 2656338 2596270 2657101 2723801 2730416
15982 2730416 2523654 2642025 2743767 2712560 2666011 2631261 2653951 2614176 2409010 2439093
15972 2439093 2509607 2798157 2848222 2782599 2687843 2740258 2829354 2784434 2892499 2743357 2681567
15961 2681567 2700307 2760590 2620766 2809206 2705151 2805563 2885797 2591877 2809749 2702130
15951 2702130 2557103 2479060 2669091 2766042 2476631 2365279 2622190 2578677 2635098 2661368
15941 2661368 2644676 2793022 2901687 2680771 2789384 2725105 2737103 2884468 2768411 2765248
15931 2765248 2752463 2873240 2773209 2636000 2557198 2644912 2963904 2807246 2748458 2864909
15921 2864909 2790821 2826920 2809584 2768823 2793954 2736547 2724123 2668400 2758246 2606351 2582381
15910 2582381 2387070 2638181 2991086 2749687 2800532 2465454 2739973 2963262 2855974 2825391
15900 2825391 2879931 2848210 2813680 2734579 2744208 2580462 2631778 2738302 2910074 2934399 3006206
15889 3006206 2728106 2761069 2828779 2807155 2595789 2647696 2975900 2818235 2616748 2806812
15879 2806812 2868584 2609383 2618999 2648886 2754245 2770177 2897809 2875906 2724398 2694183 2771420
15868 2771420 2806027 2777189 2829799 2966421 3035651 2817889 2672531 2665029 2702821 2724032 2623807
15857 2623807 2685811 2624041 2746869 2580624 2504993 2841717 2666679 2571454 2788838 2852424
15847 2852424 2795962 2734934 2733634 2782187 2729300 2564781 2719420 2938714 2750419 2726565 2832645
15836 2832645 2698234 2577791 2613409 2739968 2893798 2922596 2835096 2800160 2698778 2774813
15826 2774813 2555317 2628928 2732539 2831335 2832731 2946982 2925932 2573210 2606538 2667553 2704887
15815 2704887 2855110 2512983 2461419 2663854 2715011 2794239 2991604 2878835 2755057 2774229
15805 2774229 2683181 2766662 2874843 2765956 2678514 2807673 2867715 2682402 2848663 2935484
15795 2935484 2809504 2950358 2727197 2834231 3030308 2861527 2682487 2751319 2741015 2989695
15785 2989695 2828976 2808820 2671224 2641309 2643482 2562919 2805993 2784688 2676582 2810419
15775 2810419 2619558 2829600 2872697 2866474 2749115 2867357 2886140 2791597 2806011 2795474 2952508
15764 2952508 2899264 2857385 2872654 2870336 2819647 2626986 2538394 2738438 2695648 2844091 2774000
15753 2774000 2645498 2668314 2919010 2722339 2787100 2867219 2762995 2656310 2955069 2881691
$$ [...]
##END NTUPLES=NMR SPECTRUM
##END=
