##TITLE=1H_CA-9122-2
 CDCl3
 8 sc, 
 21.2.2023
##JCAMPDX= 6.0         $$ Bruker NMR JCAMP-DX V2.0
##DATA TYPE= NMR SPECTRUM
##DATA CLASS= NTUPLES
##ORIGIN= UXNMR, Bruker Analytische Messtechnik GmbH
##OWNER= root
$$ XWIN-NMR		Version 3.5
$$ Tue Feb 21 18:35:48 2023 Russian Standard Time (UT+4h)  she@DPX200
##.OBSERVE FREQUENCY= 200.13135
##.OBSERVE NUCLEUS= ^1H
##.ACQUISITION MODE= SIMULTANEOUS
##.ACQUISITION SCHEME= undefined
##.AVERAGES= 8
##.DIGITISER RES= 18
##SPECTROMETER/DATA SYSTEM= spect
##.PULSE SEQUENCE= zg30
##.SOLVENT NAME= DMSO
##.SHIFT REFERENCE= (INTERNAL, DMSO, 0, 15.7921)
##AUDIT TRAIL= $$ (NUMBER, WHEN, WHO, WHERE, WHAT)
$$ ##TITLE= Audit trail, XWIN-NMR		Version 3.5
$$ ##JCAMPDX= 5.01
$$ ##ORIGIN= Bruker BioSpin GmbH
$$ ##OWNER= she
$$ F:/spectra/data/she/nmr/H-F/1/pdata/1/auditp.txt
$$ ##AUDIT TRAIL=  $$ (NUMBER, WHEN, WHO, WHERE, WHAT)
(   1,<2023-02-21 18:34:27.26 +0400>,<she>,<DPX200>,
      <created by zg, POWCHK disabled, PULCHK disabled
       configuration hash MD5:
       00 E9 B6 7A A2 85 ED C7 34 08 36 98 17 FE 4E 26
       data hash MD5: 16K
       B7 09 50 E5 D0 BB F6 F8 2A 31 DB 9A 8A 04 E1 A9>)
(   2,<2023-02-21 18:34:33.01 +0400>,<she>,<DPX200>,
      <Start of raw data processing
       efp BC_mod = 2 LB = 0.24 FT_mod = 6 PKNL = 1 PHC0 = -19137.72 PHC1 = 55.20076 SI = 16K 
       data hash MD5: 16K
       3C 7F FD D5 AB 07 D1 7A 3C F1 96 48 3A A3 71 8D>)
(   3,<2023-02-21 18:34:59.17 +0400>,<she>,<DPX200>,
      <pk PHC0 = 25.53281 PHC1 = -39.20002 
       data hash MD5: 16K
       9B 43 C3 88 B9 CD 21 83 EA 8B C8 01 7A 09 41 C6>)
(   4,<2023-02-21 18:35:02.60 +0400>,<she>,<DPX200>,
      <abs ABSG = 5 
       data hash MD5: 16K
       C0 A5 16 26 3C D7 0B A0 70 1B DB 21 83 4C B1 8F>)
$$ ##END=
$$ 
$$ hash MD5
$$ 26 B7 A8 49 42 64 1B 72 2E 8E 79 2E CF C3 A8 06
##$RELAX= 
##$RELAX= 
##$RELAX= 
##$RELAX= 
##$RELAX= 
##$RELAX= 
$$ Bruker specific parameters
$$ --------------------------
##$DU= <F:/spectra>
##$EXPNO= 1
##$NAME= <H-F>
##$PROCNO= 1
##$TYPE= <nmr>
##$USER= <she>
##$AMP= (0..31)
100 100 100 100 100 100 100 100 100 100 100 100 100 100 100 100 100 100 
100 100 100 100 100 100 100 100 100 100 100 100 100 100 
##$AQSEQ= 0
##$AQ_mod= 1
##$AUNM= <au_zg>
##$AUTOPOS= <>
##$BF1= 200.13
##$BF2= 200.13
##$BF3= 200.13
##$BF4= 200.13
##$BF5= 200.13
##$BF6= 200.13
##$BF7= 200.13
##$BF8= 200.13
##$BYTORDA= 1
##$CFDGTYP= 0
##$CFRGTYP= 5
##$CHEMSTR= <none>
##$CNST= (0..31)
1 1 145 1 1 1 1 1 1 1 1 1 1 1 1 1 1 1 1 1 1 1 1 1 1 1 1 1 1 1 1 1 
##$CPDPRG= <>
##$CPDPRG1= <>
##$CPDPRG2= <>
##$CPDPRG3= <>
##$CPDPRG4= <mlev>
##$CPDPRG5= <mlev>
##$CPDPRG6= <mlev>
##$CPDPRG7= <mlev>
##$CPDPRG8= <mlev>
##$CPDPRGB= <>
##$CPDPRGT= <>
##$D= (0..31)
0 1.2 0 0 0 0 0 0 0 0.06 0 0.03 0 0 0 0 0.0002 0 0 0 0 0 0 0 0 0 0 0 0 
0 0 0 
##$DATE= 1676990066
##$DBL= (0..7)
120 120 120 120 120 120 120 120 
##$DBP= (0..7)
150 150 150 150 150 150 150 150 
##$DBP07= 0
##$DBPNAM0= <>
##$DBPNAM1= <>
##$DBPNAM2= <>
##$DBPNAM3= <>
##$DBPNAM4= <>
$$ [...]
##$SUBNAM3= <"">
##$SUBNAM4= <"">
##$SUBNAM5= <"">
##$SUBNAM6= <"">
##$SUBNAM7= <"">
##$SUBNAM8= <"">
##$SUBNAM9= <"">
##$SW= 18.05172834244
##$SWIBOX= (0..15)
0 0 2 0 0 0 0 0 0 0 0 0 0 0 0 0 
##$SW_h= 3612.71676300578
##$TD= 16384
##$TD0= 1
##$TE= 0
##$TE2= 300
##$TE3= 300
##$TEG= 300
##$TL= (0..7)
0 120 120 120 120 120 120 120 
##$TP= (0..7)
150 150 150 150 150 150 150 150 
##$TP07= 0
##$TPNAME0= <>
##$TPNAME1= <>
##$TPNAME2= <>
##$TPNAME3= <>
##$TPNAME4= <>
##$TPNAME5= <>
##$TPNAME6= <>
##$TPNAME7= <>
##$TPOAL= (0..7)
0.5 0.5 0.5 0.5 0.5 0.5 0.5 0.5 
##$TPOFFS= (0..7)
0 0 0 0 0 0 0 0 
##$TUNHIN= 0
##$TUNHOUT= 0
##$TUNXOUT= 0
##$USERA1= <user>
##$USERA2= <user>
##$USERA3= <user>
##$USERA4= <user>
##$USERA5= <user>
##$V9= 5
##$VALIST= <valist>
##$VCLIST= <CCCCCCCCCCCCCCC>
##$VD= 0
##$VDLIST= <DDDDDDDDDDDDDDD>
##$VPLIST= <PPPPPPPPPPPPPPP>
##$VTLIST= <TTTTTTTTTTTTTTT>
##$WBST= 1024
##$WBSW= 4
##$XGAIN= (0..3)
0 0 0 0 
##$XL= 0
##$YL= 0
##$YMAX_a= 142600
##$YMIN_a= -255464
##$ZGOPTNS= <>
##$ZL1= 120
##$ZL2= 120
##$ZL3= 120
##$ZL4= 120
##$ABSF1= 15.73367
##$ABSF2= -2.318179
##$ABSG= 5
##$ABSL= 3
##$ALPHA= 0
##$AQORDER= 0
##$ASSFAC= 0
##$ASSFACI= 0
##$ASSFACX= 0
##$ASSWID= 0
##$AUNMP= <proc_1d>
##$AZFE= 0.1
##$AZFW= 0.1
##$BCFW= 0
##$BC_mod= 2
##$BYTORDP= 0
##$COROFFS= 0
##$CY= -3
##$DATMOD= 1
##$DC= 0
##$DFILT= <>
##$DTYPP= 0
##$F1P= 0
##$F2P= 0
##$FCOR= 1
##$FTSIZE= 16384
##$FT_mod= 6
##$GAMMA= 0
##$GB= 0
##$INTBC= 1
##$INTSCL= 3.70164e-10
##$ISEN= 128
##$LB= 0.24
##$LEV0= 0
##$LPBIN= 0
##$MAXI= 10000
##$MC2= 0
##$MEAN= 0
##$ME_mod= 0
##$MI= 1.114404
##$NCOEF= 0
##$NC_proc= -9
##$NLEV= 6
##$NOISF1= 3.799351
##$NOISF2= 2.8
##$NSP= 0
##$NTH_PI= 0
##$NZP= 0
##$OFFSET= 15.79206
##$PC= 1
##$PHC0= -19112.19
##$PHC1= 16.00074
##$PH_mod= 1
##$PKNL= yes
##$PPARMOD= 0
##$PSCAL= 0
##$PSIGN= 0
##$REVERSE= no
##$SF= 200.12999589281
##$SI= 16384
##$SIGF1= 3
##$SIGF2= 2
##$SINO= 5.538805
##$SIOLD= 16384
##$SREGLST= <1H.CDCl3>
##$SSB= 0
##$STSI= 16384
##$STSR= 0
##$SW_p= 3612.71676300578
##$SYMM= 0
##$S_DEV= 0
##$TDeff= 16384
##$TDoff= 0
##$TI= <>
##$TILT= no
##$TM1= 0
##$TM2= 0
##$TOPLEV= 0
##$USERP1= <user>
##$USERP2= <user>
##$USERP3= <user>
##$USERP4= <user>
##$USERP5= <user>
##$WDW= 1
##$XDIM= 16384
##$YMAX_p= 331741357
##$YMIN_p= -5846444
$$ End of Bruker specific parameters
$$ ---------------------------------
##NTUPLES= NMR SPECTRUM
##VAR_NAME=  FREQUENCY,     SPECTRUM/REAL,   SPECTRUM/IMAG
##SYMBOL=    X,             R,               I
##VAR_TYPE=  INDEPENDENT,   DEPENDENT,       DEPENDENT
##VAR_FORM=  AFFN,          ASDF,            ASDF
##VAR_DIM=   16384,         16384,           16384
##UNITS=     HZ,            ARBITRARY UNITS, ARBITRARY UNITS
##FACTOR=    0.220516191357247, 1,           1
##FIRST=     3160.46488260109, 0,            0
##LAST=      -452.251880404689, 0,           0
##MIN=       -452.251880404689, -5846444,    0
##MAX=       3160.46488260109, 331741357,    0
$$ Real data points
##PAGE= N=1
##DATA TABLE= (X++(R..R)), XYDATA
$$ [...]
6329G182776k09487r0208L82287O76914n5813q45410m28090o3359J14720J67068
6319F831398l51153l35569n0256L43115K09104n43110R79329m70364p69559n32454
6309E310481r4977K70756K78726L72387l18651l6174k33751K65857J46019k69342
6299E691331M88329m42532n88547Q6776k29207l73641m29068P76512k30458j46829
6289D602666l25745M28975K76780O79732j035324n02238J49870O46350J63950
6280E085016l61858K35141p2978N7473J5289O27634J59354l50702j83594M16283
6270E627058n77687K98810J94725o25999J55936n06887p8703j86631k28035M68648
6260D541235j97528L78668K57928R2069m56537K45119N91809o97777m16387m02269
$$ plain form
6329 7182776 6973289 6883081 7265368 7942282 7886469 7041059 6612969 6549610 6664330 6831398
6319 6831398 6480245 6144676 6094420 6437535 6646639 6103529 7082858 6612494 5842935 5310481
6309 5310481 5215504 5486260 5764986 6137373 5818722 5782548 5548797 5814654 5960673 5691331
6299 5691331 6179660 5737128 5148581 5235357 5006150 4632509 4203441 4979953 4749495 4602666
6289 4602666 4276921 4705896 4982676 5662408 4627084 4124846 4274716 4921066 5085016
6280 5085016 4723158 4958299 4885321 4942794 4958083 5585717 5745071 5394369 5210775 5627058
6270 5627058 5049371 5348181 5542906 4916907 5072843 4565956 4487253 4300622 4072587 4541235
6260 4541235 4343707 4722375 4980303 5072372 4615835 4860954 5452763 4754986 4338599 3936330
6250C936330O35718r2182l64947Q33277R3554M42134l62055L54335l09378j019768
6240D147018q13492J243824O13633N33217L7933m81819r52865M60456J68685P1007
6230E027597K83206m2794p57035k19988N42196L673m25302L92138J97534l59877
6220D641348j81799K17616O33230m85912Q33885l76399m17596N7293l12900M16608
6210E025374m03705j072818J045699O40891j13285j09880K84800l43259M7659
6201E001476j9079L03401j65103m55303P85829J37305k00565p78592k33351N96451
6191D972469j46257r30857N6749J34678p2392K63411O20511o65451N83054l8882
6181D777033j054864J062126M72354q6052m40198J93716J7490l84846j12314P49898
$$ plain form
6250 3936330 4572048 4479866 4114919 4948196 5041750 5483884 5121829 5476164 5166786 4147018
6240 4147018 3333526 4577350 5190983 5724200 5762133 5280314 4327449 4787905 4956590 5027597
6230 5027597 5310803 5268009 4510974 4290986 4833182 4836855 4411553 4803691 5001225 4641348
6220 4641348 4459549 4677165 5310395 4824483 5658368 5281969 4864373 4921666 4608766 5025374
6210 5025374 4621669 3548851 4594550 5235441 5122156 5012276 5297076 4953817 5001476
6201 5001476 4982397 5285798 5120695 4665392 5451221 5588526 5387961 4609369 4376018 4972469
6191 4972469 4826212 3895355 3952104 4086782 4014390 4277801 4898312 4232861 4815915 4777033
6181 4777033 3722169 4784295 5256649 5170597 4730399 4924115 4941605 4556759 4444445 5194343
6171E194343J40986p5172l897J59253j45062l91719p70865R33156O29532j25443
6161E545112k98032J04229j39862r4757O47314k03184L66314o09341L99637l93903
6151E323527j289651K56623P69554l12714P6384N52722j22930K80469N14301j214965
6141D833320k85495R76094J35673o38612J62381O12733k17546q5194K75807K37750
6131F006911q09716J394034J3701n572K27211J36225j0078m01271O4149l96541
6121F219053K38693n39147j38032j80650K37345Q53550M56413m79008j03948K24270
6111F788539k63582L50920k12466j87925N35987k09543q64151M47045j57790O64101
6101F891135L44882k15099N33804L91035n29528r5672l32633L83800M30523k64889
$$ plain form
6171 5194343 5335329 5260157 5256260 5415513 5270451 4878732 4107867 5041023 5670555 5545112
6161 5545112 5247080 5351309 5211447 5116690 5764004 5560820 5927134 5317793 5717430 5323527
6151 5323527 4033876 4290499 5060053 4747339 4823723 5376445 5253515 5533984 6048285 4833320
6141 4833320 4547825 5523919 5659592 5020980 5183361 5796094 5578548 5493354 5769161 6006911
6131 6006911 5197195 6591229 6604930 6599358 6826569 6962794 6952716 6551445 6615594 6219053
6121 6219053 6457746 5918599 5780567 5599917 5837262 6690812 7147225 6668217 6564269 6788539
6111 6788539 6524957 6875877 6663411 6475486 7011473 6801930 5937779 6384824 6227034 6891135
6101 6891135 7236017 7020918 7554722 7945757 7416229 7320557 6987924 7371724 7802247 7537358
6091G537358M88443j13157J22592K72716K50510l88561J67835N68971p66403r5222
6081H045082j96850o06982J361035J06600l49392l7174k20890j92805R68528N43272
6071I420424j28392M0806k0146k74308o83403j34350L14222M24238j69790j5175
6061H774126M01975l06090J61041L41931p7850M61583K77429n01067l20807Q8395
6051I300666R4149p00216P81145N68423N32882Q1190q92705L39440l07568j02476
6041I694930M40966n03513J129710k41924m26308J67469P19809M9660k86094l23532
6031A0421173K44548N23213j41447L61446m59195j215993j43932M45086J385109
6022A1420008P52088m88198L69370k1651L11723J55982o32328J17498O25064m5611
$$ plain form
6091 7537358 8025801 7912644 8035236 8307952 8558462 8169901 8337736 8906707 8140304 8045082
6081 8045082 7848232 7241250 8602285 8708885 8359493 8322319 8101429 7908624 8877152 9420424
6071 9420424 9292032 9332838 9312692 9038384 8354981 8220631 8534853 8959091 8789301 8774126
6061 8774126 9176101 8870011 9031052 9372983 9295133 9756716 10034145 9533078 9212271 9300666
6051 9300666 9394815 8694599 9475744 10044167 10577049 10658239 9765534 10104974 9797406 9694930
6041 9694930 10135896 9632383 10762093 10520169 10093861 10261330 10981139 11030799 10744705 10421173
6031 10421173 10665721 11188934 11047487 11408933 10949738 9733745 9589813 10034899 11420008
6022 11420008 12172096 11683898 12053268 12031617 12343340 12499322 11866994 11984492 12609556 12563945
6012A2563945J80559j44695k8403J89297M66353p81062L61633K81469O3982J37490
6002A3290568M07720k26874N36832q0174p32942P21382L20463o01608L80655N64822
5992A4580844m86461M4323K64765M2037p29686L17720K63543m24121Q80327j27655
5982A4625636r40017N39867J99449J96677N35117M4138q43657K05506Q57391P16834
5972A6136941m56535o2557J96094K13349R26975q16532r52392O42899J94673j6818
5962A6006097L04944J50254J54576j60828N24605L40371l59668J19232J095334
5953A8174917M03148P57923L8403l42997N08737J5982J26219K05675m9618R19432
5943B0757821k49620o95259Q46950m40661o29818R1538Q11858Q22269o36522Q7775
$$ plain form
6012 12563945 12744504 12599809 12571406 12760703 13227056 12445994 12807627 13089096 13153078 13290568
6002 13290568 13698288 13471414 14008246 13928072 13195130 13916512 14236975 13635367 14016022 14580844
5992 14580844 14094383 14138706 14403471 14445508 13715822 14033542 14297085 13872964 14753291 14625636
5982 14625636 13685619 14225486 14424935 14621612 15156729 15200867 14357210 14562716 15420107 16136941
5972 16136941 15680406 15617849 15813943 16027292 16954267 16137735 15185343 15828242 16022915 16006097
5962 16006097 16311041 16461295 16615871 16455043 16979648 17320019 16960351 17079583 18174917
5953 18174917 18578065 19335988 19374391 19031394 19540131 19556113 19682332 19888007 19838389 20757821
5943 20757821 20508201 19812942 20659892 20219231 19589413 19680951 20492809 21315078 20678556 20766331
5933B0766331k23458k33279R15831O93125j82560J14676o15775M18336M95214
5924B2148441k20107R29354P54386J87234j717k64588K73158k7587J548508O34054
5914B5961136l23516m72524k34854L50570K93350K03822j65747n99555N31315
5905B5543997L44256K71267M67588L15470M68548m52826l94251K03818M63207
5896B7231074L33243J24797j42396L94906o71736j63559K3187M62705L26623Q41299
5886B8760143N46030L52331l09300o29231J46687O73977n01890L17303O12847
5877B9968897l33140L11359J81378j90201L06876N22108l33312o78775l6298j38899
5867B9579993L23112j71040L28094J31629n30295J54441k55649n12315J56887
$$ plain form
5933 20766331 20542873 20309594 21225425 21918550 21735990 21850666 21234891 21653227 22148441
5924 22148441 21928334 22857688 23612074 23799308 23797591 23533003 23806161 23778574 25327082 25961136
5914 25961136 25637620 25165096 24930242 25280812 25574162 25777984 25612237 25012682 25543997
5905 25543997 25888253 26159520 26627108 26942578 27411126 26958300 26564049 26767867 27231074
5896 27231074 27564317 27689114 27546718 27941624 27269888 27106329 27129516 27592221 27918844 28760143
5886 28760143 29306173 29658504 29349204 28719973 28866660 29540637 29038747 29356050 29968897
5877 29968897 29635757 29947116 30128494 29938293 30245169 30767277 30433965 29755190 29718892 29579993
5867 29579993 29903105 29732065 30060159 30191788 29661493 29815934 29560285 29047970 29204857
5858B9204857n190n8621k46000j106330N32573j43314M27204O04444o99020M65971
5848B8976574m39796j33895o43259l87284R91809l75464j76413m43166n88815
5839B6780291P43028J07889j006660p56396K27033P7996K6285k38003M48373k90029
5829B6119807M40894q4385Q27658k89976p53445L09656K91117j45342J80552J66835
5819B7063371J30152L13726m23094M02629l72624q3234J64967K67r86717r6874
5809B6112569K97258j44038J80618M01847K8978o00860J157650M82561p55901
5800B7160682m10209m09247m27632L30357K21655K33765L22384O2729j75530K84407
5790B7193361K98980l10765P49961n81056L0369J91437p2430J59870M22059o17619
$$ plain form
5858 29204857 29199667 29141046 28895046 27788716 28321289 28177975 28605179 29209623 28510603 28976574
5848 28976574 28536778 28402883 27759624 27372340 28364149 27988685 27812272 27369106 26780291
5839 26780291 27523319 27631208 26624548 25868152 26095185 26173181 26199466 25961463 26409836 26119807
5829 26119807 26560701 26476316 27303974 27013998 26260553 26570209 26861326 26715984 26896536 27063371
5819 27063371 27193523 27507249 27084155 27486784 27114160 27030926 27195893 27196160 26209443 26112569
5809 26112569 26409827 26265789 26446407 26848254 26877232 26276372 27434022 27916583 27160682
5800 27160682 26750473 26341226 25913594 26243951 26465606 26699371 27021755 27084484 26908954 27193361
5790 27193361 27492341 27181576 27931537 27350481 27380850 27572287 27499857 27659727 28081786 27464167
5780B7464167L58325R9083j51745m66867m63885J62876P0607j81308R3026j41166
5770B6843113M70565k4926j50799P19887J63851N2233q75561L37949J94586J41822
5760B7872720j59274j64389R7600K95180K02294L60668l63992p68744L74900n66515
5750B7180448J77809M04984Q01757j38584j57814J21702j62648p46873Q35661
5741B8316442k93966o2977M80057L37624J10227j44410m09794J73411K34184j16654
5731B8624144K56759q5941P69220l61534j250104M70697M51299J04556N42173
5722B9521269p27549n3978P12959J5131N13927m27175O02732j14732J26332M36794
5712C0605710l67743j3372j22291J065801L98827M26078J66709K19259Q1221M36667
$$ plain form
5780 27464167 27822492 27921575 27769830 27302963 26839078 27001954 27072561 26891253 26984279 26843113
5770 26843113 27313678 27288752 27137953 27857840 28021691 28073924 27198363 27536312 27730898 27872720
5760 27872720 27713446 27549057 27646657 27941837 28144131 28504799 28140807 27372063 27746963 27180448
5750 27180448 27358257 27763241 28564998 28426414 28268600 28390302 28227654 27480781 28316442
5741 28316442 28022476 27959499 28439556 28777180 28887407 28742997 28333203 28506614 28740798 28624144
5731 28624144 28880903 28794962 29564182 29202648 27952544 28423241 28874540 28979096 29521269
5722 29521269 28793720 28739742 29452701 29467832 29981759 29554584 30157316 30042584 30168916 30605710
5712 30605710 30237967 30224595 30102304 31168105 31566932 31993010 32159719 32378978 32460199 32896866
5702C2896866k17190N90202N71870J15258N65488L23305q21299K55825J325089
5693C5605414Q38139J42247j1786M81525J032889K47698k4388O35385J712228
5684D0659351R50224M77751L31947q84234j24644J0127n67153N91123m47163J58507
5674D1155836J59485L67647R41869K59322N19543M77360Q86126M44214P83997
5665D5995399j09243p07679o14505L53280K82671N7492k06084J99923L30559k063687
5655D3518126N08988J561448L64397K1144M53389J48206n9668K93152M5483j583
5645D6853082j30332l07726J41317p1362J026994N07765J047073L00863P68868
5636E0136542K70824J013632O87364J181746J115693L67720J087392R36718K75791
$$ plain form
5702 32896866 32679676 33269878 33841748 33957006 34522494 34845799 34024500 34280325 35605414
5693 35605414 36443553 36585800 36574014 37055539 38088428 38336126 38311738 38947123 40659351
5684 40659351 41609575 42087326 42419273 41535039 41410395 41420522 40853369 41444492 40997329 41155836
5674 41155836 41315321 41682968 42624837 42884159 43403702 43881062 44767188 45211402 45995399
5665 45995399 45886156 45178477 44563972 44917252 45199923 45257415 45051331 45251254 45581813 43518126
5655 43518126 44027114 45588562 45952959 45974103 46427492 46575698 46516030 46809182 46854665 46853082
5645 46853082 46722750 46415024 46556341 46484979 47511973 48019738 49066811 49367674 50136542
5636 50136542 50407366 51420998 52108362 53290108 54405801 54773521 55860913 56797631 57073422
5627E7073422K08186O25819L79719Q57393l51122n58473J99385l25058M9501P29036
5617E8887808O65040n32666l59631M57753J000794K47450O58804K005980Q88381
5608F3919713j33399j90087P76317L86997J9616m40471o88838p65339l2591P956
5598F2859874K65300k70975R8142p00725l7755k77236Q5357o90885N02237J69759
5588F2003093o43228M39142P15719j046408r39282J077827J444730o4451K82913
5579F3270055n95712J124500r0416o00345K44272l53363j82464J58873k17924
5570F2757476q75858l9946O17623k61098o07706L90053M62398m21740l90711J023562
5560F2654053k92958M69693j176864m48121K29150r33221n83966k82764J79719
$$ plain form
5627 57073422 57281608 57907427 58287146 59144539 58793417 58234944 58434329 58109271 58158772 58887808
5617 58887808 59552848 59020182 58660551 59118304 60119098 60366548 61025352 63031332 63919713
5608 63919713 63786314 63596227 64372544 64759541 64779157 64338686 63649848 62884509 62851918 62859874
5598 62859874 63125174 62854199 62952341 62251616 62213861 61936625 62021982 61331097 61833334 62003093
5588 62003093 61359865 61799007 62514726 61468318 60529036 61606863 63051593 62987142 63270055
5579 63270055 62674343 63798843 63708427 63108082 63352354 62998991 62816527 62975400 62757476
5570 62757476 61881618 61841672 62459295 62198197 61590491 61980544 62442942 62021202 61630491 62654053
5560 62654053 62361095 62830788 61653924 61205803 61434953 60501732 59917766 59635002 59814721
5551E9814721n98016N22400l27356m86983r26939r29183l00938n5259l39467r64466
5541E5408514j445066o20187Q98741R88006j075261q49532M05445k30632k28583
5532E3251445M44993o29703l42066k79098l72406r46898O6318L4527l76380j048600
5522D9802132o33747q88787j66247K33021q18921m41760j059593m50083l61919
5513D5214096K13183m76062L33900l98280Q30780n48840m45832m15389K34390
5504D4541946q48893o20897J45818O00317K02513N79402j047543o75843Q70992
5495D3747812m568l68936p89042p54786J084949n67741n86896K3461M78855j89096
5485D2074012r5557K90503Q04567n19159l43539R19744L17832J123326N35779
$$ plain form
5551 59814721 59216705 59739105 59411749 58924766 57997827 57068644 56767706 56712447 56372980 55408514
5541 55408514 53963448 53343261 54242002 55230008 54154747 53305215 53710660 53480028 53251445
5532 53251445 53696438 53066735 52724669 52445571 52073165 51126267 51192585 51227112 50850732 49802132
5522 49802132 49168385 48279598 48113351 48346372 47527451 47085691 46026098 45576015 45214096
5513 45214096 45427279 44951217 45285117 44886837 45717617 45168777 44722945 44307556 44541946
5504 44541946 43693053 43072156 43217974 43818291 44020804 44600206 43552663 42876820 43747812
5495 43747812 43743244 43374308 42585266 41830480 42915429 42347688 41760792 41784253 42263108 42074012
5485 42074012 41978455 42268958 43073525 42554366 42210827 43130571 43448403 44571729 45107508
5476D5107508N00913K67865o279K41727P0041l15949K09314q57738l57063p09461
5466D4150878k18076l21745j087853R0252K62598J19881L28011o10594n04187
5457D2209165j34755o13373J48262Q9503K03612M8789K34434R02304K03935O23987
5447D3915863M11863L51296q68389n85620r11120q14973n49335n43451j348767
5438C9057367k16315k89242o52649r0670M21969k87995j10033R65569M14981K39801
5428C9452783p01364k78920K44789J07828p9436M87364R60855l578o21858J054506
5418D0622969K17649n71031J892382L82495o12027P07801P92258o56529n15447
5409D2260520N36599J100593r20488O8338j0190K71968O39716L69198N84391j115446
$$ plain form
5476 45107508 45608421 45876286 45870007 46111734 46181775 45865826 46075140 45217402 44860339 44150878
5466 44150878 43932802 43611057 42523204 42613456 42876054 42995935 43323946 42713352 42209165
5457 42209165 42074410 41461037 41609299 41698802 41902414 41951203 42185637 43087941 43291876 43915863
5447 43915863 44327726 44679022 43810633 43225013 42313893 41498920 40949585 40406134 39057367
5438 39057367 38841052 38551810 37899161 37808491 38230460 37942465 37832432 38798001 39212982 39452783
5428 39452783 38751419 38472499 38717288 38825116 38745680 39233044 40193899 40190321 39568463 40622969
5418 40622969 40840618 40269587 42161969 42544464 41932437 42640238 43432496 42775967 42260520
5409 42260520 42797119 43897712 42977224 43045562 43035372 43307340 43947056 44316254 44900645 43785199
5399D3785199q19891p3043l31289k80663M0264P35925J479133l89691p5229k57447
5389D3813268k02448n0411L55757O681k17834K60433N78048J46969M98293j17425
5379D5071331Q92941M60259L8287n5034Q76791P64547p89903o63815l4691K37274
5369D6797987j876640m97885J29971o15374J72053L28490N68160m52342Q4232
5360D4638652J37684K05968P33697J48268N20333j63897P69423N30618J76836
5351D7697582J278349O33361O23661N24382R23165R51903k53383N83079P81990
5342E3744089r3522p14075n71390N87768N83679m93432j08440N11227N35100m25814
5332E3555190R17899O02281j17090j43K84177P11487m25154K44365J512705Q04435
$$ plain form
5399 43785199 42965308 42892265 42560976 42280313 42320577 43056502 44535635 44145944 44070715 43813268
5389 43813268 43610820 43560409 43916166 43922847 43705013 43965446 44543494 44690463 45188756 45071331
5379 45071331 45964272 46424531 46462818 46407784 47284575 48049122 47259219 46595404 46560713 46797987
5369 46797987 44921347 44423462 44553433 43938059 44110112 44438602 45006762 44554420 44638652
5360 44638652 44776336 44982304 45716001 45864269 46384602 46220705 46990128 47520746 47697582
5351 47697582 48975931 49609292 50232953 50757335 51680500 52632403 52379020 52962099 53744089
5342 53744089 53650567 52936492 52365102 52952870 53536549 53043117 52934677 53445904 53981004 53555190
5332 53555190 54473089 55075370 54958280 54958137 55242314 55953801 55528647 55773012 57285717 58090152
5322E8090152M12654k40757p82291N16559K98340M62200m37020p00624J117186
5313E8736399j123233p28489O2085k85316r59545n1947O87854k2636P36382j078253
5303E5973301m57219k69549q83406M61601R2042l18057J46569m3309j085756l47877
5293E3268340l31910p57847J63408n41917j89010L47008p64058r89340m37898
5284D9766776n87714K75503L29540M16140r9654q28846j95801k93596K6628j3790
5274D8795186P57760l27241o84831l14549m22268l88401L1024k9387j4803J33467
5264D7535957Q66623l96925j19755P64816K30343p21490Q185L34584K34440M03415
5254D9140193k88617n45766q5668L09827k00156m42683k81830J219458m80624
$$ plain form
5322 58090152 58502806 58262049 57479758 57996317 58294657 58756857 58319837 57619213 58736399
5313 58736399 57613166 56884677 56946762 56661446 55701901 55649954 56337808 56315172 57051554 55973301
5303 55973301 55516082 55246533 54363127 54824728 54916770 54598713 54745282 54701973 53616217 53268340
5293 53268340 52936430 52178583 52341991 51800074 51611064 51958072 51194014 50204674 49766776
5284 49766776 49179062 49454565 49784105 50200245 50100591 49271745 49075944 48782348 48808976 48795186
5274 48795186 49552946 49225705 48540874 48226325 47804057 47415656 47446680 47417293 47402490 47535957
5264 47535957 48402580 48005655 47885900 48650716 48881059 48159569 48167754 48502338 48736778 49140193
5254 49140193 48851576 48305810 48220142 48529969 48329813 47887130 47605300 48824758 48344134
5245D8344134M56854K82853N78676n79987j58562R02459m8121J1601M29588M15595
5235E0635090j09272J58079L73152Q1067j73036k05808M45009N85645P0282P5953
5225E1936161J066585K64393K22335j2579J467592J890633J315714K299834J536326
5216F1986994P80353N71802N0054l11593r63751j180639k299767j238104k198975
5207E5196374q44736j733613j395186j136378r73585q5861m10582L48511m98242
5198D8466702n46919K28885O29236N6367m82564J071999J076778N94035J586602
5189E2681121R25340J562081J498950J193708n97139n94221k21386j033711j981458
5180E3433285k320883j853764j584643j591237r59165j302148q28014j523871
$$ plain form
5245 48344134 48800988 49083841 49662517 49082530 48923968 49826427 49778306 49789907 50219495 50635090
5235 50635090 50525818 50683897 51057049 51138116 50965080 50759272 51204281 51789926 51860208 51936161
5225 51936161 53002746 53267139 53489474 53476895 54944487 56835120 58150834 60450668 61986994
5216 61986994 62767347 63339149 63389203 63077610 62113859 60933220 58633453 57395349 55196374
5207 55196374 54351638 52618025 51222839 50086461 49112876 49027015 48616433 48964944 48466702
5198 48466702 47919783 48148668 48777904 48834271 48351707 49423706 50500484 51094519 52681121
5189 52681121 53606461 55168542 56667492 57861200 57264061 56669840 56448454 55414743 53433285
5180 53433285 51112402 49258638 47673995 46082758 45123593 43821445 42993431 41469560
5172D1469560o64610l89590r86758j274372m01298n87359m03229p20566p41531
5163C5300247j047606j76122Q9933k7403j040833N7713J518534n71839n63839
5154C3538785M95248k09366P39204L77314m64900J03909L21157l47391r651n79454
5144C3964855j37263K06204q41526J48961o310p93217Q24821o76893l74738m03531
5134C1911363p64303j07608K91814l44729k66313K98568P7197N1024J14007M52946
5124C1713966o45627o6694K3583N98456L48855j012720o33746J531047M69083
5115C2326203o27512L33756J18361q73233k14805k54250K37059M9950j6284J051397
5105C2130642l84094o49261N9783Q6617K06776P166j118N3295L13435N9996M0893
$$ plain form
5172 41469560 40804950 40415360 39428602 38154230 37752932 37165573 36762344 36041778 35300247
5163 35300247 34252641 34076519 34166452 34139049 33098216 33155929 34674463 34102624 33538785
5154 33538785 34034033 33824667 34563871 34941185 34476285 34580194 34901351 34553960 34544309 33964855
5144 33964855 33827592 34033796 33192270 33341231 33334921 32541704 33366525 32689632 32314894 31911363
5134 31911363 31147060 31039452 31331266 30986537 30720224 31018792 31095989 31147013 31261020 31713966
5124 31713966 31068339 31001645 31025228 31623684 31972539 30959819 30326073 31857120 32326203
5115 32326203 31698691 32032447 32150808 31277575 31062770 30808520 31045579 31095529 31079245 32130642
5105 32130642 31746548 31097287 31157070 31243687 31450463 31457629 31456511 31509806 31823241 31883237 31924130
5094C1924130P43065M59075K78128n45966j062003J144566L34898L33548k13465
5085C3395976m13553J87369J30311P71368K8647m52096K28994M98678L21105j34656
5075C4562143K70253Q26437L54997m76009J91894m240K76709l424k69185m49078
5065C5280497M51536J9558O29079J16992k1498k990k22855J94771N11881R49357
5055C7906328q30131J15682K14886R71539L26198n82014k49823J075865k93102
5046C8655428m48091N89684J65274N56245q3822j50801k802K88788K95394Q1296
5036C9946593q8816P55761l49814l87642O4762l48425M16364k65562J52662J043305
5026D0939188m41995j54541L87571j30829M84069Q11767l79604N78893J57140
$$ plain form
5094 31924130 32667195 33126270 33404398 32858432 31796429 32940995 33275893 33609441 33395976
5085 33395976 32982423 33169792 33300103 34071471 34100118 33648022 33877016 34375694 34696799 34562143
5075 34562143 34832396 35658833 36013830 35537821 35729715 35725475 36002184 35998760 35729575 35280497
5065 35280497 35732033 35751591 36380670 36497662 36476164 36473174 36250319 36445090 36956971 37906328
5055 37906328 37076197 37191879 37406765 38378304 38704502 38122488 37872665 38948530 38655428
5046 38655428 38207337 38797021 38962295 39518540 39434718 39283917 39281115 39569903 39865297 39946593
5036 39946593 39857777 40613538 40263724 39876082 39940844 39592419 40008783 39743221 39895883 40939188
5026 40939188 40497193 40342652 40730223 40599394 41083463 41895230 41515626 42094519 42251659
5017D2251659l31802j29974N4653l68729M39311J091740K56644K67303J10658
5008D3641463j96193p2473N3367K84456n49015J81104J4493l39742Q59084L17466
4998D4194010J35427n2858O30231J11078J06092N01090N37247n3740l373R693
4988D6114897R09619N74027J49953M13103J57087Q6166J98816Q42646K30655M06529
4978E0083498N01018O34070Q87138k66950M6486j93028l90049J343072J522557
4969E4167812M25496J18514J06274J157200P62833Q80173K95101J04051J321393
4960E9338847K06081P82106P05184P58955P54657K13215K92482O57815J029455
4951F4738797P32214J695518P02039J948744K224582M65152R91526J818163R56139
$$ plain form
5017 42251659 41919857 41789883 41844536 41475807 41915118 43006858 43263502 43530805 43641463
5008 43641463 43445270 43372797 43426164 43710620 43161605 43342709 43357202 43017460 43876544 44194010
4998 44194010 44329437 44276579 44906810 45017888 45123980 45625070 46162317 46108577 46105204 46114897
4988 46114897 47024516 47598543 47748496 48161599 48318686 48404852 48603668 49446314 49676969 50083498
4978 50083498 50584516 51218586 52105724 51838774 51885260 51692232 51302183 52645255 54167812
4969 54167812 54593308 54711822 54818096 55975296 56738129 57618302 57913403 58017454 59338847
4960 59338847 59544928 60327034 61032218 61791173 62545830 62759045 63051527 63709342 64738797
4951 64738797 65471011 67166529 67868568 69817312 72041894 72507046 73498572 75316735 76272874
4942G6272874K006393J092576N43031O75271J413362Q86303P53602K579432J596395
4933H7819239K029146L272834L101011L468096L598028M756472N973029O539916
4925A20557771O724839Q926815R123339Q927277Q782442N074357J811471j142354
4917A68785957l307816l557094m298483m866703l180279j408997j011515k29008
4909A46926062j391854m50161j41678j457970j059803k413179l128833k261374
4901A34621210l889110m364804m357920m523725n413720m754152l217827l451292
4893A00648660k481413k135729j465113j727664j478221j704424m54178j190468
4885H8011450k24409k79116O03640j01709J176425J473074J639826J232146L17347
$$ plain form
4942 76272874 78279267 79371843 79914874 80590145 82003507 82889810 83643412 86222844 87819239
4933 87819239 89848385 93121219 96222230 99690326 103288354 108044826 114017855 120557771
4925 120557771 127282610 136209425 145332764 154260041 163042483 168116840 169928311 168785957
4917 168785957 165478141 161921047 157622564 152755861 149575582 148166585 147155070 146926062
4909 146926062 145534208 145084047 144942369 143484399 142424596 140011417 136882584 134621210
4901 134621210 130732100 126367296 122009376 117485651 112071931 107317779 104099952 100648660
4893 100648660 98167247 96031518 94566405 92838741 91360520 89656096 89201918 88011450
4885 88011450 87787041 87507925 88111565 88009856 89186281 90659355 92299181 93531327 93848674
4876I3848674o22285p76191j218148k709569k641751l085883k885101k293181
4868G7616565o75588k152799j967060j181691k203091o30932j107940j103337
4860F6594127j40359l07676n81689m20657q49590l96013O65241M72962J71273
4851F5207619J420415J574148R98295J710347J481046Q84799J170716J567980
4843G6015365J41315J67097j026902k134848k231945j328917n94523j414135j829258
4834F5763249j693374o18236l52352j586722j65817n07311o19733J59961n63160
4825E9816505M01494P18330j06263n07276n93130J97032J321201k11155l46765
4816F0689973K79075K13349l47601j63110K41774j71798k96995m29882R35320
$$ plain form
4876 93848674 93226389 92450198 91232050 88522481 85880730 82794847 79909746 77616565
4868 77616565 76940977 74788178 72821118 71639427 69436336 68805404 67697464 66594127
4860 66594127 66453768 66146092 65564403 65143746 64294156 63898143 64563384 65036346 65207619
4851 65207619 66628034 68202182 69200477 70910824 72391870 73276669 74447385 76015365
4843 76015365 76156680 76323777 75296875 73162027 70930082 69601165 69006642 67592507 65763249
4834 65763249 64069875 63451639 63099287 61512565 61346748 60839437 60219704 60379665 59816505
4825 59816505 60217999 60936329 60830066 60322790 59729660 59926692 61247893 61036738 60689973
4816 60689973 60969048 61182397 60834796 60671686 60913460 60741662 60444667 60014785 60950105
4807F0950105J15431l17745M14453O75443M65805k21800M17106P25460K20823
4798F3445081N04722k99372n41542P40053P95445j41627K56024O3419K59449J092462
4788F6174114k74551m12139O49649O91015N36013J443633O71117O24037N22596
4779G0625484L66000k68189L68138P28542J006850N52284O54936J389008O44047
4770G6067100L04976L30870J308360P92812P07759O15831R73054J119358J324554
4761H3544674J344425J027842J212411J649882J323202J653412P88598J377080
4753I3921526J661414J899065K591252J463683J885607K131996K666799K336854
4745A10558196K392383J960776J288650K922263L242694J839162J234011J857007
$$ plain form
4807 60950105 61065536 60747791 61162244 61837687 62303492 62081692 62498798 63224258 63445081
4798 63445081 63949803 63650431 63108889 63848942 64644387 64502760 64758784 64822203 65081652 66174114
4788 66174114 65899563 65487424 66137073 66828088 67364101 68807734 69478851 70102888 70625484
4779 70625484 70991484 70723295 71091433 71819975 72826825 73379109 74034045 75423053 76067100
4770 76067100 76372076 76702946 78011306 78804118 79511877 80127708 81100762 82220120 83544674
4761 83544674 84889099 85916941 87129352 88779234 90102436 91755848 92544446 93921526
4753 93921526 95582940 97482005 100073257 101536940 103422547 105554543 108221342 110558196
4745 110558196 112950579 114911355 116200005 119122268 122364962 124204124 125438135 127295142
4737A27295142K215384K463982K263878K313585J535223P98821J420821K381229
4729A42688065J117244P38479J615565J889364J994688J998050J801777K815478
4721A56658710K579967L826500M705896N263673N496184N677118P664782N952287
4713A97825117L397114L74805l165916m490092o720921p950557q642572p779098
4705A62847880n797032n198200m563744m721298l043911k750036l174395j450661
4697A32148603r64620k486190j748175r27970j919237j612057J4479r40147J26771
4688A21691457J36425j856400m56210r50332j999429l125141j331364j779752
4680A10329254k374008j758221m54489j594456j536665q11823j29041L81839r65889
$$ plain form
4737 127295142 129510526 131974508 134238386 136551971 138087194 138886015 140306836 142688065
4729 142688065 143805309 144543788 146159353 148048717 150043405 152041455 153843232 156658710
4721 156658710 159238677 163065177 167771073 173034746 178530930 184208048 191872830 197825117
4713 197825117 201222231 201597036 198431120 193941028 187220107 179269550 170626978 162847880
4705 162847880 157050848 151852648 147288904 142567606 139523695 136773659 133599264 132148603
4697 132148603 131183983 128697793 126949618 126021648 124102411 122490354 122504833 121564686 121691457
4688 121691457 121827882 119971482 119515272 118564940 116565511 113440370 112109006 110329254
4680 110329254 107955246 106197025 105742536 104148080 102611415 101799592 101670551 102052390 101086501
4671A01086501k20744N7343q27954j086269J82911j61756R47026P5156Q21125
4662A00873339N45361Q3780L45854M22671R22667J013485l9817J19735O99527
4653A04986602K62491L79940O6175p80654o86793j063942j914767m25898j185444
4644I9637710J4288j11820p83253k31464r42362q51457k57596q5140j203104J34692
4634I5320494p11723o79650K93735r2879r6020L89099J22391P18265K54970p01277
4624I4817405l76250P9557j37483j67145p10491k47962r27847j73075m30589N37954
4614I2264074n39320K52702j14475n96813p4947K17591L08004j5125k31692p31571
4604I0738428P32433r9280j17590M80432J67294M31454K07189K38436k19390J11228
$$ plain form
4671 101086501 100865757 100923100 100095146 99008877 99191788 99030032 99977058 100052214 100873339
4662 100873339 101418700 101502480 101848334 102271005 103193672 104207157 104167340 104287075 104986602
4653 104986602 105249093 105629033 105695208 104914554 104227761 103163819 101249052 100823154 99637710
4644 99637710 99651998 99540178 98756925 98525461 97583099 96731642 96474046 96388906 95185802 95320494
4634 95320494 94608771 93929121 94222856 94129977 94033957 94423056 94545447 95263712 95518682 94817405
4624 94817405 94441155 94520712 94383229 94216084 93505593 93257631 92329784 92156709 91726120 92264074
4614 92264074 91724754 91977456 91862981 91266168 91191221 91408812 91716816 91701691 91469999 90738428
4604 90738428 91470861 91371581 91253991 91734423 91901717 92333171 92540360 92778796 92559406 92670634
4594I2670634M90947N86408K17926n96077R26761p25133l20006M51179J079792
4585I4782431M81188N79765k01984l8571R35530R85213J114120P87786K287633
4576A01713111J737907K267327L414106K507172L538111L252657L791530L507057
4568A25728978K001589R15776m32938k027448k366111l838354m906560m418925
4560A10656007k663576k393549k126914k338764k105706j841172r51756j692359
4552I4542211j634166m71916j071890j5923n15290k27878r01852j035960m88242
4543H8179094n39710j93635p82379M92774o64110l48323o74447K51747K93051
4534H6014062j465630M06316J75098p84221Q87830j391127k36598J87631j63320
$$ plain form
4594 92670634 93161581 93747989 93965915 93369838 94296599 93571466 93251460 93702639 94782431
4585 94782431 95263619 95843384 95641400 95602829 96538359 97523572 98637692 99425478 101713111
4576 101713111 103451018 105718345 109132451 111639623 115177734 118430391 122221921 125728978
4568 125728978 127730567 128646343 128213405 126185957 123819846 119981492 115074932 110656007
4560 110656007 107992431 105598882 103471968 101133204 99027498 97186326 96234570 94542211
4552 94542211 92908045 92436129 91364239 91348316 90833026 90605148 89703296 88667336 88179094
4543 88179094 87639384 87445749 86663370 87156144 86492034 86143711 85469264 85721011 86014062
4534 86014062 84548432 84954748 85129846 84345625 85233455 83842328 83605730 83793361 83630041
4525H3630041j59061p23883J387553n13295q42950J89728l54856n20437O47401
4516H2740241L1782Q7830j64878Q55106r33349k23095R8352j003110m99685L28090
4506H1317284j8929m20879J99107o95840J04353L08251J57380M07298K97505J12758
4496H1768288M52215n08510j17820j55059M9753O48014l00636o34603j83263n04327
4486H0514052O79947J88022l77209J51530L50564o94811J80332O96670o82076
4477H1007021Q1324l22305r803M29206N78303m7700m63073O96622l89368p95818
4467H0764409P59030n79636k00024K39899l4565N3783J25765o21582M11826N41880
4457H1460785N836M27411N31138J53650j034805N9472J576338N4021j38156Q79332
$$ plain form
4525 83630041 83470980 82747097 84134650 83621355 82778405 82968133 82613277 82092840 82740241
4516 82740241 82772023 82859853 82694975 83550081 82616732 82393637 82491989 81488879 80989194 81317284
4506 81317284 81298355 80877476 81076583 80380743 80485096 80793347 80950727 81358025 81655530 81768288
4496 81768288 82220503 81711993 81594173 81439114 81488867 82136881 81836245 81201642 81018379 80514052
4486 80514052 81193999 81382021 81004812 81156342 81506906 80812095 80992427 81689097 81007021
4477 81007021 81088345 80766040 80756237 81185443 81763746 81716046 81252973 81949595 81560227 80764409
4467 80764409 81523439 80943803 80743779 80983678 80949113 81002896 81128661 80507079 80918905 81460785
4457 81460785 81466621 81894032 82425170 82578820 81544015 81603487 83179825 83233846 83095690 83975022
4447H3975022J32849q09721K88238k27708N24299M3247J08043N17015k42544j28488
4437H4180252r3318j78211J006562j7345M58929P03647M58470N0803k5587R20617
4427H7464819J077402M1384J19088K27497n0732J028763o3524j07167K48531O06060
4417I0592121J005557P04392Q32824j28370O6180L90151J352570K27745n42250
4408I4500920J204508m62473j11763M65358J36694J64608L27363O77638L88170
4399I7291023k32984k23765k85695N32794P6984J67568p9985N0211J540585l2876
4389I8803860m85051K74847J7991m3094L51816L26985K25186P34580M40216L90804
4379A01038140Q7160r1390O7027Q92086N53259j72847N28108O35102l44979N47402
$$ plain form
4447 83975022 84107871 83298150 83586388 83358680 83882979 83926226 84034269 84551284 84308740 84180252
4437 84180252 84086934 83908723 84915285 84897940 85356869 86060516 86518986 86569789 86544202 87464819
4427 87464819 88542221 88583605 88702693 88930190 88879458 89908221 89844697 89737530 89986061 90592121
4417 90592121 91597678 92302070 93134894 93006524 93072704 93462855 94815425 95043170 94500920
4408 94500920 95705428 95242955 95131192 95596550 95733244 95897852 96225215 96902853 97291023
4399 97291023 97058039 96834274 96548579 97081373 97158357 97325925 97245940 97296151 98836736 98803860
4389 98803860 98318809 98593656 98611647 98568553 98920369 99247354 99472540 100207120 100647336 101038140
4379 101038140 101125300 101033910 101100937 101993023 102546282 102373435 102901543 103536645 103191666 103739068
4369A03739068N28568O85543J41256O22303O13213J421234j03637O82796K91778
4360A08622122O78304L36558n282N57102Q47522Q97243K68274M71249L96678J137211
4350A14206981M24998R5632j12582P97539J114639L42447M70291J750629R31112
4341A20021686M54789O28179R22420k0739J33778P7182R12549J022017L40305
4332A24492166O00993Q19969P61403N17026K47475M27038K04096P00717O93511
4323A29464394K6399J061729J181480Q85193O20856p4408m67144R67690J219928
4314A34886117q9098M07672J010321J46558J53965Q10556L60985L43489L32206
4305A38362771K7691j62147R71437P52146n24462J40612k80796l70154O66887
$$ plain form
4369 103739068 104267636 104953179 105094435 105716738 106329951 107751185 107647548 108330344 108622122
4360 108622122 109300426 109636984 109631702 110188804 111036326 111933569 112201843 112673092 113069770 114206981
4350 114206981 114631979 114727611 114615029 115412568 116527207 116869654 117339945 119090574 120021686
4341 120021686 120476475 121104654 122027074 122006335 122140113 122217295 123129844 124151861 124492166
4332 124492166 125093159 125913128 126674531 127191557 127439032 127866070 128070166 128770883 129464394
4323 129464394 129490793 130552522 131734002 132619195 133240051 133165643 132698499 133666189 134886117
4314 134886117 134797019 135204691 136215012 136361570 136515535 137326091 137687076 138030565 138362771
4305 138362771 138390462 138228315 139199752 139951898 139427436 139568048 139287252 138917098 139583985
4296A39583985N43055K31683N53700q4102l2186O23500k09013l51410K14549K03596
4286A41277357P13423k62018k21943j01111K70182l47414m21192r19922l41414
4277A39645948M30717k87559k66506o04000n28135M78787j31641o53236J10770
4268A38195145r77931r32930p07099K99694n03438p94659q61809p26613q47315
4259A32143045O06420j77142p46294k62773m28982o15649j451261o93854o98282
4250A27675228n52642j127631l5337m31600j027929n76772j258110k284681k01219
4241A20179307j99015o62429l35132k320773k86088l08814o04106j016099j408742
4232A13038109m63132q82095j300569p13640j419942j306648q93878M341j000121
$$ plain form
4296 139583985 140127040 140358723 140912423 140828321 140796135 141419635 141210622 140859212 141073761 141277357
4286 141277357 141990780 141728762 141506819 141405708 141675890 141328476 140907284 139987362 139645948
4277 139645948 140076665 139789106 139522600 138918600 138390465 138869252 138737611 138084375 138195145
4268 138195145 137217214 136284284 135577185 135876879 135373441 134578782 133716973 132990360 132143045
4259 132143045 132749465 132572323 131826029 131563256 131134274 130518625 129067364 128373510 127675228
4250 127675228 127122586 125994955 125959618 125528018 124500089 123923317 122665207 120380526 120179307
4241 120179307 119980292 119317863 118982731 116661958 116375870 116067056 115462950 114446851 113038109
4232 113038109 112574977 111692882 110392313 109678673 108258731 106952083 106058205 106062546 105062425
4223A05062425q11855k47966j682686m66474j317917k018582o92437q34121K16753
4214I7207140j048052j216082j026239j061427j223475n61564q95391o01218j121285
4205H8452407j443901j312983l42531r07512q89198J30426o16698k158566n45762
4196H0365682J09072j784609j022182o20866p37923q42985l78694j323236j120037
4187G2644222j199485o59541r6282n6361l41215O4934j015767j657304j410010
4178F6273191p57532p77275n29507n87913J96136n57981r9297r71722r93062l87294
4168F0807744o3799j511191l64942k58382j508856j432689j53911p09274n16329
4159E4288371M05638j51329l36716n91575l21171p70013j30358r39957j42984
$$ plain form
4223 105062425 104250570 104002604 102319918 101853444 100535527 98516945 97824508 96990387 97207140
4214 97207140 96159088 94943006 93916767 92855340 91631865 91070301 90174910 89573692 88452407
4205 88452407 87008506 85695523 85352992 84445480 83556282 83686708 83070010 80911444 80365682
4196 80365682 80474754 78690145 77667963 77047097 76309174 75466189 75087495 73764259 72644222
4187 72644222 71444737 70785196 70688914 70632553 70291338 70356272 69340505 67683201 66273191
4178 66273191 65515659 64738384 64208877 63620964 63817100 63259119 63159822 62188100 61195038 60807744
4168 60807744 60743945 59232754 58867812 58609430 57100574 55667885 55513974 54804700 54288371
4159 54288371 54694009 54542680 54205964 53614389 53293218 52523205 52392847 51452890 51309906
4150E1309906M82473q42511j390403m2295n82855m11578L80823j099121k7279
4141D7777160K36320j52853m19048p00495j34397q6705q91951o95009r43737m28689
4131D3560596K72790j53772m76016n42086M84771o26266N97359P17059n86862
4122D3247573p50207m38718J163722j202085p47055Q3347l38320L18235O80681
4113D2017173o7218n66519o32431j698M98485q57231N0487M37636m93503r2653
4103D0292528m69545P61242j12865m57091L54955j162366o74629L9467K52998
4094C8824694p86545r0052l517j25657o23580J2311m00729L65857j93609r22580
4084C6056593m58891P31192N0216n039L2034l39923m8533k70765o91995L23709
$$ plain form
4150 51309906 51792379 50949868 49559465 49517170 48934315 48522737 48903560 47804439 47777160
4141 47777160 48013480 47860627 47441579 46741084 46606687 46519982 45628031 44933022 43989285 43560596
4131 43560596 43833386 43679614 43203598 42661512 43146283 42520017 43117376 43834435 43247573
4122 43247573 42497366 42058648 43222370 42020285 41273230 41356577 41018257 41336492 42017173
4113 42017173 41949955 41383436 40751005 40749307 41247792 40390561 40441048 40878684 40385181 40292528
4103 40292528 39822983 40584225 40471360 40014269 40369224 39206858 38532229 38571696 38824694
4094 38824694 38038149 37948097 37944580 37818923 37195343 37207654 36806925 37172782 36979173 36056593
4084 36056593 35597702 36328894 36379110 36374071 36406105 36066182 36017649 35746884 35054889 35378598
4074C5378598L59231O6581M14313L39469r52001n31531j42301k0851R7871M25476
4064C5434855q59859j98309P779m31716K12063l28353M19234J72737j37895k23044
4054C4067492n17482K61979K20270l17936Q49288p55404k91002o70573j43690
4045C2702942O09719k14856l35277m17328M5121m9243o68871N12969n60747M15182
4035C2039611j33220O71595Q7430k08415j47394n22474L39541N36490N55234l24726
4025C2893672m60632p65602n72349j52146N46752O2333o95173O5364M49433m49699
4015C0921953N87610l92029p51011K85974l15094l57041j2182K51745j33312J93076
4005C0279689N2329m89036m34302j43347l3073M02537k76795k50379P4227j06537
$$ plain form
4074 35378598 35737829 35804410 36218723 36558192 35606191 35074660 34932359 34911508 35009379 35434855
4064 35434855 34574996 34376687 34384466 33952750 34164813 33836460 34255694 34428431 34290536 34067492
4054 34067492 33550010 33811989 34032259 33714323 34563611 33808207 33517205 32846632 32702942
4045 32702942 33312661 33097805 32762528 32345200 32390321 32341078 31672207 32185176 31624429 32039611
4035 32039611 31906391 32577986 32665416 32457001 32309607 31787133 32126674 32663164 33218398 32893672
4025 32893672 32433040 31667438 31095089 30942943 31489695 31552028 30856855 30922219 31371652 30921953
4015 30921953 31509563 31117534 30366523 30652497 30337403 29980362 29968180 30219925 30086613 30279689
4005 30279689 30332018 29842982 29408680 29265333 29232260 29634797 29358002 29107623 29181850 29075313
3995B9075313j17520p22768N26801M03083M8530n81522M35036n15816N13104K79836
3985B9344077K36905j031714o87184N01249M03949o6000l15956K8452K08404o9618
3975B8552564J23466n41752K01331l62591J47282p6558j106875Q36246k92367
3966B7480746P03598N9775N83701q71504R03721l99170m18277L92785n09275L6178
3956B7962278R4208m61007L85128l19158P4629j50801J47361O34327O96993K67826
3946B9331784n15082j88270o31681L07802m9785l01412J30989P03508o48537n73595
3936B7565721J28690L88668L20871k22779j45269J235686p79358o15738k45591
3927B7630901J4008P58013l79122J208935N941j106480O8309k91956O23299n47254
$$ plain form
3995 29075313 28957793 28235025 28761826 29164909 29213439 28631917 29066953 28551137 29064241 29344077
3985 29344077 29580982 28549268 27862084 28363333 28767282 28701282 28385326 28413778 28622182 28552564
3975 28552564 28676030 28134278 28335609 27973018 28120300 28043742 26936867 27773113 27480746
3966 27480746 28184344 28244119 28827820 27956316 28860037 28460867 28042590 28435375 27926100 27962278
3956 27962278 28056486 27595479 27980607 27661449 27736078 27585277 27732638 28366965 29063958 29331784
3946 29331784 28816702 28628432 27996751 28304553 28254768 27953356 28084345 28787853 28139316 27565721
3936 27565721 27694411 28083079 28403950 28181171 28035902 29271588 28492230 27876492 27630901
3927 27630901 27644909 28402922 28023800 29232735 29238676 28132196 28200505 27908549 28531848 27984594
3917B7984594N47669N10113o0302j20463K49532M52586n27568O74864J23340R0401
3907B9924766j150981L42653N57209K56538Q96121j22014o64105O0412q3061j87818
3897B9829720J76604N37599p5134K37690P72256j79243K77451L56410O9643k01797
3887C1801199Q27380n5733j07747O90550P82679j42458n97437O78180L2604N80292
3877C4489509n5769J93527M24882N01440K43895k37188J199631O84442L77647
3868C7822016j24170q8386J95082Q55215J188116M41740P62790O62615j33448
3859D1581570J14096J91428L31073R68721Q21859M36179J606092J02346J127973
3850D7281337L36621P9231J537071M66725O05225O53778J448536O15294n314P7439
$$ plain form
3917 27984594 28532263 29042376 28982074 28861611 29111143 29563729 29036161 29711025 29834365 29924766
3907 29924766 28773785 29116438 29673647 29930185 30826306 30704292 30040187 30100599 30017538 29829720
3897 29829720 30006324 30543923 30468789 30706479 31478735 31299492 31576943 31933353 32002996 31801199
3887 31801199 32628579 32572846 32465099 33155649 33938328 33795870 33198433 33876613 33909217 34489509
3877 34489509 34433740 34627267 35052149 35553589 35797484 35560296 36759927 37444369 37822016
3868 37822016 37697846 37609460 37804542 38659757 39847873 40289613 41052403 41715018 41581570
3859 41581570 41695666 41887094 42218167 43186888 44008747 44444926 46051018 46153364 47281337
3850 47281337 47617958 47697189 49234260 49700985 50306210 50959988 52408524 53023818 53018504 53095943
3840E3095943J253047J304070J257019P50613J54031J868610J125203M33848J057084
3831F2299468J552008J101732L27082Q56900k20844Q75791J861601J129898L54693
3822G0138329O85743J535705P46739J855598J324090J293647J421237J107531
3814H0108619Q50932O10814J531366J391046R72108O44904J863075J007143J235000
3805I0215007K048923K005248J733672K289668J461225J108143J855659J412740
3797A04130285J523168J977332K764025K688005K307896J325793J207853K815999
3789A20740356J937388J970074K615218J718091K217889K297504K199375K273098
3781A37968993K763137K212194J868774J528909K989492K202467L345005L616987
$$ plain form
3840 53095943 54348990 55653060 56910079 57660692 57814723 59683333 60808536 61242384 62299468
3831 62299468 63851476 64953208 65280290 66137190 65916346 66792137 68653738 69783636 70138329
3822 70138329 70824072 72359777 73106516 74962114 76286204 77579851 79001088 80108619
3814 80108619 80959551 81570365 83101731 84492777 85464885 86109789 87972864 88980007 90215007
3805 90215007 92263930 94269178 96002850 98292518 99753743 100861886 102717545 104130285
3797 104130285 105653453 107630785 110394810 113082815 115390711 116716504 117924357 120740356
3789 120740356 122677744 124647818 127263036 128981127 131199016 133496520 135695895 137968993
3781 137968993 140732130 142944324 144813098 146342007 149331499 151533966 154878971 158495958
3773A58495958J516105J757063J582262K609645K049571J306661J444001K258880
3765A73020146K963112J915700J398388J810213J769375J630579K463978J055987
3757A88027478K072161J591773J336535K665123K176865J532406J545800K191708
3749B03139849K027031J628453K158129K616989J659150K311257K521281K805575
3741B20867714J841400K914109K025988K766427K343040K689533L277398J395356
3733B40120965K584833K838671L322160L277725K461230K698869L246199K991911
3725B63542563K265740K661114K202223K518540L454301K777384J422503K578836
3717B83423204K457505J768073K427037K316630J547300J238193J479186J019679
$$ plain form
3773 158495958 160012063 161769126 163351388 165961033 168010604 169317265 170761266 173020146
3765 173020146 175983258 177898958 179297346 181107559 182876934 184507513 186971491 188027478
3757 188027478 190099639 191691412 193027947 195693070 197869935 199402341 200948141 203139849
3749 203139849 205166880 206795333 208953462 211570451 213229601 215540858 218062139 220867714
3741 220867714 222709114 225623223 227649211 230415638 232758678 235448211 238725609 240120965
3733 240120965 242705798 245544469 248866629 252144354 254605584 257304453 260550652 263542563
3725 263542563 265808303 268469417 270671640 273190180 276644481 279421865 280844368 283423204
3717 283423204 285880709 287648782 290075819 292392449 293939749 295177942 296657128 297676807
3709B97676807J701544K84643J885438J256850m1767J062806J428053M53509J147136
3700C06855019L02844o31291J0389M43862N18677N14587j15515R2065M56069m48037
3690C07998669o89617J18122j79298k32457K27263j002283k70814q8535n04392
3681C05376658n60994o42098j148988n06012r39842q06530j067410o22793j062627
3672B98019364j917401j147307k188324k916623j407929k577363k352737j358266
3664B82153414l664088k975033k830517l204549k030770k988205l244020l402571
3656B57813661l512523l686999k300687m211051l844696l542769k804470l157373
3648B30753093l454848l006737l784212k628365k495095l446966l018383j954530
$$ plain form
3709 297676807 299378351 299662994 301548432 302805282 302763515 303826321 305254374 305707883 306855019
3700 306855019 307157863 306526572 306536961 306980823 307499500 308014087 307898572 307990637 308446706 307998669
3690 307998669 307309052 307427174 307247876 307015419 307242682 306240399 305969585 305881050 305376658
3681 305376658 304815664 304173566 303024578 302518566 301578724 300772194 299704784 299081991 298019364
3672 298019364 296101963 294954656 292766332 289849709 288441780 285864417 283511680 282153414
3664 282153414 278489326 275514293 272683776 269479227 267448457 264460252 261216232 257813661
3656 257813661 254301138 250614139 248313452 244102401 240257705 236714936 233910466 230753093
3648 230753093 227298245 224291508 220507296 217878931 215383836 211936870 208918487 206963957
3640B06963957k966534l049815k949424j614415k350615k304729j933196k050242
3632A87744987k008487k226203j586080k313333k438689l56873j278189j643351
3624A73893782j428443p67897j202297q40504j184265l90771o19561l21120r00065
3615A66238859j154792n92895j67499p49255k90827j55498j042083l02347J14804
3606A61898467l85484O21289j88555q94279k34876L1489k53251M28499N16996
3597A61540295p65311M00012M59155L4847l50065Q36274j32889R85973P32697
3588A63740988P0923K35632L31023L58961r3709M55065R05607N65771M93613M21269
3578A67485143K03342Q87529J310955n909J05898l66691K60552Q07239K22690
$$ plain form
3640 206963957 203997423 200947608 197998184 196383769 194033154 191728425 189795229 187744987
3632 187744987 185736500 183510297 181924217 179610884 177172195 176815322 175537133 173893782
3624 173893782 172465339 171697442 170495145 169654641 168470376 168079605 167460044 167138924 166238859
3615 166238859 165084067 164491172 164323673 163574418 163283591 163128093 162086010 161783663 161898467
3606 161898467 161512983 162134272 161945717 161051438 160816562 160848051 160594800 161023299 161540295
3597 161540295 160774984 161174996 161634151 161668998 161318933 162155207 162022318 163008291 163740988
3588 163740988 163811911 164047543 164378566 164737527 164643818 165098883 166004490 166570261 167063874 167485143
3578 167485143 167688485 168576014 169886969 169881060 169986958 169620267 169880819 170688058 170910748
3569A70910748O77461M92090o6744J28308K08992M1731J00874L42470M2939M08834
3559A73287703J26576J16284q42834p32364m14151J31299n61364j075691m75718
3550A69559740q57312j313235n148k37585o37111j103774p68884p72730J43859
3541A64007820m13064r45220l72323k88116m47995q24533N28133j86637k28787
3532A60829278r17519K01976q20600j61067l1782q57595k07441M27708m60234
3523A58002724J08228m4048j398040o26142K38736p34272r18980j437170m80565
3514A52710471m57298q70742j097922l69875j060681j694389j517729j048663
3506A44593172p79596j242314j406915j613896j414219j461685j510288j898608
$$ plain form
3569 170910748 171588209 172080299 172013555 172141863 172350855 172392586 172493460 172835930 172878869 173287703
3559 173287703 173414279 173530563 172687729 171955365 171541214 171672513 171111149 170035458 169559740
3550 169559740 168702428 167389193 167384045 167146460 166509349 165405575 164636691 163863961 164007820
3541 164007820 163594756 162649536 162277213 161989097 161541102 160716569 161244702 161058065 160829278
3532 160829278 159911759 160113735 159293135 159132068 159100286 158242691 158035250 158462958 158002724
3523 158002724 158110952 158066904 156668864 156042722 156281458 155547186 154628206 153191036 152710471
3514 152710471 152253173 151382431 150284509 149914634 148853953 147159564 145641835 144593172
3506 144593172 143813576 142571262 141164347 139550451 138136232 136674547 135164259 133265651
3498A33265651j359743p39071k014857j726540j835510k358524j124934j864320
3490A20242152j317242j618810j308497j064871j650568j833980j734953j307025
3482A08406206r07879j480051k170879r17697j56084j057559j231537j544007
3474I8940513j771454o05913j030895q04354k66701K07112l87574q10311j076057
3465I2394366l83591j323574o24033k87187l26241k47946o67911k89528J35282
3456H8379637N00092n53477o00365j89409r7208r22017m03465P6546l8996o52322
3446H5499016k49244J94257n49103j332294M37156p66741o93590K26309j98399
3437H2567367j240026m63641L23967L65818j75556o74763k28632r25238q64686
$$ plain form
3498 133265651 131905908 131166837 129151980 127425440 125589930 123231406 122106472 120242152
3490 120242152 118924910 117306100 115997603 114932732 113282164 111448184 109713231 108406206
3482 108406206 107498327 106018276 103847397 102929700 102773616 101716057 100484520 98940513
3474 98940513 97169059 96563146 95532251 94727897 94461196 94668308 94280734 93470423 92394366
3465 92394366 92010775 90687201 90063168 89775981 89449740 89201794 88533883 88244355 88379637
3456 88379637 88879729 88326252 87725887 87536478 87439270 86517253 86113788 86190334 86151338 85499016
3446 85499016 85249772 85444029 84894926 83562632 83999788 83233047 82539457 82765766 82567367
3437 82567367 81327341 80863700 81187667 81553485 81377929 80703166 80474534 79549296 78684610
3428G8684610J195640M30745q54730k63880n00584J51792k79822L42861R0297
3419G8996929O1926M74100L31293P4990m95515L15438P92411N63590m28497j35186
3409H0551479N48955J53198O90550P12925l60856R89478k084k11152K36679O34808
3399H3943980J91153Q80812N94883K74930K24388N5869j106191M91355k1717P56667
3389H6286129Q59743M8020o09527L33151J152669q04622O9076L58307L07730N71299
3379H8571975M68778N04716J018642J78097J550859J135601J242089J618527J623505
3370I7912789Q59952K336957K590393K763286L124389L147273L179046M647957
3362A20562042L281427J836446J584628j61703q70938j696619k324545j420273
$$ plain form
3428 78684610 79880250 80310995 79456265 79192385 78691801 78843593 78563771 78906632 78996929
3419 78996929 79058855 79532955 79864248 79939238 79443723 79759161 80551572 81115162 80686665 80551479
3409 80551479 81100434 81253632 81944182 82657107 82296251 83285729 83283645 83072493 83309172 83943980
3399 83943980 84135133 85015945 85610828 85885758 86110146 86166015 85059824 85551179 85529462 86286129
3389 86286129 87145872 87193892 86584365 86917516 88070185 87265563 87334639 87692946 88000676 88571975
3379 88571975 89040753 89545469 90564111 90742208 92293067 93428668 94670757 96289284 97912789
3370 97912789 98772741 101109698 103700091 106463377 109587766 112735039 115914085 120562042
3362 120562042 123843469 125679915 127264543 127102840 126231902 124535283 122210738 120790465
3354A20790465j622409q50610j059272m10229j25591l13315q62053Q93209J3093
3345A16453288j86746l18724n05474J115719J148661J398341J194578J538369
3337A21838012K279429L078696L197361M034322M203871N284177M639865N912486
3329A54468219M749268L425501J003680n55699k787293m245332l991799n086318
3321A46980227n125192l395440k206593k508625j221121j797007m91359j039771
3313A29195119J39199M56720k6765L02681Q50319J17189J456750R62957J142402
3304A34596571J385154J979508J342908P69521K539135K053517L052800L730290
3296A51449404J696564J685060J131153p0287j772388j872247j576240k860105
$$ plain form
3354 120790465 119168056 118317446 117258174 116847945 116722354 116409039 115546986 116440195 116453288
3345 116453288 116266542 115947818 115442344 116558063 117706724 119105065 120299643 121838012
3337 121838012 124117441 127196137 130393498 134427820 138631691 143915868 148555733 154468219
3329 154468219 159217487 162642988 163646668 163090969 160303676 156058344 152066545 146980227
3321 146980227 141855035 138459595 136253002 133744377 132523256 130726249 130234890 129195119
3313 129195119 129334318 129791038 129764273 130066954 130917273 131034462 132491212 133454169 134596571
3304 134596571 135981725 137961233 139304141 140073662 142612797 144666314 147719114 151449404
3296 151449404 153145968 154831028 155962181 155891894 154119506 152247259 150671019 147810914
3288A47810914k911676j974716j355642k231776j660795j30415K17455j128240
3280A36635109r66186o78282K04125J40101M07911j87913l43543q1790J028616
3271A36158148K56272M069Q70902J237693P88062O99885J54706J982485Q83868
3262A43036090M40239J530637J648102Q67147k64864P01766R95591J221323J197631
3253A51373662J470895J990522R16210Q81832Q07168Q39788M47330R53655J603665
3244A61284727J757717J075373J028844J282800O9423J299278J201008R40448
3236A69939618O40467P12298J227310K33836J435061O16955J640192N78376J010440
3227A78034553J469255Q34063J370414P27663O11962J228718L37286J337811J597241
$$ plain form
3288 147810914 144899238 142924522 141568880 139337104 137676309 137545894 137763349 136635109
3280 136635109 135668923 134990641 135194766 135334867 135742778 135554865 135211322 135129532 136158148
3271 136158148 136414420 136418489 137289391 138527084 139315146 140015031 140169737 142152222 143036090
3262 143036090 143476329 145006966 146655068 147522215 147257351 147959117 148954708 150176031 151373662
3253 151373662 152844557 154835079 155751289 156633121 157440289 158280077 158727407 159681062 161284727
3244 161284727 163042444 164117817 165146661 166429461 166498884 167798162 168999170 169939618
3236 169939618 170580085 171292383 172519693 172753529 174188590 174805545 176445737 177024113 178034553
3227 178034553 179503808 180337871 181708285 182435948 183047910 184276628 184613914 185951725 187548966
3218A87548966R69961J790481L17244Q29884J694416J592619Q61102J826431K535132
3209A99966236J389247J149354J313908J356042J543209J691691J322414J621724
3201B11353825J030059P24939J693437J246535J728752R65424J451973K419554
3193B22614498J513822J339521P23140P00824J345000N43463M85127K08284Q59083
3184B30332762J01056M09343Q8977o51785l72540J15341P05330M02972K77420
3175B31408876J95337l40281K77978L44357N62750O38030K68570M49364J66101
3166B33971082N51819J217790r9598M19787J176770P15374J6577K15449L36622
3157B38521672L58420J0826L74907Q90984n44684j32841M78685l30366O33460
$$ plain form
3218 187548966 188518927 190309408 190626652 191456536 193150952 194743571 195604673 197431104 199966236
3209 199966236 201355483 202504837 203818745 205174787 206717996 208409687 209732101 211353825
3201 211353825 212383884 213108823 214802260 216048795 217777547 218742971 220194944 222614498
3193 222614498 224128320 225467841 226190981 226891805 228236805 228780268 229265395 229473679 230332762
3184 230332762 230433818 230843161 230932138 230280353 229907813 230023154 230728484 231131456 231408876
3175 231408876 231604213 231263932 231541910 231886267 232449017 233087047 233355617 233804981 233971082
3166 233971082 234522901 235740691 235641093 236060880 237237650 237953024 237969601 238185050 238521672
3157 238521672 238880092 238890918 239265825 240156809 239612125 239479284 239957969 239627603 240261063
3148B40261063l68883o26747l98367l5222l80126j36477o09936M3819P23411J097
3138B38473632p15929l8926J89752m3219J54495r60984q35912p20020l88001o10929
3128B34503959J15705l88574n52597j52400q24969J01556j318464j222952l39822
3119B29921442o18611j413923p81316K60790j141056n23774p49107j190147j148721
3110B22615577j360053m49108r64850j472291o93587o16165q02635j188241p68282
3101B14300365j213887j027718k079361o32060j312056p82622r75074p47992j008030
3092B04521565q83864l98058j082005r29319j288464j083843j087805k125916
3084A95642291r67700j005748j300690j071442k469479j513302j265959k451150
$$ plain form
3148 240261063 239892180 239265433 238867066 238831844 238451718 238315241 237705305 237749124 238472535 238473632
3138 238473632 237757703 237718777 237908529 237865310 238019805 237058821 236222909 235502889 235114888 234503959
3128 234503959 234619664 234231090 233678493 233526093 232701124 232802680 231484216 230261264 229921442
3119 229921442 229302831 227888908 227107592 227368382 226227326 225703552 224954445 223764298 222615577
3110 222615577 221255524 220806416 219841566 218369275 217675688 217059523 216256888 215068647 214300365
3101 214300365 213086478 212058760 209979399 209347339 208035283 207252661 206277587 205529595 204521565
3092 204521565 203637701 203239643 202157638 201228319 199939855 198856012 197768207 195642291
3084 195642291 194674591 193668843 192368153 191296711 188827232 187313930 186047971 183596821
3076A83596821j664563j235714k103933j770758j598615j955135j444093j624120
3068A70199890k513302k039937j426052j123766k543906k361447j621598j725427
3060A54844455k524359j945581k190868j853691j356525j754184j474771j690602
3052A40053874j598851j525865j311380o97733j749344q75551j149605j606244
3044A29539301j207393p88839j818563r79729m15110q28068o64662o58010j828985
3035A20349942q19147L11100j453071k9201j351545j013904o93008j191546j617365
3026A12492255k82345j068821j082146r03817r06128r76536j180726p08079j406314
3017A03977343j458667j299111l15969m36470q57884j044775j736576j125395
$$ plain form
3076 183596821 181932258 180696544 178592611 176821853 175223238 173268103 171824010 170199890
3068 170199890 167686588 165646651 164220599 163096833 160552927 158191480 156569882 154844455
3060 154844455 152320096 150374515 148183647 146329956 144973431 143219247 141744476 140053874
3052 140053874 138455023 136929158 135617778 134920045 133170701 132295150 131145545 129539301
3044 129539301 128331908 127543069 125724506 124744777 124329667 123501599 122836937 122178927 120349942
3035 120349942 119530795 119841895 118388824 118359623 117008078 115994174 115301166 114109620 112492255
3026 112492255 112209910 111141089 110058943 109155126 108248998 107272462 106091736 105383657 103977343
3017 103977343 102518676 101219565 100903596 100467126 99609242 98564467 96827891 95702496
3009I5702496q84943p04378j061380j106073j186030j528601j467786l20956j321379
3000H6120970j761760j573789j539175L28301j141395j430388o35383j127207
2992G7240174o90822k63664j019975j348667r91848M83513n07264j672998l38042
2983G0890407j260504j192359P5864r46838j175258Q42234O52839j382110j434449
2974F5069826j110946j134638j021122N52244O03989o96990j084465q27078j089307
2965E9261513j184790n64430p48097n50602j113015j100257Q487q61872o38384
2956E2508553n95770q88646j084870o29025j142717k86060K49647q25903p13098
2947D6592111M27133k21097m96236j067173j226345q6219j39492m76005j624025
$$ plain form
3009 95702496 94817553 94113175 93051795 91945722 90759692 89231091 87763305 87442349 86120970
3000 86120970 84359210 82785421 81246246 81574547 80433152 79002764 78367381 77240174
2992 77240174 76549352 76285688 75265713 73917046 72925198 73408711 72901447 71228449 70890407
2983 70890407 69629903 68437544 68513408 67566570 66391312 67233546 67886385 66504275 65069826
2974 65069826 63958880 62824242 61803120 62355364 62959353 62262363 61177898 60350820 59261513
2965 59261513 58076723 57512293 56764196 56213594 55100579 54000322 54008809 53146937 52508553
2956 52508553 51912783 51024137 49939267 49310242 48167525 47881465 48131112 47305209 46592111
2947 46592111 47019244 46798147 46301911 45234738 44008393 43922174 43782682 43306677 41682652
2938D1682652q08184j49740p16978j456151q47532j69118R1534J47349r89080
2929C6784752j040648J3759m66599l02345m02973j032838J67438k32068j006667
2920C2481811j74144P45159l73858l35604p19849M338J73536p6993k19992m48714
2910C1055690o28107o46727o13481l57142j9117O0009n66161o74448K39256o40257
2900B7209515o90997K08330m46270q4217K6034j40448l06918j130619k22394O63675
2890B5085691K21480m60634k5079J27165Q50432K24491q81552K03034J127703
2881B6472731o20412J86318j77798k52870j116091m16609J002017J036744j251577
2872B4862453l44998K24758l13576J58709j52880J33826p1778M71628O79754J17197
$$ plain form
2938 41682652 40874468 40724728 40007750 38551599 37704067 37534949 37626483 37773832 36784752
2929 36784752 35744104 35757863 35291264 34988919 34585946 33553108 33720546 33488478 32481811
2920 32481811 32307667 33052826 32678968 32343364 31623515 31627853 31801389 31724396 31504404 31055690
2910 31055690 30427583 29780856 29167375 28810233 28791116 28851125 28284964 27610516 27849772 27209515
2900 27209515 26518518 26726848 26280578 26196361 26222395 26081947 25775029 24644410 24422016 25085691
2890 25085691 25307171 24846537 24821458 24948623 25799055 26023546 25141994 25345028 26472731
2881 26472731 25852319 26038637 25860839 25607969 24491878 24075269 25077286 26114030 24862453
2872 24862453 24517455 24742213 24428637 24587346 24434466 24568292 24496514 24968142 25647896 25765093
2862B5765093K3637M18714P25735M29016R86371L6574n45382M23780L33039Q14913
2852B9411490p0304L20558Q17138P52891l33549l89675r26358n932m66038j080305
2842B8029916o56359j948068N22869J014425n60038m02758j60739O37604j83715
2833B6293137N2489J41540r2767l6091Q25930M01190j7076L16101k02006o98466
2823B6983981P76448r1917n23712n25912o94648J62713p04458j012091l87103
2814B3983301r93855n66133j82968j696518m57452k01692J22618K81522l67852
2805A9920971q21219j207583N45830K99676l26179o5743n22312K83604N7707K83133
2795A8447885j393002n46480j033207j91340L97764p61556p23905q70302n0908
$$ plain form
2862 25765093 25788730 26207444 26933179 27362195 28348566 28385140 27839758 28263538 28596577 29411490
2852 29411490 29341186 29661744 30478882 31231773 30898224 30508549 29582191 29576259 29110221 28029916
2842 28029916 27373557 25425489 25948358 26962783 26402745 25999987 25839248 26476852 26293137
2833 26293137 26345626 26487166 26394399 26358308 27184238 27585428 27568352 27884453 27682447 26983981
2823 26983981 27760429 27668512 27144800 26618888 25924240 26086953 25382495 24370404 23983301
2814 23983301 22989446 22423313 22240345 20543827 20086375 19884683 20007301 20288823 19920971
2805 19920971 19099752 17892169 18437999 18737675 18411496 18345753 17823441 18107045 18164752 18447885
2795 18447885 17054883 16508403 15475196 15283856 15681620 14920064 14196159 13325857 13274949
2786A3274949m15562n77338N51011O27324r44103m29192o17925J05971N12756
2777A2087891k54817K36784n08080l47585O7939N11411l6712j41099r73242o89222
2767I953268M72970M6582P64958j71806n10336o4515p43368k7939L92764m33029
2757I679549j16064k92986l36481r9448l32352L66825J76481J78091k39573l52096
2747H631946M40043k00845m61882L5264m82870l03182L86793J4445P37574l18443
2737H478843N27708n93356l35241n76423m0997J0742P23924M29680j69884P82104
2727I237100j325183l70260k99575l05100M81438P67160k67228k12188L12983
2718H019147m16102j59587m05582L36479L42950o27429j00327j60758K39441p12784
$$ plain form
2786 13274949 12859387 12282049 12833060 13460384 12516281 12087089 11469164 11575135 12087891
2777 12087891 11833074 12069858 11561778 11214193 11282132 11793543 11756831 11615732 10642490 9953268
2767 9953268 10426238 10472820 11237778 11065972 10555636 10491121 9747753 9719814 10112578 9679549
2757 9679549 9563485 9270499 8934018 8834570 8502218 8869043 9045524 9223615 8984042 8631946
2747 8631946 9071989 8871144 8409262 8444526 7961656 7658474 8045267 8059712 8797286 8478843
2737 8478843 9006551 8413195 8077954 7501531 7460534 7471276 8195200 8624880 8454996 9237100
2727 9237100 7911917 7541657 7242082 6936982 7418420 8185580 7918352 7706164 8019147
2718 8019147 7603045 7443458 7037876 7374355 7717305 7089876 6989549 6828791 7068232 6355448
2708F355448P03228K46859J00648l73164j490098R7381J86683J56369J25316q1696
2698F026974k04848P10781l1127N14693K24018o89474N9045l06144N53767K74469
2688G132154p15713m5309m2965j77532M0Q67981l67489l60024j59793j84233K88566
2677F235683k10737M42230j16126o37851k51599N3511J51451l85748j14764P2504
2667E238554P43514r2618j088580N98693O42992l28491j43109J81166m6081J54446
2657E860486p80442k51220J62663O31099J43213l66582o5804J040719J27172m56473
2647F044831o35164k62552L87579k19691N789k89050J75740m5501o70653k65454
2637D225874K21421K77146o1772J72044O08517r45002o774k69936J201116j36426
$$ plain form
2708 6355448 7058676 7305535 7406183 7033019 5542921 5640302 5826985 5983354 6108670 6026974
2698 6026974 5822126 6532907 6501780 7016473 7240491 6551017 6610062 6303918 6857685 7132154
2688 7132154 6416441 6371132 6328167 6150635 6150675 7018656 6651167 6291143 6131350 5947117 6235683
2677 6235683 6024946 6467176 6351050 5713199 5461600 5515111 5666562 5280814 5166050 5238554
2667 5238554 5982068 5889450 4800870 5399563 6042555 5714064 5570955 5752121 5706040 5860486
2657 5860486 5080044 4828824 4991487 5622586 5765799 5399217 5333413 6374132 6501304 6044831
2647 6044831 5409667 5147115 5534694 5315003 5320792 5031742 5207482 5161981 4491328 4225874
2637 4225874 4447295 4724441 4662669 4834713 5443230 4498228 4491454 4221518 5422634 5286208
2627E286208Q09526J08025r04620N96991j039103k16303K09518k26829l19722
2618D303691J00769m1280N9696L11173L52403k79466j69998K37303N13165J60009
2608E547465L86776j9391j071249l59818J04879q3791Q62847M60402l40031q65902
2598D622187J46099L58921L04346n59280k01658o28844L6896J88892K44230k36735
2588D275054J63119M15494J89615R3044n58319O14933M84103k13177j10740r27165
2578D425961n55419L89410K27643l8834k66497K69986m93087M20405K99556k25982
2568D453142k79692J46717L68885R05957j492759J64491J698507q58617j252563
2559C854068K87582m45215m1748R35814J08681l28208l90068J20641m42423k1558
$$ plain form
2627 5286208 6095734 6203759 5299139 5896130 4857027 4640724 4850242 4623413 4303691
2618 4303691 4404460 4363180 4422876 4734049 5086452 4806986 4636988 4874291 5387456 5547465
2608 5547465 5934241 5914850 4843601 4483783 4588662 4504871 5367718 5828120 5488089 4622187
2598 4622187 4768286 5127207 5431553 4872273 4670615 4041771 4078667 4267559 4511789 4275054
2588 4275054 4438173 4853667 5043282 5136326 4578007 5192940 5677043 5463866 5353126 4425961
2578 4425961 3870542 4259952 4487595 4448761 4182264 4452250 3959163 4379568 4679124 4453142
2568 4453142 4173450 4320167 4689052 5595009 4102250 4266741 5965248 5106631 3854068
2559 3854068 4141650 3696435 3654687 4590501 4699182 4370974 3980906 4101547 3659124 3637566
2549C637566P29179J82624O9571l94019m93909M74936J58193k31580R17526k36666
2539D813421j185159K08090j97199K36814o4835L69862K33524l09111k36319L58900
2529D227988M61234O07655L19161j26537j455707k6925n96148j11294J50435O28538
2519D078400J1439J16817l34434k47035P48328K89355J09284j706794q04650P92359
2509C053069P77657l80100O34470N24568j87192o73484J94729j73906N59175m3450
2499D285536O198q19007k77337R87642J93270m65015M9062N39397L48220n60561
2489D287405j08047q27499N4264l7414j86600K7083N5290O9521p4100R40643M37285
2478D637831m77678R3468j57244m06482K31947l2344k74256k37588k0294j723
$$ plain form
2549 3637566 4366745 4549369 4618940 4224921 3731012 4205948 4364141 4132561 5050087 4813421
2539 4813421 3628262 3836352 3639153 3875967 3811132 4180994 4414518 4105407 3869088 4227988
2529 4227988 4689222 5296877 5616038 5489501 4033794 4006869 3410721 3299427 3449862 4078400
2519 4078400 4089839 4206656 3872222 3625187 4373515 4662870 4772154 3065360 2260710 3053069
2509 3053069 3830726 3450626 4085096 4609664 4422472 3748988 3943717 3769811 4328986 4285536
2499 4285536 4291734 3472727 3195390 4183032 4376302 3911287 3960349 4499746 4847966 4287405
2489 4287405 4179358 3351859 3406123 3368709 3182109 3209192 3264482 3334003 3259903 4200546 4637831
2478 4637831 4160153 4253621 4096377 3689895 3921842 3889498 3615242 3377654 3357360 3355637
2468C355637j89865K40643L79995N82207L20400q79101N2905n73398L35212K58322
2458C882957m90102m22698o43729K65009J56728L20310J45401R961m31507j49700
2448B642630K51754m06734K50141J87360K95014K8190K2508o46268j87048k51179
2438B186368q7803K46757P37683M71143o72818m35637N41513q6605L73251j88580
2428C085272K04674N76482j04125q32366j70124K32581j351K61311r7708k32429
2418B922217K40208L43302k78005K15433j79035j27824M53840m8283O16557q7155
2408D071255n19050J82867K81028m70463k82145L22891M6462l33779o50667O71768
2398C320167P67306m17610j76504L69612L95204O4190q11069m88569L0300P45
$$ plain form
2468 3355637 3165772 3406415 3786410 4368617 4689017 3809916 3862821 3289423 3624635 3882957
2458 3882957 3392855 2970157 2326428 2591437 2748165 3068475 3213876 3223837 2792330 2642630
2448 2642630 2894384 2487650 2737791 2925151 3220165 3248355 3270863 2624595 2437547 2186368
2438 2186368 2098565 2345322 3083005 3554148 2881330 2445693 2987206 2900601 3273852 3085272
2428 3085272 3289946 3866428 3762303 2929937 2759813 2992394 2991043 3252354 3154646 2922217
2418 2922217 3162425 3505727 3227722 3443155 3264120 3136296 3590136 3541853 4158410 4071255
2408 4071255 3552205 3735072 4016100 3545637 3263492 3586383 3632845 3299066 2648399 3320167
2398 3320167 4087473 3669863 3493359 3862971 4258175 4322365 3511296 3022727 3053027 3053772
2388C053772L56183L82335r0468L3222j88904j69997q96855L24695N72689N74212
2378C950884J70324M0995m11066P13389o59180j225082j83462r4486q6206J73707
2368B389817o517O06796q5113o03202M11254L253m12222k41142o21622P3951P60239
2357B275492J66229L30274l36757K85878L51055M02608p7786l51825J05314M33830
2347C584312Q9372N6308R704m49824K50317R1935j86502N86398M83036k99342
2337D215714k405o90547n72796m68689K94871M09733J33248j02204m19105L56961
2327C154781K26347J28053J27877k735m64863J431799K55095O12891j6776K12427
2317E664896p48610j70804J92971j15812k11258r84475J37864n13851L88565m71756
$$ plain form
2388 3053772 3409955 3792290 3701822 3735044 3546140 3376143 2479288 2803983 3376672 3950884
2378 3950884 4121208 4162203 3751137 4464526 3805346 2580264 2396802 2302316 2216110 2389817
2368 2389817 2383300 2990096 2904983 2301781 2713035 2716288 2304066 2062924 1441302 1515253 2275492
2357 2275492 2441721 2771995 2435238 2721116 3072171 3474779 3396993 3045168 3150482 3584312
2347 3584312 3673684 3729992 3739696 3289872 3540189 3632124 3445622 4032020 4515056 4215714
2337 4215714 4213309 3522762 2949966 2481277 2776148 3185881 3319129 3216925 2797820 3154781
2327 3154781 3381128 3509181 3637058 3634323 3169460 4601259 4856354 5469245 5452469 5664896
2317 5664896 4916286 4745482 4938453 4822641 4611383 3626908 3764772 3250921 3639486 3167730
2307C167730n01436Q66101l51633k08815R48822P97p61042J67772q61951j48244
2297B318101J71736R28189K55944n12476J89732N01843l77547j26733j15143l64960
2287B868686J1133j03778j78375n16386M64913M89109K84722K72985k50252m11361
2277B931396M04674P2095k01386q72560N0152l61679n3975M31461J009047p42741
2267B666484N6245k9383r7597R06582J01654J04972j84210k53985J4751q19626
2257B465887M58031K23503J46345q1838Q9855J19901k33271m28450M78493p8591
2247C159865k87807l82036J53031K61403m11394N2291L29829M0074M91131K78535
2237C684922j076815k53883N77071N93631m18976N12595j493734J078405M62002
$$ plain form
2307 3167730 2666294 3532395 3180762 2971947 3920769 3921566 3160524 3328296 2466345 2318101
2297 2318101 2489837 3418026 3673970 3161494 3351226 3853069 3475522 3348789 3233646 2868686
2287 2868686 2879819 2776041 2597666 2081280 2546193 3035302 3320024 3593009 3342757 2931396
2277 2931396 3336070 3408165 3206779 2334219 2384371 2022692 1968717 2400178 3409225 2666484
2267 2666484 2722729 2693346 2595749 3502331 3603985 3708957 3524747 3270762 3285513 2465887
2257 2465887 2923918 3147421 3293766 3211928 3301783 3421684 3188413 2759963 3238456 3159865
2247 3159865 2872058 2490022 2643053 2904456 2493062 2545353 2875182 2915256 3406387 3684922
2237 3684922 2608107 2354224 2931295 3524926 3105950 3618545 2124811 3203216 3665218
2228C665218l57207o29563J60760O62030o91406J3787N69528J97569J26615o33456
2218C083875N70618M61841o52145J63904L10603m76826m90698L6328p5304K02751
2208C134947l19523M93497K21115j83535M57868M06427n5609K56311k54579q6126
2198D070793L99364k01702p8542n80845j08441J13436J30293M85994lM04585n46474
2187D088458J97197k02204P27768J7786m77505P1763J74223L92587j40207K99183
2177E149049k97510j72478J66374m14948K34655M65960L14745m85065K03366j5383
2167E148765m8508J89423n15037K01052p69049R5377J107094L73454J33307l36878
2157E579000r27215R25911j44054O55818M08993j000663k24854R85596J18561
$$ plain form
2228 3665218 3308011 2678448 2839208 3501238 2809832 2823619 3393147 3590716 3717331 3083875
2218 3083875 3654493 4116334 3464189 3628093 3938696 3461870 2971172 3007500 2932196 3134947
2208 3134947 2815424 3308921 3530036 3346501 3804369 4210796 4155187 4411498 4156919 4070793
2198 4070793 4470157 4268455 4189913 3609068 3500627 3614063 3744356 4230350 4230347 4634932 4088458
2187 4088458 4285655 4083451 4811219 4829005 4351500 4423263 4597486 4990073 4849866 5149049
2177 5149049 4851539 4679061 4845435 4430487 4665142 5131102 5445847 4960782 5164148 5148765
2167 5148765 5100257 5289680 4774643 4975695 4206646 4302023 5409117 5782571 5915878 5579000
2157 5579000 4651785 5577696 5433642 6089460 6498453 5497790 5272936 6258532 6377093
2148F377093m36621J57685J95838L55182O1893p69067J57419M16826L37711O53102
2138G507061M93382J26987J23619K47066l75809P98691k6804L52004k84223N49293
2128I511267P37395m71987L48382K17498k64359m4313R48673M16327M29468M32457
2118A2260808p5244Q20196J6737o12916l05339R13748O35199P99012O20138k2323
2108A5050016k18452R75884N4399L22127O3494P9379l1868J024386M39012M1441
2098A7799818J156862N29111P60935Q24614N20336J84753J404949N00725J076401
2089B4758504N61965Q62222J121077J240494Q95966J527295J219755J946218J141504
2080C5275000J384809J746297J974117J609647K998456L561032K506717K539225
$$ plain form
2148 6377093 5940472 6098157 6293995 6649177 6711070 5942003 6099422 6516248 6853959 7507061
2138 7507061 8000443 8127430 8251049 8498115 8122306 8920997 8894193 9246197 8961974 9511267
2128 9511267 10248662 9776675 10125057 10342555 10078196 10033883 10982556 11398883 11828351 12260808
2118 12260808 12185564 13005760 13022497 12409581 12104242 13017990 13653189 14452201 15072339 15050016
2108 15050016 14831564 15807448 15861847 16183974 16247468 16326847 16294979 17319365 17758377 17799818
2098 17799818 18956680 19485791 20246726 21071340 21591676 21776429 23181378 23682103 24758504
2089 24758504 25320469 26182691 27303768 28544262 29440228 30967523 32187278 34133496 35275000
2080 35275000 36659809 38406106 40380223 41989870 44988326 48549358 51056075 53595300
2072E3595300K371935K896156L743097M683847M374632M046578M328513M704844
2064H4744902O164397P940766R819652J1720205J4340764J7824827K0737443K4709317
2056A98002273L0146909L2915963L4215033K7264607R196572q012091j7164582
2049C06564684k3456748l0372793l3361352l1435233k6412530k0615721j5036335
2042A25873972j3925879j1403165q224601o440612n534307n932441n455473n558197
2034F3399297m689763k788334l390869l011410l686460k618583j233796k462810
2026C9517272j809585j840957j715075o48436j924378j135371j272472q73936
2018B8297062j274772j986485l74373J77263j610229j389091q51032p58645K2594
$$ plain form
2072 53595300 55967235 58863391 62606488 67290335 71664967 75711545 80040058 84744902
2064 84744902 90909299 98850065 108669717 120389922 134730686 152555513 173292956 198002273
2056 198002273 228149182 261065145 295280178 322544785 331741357 323729266 306564684
2049 306564684 283107936 252735143 219373791 187938558 161526028 140910307 125873972
2042 125873972 111948093 100544928 92320327 85879715 80345408 74412967 68957494 63399297
2034 63399297 58709534 55921200 52530331 49518921 45832461 43213878 41980082 39517272
2026 39517272 37707687 35866730 34151655 33503219 31578841 30443470 29170998 28297062
2018 28297062 27022290 25035805 24661432 24838695 23228466 21839375 20988343 20229698 20252292
2009B0252292j254442q52316L70969k66795j203279o47413L86032j221621m28417
2000A5135010m66430K49685L84845q89294p66350j09991K97347o1803q09297l0969
1990A2932753p20611m43630l89615p16510J03722J62592L26229m59044r29986
1981I865900p02544Q88563L17914m23428k49036j028072K96521N33826r27991
1972H571653r8859M45897K73349q49185r47592j03131M87441n71873L38646Q51512
1962H397858N06828j333170n06973j71785N4819j57557m2105J82589l15276L6520
1952F651748j36799K59691j52390j80706n3766p89054j82263R53897l05014m52515
1942E612829L92586l89972k91124J6900J41800j35909N70060N4007j099780l10051
$$ plain form
2009 20252292 18997850 18145534 18516503 18249708 17046429 16399016 16785048 15563427 15135010
2000 15135010 14668580 14918265 15303110 14413816 13647466 13537475 13834822 13773019 12963722 12932753
1990 12932753 12212142 11768512 11378897 10662387 10766109 10928701 11254930 10795886 9865900
1981 9865900 9163356 10051919 10369833 9946405 9697369 8669297 8965818 9499644 8571653
1972 8571653 8472794 8918691 9192040 8342855 7395263 7292132 7779573 7207700 7546346 8397858
1962 8397858 8904686 7571516 7064543 6892758 6947577 6790020 6747915 6930504 6615228 6651748
1952 6651748 6514949 6774640 6622250 6441544 6387778 5598724 5416461 6370358 6065344 5612829
1942 5612829 6005415 5615443 5324319 5341219 5483019 5347110 5917170 5971177 4871397 4561346
1932D561346J73582n35886N95170M25307k65395j31150o35099J65608J277937
1923E631420l34574p92812K47202m85175j42420K58003k90347L34333l61911O94349
1913D758068N86090p06261n50831J7223J94187k84552l96166M47936N38198n55504
1903D048388J233454r51120m05060J133983n62714o6194q46699N36205N37541
1894D657784J10551r71007m59938J288286p59214J48181k26213k38128o1758P56416
1884D244960P56941l43368l50086l15652n41759L66767j69151k73010N93574m41948
1874C527268M3514J70326n32511R409k46169L37574J89989n88456N40729J28443
1864C580116K33394q32512K52469O02739p39660K489M67577J3787m31464j11136
$$ plain form
1932 4561346 4734928 4199042 4794212 5219519 4954124 4822974 4187875 4353483 5631420
1923 5631420 5296846 4504034 4751236 4266061 4123641 4381644 4091297 4425630 4063719 4758068
1913 4758068 5344158 4637897 4087066 4104289 4298476 4013924 3617758 4065694 4603892 4048388
1903 4048388 5281842 4330722 3925662 5059645 4496931 4430737 3584038 4120243 4657784
1894 4657784 4768335 3797328 3337390 4625676 3866462 4014643 3788430 3550302 3488544 4244960
1884 4244960 5001901 4658533 4308447 3992795 3451036 3817803 3648652 3375642 3969216 3527268
1874 3527268 3570782 3741108 3208597 3218006 2971837 3309411 3499400 2910944 3451673 3580116
1864 3580116 3813510 2980998 3233467 3836206 3096546 3099035 3566612 3580399 3148935 3037799
1854C037799o6250L76487k07508l89941l53965K1301k00557M03378o44326j57227
1844A819191j5591l37065Q62863J150r7938Q97068J12684m55068k54111r11012
1834A622171n72834O11196N13154P4855Q31208K45271p32312R5865J33364j3673
1824B808265M45463Q98158q40717K60724n9785j16497k32883k84905K06614l16878
1814B767559m16528j10128L26913o5844q3276N4689O31304n62517L82788K93227
1804C218187K6176j56857l50901K60117L32867K43943o03015l44417l28050N42919
1794B840969j40017M28385N80577P2650J94927m34690j040189q7819J178809l6427
1784C557175L80971q565K21864l66763p11074k10105m88307N25418O013j146N11186
$$ plain form
1854 3037799 2971549 3348036 3140528 2750587 2396622 2417923 2217366 2620744 1976418 1819191
1844 1819191 1803600 1466535 2329398 2330548 2232610 3129678 3242362 2787294 2533183 1622171
1834 1622171 1049337 1660533 2173687 2248542 3079750 3325021 2592709 2688574 2821938 2808265
1824 2808265 3253728 4151886 3311169 3571893 3512108 3395611 3162728 2877823 3084437 2767559
1814 2767559 2351031 2240903 2567816 2501972 2418696 2473385 3104689 2542172 2924960 3218187
1804 3218187 3244363 3087506 2736605 2996722 3329589 3573532 2970517 2626100 2298050 2840969
1794 2840969 2700952 3129337 3709914 3782564 3977491 3542801 2502612 2414793 3593602 3557175
1784 3557175 3938146 3929581 4151445 3784682 3073608 2863503 2375196 2900614 2906627 2905481 3416667
1773C416667k16418k52304n86966Q9653l09257K07399m91957K84996O62879L19780
1763C124472j4255j74070k26798l29156l36787L17593J41212l21464m68153J72403
1753A884997N77821K28508o05438j40693R58449N7986p75263j52167N94729j36143
1743B492786P5617K81115k95552l07170n9516j69602K12189N97551n53188n4977
1733B219253M97433l85134r18990Q24213P4545O04207p91415k35774K05588j033422
1723A060504P87230k99852K23497k37044r1100P2049L29483M37161L10563q78804
1713A713687r631L95347k65453K81091j835J15975L38703J056123o85916r87250
1703A950841k14982k67815N43329R72574m87906p78625R78179L99092P5060n25929
$$ plain form
1773 3416667 3200249 2947945 2360979 2450632 2141375 2348774 1856817 2141813 2804692 3124472
1763 3124472 3110217 2936147 2709349 2380193 2043406 2360999 2502211 2180747 1712594 1884997
1753 1884997 2462818 2691326 2085888 1945195 2903644 2961630 2186367 2034200 2628929 2492786
1743 2492786 2568403 2849518 2553966 2246796 2187280 2017678 2229867 2827418 2274230 2219253
1733 2219253 2716686 2331552 1412562 2236775 2311320 2915527 2124112 1888338 2093926 1060504
1723 1060504 1847734 1547882 1771379 1534335 1443235 1515284 1844767 2281928 2592491 1713687
1713 1713687 1704056 2099403 1833950 2115041 2113206 2229181 2567884 3624007 2938091 1950841
1703 1950841 1735859 1468044 2011373 2983947 2496041 1717416 2695595 3094687 3169747 2643818
1693B643818m60873R8714n02931l00596O22252R1164J02457n27684r7990j89642
1683A478689o4581o07155O35512N14211M2286J51024K82165m85081J4286N88097
1673B549453j86691J3932j02531o47290l7548l9388j70193O37115o93832P80710
1663B103737K05598l65012K89453n03045m66094K30095k36778J50581n637m56924
1653I45974l525K36315P00817M45325j226816r87731Q18651P99944J27438j80610
1643A675782Q8488l10370k95346K59898l05076N0983M40725L80349L65249l35417
1633B015265m6056j27171o38688M58156J080227m57351r7510k28136o10914L50025
1623A697847J20808M87120l3479p23217M28554n23666o75588Q51386j85528p4067
$$ plain form
1693 2643818 2182945 2281659 1778728 1478132 2100384 2191548 2294005 1766321 1668331 1478689
1683 1478689 1414108 806953 1442465 1956676 1998962 2149986 2432151 1947070 1961356 2549453
1673 2549453 2362762 2376694 2274163 1626873 1589325 1549937 1379744 2016859 1323027 2103737
1663 2103737 2309335 1944323 2233776 1730731 1264637 1494732 1257954 1408535 1402898 945974
1653 945974 942449 1178764 1879581 2324906 1098090 110359 929010 1728954 1856392 1675782
1643 1675782 1764270 1453900 1158554 1418452 1113376 1164359 1605084 1985433 2350682 2015265
1633 2015265 1969209 1842038 1203350 1661506 2741733 2284382 2186872 1958736 1347822 1697847
1623 1697847 1818655 2305775 2272296 1549079 1977633 1453967 778379 1629765 1444237 1370170
1613A370170M8626j50421Q1469j78578M36764r8022k53321R74182k38432q07322
1603A185115J60740m93815R28546l52487L47750M82472j16998J30076j77839p03252
1593A390308n81351J18731P12023O43560m76615r593j75249L02700L81430j131175
1583A174769n75541R94446j40327M13125K31991l87281j55243M02814p83103M61743
1573A637393k11901L66111o4682q14893k3041K77119q0178R6084L04144j99081
1563A287075J363542k08730j364938j93324j72042L2713N52544J28396M1118M94355
1553A960709M33233o21663o75697L14531K21703o31632k22771N77348n45313r5766
1543G14682O40123l01604L1045K27806P70080J059642o82222r38718j2218L40916
$$ plain form
1613 1370170 1418796 1268375 1349844 1171266 1608030 1510008 1256687 2230869 1992437 1185115
1603 1185115 1345855 852040 1780586 1428099 1775849 2258321 2141323 2271399 2093560 1390308
1593 1390308 808957 927688 1639711 2283271 1806656 1797063 1621814 1924514 2305944 1174769
1583 1174769 599228 1593674 1453347 1866472 2098463 1711182 1555939 1958753 1175650 1637393
1573 1637393 1425492 1791603 1726921 912028 888987 1166106 1085928 1182012 1486156 1287075
1563 1287075 2650617 2441887 1076949 883625 711583 744296 1296840 1425236 1466354 1960709
1553 1960709 2393942 1772279 1096582 1411113 1632816 1001184 778413 1355761 810448 714682
1543 714682 1354805 1053201 1084246 1312052 2082132 3141774 2459552 1520834 1508616 1849532
1533A849532K29922p50060M3649n7515K17616K01198P9901L3120P0479n06202
1523A411640J26414r7001M95384K88613l45348J41342j96813J85233l28312K14138
1513A895290R0741k27030m31728Q383J86546k95611l72015j74501k70364L21696
1503G31407n8937N76598K24648j58407l17447K22869M01951L29860M6104p54984
1493A243662q43568Q02218R82401j37104o45693j85141J18246k94649Q1136L27857
1483A449365j94577j32589k29120l28414J87676M13250O32492n93997l43090k96701
1473E64295Q83723Q0396l53589K36976k54096k87185M6633R21295n17728n39287
1463G81433M88091m45610N64980p4675P5309j89158O6108K68831n8448J12867
$$ plain form
1533 1849532 2079454 1329394 1373043 1315528 1533144 1734342 1814243 1847363 1917842 1411640
1523 1411640 1538054 1441053 1936437 2225050 1879702 2021044 1824231 2009464 1681152 1895290
1513 1895290 1986031 1759001 1327273 1335656 1522202 1226591 854576 680075 409711 731407
1503 731407 672470 1249068 1473716 1315309 997862 1220731 1622682 1952542 1998646 1243662
1493 1243662 400094 1202312 2184713 2047609 1401916 1216775 1335021 1040372 1121508 1449365
1483 1449365 1254788 1122199 893079 564665 752341 1165591 1798083 1204086 860996 564295
1473 564295 1448018 1528414 1174825 1411801 1157705 870520 917153 1838448 1320720 781433
1463 781433 1269524 823914 1388894 1314219 1389528 1200370 1266478 1535309 1476861 1589728
1453A589728J21565l4987j005532L09861k61441M24834N91989l78942k92862l01345
1443G62868P7451R12935k50442Q9235J0528j257115K43353l15839K40071L91693
1433I04738J79494M01036n1709r68939K17496p9531L3725m5925k59849K02923
1423E33459M11642L44443o02175l36467P44783P43040r6079q41334o182p2069
1413H23061k70361M40212j6233P81967q56597p09260M14223J372794j84449m11657
1403A383700O28606j123217j004463N18729O92891l98841L04014L56905L125J65901
1393A527350J76230o68081n72872n33313J35651O54994J244504l54574j76462
1384A433427o10635N0086L68931J7213q8454l80753k74496l89775r2016J55972
$$ plain form
1453 1589728 1711293 1676306 670774 980635 719194 1144028 1736017 1357075 1064213 762868
1443 762868 840319 1753254 1502812 1592047 1602575 345460 588813 272974 513045 904738
1433 904738 1084232 1485268 1433559 464620 682116 602585 636310 590385 330536 533459
1423 533459 945101 1289544 687369 350902 1095685 1838725 1742646 901312 895130 823061
1413 823061 552700 992912 976679 1758646 902049 192789 607012 1979806 1795357 1383700
1403 1383700 2012306 889089 -115374 403355 1096246 697405 1001419 1358324 1361449 1527350
1393 1527350 1703580 1035499 462627 -70686 64965 719959 1964463 1609889 1433427
1384 1433427 822792 872878 1241809 1259022 1170568 789815 515319 125544 33528 189500
1374A89500J316716l90803o46500J159915j18271q50538l4949P10681m53567o9244
1364H12940M37543n45057r5010l14099O11735n38228J209912k15923k44388P0077
1354A189502k06057P20361n41021l51710K45083j17833o15145n90521P35876M29078
1344H97613j00675n31473N53429m97235k2736N55914N91873M1632r2636j69040
1334A226666P63611K45116p58132k66842l45639L93612m55447L03169L74597j75570
1324A305141j16649j52545q53184L09557Q23095m7695k92972L03829L10353j152401
1314D36529q44406L24812j88011m7189L61138R23376M13921j210645k59269P43444
1304F53700L29852R1103q06690O26324L23420k63730o21084k91528P73815m6472
$$ plain form
1374 189500 1506216 1115413 468913 1628828 1510557 660019 625070 1335751 882184 812940
1364 812940 1250483 705426 610416 296317 908052 369824 1579736 1363813 1119425 1189502
1354 1189502 983445 1703806 1162785 811075 1056158 938325 323180 -267341 468535 897613
1344 897613 796938 265465 818894 321659 298923 854837 1446710 1488342 1395706 1226666
1334 1226666 1990277 2235393 1477261 1210419 864780 1258392 802945 1106114 1480711 1305141
1324 1305141 1188492 1035947 182763 492320 1315415 1267720 974748 1278577 1588930 436529
1314 436529 -407877 -83065 -271076 -318265 42873 966249 1380170 169525 -89744 653700
1304 653700 983552 1074655 267965 894289 1217709 953979 332895 41367 815182 768710
1294G68710k24032r483n15419j65303K8765J65932K2296M05621m7775l75016M30953
1283D85249K31861n7488p78849p0250J23193J86279Q80514M69632l37059M23084
1273A556166m43671L89504l72262O0783K5271k83384k12289l2051O10303l78678
1263I19692K32016O64353p57862k38467J8945k70501j04754J5379n72840M74661
1253C80622K5414m99380M42517J115691O119q85984J035745L57725n10554n79465
1243H88450K46875l52873l24315j91656L58088M98917L90541m8146j02610m17250
1233I46021N90310J5828o94691r6358R58173j261843M23416K9899K25426k44078
1223H92103n6747P4496R9613k56825q53454P4683P64850j06797j093340m00514
$$ plain form
1294 768710 544678 535195 19776 -145527 -116762 49170 71466 477087 429312 54296 485249
1283 485249 717110 659622 -119227 -189477 -66284 119995 1000509 1470141 1133082 1556166
1273 1556166 1112495 1501999 1129737 1190520 1215791 932407 720118 688067 1298370 919692
1263 919692 1151708 1816061 1058199 819732 838677 568176 463422 478801 -94039 380622
1253 380622 406036 -93344 349173 1464864 1470983 584999 1620744 1978469 1467915 888450
1243 888450 1135325 782452 458137 266481 624569 1123486 1514027 1465881 1363271 946021
1233 946021 1536331 1552159 857468 761110 1719283 457440 880856 910755 1136181 892103
1223 892103 835356 909852 1009465 752640 -100814 -26131 738719 631922 -461418 -861932
1213h61932O70214O83342k29969j16247K52071N67248n15126o87407j28215R05337
1203E39316k77028K02147M15557j32311O591o65554l4014L96890q077K45869K36912
1192I26298o12634N88639J27956n79811K34886n60811k38875K26451N77993O79270
1182A369362l91346K83926j13680K63544l21638j92572l59388o75047p9661N53956
1172C37456M57783j19542l39438m8155k3422n40605M52191K98425L11752j046819
1162b60374O87815N79596K51967q24377p4964J84005J9752o55449R97028J10414
1152A015413n86198j91207l24380L76508J75783j044838L66055P38151n26689
1143a402n8953P31870L872j0198N87064J57480j233010k21432P89580N30514r51324
$$ plain form
1213 -861932 -191718 491624 261655 145408 397479 964727 449601 -237806 -366021 539316
1203 539316 262288 464435 879992 747681 754272 88718 54704 451594 443517 689386 926298
1192 926298 313664 902303 1030259 450448 685334 124523 -114352 112099 690092 1369362
1182 1369362 978016 1261942 1148262 1411806 1090168 897596 538208 -136839 -216500 337456
1172 337456 795239 675697 336259 288104 264682 -275923 176268 474693 786445 -260374
1162 -260374 427441 1007037 1259004 434627 359663 543668 563420 -92029 904999 1015413
1152 1015413 429215 238008 -86372 290136 465919 -578919 -212864 525287 -1402
1143 -1402 -60355 671515 675387 665189 1252253 1409733 176723 -44709 744871 1275385 324061
1132C24061l39608M370l48243P6282O32184J983918l06222o58492j48080l63920
1122H56250J77630L92183j020965o20292L65243R5654P0922K22050L48590n58642
1112C28623L27319l3508M7352l7621n53101P0530l17254K43789N67673l02006
1102C41796P98148n73419j238332N4275P03066J50989m63590Q30191L84228o24003
1092C63349o1068K63186n91793Q55230k49025R8924j42772m41499m67825M95282
1082A21989P57971L33423j45143r91866K03279K98828k98394K82025l88832J04443
1072B77723L07670j7918J28336L47951k61456j091560m16806R31006m88745N26426
1062B42627R3600k01510Q17774k92419q74757P15050j56085k94582m1502J46160
$$ plain form
1132 324061 -15547 -11177 -359420 -283138 349046 2332964 2026742 1368250 1220170 856250
1122 856250 1033880 1426063 405098 -215194 150049 245703 316625 538675 887265 328623
1112 328623 655942 622434 669786 632165 79064 149594 -167660 76129 643802 341796
1102 341796 1139944 566525 -671807 -617532 85534 236523 -227067 603124 987352 363349
1092 363349 302281 565467 -26326 828904 579879 678803 536031 94532 -373293 121989
1082 121989 879960 1213383 1068240 76374 279653 578481 280087 562112 173280 277723
1072 277723 585393 567475 695811 1043762 782306 -309254 -726060 204946 -283799 242627
1062 242627 336227 134717 952491 660072 -214685 500365 344280 49698 8196 154356
1052A54356m0187K25044J059689o18350q08157m66711J168940N97731o82421n44387
1042D5547k94058J87153M22480M31631N05512p77802n82568N10034J61429P06803
1032A316161k16515l66431r1781k97496J96968l5661P2230q7093k66906m35214
1022b11738J449013M18731k53236q58864k48792J0972l71894l12966J78808Q22208
1012F22242m47605K35976J3904N48697o36435L12514Q8803k9617K2987m31681
1002B99785j4537j80373N32810o00644J24734M71266j53636L8644L86546o18768
$$ plain form
1052 154356 114169 339213 1398902 780552 -27605 -494316 674624 1272355 589934 45547
1042 45547 -248511 -61358 361122 792753 1298265 520463 -62105 447929 609358 1316161
1032 1316161 1099646 733215 641434 343938 540906 505245 577475 490382 223476 -211738
1022 -211738 1237275 1656006 1402770 543906 295114 306086 -65808 -378774 -199966 622242
1012 622242 174637 410613 424517 973214 336779 649293 738096 708479 731466 299785
1002 299785 285248 104875 637685 37041 161775 633041 479405 518049 904595 285827
$$ [...]
##END NTUPLES=NMR SPECTRUM
##END=
