##TITLE=1H_CA-9122-1
 CDCl3
 8 sc, 
 20.2.2023
##JCAMPDX= 6.0         $$ Bruker NMR JCAMP-DX V2.0
##DATA TYPE= NMR SPECTRUM
##DATA CLASS= NTUPLES
##ORIGIN= UXNMR, Bruker Analytische Messtechnik GmbH
##OWNER= root
$$ XWIN-NMR		Version 3.5
$$ Mon Feb 20 14:07:13 2023 Russian Standard Time (UT+4h)  she@DPX200
##.OBSERVE FREQUENCY= 200.13135
##.OBSERVE NUCLEUS= ^1H
##.ACQUISITION MODE= SIMULTANEOUS
##.ACQUISITION SCHEME= undefined
##.AVERAGES= 8
##.DIGITISER RES= 18
##SPECTROMETER/DATA SYSTEM= spect
##.PULSE SEQUENCE= zg30
##.SOLVENT NAME= CDCl3
##.SHIFT REFERENCE= (INTERNAL, CDCl3, 0, 15.8229)
##AUDIT TRAIL= $$ (NUMBER, WHEN, WHO, WHERE, WHAT)
$$ ##TITLE= Audit trail, XWIN-NMR		Version 3.5
$$ ##JCAMPDX= 5.01
$$ ##ORIGIN= Bruker BioSpin GmbH
$$ ##OWNER= she
$$ F:/spectra/data/she/nmr/H-F/1/pdata/1/auditp.txt
$$ ##AUDIT TRAIL=  $$ (NUMBER, WHEN, WHO, WHERE, WHAT)
(   1,<2023-02-20 14:06:03.82 +0400>,<she>,<DPX200>,
      <created by zg, POWCHK disabled, PULCHK disabled
       configuration hash MD5:
       00 E9 B6 7A A2 85 ED C7 34 08 36 98 17 FE 4E 26
       data hash MD5: 16K
       99 7F BE 98 89 D9 C2 BA 47 D0 85 22 46 4E F3 47>)
(   2,<2023-02-20 14:06:07.37 +0400>,<she>,<DPX200>,
      <Start of raw data processing
       efp BC_mod = 2 LB = 0.24 FT_mod = 6 PKNL = 1 PHC0 = -19110.08 PHC1 = 15.40078 SI = 16K 
       data hash MD5: 16K
       52 4A 03 50 A1 22 05 0F D6 63 53 7A 9E E3 A7 B3>)
(   3,<2023-02-20 14:06:23.96 +0400>,<she>,<DPX200>,
      <pk PHC0 = -159.4794 PHC1 = 1.2 
       data hash MD5: 16K
       6F CC 81 39 91 E4 69 AA D0 C8 82 56 B2 4C 85 1C>)
(   4,<2023-02-20 14:06:27.14 +0400>,<she>,<DPX200>,
      <abs ABSG = 5 
       data hash MD5: 16K
       E8 63 0F 3C FE B9 AD 4E 8B 43 E3 90 B1 3E AF D5>)
$$ ##END=
$$ 
$$ hash MD5
$$ BA 12 24 5C DE EB 88 D0 3D 0A 23 E2 E9 BF 1C 86
##$RELAX= 
##$RELAX= 
##$RELAX= 
##$RELAX= 
##$RELAX= 
##$RELAX= 
$$ Bruker specific parameters
$$ --------------------------
##$DU= <F:/spectra>
##$EXPNO= 1
##$NAME= <H-F>
##$PROCNO= 1
##$TYPE= <nmr>
##$USER= <she>
##$AMP= (0..31)
100 100 100 100 100 100 100 100 100 100 100 100 100 100 100 100 100 100 
100 100 100 100 100 100 100 100 100 100 100 100 100 100 
##$AQSEQ= 0
##$AQ_mod= 1
##$AUNM= <au_zg>
##$AUTOPOS= <>
##$BF1= 200.13
##$BF2= 200.13
##$BF3= 200.13
##$BF4= 200.13
##$BF5= 200.13
##$BF6= 200.13
##$BF7= 200.13
##$BF8= 200.13
##$BYTORDA= 1
##$CFDGTYP= 0
##$CFRGTYP= 5
##$CHEMSTR= <none>
##$CNST= (0..31)
1 1 145 1 1 1 1 1 1 1 1 1 1 1 1 1 1 1 1 1 1 1 1 1 1 1 1 1 1 1 1 1 
##$CPDPRG= <>
##$CPDPRG1= <>
##$CPDPRG2= <>
##$CPDPRG3= <>
##$CPDPRG4= <mlev>
##$CPDPRG5= <mlev>
##$CPDPRG6= <mlev>
##$CPDPRG7= <mlev>
##$CPDPRG8= <mlev>
##$CPDPRGB= <>
##$CPDPRGT= <>
##$D= (0..31)
0 1.2 0 0 0 0 0 0 0 0.06 0 0.03 0 0 0 0 0.0002 0 0 0 0 0 0 0 0 0 0 0 0 
0 0 0 
##$DATE= 1676887563
##$DBL= (0..7)
120 120 120 120 120 120 120 120 
##$DBP= (0..7)
150 150 150 150 150 150 150 150 
##$DBP07= 0
##$DBPNAM0= <>
##$DBPNAM1= <>
##$DBPNAM2= <>
##$DBPNAM3= <>
##$DBPNAM4= <>
$$ [...]
##$SUBNAM3= <"">
##$SUBNAM4= <"">
##$SUBNAM5= <"">
##$SUBNAM6= <"">
##$SUBNAM7= <"">
##$SUBNAM8= <"">
##$SUBNAM9= <"">
##$SW= 18.05172834244
##$SWIBOX= (0..15)
0 0 2 0 0 0 0 0 0 0 0 0 0 0 0 0 
##$SW_h= 3612.71676300578
##$TD= 16384
##$TD0= 1
##$TE= 0
##$TE2= 300
##$TE3= 300
##$TEG= 300
##$TL= (0..7)
0 120 120 120 120 120 120 120 
##$TP= (0..7)
150 150 150 150 150 150 150 150 
##$TP07= 0
##$TPNAME0= <>
##$TPNAME1= <>
##$TPNAME2= <>
##$TPNAME3= <>
##$TPNAME4= <>
##$TPNAME5= <>
##$TPNAME6= <>
##$TPNAME7= <>
##$TPOAL= (0..7)
0.5 0.5 0.5 0.5 0.5 0.5 0.5 0.5 
##$TPOFFS= (0..7)
0 0 0 0 0 0 0 0 
##$TUNHIN= 0
##$TUNHOUT= 0
##$TUNXOUT= 0
##$USERA1= <user>
##$USERA2= <user>
##$USERA3= <user>
##$USERA4= <user>
##$USERA5= <user>
##$V9= 5
##$VALIST= <valist>
##$VCLIST= <CCCCCCCCCCCCCCC>
##$VD= 0
##$VDLIST= <DDDDDDDDDDDDDDD>
##$VPLIST= <PPPPPPPPPPPPPPP>
##$VTLIST= <TTTTTTTTTTTTTTT>
##$WBST= 1024
##$WBSW= 4
##$XGAIN= (0..3)
0 0 0 0 
##$XL= 0
##$YL= 0
##$YMAX_a= 360239
##$YMIN_a= -195957
##$ZGOPTNS= <>
##$ZL1= 120
##$ZL2= 120
##$ZL3= 120
##$ZL4= 120
##$ABSF1= 15.87139
##$ABSF2= -2.180461
##$ABSG= 5
##$ABSL= 3
##$ALPHA= 0
##$AQORDER= 0
##$ASSFAC= 0
##$ASSFACI= 0
##$ASSFACX= 0
##$ASSWID= 0
##$AUNMP= <proc_1d>
##$AZFE= 0.1
##$AZFW= 0.1
##$BCFW= 0
##$BC_mod= 2
##$BYTORDP= 0
##$COROFFS= 0
##$CY= -3
##$DATMOD= 1
##$DC= 0
##$DFILT= <>
##$DTYPP= 0
##$F1P= 0
##$F2P= 0
##$FCOR= 1
##$FTSIZE= 16384
##$FT_mod= 6
##$GAMMA= 0
##$GB= 0
##$INTBC= 1
##$INTSCL= 3.70164e-10
##$ISEN= 128
##$LB= 0.24
##$LEV0= 0
##$LPBIN= 0
##$MAXI= 10000
##$MC2= 0
##$MEAN= 0
##$ME_mod= 0
##$MI= 1.114404
##$NCOEF= 0
##$NC_proc= -7
##$NLEV= 6
##$NOISF1= 3.799351
##$NOISF2= 2.8
##$NSP= 0
##$NTH_PI= 0
##$NZP= 0
##$OFFSET= 15.82291
##$PC= 1
##$PHC0= -19269.56
##$PHC1= 16.60078
##$PH_mod= 1
##$PKNL= yes
##$PPARMOD= 0
##$PSCAL= 0
##$PSIGN= 0
##$REVERSE= no
##$SF= 200.129989718102
##$SI= 16384
##$SIGF1= 3
##$SIGF2= 2
##$SINO= 5.538805
##$SIOLD= 16384
##$SREGLST= <1H.CDCl3>
##$SSB= 0
##$STSI= 16384
##$STSR= 0
##$SW_p= 3612.71676300578
##$SYMM= 0
##$S_DEV= 0
##$TDeff= 16384
##$TDoff= 0
##$TI= <>
##$TILT= no
##$TM1= 0
##$TM2= 0
##$TOPLEV= 0
##$USERP1= <user>
##$USERP2= <user>
##$USERP3= <user>
##$USERP4= <user>
##$USERP5= <user>
##$WDW= 1
##$XDIM= 16384
##$YMAX_p= 327289840
##$YMIN_p= -310666
$$ End of Bruker specific parameters
$$ ---------------------------------
##NTUPLES= NMR SPECTRUM
##VAR_NAME=  FREQUENCY,     SPECTRUM/REAL,   SPECTRUM/IMAG
##SYMBOL=    X,             R,               I
##VAR_TYPE=  INDEPENDENT,   DEPENDENT,       DEPENDENT
##VAR_FORM=  AFFN,          ASDF,            ASDF
##VAR_DIM=   16384,         16384,           16384
##UNITS=     HZ,            ARBITRARY UNITS, ARBITRARY UNITS
##FACTOR=    0.220516191357247, 1,           1
##FIRST=     3166.63887741818, 0,            0
##LAST=      -446.077885587603, 0,           0
##MIN=       -446.077885587603, -310666,     0
##MAX=       3166.63887741818, 327289840,    0
$$ Real data points
##PAGE= N=1
##DATA TABLE= (X++(R..R)), XYDATA
$$ [...]
$$ plain form
7737 338921 329351 283860 314326 351137 360315 379300 398655 392382 355034 373776 340650 246516
7725 246516 245159 347980 350176 318207 301694 314877 287133 264744 281769 243238 326625 314135
7713 314135 298283 330176 277970 204546 241806 331276 356757 377959 363410 394661 430633 384721
7701 384721 365718 381233 386421 403150 370344 369234 357607 398791 415584 403072 382501 346896
7689 346896 338754 342477 377349 352609 377767 354012 432718 424256 353617 339259 328391 311790
7677 311790 345313 395808 403233 313926 332694 393073 432478 440461 375758 383630 408113 453125
7665 453125 443092 443716 451919 444327 483572 493091 462970 445538 468523 541081 465997 448265 452741
7652 452741 468926 445792 507813 537555 569922 505946 459598 466180 446980 491737 500570 528537
$$ packed form
7737C38921r570m5491L0466L6811R178J8985J9355o273l7348J8742l3126r4134
7725B46516j357J02821K196l1969j6513J3183k7744k2389J7025l8531Q3387j2490
7713C14135j5852L1893n2206p3424L7260Q9470K5481K1202j4549L1251L5972m5912
7701C84721j9003J5515N188J6729l2806j110j1627M1184J6793j2512k0571l5605
7689C46896q142L723L4872k4740K5158k3755P8706q462p0639j4358j0868j6601
7677C11790L3523N0495P425q9307J8768O0379L9405P983o4703P872K4483M5012
7665D53125j0033O24Q203p592L9245R519l0121j7432K2985P2558p5084j7732M476
7652D52741J6185k3134O2021K9742L2367o3976m6348O582j9200M4757Q833K7967
$$ plain form
7640 528537 557733 575609 551963 476650 502136 528109 505833 509522 547282 520930 533341 520640
7628 520640 574995 564022 561104 609759 616450 598490 598511 636446 590048 602043 502523 557064 552642
7615 552642 552800 583831 533477 526163 551896 571100 636252 631538 586604 680529 675424 714811 748694
7602 748694 718437 709868 686989 662307 699350 706594 667441 746587 794370 741117 669840 713165
7590 713165 741892 671783 677062 751660 756384 846797 832871 817973 891462 891972 901171 928608 933026
7577 933026 949125 930363 888155 877736 905142 920181 949191 955504 963188 945897 919364 975875
7565 975875 1046142 973826 1029807 1156479 1139643 1132385 1137205 1148866 1171143 1139786 1127287 1204872
7553 1204872 1202744 1215306 1190495 1177567 1165148 1197156 1229529 1243517 1248566 1303295 1290112 1277754
$$ packed form
7640E28537K9196J7876k3646p5313K5486K5973k2276L689L7760k6352J2411j2701
7628E20640N4355j0973k918M8655O691j7960K1L7935m6398J1995r9520N4541m422
7615E52642J58L1031n0354p314K5733J9204O5152m714m4934R3925n105L9387L3883
7602G48694l0257q569k2879k4682L7043P244l9153P9146M7783n3253p1277M3325
7590G13165K8727p0109N279P4598M724R0413j3926j4898P3489N10R199K7437M418
7577I33026J6099j8762m2208j0419K7406J5039K9010O313P684j7291k6533N6511
7565I75875P0267p2316N5981J26672j6836p258M820J1661K2277l1357j2499P7585
7553A204872k128J2562k4811j2928j2419L2008L2373J3988N049N4729j3183j2358
$$ plain form
7541 1277754 1287874 1286234 1327447 1352577 1379845 1370753 1394239 1324748 1387701 1430401 1440730 1471773
7529 1471773 1400548 1454899 1526171 1510013 1511621 1506456 1496694 1557026 1580521 1615047 1619599 1626666
7517 1626666 1635217 1660946 1649288 1698501 1665305 1676817 1689697 1757767 1812470 1863147 1884879 1839281
7505 1839281 1900721 1949265 2003499 1968175 1930250 1940216 2026437 2083752 2121829 2116340 2146679 2155229
7493 2155229 2155505 2140396 2189645 2271929 2245747 2328020 2341245 2348702 2363786 2349065 2421069 2455290
7481 2455290 2412784 2405054 2382198 2416117 2410994 2422429 2483601 2468119 2531591 2596571 2639968 2687815
7469 2687815 2624514 2616867 2682660 2676890 2644915 2627919 2667192 2615893 2562378 2536195 2515176 2491765
7457 2491765 2506926 2510128 2479360 2413126 2427968 2514323 2490460 2426120 2412603 2363117 2399589 2428640
$$ packed form
7541A277754J0120j640M1213K5130K7268r092K3486o9491O2953M2700J0329L1043
7529A471773p1225N4351P1272j6158J608n165r762O0332K3495L4526M552P067
7517A626666Q551K5729j1658M9213l3196J1512J2880O8070N4703N0677K1732m5598
7505A839281O1440M8544N4234l5324l7925R966Q6221N7315L8077n489L0339Q550
7493B155229K76j5109M9249Q2284k6182Q2273J3225P457J5084j4721P2004L4221
7481B455290m2506p730k2856L3919n123J1435O1172j5482O3472O4980M3397M7847
7469B687815o3301p647O5793n770l1975j6996L9273n1299n3515k6183k1019k3411
7457B491765J5161L202l0768o6234J4842Q6355k3863o4340j3517m9486L6472K9051
$$ plain form
7445 2428640 2309106 2297761 2368408 2283355 2240699 2297689 2237899 2189293 2161154 2161980 2188678 2196656
7433 2196656 2183112 2111873 2133288 2096317 2073375 1998525 1988344 1982842 1955033 1905060 1855445 1954390
7421 1954390 1955339 1848453 1826343 1824739 1837212 1885723 1832801 1773489 1810639 1789043 1730158 1709705
7409 1709705 1706527 1610893 1634290 1744223 1730536 1686188 1662551 1681624 1662259 1669870 1638856 1586367
7397 1586367 1589568 1584586 1566599 1612731 1573974 1601371 1648044 1610359 1581665 1523095 1514108 1517876
7385 1517876 1548083 1534984 1550667 1542109 1461548 1517660 1540324 1611057 1580558 1557899 1520943 1492426
7373 1492426 1550301 1558158 1533371 1541905 1520407 1501395 1489823 1565066 1626195 1566170 1560763 1595141
7361 1595141 1559456 1521907 1511373 1447570 1391978 1409808 1449492 1509960 1528097 1538636 1520626
$$ packed form
7445B428640j19534j1345P0647q5053m2656N6990n9790m8606k8139Q26K6698P978
7433B196656j3544p1239K1415l6971k2942p4850j0181n502k7809m9973m9615R8945
7421A954390R49j06886k2110j604J2473M8511n2922n9312L7150k1596n8885k0453
7409A709705l178r5634K3397J09933j3687m4348k3637J9073j9365P611l1014n2489
7397A586367L201m982j7987M6132l8757K7397M6673l7685k8694n8570q987L768
7385A517876L0207j3099J5683q558q0561N6112K2664P0733l0499k2659l6956k8517
7373A492426N7875P857k4787Q534k1498j9012j1572P5243O1129o0025n407L4378
7361A595141l5685l7549j0534o3803n5592J7830L9684O0468J8137J0539j8010
$$ plain form
7350 1520626 1528388 1536061 1438189 1392451 1410447 1425888 1461048 1459692 1499615 1537729 1515643 1532287
7338 1532287 1534779 1530392 1541978 1587531 1554407 1522347 1550137 1628274 1687965 1681505 1642302 1563991
7326 1563991 1576698 1636352 1596410 1657674 1694113 1671535 1671362 1710470 1768798 1774993 1772944 1765530
7314 1765530 1844486 1891171 1856957 1858954 1888738 1943347 1969287 1998661 2019922 2079427 2118701 2140870
7302 2140870 2188567 2218649 2293416 2307615 2410003 2492507 2522196 2565355 2561479 2632642 2679557
7291 2679557 2710432 2709146 2779132 2836125 2847990 2887942 2935138 2993237 3117920 3235806 3279668
7280 3279668 3332238 3427529 3543019 3658909 3745950 3849067 4011010 4038133 4057672 4117975 4260555
7269 4260555 4353992 4411816 4472639 4450607 4461245 4478306 4522941 4590364 4661180 4723151 4722131 4735520
$$ packed form
7350A520626P762P673r7872m5738J7996J5441L5160j356L9923L8114k2086J6644
7338A532287K492m387J1586M5553l3124l2060K7790P8137N9691o460l9203p8311
7326A563991J2707N9654l9942O1264L6439k2578j73L9108N8328O195k049p414
7314A765530P8956M6685l4214J997K9784N4609K5940K9374K1261N9505L9274K2169
7302B140870M7697L0082P4767J4199J02388Q2504K9689M3159l876P1163M6915
7291B679557L0875j286O9986N6993J1865L9952M7196N8099J24683J17886M3862
7280C279668N2570R5291J15490J15890Q7041J03117J61943K7123J9539O0303J42580
7269D260555R3437N7824O0823k2032J0638J7061M4635O7423P0816O1971j020J3389
$$ plain form
7257 4735520 4779201 4764725 4858829 4957123 4967363 5042144 5135164 5130741 5239072 5399477 5424402
7246 5424402 5465809 5537296 5664285 5736875 5731940 5758103 5805222 5826320 5814804 5772024 5674701
7235 5674701 5570497 5455951 5381163 5283129 5254524 5251293 5205921 5067578 5017973 5021848 5023271
7224 5023271 4947208 4856044 4872783 4940439 4901828 4902448 4886827 4819189 4782324 4704979 4673164 4624734
7212 4624734 4500564 4416640 4393474 4288009 4191548 4139337 4062355 3972082 3897376 3704032 3657233
7201 3657233 3500434 3388781 3296485 3212167 3062780 2979655 2940603 2826448 2792884 2768139 2759804
7190 2759804 2684951 2685372 2696921 2650826 2575860 2479116 2425018 2414070 2323041 2188904 2209904 2151278
7178 2151278 2039271 2013200 2020768 1969895 1920874 1771914 1694245 1715949 1661298 1619678 1573475
$$ packed form
7257D735520M3681j4476R4104R8294J0240P4781R3020m423J08331J60405K4925
7246E424402M1407P1487J26989P2590m935K6163M7119K1098j1516m2780r7323
7235E674701j04204j14546p4788r8034k8605l231m5372j38343m9605L875J423
7224E023271p6063r1164J6739O7656l8611O20j5621o7638l6865p7345l1815m8430
7212D624734j24170q3924k3166j05465r6461n2211p6982r0273p4706j93344m6799
7201C657233j56799j11653r2296q4318j49387q3125l9052j14155l3564k4745q335
7190B759804p4853M21J1549m6095p4966r6744n4098j0948r1029j34137K1000n8626
7178B151278j12007k6071P568n0873m9021j48960p7669K1704n4651m1620m6203
$$ plain form
7167 1573475 1547388 1430422 1423007 1500774 1550566 1529258 1477099 1411547 1401145 1425297 1430487 1361944
7155 1361944 1405882 1376090 1358571 1343771 1350550 1314474 1299727 1320702 1306112 1334664 1340088 1329217
7143 1329217 1313395 1320684 1293280 1306587 1334414 1285631 1319596 1282515 1250778 1240222 1234237 1339222
7131 1339222 1275998 1294556 1301042 1248539 1271498 1286330 1258078 1295633 1280268 1249453 1281697 1324269
7119 1324269 1316921 1272456 1244694 1304355 1304309 1322324 1302422 1298625 1382748 1398806 1335021 1352063
7107 1352063 1400690 1385975 1365106 1419895 1387980 1340224 1374916 1368069 1383245 1439895 1467655 1429056
7095 1429056 1440041 1427873 1430998 1536135 1520499 1469008 1506405 1534793 1537695 1514812 1487711 1539952
7083 1539952 1592621 1608177 1612407 1568962 1626204 1594261 1685877 1666548 1620043 1572828 1596362 1676065
$$ packed form
7167A573475k6087j16966p415P7767M9792k1308n2159o5552j0402K4152N190o8543
7155A361944M3938k9792j7519j4800O779l6076j4747K0975j4590K8552N424j0871
7143A329217j5822P289k7404J3307K7827m8783L3965l7081l1737j0556n985J04985
7131A339222o3224J8558O486n2503K2959J4832k8252L7555j5365l0815L2244M2572
7119A324269p348m4465k7762N9661m6J8015j9902l797Q4123J6058o3785J7042
7107A352063M8627j4715k0869N4789l1915m7756L4692o847J5176N6650K7760l8599
7095A429056J0985j2168L125J05137j5636n1491L7397K8388K902k2883k7101N2241
7083A539952N2669J5556M230m3445N7242l1943R1616j9329m6505m7215K3534P9703
$$ plain form
7071 1676065 1676244 1685832 1624906 1708536 1722119 1666221 1661969 1692376 1652439 1645523 1704164 1723296
7059 1723296 1709747 1697116 1664438 1638597 1599682 1595933 1632967 1642057 1642261 1632601 1629520 1650840 1609576
7046 1609576 1627127 1689771 1653024 1663165 1636536 1619278 1662701 1626112 1645338 1671889 1643280
7035 1643280 1681798 1679256 1700366 1736362 1669702 1743562 1752194 1698282 1720247 1697971 1709554 1687473
7023 1687473 1643243 1647424 1646510 1711849 1692576 1652362 1679355 1627645 1652767 1545857 1532412 1552131
7011 1552131 1585891 1582519 1575464 1632628 1697836 1699997 1650082 1670193 1690955 1673318 1654158 1646723
6999 1646723 1698411 1648701 1572915 1522681 1579094 1546574 1509939 1564772 1560327 1545611 1553261 1525275
6987 1525275 1396129 1467281 1476352 1482261 1475313 1505630 1500877 1499597 1513630 1493055 1561864 1645705
$$ packed form
7071A676065J79R588o0926Q3630J3583n5898m252L0407l9937o916N8641J9132
7059A723296j3549j2631l2678k5841l8915l749L7034R090K04r660l081K1320m1264
7046A609576J7551O2644l6747J0141k6629j7258M3423l6589J9226K6551k8609
7035A643280L8518k542K1110L5996o6660P3860Q632n3912K1965k2276J1583k2081
7023A687473m4230M181r14O5339j9273m0214K6993n1710K5122j06910j3445J9719
7011A552131L3760l372p055N7164O5208K161m9915K0111K0762j7637j9160p435
6999A646723N1688m9710p5786n0234N6413l2520l6635N4833m445j4716P650k7986
6987A525275j29146P1152R071N909o948L0317m753j280J4033k0575O8809Q3841
$$ plain form
6975 1645705 1636697 1618616 1581675 1552824 1538400 1548585 1542975 1564506 1536305 1490607 1476275 1531344
6963 1531344 1585940 1597926 1526887 1495541 1536152 1556961 1532116 1565726 1641062 1603186 1584752
6952 1584752 1564000 1603609 1574397 1636193 1648843 1609871 1609911 1683180 1708626 1650000 1641496 1628841
6940 1628841 1603370 1687482 1712350 1738357 1778774 1729777 1684265 1737798 1762588 1768002 1750590 1775764
6928 1775764 1774433 1814224 1840468 1889310 1921099 1918213 1955100 1957844 1929581 1943630 1993095 2010380
6916 2010380 2070701 2101929 2090841 2105427 2168586 2198866 2234090 2242163 2275702 2263800 2339969 2313113
6904 2313113 2369661 2421848 2426822 2393949 2421525 2430143 2533013 2603460 2657145 2710334 2728337 2796379
6892 2796379 2751569 2812265 2877696 2903337 2971366 2994180 3034069 3073800 3197018 3197599 3189506 3258363
$$ packed form
6975A645705r008j8081l6941k8851j4424J0185n610K1531k8201m5698j4332N5069
6963A531344N4596J1986p1039l1346M0611K0809k4845L3610P5336l7876j8434
6952A584752k0752L9609k9212O1796J2650l8972M0P3269K5446n8626q504j2655
6940A628841k5471Q4112K4868K6007M0417m8997m5512N3533K4790N414j7412K5174
6928A775764j331L9791K6244M8842L1789k886L6887K744k8263J4049M9465J7285
6916B010380O0321L1228j1088J4586O3159L0280L5224Q073L3539j1902P6169k6856
6904B313113N6548N2187M974l2873K7576Q618J02870P0447N3685N3189J8003O8042
6892B796379m4810O0696O5431K5641O8029K2814L9889L9731J23218N81q093O8857
$$ plain form
6880 3258363 3330144 3392200 3510186 3576269 3612656 3719952 3853749 3994183 4057003 4141180 4238154
6869 4238154 4336699 4418307 4529469 4675927 4862250 5023044 5222252 5396261 5645918 5874237
6859 5874237 6055227 6292469 6537725 6747113 7015681 7283251 7512652 7819571 8076202 8278199
6849 8278199 8412972 8559482 8586920 8597397 8611279 8561153 8470261 8367035 8234820 8087329
6839 8087329 7932733 7873395 7793723 7695334 7643176 7510107 7490913 7470344 7403947 7412732 7512551
6828 7512551 7619670 7716594 7762508 7841893 7962830 8183988 8326961 8583990 8814759 9075230
6818 9075230 9215045 9365703 9534709 9603404 9611597 9656999 9629596 9568417 9473952 9371387 9273366
6807 9273366 9223025 9192164 9129588 9109889 9081430 9120063 9162953 9267525 9321403 9355611 9518161
$$ packed form
6880C258363P1781O2056J17986O6083L6387J07296J33797J40434O2820Q4177R6974
6869D238154R8545Q1608J11162J46458J86323J60794J99208J74009K49657K28319
6859E874237J80990K37242K45256K09388K68568K67570K29401L06919K56631K01997
6849H278199J34773J46510K7438J0477J3882n0126r0892j03226j32215j47491
6839H087329j54596n9338p9672r8389n2158j33069j9194k0569o6397Q785R9819
6828G512551J07119R6924M5914P9385J20937K21158J42973K57029K30769K60471
6818I075230J39815J50658J69006O8695Q193M5402k7403o1179r4465j02565r8021
6807I273366n0341l0861o2576j9699k8459L8633M2890J04572N3878L4208J62550
$$ plain form
6796 9518161 9748807 9944122 10093095 10287919 10430900 10581413 10847113 10984944 11067349 11186537
6786 11186537 11262685 11239362 11156312 10965644 10727250 10494749 10187209 9930223 9686053 9432266
6776 9432266 9158802 8962178 8816773 8705638 8664114 8510242 8480568 8465276 8485290 8558421
6766 8558421 8673763 8770954 8885497 9011856 9180321 9350303 9535958 9683846 9808587 10010974
6756 10010974 10187136 10340346 10421232 10531052 10541389 10464652 10316533 10157701 9989595 9842892
6746 9842892 9698964 9483251 9256399 9062416 8815229 8532620 8357737 8265582 8101095 7912544
6736 7912544 7714835 7542090 7484346 7339719 7140863 7095639 7033591 7031124 7045177 6947887 6935285
6725 6935285 6920672 6868834 6936430 6976110 6979050 7003999 7060001 7178790 7285710 7347308 7416997
$$ packed form
6796I518161K30646J95315J48973J94824J42981J50513K65700J37831Q2405J19188
6786A1186537P6148k3323q3050j90668k38394k32501l07540k56986k44170k53787
6776I432266k73464j96624j45405j11135m1524j53872k9674j5292K0014P3131
6766H558421J15342R7191J14543J26359J68465J69982J85655J47888J24741K02387
6756A0010974J76162J53210Q0886J09820J0337p6737j48119j58832j68106j46703
6746I842892j43928k15713k26852j93983k47187k82609j74883r2155j64487j88551
6736G912544j97709j72745n7744j44627j98856m5224o2048k467J4053r7290j2602
6725F935285j4613n1838O7596L9680K940K4949N6002J18789J06920O1598O9689
$$ plain form
6714 7416997 7621862 7668781 7812883 7914667 8052530 8236166 8300576 8375048 8553891 8673265
6704 8673265 8820474 8864117 9057563 9226228 9338499 9576338 9792084 10091023 10476818 10889064
6694 10889064 11370178 11977368 12678386 13365042 13987096 14519105 14836039 14914769 14821042 14592545
6684 14592545 14276786 14039247 13854217 13708786 13677620 13696978 13846619 14013919 14281437 14591206
6674 14591206 14992098 15492710 16138064 16913113 17773208 18953667 20449259 22311319 24341676
6665 24341676 26498981 28536842 30208927 31184107 31367362 30725446 29361268 27690416 25875978
6656 25875978 24105424 22658862 21571871 20874607 20422930 20149500 20055960 20287102 20662956
6647 20662956 21151372 21784730 22579185 23664182 25064316 26844634 29050328 31700316 34714086
$$ packed form
6714G416997K04865M6919J44102J01784J37863J83636O4410P4472J78843J19374
6704H673265J47209M3643J93446J68665J12271K37839K15746K98939L85795M12246
6694A0889064M81114O07190P01018O86656O22054N32009L16934P8730r3727k28497
6684A4592545l15759k37539j85030j45431l1166J9358J49641J67300K67518L09769
6674A4591206M00892N00612O45354P75049Q60095J180459J495592J862060K030357
6665B4341676K157305K037861J672085R75180J83255o41916j364178j670852j814438
6656B5875978j770554j446562j086991o97264m51677k73430r3540K31142L75854
6647B0662956M88416O33358P94455J084997J400134J780318K205694K649988L013770
$$ plain form
6638 34714086 37739443 40316971 42007696 42481848 41692604 39692663 36849852 33615756
6630 33615756 30447570 27536086 25069517 23087659 21554361 20483139 19689044 19102090
6622 19102090 18720145 18615124 18608583 18860411 19233132 19924712 20773823 21928621 23455940
6613 23455940 25263092 27196595 29075420 30485126 31136621 30958163 29868132 28081995
6605 28081995 25767506 23277596 20916016 18908115 17326069 15940899 14862833 14027263
6597 14027263 13364493 12843403 12300363 11991856 11833289 11630000 11484899 11458446 11521689 11643538
6587 11643538 11923901 12302281 12734189 13102214 13290886 13209144 12807038 12194632 11459812 10646213
6577 10646213 9823412 9179907 8623504 8125410 7804729 7418745 7075342 6877242 6602191
$$ packed form
6638C4714086L025357K577528J690725M74152p89244j999941k842811l234096
6630C3615756l168186k911484k466569j981858j533298j071222p94095n86954
6622A9102090l81945j05021o541K51828L72721O91580Q49111J154798J527319
6613B3455940J807152J933503J878825J409706O51495j78458j090031j786137
6605B8081995k314489k489910k361580k007901j582046j385170j078066q35570
6597A4027263o62770n21090n43040l08507j58567k03289j45101k6453O3243J21849
6587A1643538K80363L78380M31908L68025J88672q1742m02106o12406p34820q13599
6577A0646213q22801o43505n56403m98094l20681l85984l43403j98100k75051
$$ plain form
6568 6602191 6439892 6297819 6157559 6005170 5793971 5703701 5614163 5530684 5434646 5323810
6558 5323810 5286545 5171649 5143249 5035086 4979778 4937871 4857266 4770542 4689656 4648239 4594370
6547 4594370 4486276 4425135 4355526 4364577 4319146 4245690 4242704 4290638 4252912 4246897 4262514 4187130
6535 4187130 4129672 4089835 4038987 3997723 3970446 3949902 3881972 3826164 3767967 3743134 3749753 3738177
6523 3738177 3715541 3756926 3644207 3614313 3653494 3646960 3619709 3620833 3645673 3575648 3609066 3599000
6511 3599000 3612938 3607402 3556029 3564325 3559801 3545019 3557662 3506855 3520437 3521566 3445074 3389833
6499 3389833 3408986 3381402 3306999 3326092 3356404 3424404 3426130 3397970 3396470 3344557 3309497 3312521
6487 3312521 3371467 3445841 3357319 3300790 3275757 3304220 3386541 3397329 3376138 3380843 3419162 3375741
$$ packed form
6568F602191j62299j42073j40260j52389k11199r0270q9538q3479r6038j10836
6558E323810l7265j14896k8400j08163n5308m1907q0605q6724q0886m1417n3869
6547D594370j08094o1141o9609R051m5431p3456k986M7934l7726o015J5617p5384
6535D187130n7458l9837n0848m1264k7277k0544o7930n5808n8197k4833O619j1576
6523C738177k2636M1385j12719k9894L9181o534k7251J124K4840p0025L3418j0066
6511C599000J3938n536n1373Q296m524j4782J2643n0807J3582J129p6492n5241
6499C389833J9153k7584p4403J9093L0312O8000J726k8160j500n1913l5060L024
6487C312521N8946P4374q8522n6529k5033K8463Q2321J0788k1191M705L8319m3421
$$ plain form
6475 3375741 3332127 3361275 3399687 3381255 3403350 3399693 3391500 3394605 3440234 3445967 3483102 3460854
6463 3460854 3480434 3470959 3480613 3497955 3535162 3562527 3534363 3551291 3581758 3598620 3551328 3545232
6451 3545232 3516070 3481555 3552466 3584341 3562862 3542144 3536951 3532614 3611009 3668928 3641099 3621211
6439 3621211 3618406 3605379 3630612 3639436 3654855 3738695 3836608 3838717 3768799 3807963 3909166 3955265
6427 3955265 3980756 3997138 3959084 3971302 4103700 4158072 4097017 4102129 4166978 4214378 4231857
6416 4231857 4208810 4219268 4261654 4338353 4352880 4413465 4499507 4518609 4561998 4647204 4726337
6405 4726337 4797555 4842554 4874292 4957452 5057336 5186978 5265890 5405752 5561056 5626203 5703619
6394 5703619 5875883 5998284 6139231 6230098 6315643 6392195 6456122 6499695 6515324 6543391 6508387
$$ packed form
6475C375741m3614K9148L8412j8432K2095l657q193L105M5629N733L7135k2248
6463C460854J9580r475R654J7342L7207K7365k8164J6928L0467J6862m7292o096
6451C545232k9162l4515P0911L1875k1479k0718n193m337P8395N7919k7829j9888
6439C621211k805j3027K5233Q824J5419Q3840R7913K109o9918L9164J01203M6099
6427C955265K5491J6382l8054J2218J32398N4372o1055N112O4849M7400J7479
6416D231857k3047J0458M2386P6699J4527O0585Q6042J9102M3389Q5206P9133
6405D726337P1218M4999L1738Q3160R9884J29642P8912J39862J55304O5147P7416
6394E703619J72264J22401J40947R0867Q5545P6552O3927M3573J5629K8067l5004
$$ plain form
6383 6508387 6512438 6512806 6435270 6461656 6489965 6545054 6562104 6534741 6583658 6671957 6655047 6647414
6371 6647414 6739578 6757730 6814452 6821292 6899753 6873105 6820383 6768278 6748103 6647640 6510291
6360 6510291 6467664 6439268 6324398 6236138 6158225 6132475 6127285 6064876 6039336 5955355 5978327
6349 5978327 5955148 6012085 6085592 6101879 6116367 6117701 6182959 6241681 6300456 6384367 6525904
6338 6525904 6650999 6683640 6760092 6818761 6864368 6987066 7096564 7155905 7210577 7283066 7366005
6327 7366005 7384234 7417150 7426080 7470145 7516007 7436099 7363388 7359212 7366085 7369989 7356089 7301688
6315 7301688 7296527 7318221 7321263 7334842 7358793 7415693 7482737 7548534 7602665 7632532 7565674 7501140
6303 7501140 7440146 7395666 7344680 7324079 7250588 7241424 7209550 7140023 7180760 7207416 7216421 7323366
$$ packed form
6383F508387M051L68p7536K6386K8309N5089J7050k7363M8917Q8299j6910p633
6371F647414R2164J8152N6722O840P8461k6648n2722n2105k0175j00463j37349
6360F510291m2627k8396j14870q8260p7913k5750n190o2409k5540q3981K2972
6349E978327k3179N6937P3507J6287J4488J334O5258N8722N8775Q3911J41537
6338F525904J25095L2641P6452N8669M5607J22698J09498N9341N4672P2489Q2939
6327G366005J8229L2916Q930M4065M5862p9908p2711m176O873L904j3900n4401
6315G301688n161K1694L042J3579K3951N6900O7044O5797N4131K9867o6858o4534
6303G501140o0994m4480n0986k0601p3491r164l1874o9527M0737K6656R005J06945
$$ plain form
6291 7323366 7408551 7423031 7463050 7529152 7596655 7651070 7687757 7805849 7984365 8167288 8318095
6280 8318095 8514358 8752175 8966415 9249195 9497859 9784835 10138781 10505283 10917242 11296903
6270 11296903 11582514 11824353 12099144 12277910 12364080 12442291 12493792 12462327 12420481 12307414
6260 12307414 12236655 12146923 12070622 12044122 11968785 11906039 11893920 11946600 12079516 12159942 12149946
6249 12149946 12266154 12404503 12518771 12550307 12480918 12404624 12335195 12220268 12082816 11811408
6239 11811408 11599782 11288275 11024240 10787908 10510467 10198029 9949699 9758366 9597576
6230 9597576 9411391 9256879 9180273 9122853 9025139 8929098 8788479 8777224 8851431 8925609 8968533
6219 8968533 9081263 9155602 9246785 9363073 9524810 9668677 9800356 9908254 10137025 10399209
$$ packed form
6291G323366Q5185J4480M0019O6102O7503N4415L6687J18092J78516J82923J50807
6280H318095J96263K37817K14240K82780K48664K86976L53946L66502M11959L79661
6270A1296903K85611K41839K74791J78766Q6170P8211N1501l1465m1846j13067
6260A2307414p0759q9732p6301k6500p5337o2746j2119N2680J32916Q0426r996
6249A2149946J16208J38349J14268L1536o9389p6294o9429j14927j37452k71408
6239A1811408k11626l11507k64035k36332k77441l12438k48330j91333j60790
6230I597576j86185j54512p6606n7420r7714r6041j40619j1255P4207P4178M2924
6219H968533J12730P4339R1183J16288J61737J43867J31679J07898K28771K62184
$$ plain form
6209 10399209 10548034 10648672 10755581 10923306 10999112 11005383 11027867 11008741 10906984 10825127
6199 10825127 10749554 10609662 10528323 10419806 10294892 10248132 10158911 10135482 10097105 10149967 10186510
6188 10186510 10309422 10332864 10362119 10370787 10333835 10252896 10118867 10028242 9870757 9592742 9268967
6177 9268967 8950063 8694708 8399424 8035630 7826103 7669055 7355982 7127200 6900590 6748846
6167 6748846 6565280 6462392 6336039 6153565 5992530 5981929 5981160 5879951 5790974 5646395
6157 5646395 5557671 5548855 5490259 5483523 5461418 5453710 5412329 5299439 5244153 5215149 5195959 5130965
6145 5130965 5062489 5021590 5080523 5058630 5000704 5018988 5002589 4962573 4925596 4922424 4940264 4918202
6133 4918202 4897089 4897643 4916297 4871493 4840858 4786208 4851577 4844420 4875512 4874787 4804094 4823653
$$ packed form
6209A0399209J48825J00638J06909J67725P5806O271K2484j9126j01757q1857
6199A0825127p5573j39892q1339j08517j24914m6760q9221k3429l8377N2862L6543
6188A0186510J22912K3442K9255Q668l6952q0939j34029r0625j57485k78015l23775
6177I268967l18904k55355k95284l63794k09527j57048l13073k28782k26610j51744
6167F748846j83566j02888j26353j82474j61035j0601p69j01209q8977j44579
6157E646395q8724q816n8596o736k2105p708m1381j12890n5286k9004j9190o4994
6145E130965o8476m0899N8933k1893n7926J8284j6399m0016l6977l172J7840k2062
6133D918202k1113N54J8654m4804l0635n4650O5369p157L1092p25p0693J9559
$$ plain form
6121 4823653 4784423 4823413 4839985 4870764 4868951 4864251 4800864 4797715 4804542 4813047 4780317 4757014
6109 4757014 4734309 4745191 4805874 4770291 4753799 4698259 4779829 4799435 4732643 4692660 4668974
6098 4668974 4617603 4612929 4592471 4646948 4721374 4662566 4609227 4632471 4597306 4621471 4595583 4631656
6086 4631656 4721153 4680807 4720122 4742446 4740986 4774422 4769261 4841792 4880914 4941779 4923465 4956763
6074 4956763 4956534 4929512 4967236 4949436 4940772 4902638 4845009 4842521 4852948 4885908 4933370 4887912
6062 4887912 4908295 4987459 5004118 4989076 5072332 5138554 5129865 5198136 5153364 5226005 5324476 5411558
6050 5411558 5372518 5447679 5572972 5568091 5653360 5672842 5773600 5820395 5858256 5891569 5955538
6039 5955538 5974165 6022920 6076827 6163851 6200501 6290339 6300805 6397468 6441275 6407014 6459176
$$ packed form
6121D823653l9230L8990J6572L0779j813m700o3387l149O827Q505l2730k3303
6109D757014k2705J0882O0683l5583j6492n5540Q1570J9606o6792l9983k3686
6098D668974n1371m674k0458N4477P4426n8808n3339K3244l5165K4165k5888L6073
6086D631656Q9497m0346L9315K2324j460L3436n161P2531L9122O0865j8314L3298
6074D956763k29k7022L7724j7800q664l8134n7629k488J0427L2960M7462m5458
6062D887912K0383P9164J6659j5042Q3256O6222q689O8271m4772P2641R8471Q7082
6050E411558l9040P5161J25293m881Q5269J9482J00758M6795L7861L3313O3969
6039E955538J8627M8755N3907Q7024L6650Q9838J0466R6663M3807l4261N2162
$$ plain form
6028 6459176 6498805 6520968 6556212 6615926 6614425 6648298 6776999 6803955 6861323 6927109 6991765
6017 6991765 7167503 7272243 7343663 7365350 7484547 7618279 7748555 7963408 8084300 8206860
6007 8206860 8285385 8381045 8422356 8510822 8547847 8613555 8649980 8659314 8690924 8747468 8818367 8777365
5995 8777365 8734841 8752315 8856513 8959859 9003040 9041868 9141146 9194121 9233459 9321308 9423264
5984 9423264 9492796 9546965 9601149 9776592 9846274 9825911 9874531 9836078 9862330 9894143 9780548
5973 9780548 9719021 9655296 9572071 9472290 9496309 9472738 9449684 9358664 9330329 9252866 9190059
5962 9190059 9262397 9213265 9194900 9244656 9313220 9354314 9373058 9341315 9265594 9250458 9239657
5951 9239657 9175518 9114316 8998231 8949353 8922438 8852980 8826646 8766461 8669259 8569305 8439054
$$ packed form
6028F459176L9629K2163L5244N9714j501L3873J28701K6956N7368O5786O4656
6017F991765J75738J04740P1420K1687J19197J33732J30276K14853J20892J22560
6007H206860P8525R5660M1311Q8466L7025O5708L6425R334L1610N6544P0899m1002
5995H777365m2524J7474J04198J03346M3181L8828R9278N2975L9338Q7849J01956
5984I423264O9532N4169N4184J75443O9682k0363M8620l8453K6252L1813j13595
5973I780548o1527o3725q3225r9781K4019k3571k3054r1020k8335p7463o2807
5962I190059P2338m9132j8365M9756O8564M1094J8744l1743p5721j5136j0801
5951I239657o4139o1202j16085m8878k6915o9458k6334o0185r7202r9954j30251
$$ plain form
5940 8439054 8311540 8254087 8220528 8093766 7985133 7903050 7847464 7817287 7788365 7722416 7677913
5929 7677913 7591276 7536049 7568626 7565854 7501355 7403996 7437521 7385124 7355020 7332363 7368797 7367655
5917 7367655 7314293 7325974 7291222 7197124 7122608 7095135 7086738 7075880 6992564 6940460 6977298 6968955
5905 6968955 6948483 6953293 6920131 6829279 6769799 6692853 6648474 6704808 6678274 6579474 6537400 6489016
5893 6489016 6376849 6330771 6312061 6259729 6267911 6242133 6161562 6093959 6096469 6125477 6095795 6140029
5881 6140029 6134288 6094379 6125580 6126305 6086413 6044272 6036619 6075473 6078809 5979105 5905220 5864421
5869 5864421 5837641 5757308 5753609 5752339 5720694 5651737 5552559 5522824 5574402 5600878 5534376 5576210
5857 5576210 5538176 5579672 5650455 5623384 5584665 5586120 5628017 5615908 5581883 5591614 5575904 5563673
$$ packed form
5940H439054j27514n7453l3559j26762j08633q2083n5586l0177k8922o5949m4503
5929G677913q6637n5227L2577k772o4499r7359L3525n2397l0104k2657L6434j142
5917G367655n3362J1681l4752r4098p4516k7473q397j0858q3316n2104L6838q343
5905F968955k0472M810l3162r0852n9480p6946m4379N6334k6534r8800m2074m8384
5893F489016j12167m6078j8710n2332Q182k5778q0571o7603K510K9008k9682M4234
5881F140029n741l9909L1201P25l9892m2141p653L8854L336r9704p3885m0799
5869E864421k6780q0333l699j270l1645o8957r9178k9735N1578K6476o6502M1834
5857E576210l8034M1496P0783k7071l8719J455M1897j2109l4025R731j5710j2231
$$ plain form
5845 5563673 5561154 5570658 5539088 5516003 5524595 5540331 5514315 5476241 5501770 5548115 5449335 5413925
5833 5413925 5402390 5425566 5387535 5321917 5298987 5373586 5391250 5338274 5297227 5304261 5298887 5298196
5821 5298196 5368211 5390166 5391158 5406378 5443537 5437355 5475881 5495051 5567680 5616211 5649996 5682766
5809 5682766 5668680 5700788 5827280 5816199 5893713 5977540 6021293 5993372 5996532 6087247 6075161
5798 6075161 6120629 6146731 6243221 6303784 6308279 6332033 6366393 6370562 6421383 6482262 6539713 6578749
5786 6578749 6589519 6600666 6570626 6588468 6646700 6576618 6565559 6582169 6541362 6555312 6560267 6497466
5774 6497466 6408756 6416238 6309273 6332310 6298384 6185958 6070271 6027130 6015665 5945278 5917297
5763 5917297 5818115 5741920 5694896 5672413 5609358 5552863 5541560 5595853 5623384 5614108 5574308 5649580
$$ packed form
5845E563673k519R504l1570k3085Q592J5736k6016l8074K5529M6345r8780l5410
5833E413925j1535K3176l8031o5618k2930P4599J7664n2976m1047P034n374o91
5821E298196P0015K1955R92J5220L7159o182L8526J9170P2629M8531L3785L2770
5809E682766j4086L2108J26492j1081P7514Q3827M3753k7921L160R0715j2086
5798F075161M5468K6102R6490O0563M495K3754L4360M169N0821O0879N7451L9036
5786F578749J0770J1147l0040J7842N8232p0082j1059J6610m0807J3950M955o2801
5774F497466q8710P482j06965K3037l3926j12426j15687m3141j1465p0387k7981
5763E917297r9182p6195m7024k2483o3055n6495j1303N4293K7531r276l9800P5272
$$ plain form
5751 5649580 5641323 5549049 5476487 5477622 5526770 5534625 5566909 5569848 5538810 5559440 5611663 5563923
5739 5563923 5495841 5479662 5483468 5396947 5444809 5416473 5339102 5281423 5310215 5206392 5161562
5728 5161562 5139963 5071220 5112568 5128269 5096226 5005719 4930566 4941913 4940079 4934733 4894492 4897858
5716 4897858 4782702 4716494 4794795 4687366 4623139 4609365 4605766 4606670 4679252 4689698 4643114 4605999
5704 4605999 4573902 4531280 4529096 4569431 4555105 4448987 4426589 4474449 4458748 4476421 4496420
5693 4496420 4489961 4549060 4557990 4517007 4483655 4461246 4515407 4501006 4528089 4538235 4539876 4550977
5681 4550977 4604912 4630865 4608800 4624857 4732103 4771512 4685570 4630621 4652517 4740446 4739417
5670 4739417 4751950 4784642 4778409 4784417 4817038 4849851 4934020 4894004 4864147 4901541 4957830 4974999
$$ packed form
5751E649580q257r2274p2562J135M9148P855L2284K939l1038K0630N2223m7740
5739E563923o8082j6179L806q6521M7862k8336p7371n7679K8792j03823m4830
5728E161562k1599o8743M1348J5701l2043r0507p5153J1347j834n346m0241L366
5716D897858j15156o6208P8301j07429o4227j3774l599R04P2582J0446m6584l7115
5704D605999l2097m2622k184M0335j4326j06118k2398M7860j5701J7673J9999
5693D496420o459N9099Q930m0983l3352k2409N4161j4401K7083J0146J641J1101
5681D550977N3935K5953k2065J6057J07246L9409q5942n4949K1896Q7929j029
5670D739417J2533L2692o233O008L2621L2813Q4169m0016k9857L7394N6289J7169
$$ plain form
5658 4974999 5028251 5098105 5122075 5201687 5197716 5096445 5176846 5150639 5135627 5159956 5111403
5647 5111403 5129264 5172663 5181321 5169462 5211623 5266594 5378067 5481740 5530437 5602672 5605503
5636 5605503 5620496 5636065 5652610 5637467 5667070 5639323 5602690 5543761 5541791 5598429 5562148 5568554
5624 5568554 5570119 5553805 5578640 5666986 5719738 5736195 5715334 5696149 5669593 5706082 5775063 5889620
5612 5889620 5964824 6011306 6079786 6076923 6104313 6151304 6285685 6315083 6360411 6500914 6565359
5601 6565359 6711879 6796016 6872333 6966462 7009066 7054803 7128733 7063108 6999532 6915961 6852404
5590 6852404 6859177 6815661 6899215 6880240 6884463 6889029 6998821 7019828 7118701 7181954 7148442 7246543
5578 7246543 7248919 7226638 7122918 7083008 6986494 6895756 6871057 6801925 6790114 6886687 6830865
$$ packed form
5658D974999N3252O9854K3970P9612l971j01271Q0401k6207j5012K4329m8553
5647E111403J7861M3399Q658j1859M2161N4971J11473J03673M8697P2235K831
5636E605503J4993J5569J6545j5143K9603k7747l6633n8929j970N6638l6281O406
5624E568554J565j6314K4835Q8346N2752J6457k0861j9185k6556L6489O8981J14557
5612E889620P5204M6482O8480k863K7390M6991J34381K9398M5328J40503O4445
5601F565359J46520Q4137P6317R4129M2604M5737P3930o5625o3576q3571o3557
5590F852404O773m3516Q3554j8975M223M566J09792K1007R8873O3253l3512R8101
5578G246543K376k2281j03720l9910r6514r0738k4699o9132j1811R6573n5822
$$ plain form
5567 6830865 6908768 6868792 6848907 6894479 6922377 6948317 6993198 7046437 7151433 7208014 7308734
5556 7308734 7283059 7302439 7339912 7421784 7509162 7508668 7548670 7627385 7715248 7866838 8039949
5545 8039949 8111362 8195937 8423317 8640720 8767439 8885957 8984125 8995254 8913533 8886744 8826635
5534 8826635 8783176 8747023 8767038 8774427 8897474 8941442 8958403 9078572 9234724 9325947 9420335
5523 9420335 9522271 9647832 9765465 9879050 9955173 10068980 10131909 10237176 10390370 10526304
5513 10526304 10586457 10694130 10794058 10833965 10927462 11064012 11167217 11330563 11482964 11716404
5503 11716404 11886132 12110490 12293693 12487630 12672148 12796514 13016617 13268701 13519840
5494 13519840 13764721 14067798 14338998 14677910 14959024 15284176 15617878 16059298 16532583
$$ packed form
5567F830865P7903l9976j9885M5572K7898K5940M4881N3239J04996N6581J00720
5556G308734k5675J9380L7473Q1872Q7378m94M0002P8715Q7863J51590J73111
5545H039949P1413Q4575K27380K17403J26719J18518R8168J1129q1721k6789o0109
5534H826635m3459l6153K0015P389J23047M3968J6961J20169J56152R1223R4388
5523I420335J01936J25561J17633J13585P6123J13807O2929J05267J53194J35934
5513A0526304O0153J07673R9928L9907R3497J36550J03205J63346J52401K33440
5503A1716404J69728K24358J83203J93937J84518J24366K20103K52084K51139
5494A3519840K44881L03077K71200L38912K81114L25152L33702M41420M73285
$$ plain form
5485 16532583 17008956 17552578 18144344 18806704 19517900 20299128 21179276 22165500 23276222
5476 23276222 24578238 26072588 27815597 29869843 32395110 35618475 39541540 43736220
5468 43736220 47575553 50456658 52063399 52039849 50653505 48701361 46854894 45641134
5460 45641134 45213197 45307943 45294275 45077336 44486193 43326463 41966220 40617118 39451928
5451 39451928 38676747 38311719 38331428 38798469 39670215 40968831 42765240 45266579 48576346
5442 48576346 52737577 57425977 61771945 65386502 68165412 69785076 70343174 70434554 70405111
5433 70405111 70612837 70810442 70954283 70904211 70922894 71410738 72278965 73225881 73625918 72868194
5423 72868194 70919060 67405225 62669113 57481113 52611550 48546283 45443635 43065359
$$ packed form
5485A6532583M76373N43622N91766O62360P11196P81228Q80148R86224J110722
5476B3276222J302016J494350J743009K054246K525267L223365L923065M194680
5468D3736220L839333K881105J606741k3550j386344j952144j846467j213760
5460D5641134m27937R4746j3668k16939n91143j159730j360243j349102j165190
5451C9451928p75181l65028J9709M67041Q71746J298616J796409K501339L309767
5442D8576346M161231M688400M345968L614557K778910J619664N58098R1380k9443
5433G0405111K07726J97605J43841n0072J8683M87844Q68227R46916M00037p57724
5423G2868194j949134l513835m736112n188000m869563m065267l102648k378276
$$ plain form
5415 43065359 41453366 40414178 39826006 39833410 40319088 41410181 43000149 44818806 46662456
5406 46662456 48144177 49183089 49806081 49975666 50134586 50783677 52343465 54596106 57153954
5397 57153954 59088539 59840348 59054962 56634615 52928989 48684175 44613964 41122670
5389 41122670 38266044 35854849 33879759 32227778 30855642 29689827 28588726 27671909
5381 27671909 26873969 26122241 25411756 24878333 24325173 23911674 23546409 23196367 22906055
5372 22906055 22634305 22390937 22181131 21990201 21874483 21771353 21773923 21805314 21866161 22078754
5362 22078754 22234841 22461759 22753973 23045341 23355312 23653372 23974359 24326362 24624911
5353 24624911 24903337 25099980 25287538 25556182 25725534 25830363 25963913 26071930 26043576 25972808
$$ packed form
5415D3065359j611993j039188n88172P404M85678J091093J589968J818657J843650
5406D6662456J481721J038912O22992J69585J58920O49091J559788K252641K557848
5397E7153954J934585P51809p85386k420347l705626m244814m070211l491294
5389D1122670k856626k411195j975090j651981j372136j165815j101101r16817
5381B7671909p97940p51728p10485n33423n53160m13499l65265l50042k90312
5372B2906055k71750k43368k09806j90930j15718j03130K570L1391O0847K12593
5362B2078754J56087K26918K92214K91368L09971K98060L20987L52003K98549
5353B4624911K78426J96643J87558K68644J69352J04829J33550J08017k8354p0768
$$ plain form
5343 25972808 25752006 25460734 25140904 24711790 24229888 23749801 23297935 22814810 22410235
5334 22410235 21978085 21633868 21347932 21021105 20803973 20570311 20356533 20222629 20059307
5325 20059307 20041048 20065604 20111577 20185495 20192421 20269190 20392399 20545528 20744804 20861030 20962953
5314 20962953 21063897 21075552 21056324 20939956 20763894 20538301 20311516 20073514 19841234 19582365
5304 19582365 19239467 19051536 18881413 18717407 18514769 18273555 18060340 17890176 17649860
5295 17649860 17403431 17130099 16973055 16757936 16467384 16252361 16055444 15936980 15829841
5286 15829841 15719274 15617210 15525725 15473467 15418856 15301457 15289093 15286140 15279853 15301753 15321648
5275 15321648 15301846 15371895 15501744 15567352 15685280 15820631 15924855 15982898 16068870 16131543
$$ packed form
5343B5972808k20802k91272l19830m29114m81902m80087m51866m83125m04575
5334B2410235m32150l44217k85936l26827k17132k33662k13778j33904j63322
5325B0059307j8259K4556M5973P3918O926P6769J23209J53129J99276J16226J01923
5314B0962953J00944J1655j9228j16368j76062k25593k26785k38002k32280k58869
5304A9582365l42898j87931j70123j64006k02638k41214k13215j70164k40316
5295A7649860k46429k73332j57044k15119k90552k15023j96917j18464j07139
5286A5829841j10567j02064r1485n2258n4611j17399j2364k953o287K1900J9895
5275A5321648j9802P0049J29849O5608J17928J35351J04224N8043Q5972O2673
$$ plain form
5265 16131543 16191760 16230415 16247414 16328817 16302600 16199322 16069626 15831831 15563862 15316272
5255 15316272 15096580 14913232 14753043 14624944 14581298 14545682 14555689 14582329 14745839 14867327
5245 14867327 15034007 15223585 15375531 15609547 15923544 16196643 16497218 16858879 17227124
5236 17227124 17586096 17969923 18405410 18802240 19122285 19368422 19670341 19938137 20199267
5227 20199267 20288183 20407633 20346975 20275521 20130292 20040414 19912691 19767844 19623692 19476251
5217 19476251 19429195 19351645 19289647 19310977 19407121 19440847 19592978 19683146 19793435 19895782 20051381
5206 20051381 20201808 20256666 20254367 20330374 20351453 20303931 20216088 20084467 19890872 19619049 19491256
5195 19491256 19306634 19075341 18879424 18717745 18666394 18689508 18686777 18741420 18719324 18753971 18665906
$$ packed form
5265A6131543O0217L8655J6999Q1403k6217j03278j29696k37795k67969k47590
5255A5316272k19692j83348j60189j28099m3646l5616J0007K6640J63510J21488
5245A4867327J66680J89578J51946K34016L13997K73099L00575L61661L68245
5236A7227124L58972L83827M35487L96830L20045K46137L01919K67796K61130
5227B0199267Q8916J19450o0658p1454j45229q9878j27723j44847j44152j47441
5217A9476251m7056p7550o1998K1330R6144L3726J52131R0168J10289J02347J55599
5206B0051381J50427N4858k299P6007K1079m7522q7843j31621j93595k71823j27793
5195A9491256j84622k31293j95917j61679n1351K3114k731N4643k2096L4647q8065
$$ plain form
5184 18665906 18407651 18180349 17817582 17414975 17002346 16639415 16327879 15971439 15678429
5175 15678429 15439781 15203560 15020883 14851333 14698338 14611343 14540609 14546942 14584908 14586692 14623067
5164 14623067 14692232 14769416 14893067 14987066 15095442 15234630 15251878 15189918 14977132 14674097
5154 14674097 14368734 13914685 13500561 13029751 12561944 12285508 11955382 11598581 11300361
5145 11300361 11069855 10904593 10727196 10608344 10462999 10308143 10183141 10098890 10071539 9965892
5135 9965892 9960242 9966989 9965513 9936208 9997057 9954028 9920697 9903349 9929306 9938470 10011190 10039683
5123 10039683 10061443 10090753 10142397 10242500 10397363 10517383 10611305 10788366 10903752 11062186
5113 11062186 11195845 11388011 11573238 11763210 11990486 12238459 12515445 12794380 13161932
$$ packed form
5184A8665906k58255k27302l62767m02607m12629l62931l11536l56440k93010
5175A5678429k38648k36221j82677j69550j52995q6995p0734O333L7966J784L6375
5164A4623067O9165P7184J23651R3999J08376J39188J7248o1960k12786l03035
5154A4674097l05363m54049m14124m70810m67807k76436l30126l56801k98220
5145A1300361k30506j65262j77397j18852j45345j54856j25002q4251k7351j05647
5135I965892n650O747j476k9305O0849m3029l3331j7348K5957R164P2720K8493
5123A0039683K1760K9310N1644J00103J54863J20020R3922J77061J15386J58434
5113A1062186J33659J92166J85227J89972K27276K47973K76986K78935L67552
$$ plain form
5104 13161932 13564883 13998509 14409943 14759938 15035508 15280831 15481698 15603286 15724279
5095 15724279 15856078 16158151 16464479 16850386 17334998 17942591 18516954 19222501 20046426
5086 20046426 21021960 22140535 23343349 24771734 26524589 28426948 30547882 33100452
5078 33100452 36261490 40214403 45006746 50436599 55737810 59998801 62316171 62350753
5070 62350753 59968169 55585823 50158761 44703231 39882799 35753976 32478794 29818910
5062 29818910 27669036 26063229 24748991 23671997 22737705 21985117 21334842 20847926 20462581
5053 20462581 20191540 20036830 19824776 19652560 19545654 19515176 19414195 19407086 19402802 19458941
5043 19458941 19503200 19601587 19727868 19839137 20070431 20395240 20652141 20972762 21411662 21930491
$$ packed form
5104A3161932M02951M33626M11434L49995K75570K45323K00867J21588J20993
5095A5724279J31799L02073L06328L85907M84612O07593N74363P05547Q23925
5086B0046426R75534J118575J202814J428385J752855J902359K120934K552570
5078C3100452L161038L952913M792343N429853N301211M260991K317370L4582
5070F2350753k382584m382346n427062n455530m820432m128823l275182k659884
5062B9818910k149874j605807j314238j076994r34292p52588o50275m86916l85345
5053B0462581k71041j54710k12054j72216j06906l0478j00981p109m284N6139
5043A9458941M4259R8387J26281J11269K31294L24809K56901L20621M38900N18829
$$ plain form
5033 21930491 22385944 22714881 22990427 23100255 23177915 23178814 23211710 23331036 23420403 23655483
5023 23655483 23917653 24255465 24678686 25288506 26112465 26901800 27784219 28585560 29456501
5014 29456501 30328420 31178498 32107605 33220340 34648043 36214625 37776139 39094548 39892443
5005 39892443 40001207 39384043 38038458 36244102 34500510 32914504 31571244 30560629
4997 30560629 29820927 29316705 28872901 28447605 28295458 28200071 28183312 28203628 28290191 28500250
4987 28500250 28812584 29142285 29659999 30130128 30610704 31106509 31629404 32152014 32736248
4978 32736248 33385097 34152777 35008816 35948858 37161776 38724254 40651147 43258365 46673417
4969 46673417 50896313 55521837 59885175 63222154 64966330 64955219 63298116 60831933
$$ packed form
5033B1930491M55453L28937K75546J09828P7660Q99L2896J19326Q9367K35080
5023B3655483K62170L37812M23221O09820Q23959P89335Q82419Q01341Q70941
5014B9456501Q71919Q50078R29107J112735J427703J566582J561514J318409P97895
5005C9892443J08764o17164j345585j794356j743592j586006j343260j010615
4997C0560629p39702n04222m43804m25296j52147r5387j6759K0316Q6563K10059
4987B8500250L12334L29701N17714M70129M80576M95805N22895N22610N84234
4978C2736248O48849P67680Q56039R40042J212918J562478J926893K607218L415052
4969D6673417M222896M625524M363338L336979J744176j1111j657103k466183
$$ plain form
4961 60831933 58363224 56551513 55592472 55305054 55326660 55294298 55048355 54373096 53315466
4952 53315466 52159241 51242919 50724515 50693298 51177323 52363614 54148431 56780727 60409348
4943 60409348 64812641 69395607 73283254 76102079 77570511 77712611 76987385 76345914 76218786
4934 76218786 76821452 77649039 78185354 77950396 76878436 75185951 73462572 72351888 72276770
4925 72276770 72824980 73358749 73174603 71819420 69222830 65559406 61424714 57462352 54067329
4916 54067329 51544546 49831202 48820547 48593594 48977859 49931093 51468371 53260239 55021225
4907 55021225 56663040 57968045 59062509 60190616 61595703 63581941 66274093 69229021
4899 69229021 71768654 73190638 73230808 71453716 68003969 63489483 58514253 53721365
$$ packed form
4961F0831933k468709j811711r59041k87418K1606l2362k45943o75259j057630
4952E3315466j156225r16322n18404l1217M84025J186291J784817K632296L628621
4943F0409348M403293M582966L887647K818825J468432J42100p25226o41471j27128
4934G6218786O02666Q27587N36315k34958j071960j692485j723379j110684p5118
4925G2276770N48210N33769j84146j355183k596590l663424m134692l962362l395023
4916E4067329k522783j713344j010655k26953L84265R53234J537278J791868J760986
4907E5021225J641815J305005J094464J128107J405087J986238K692152K954928
4899F9229021K539633J421984M0170j777092l449747m514486m975230m792888
$$ plain form
4891 53721365 49531802 46146430 43478304 41485305 39910983 38828150 38076506 37652036
4883 37652036 37403083 37356628 37126588 36806560 36304414 35576345 34677833 33647645 32919569
4874 32919569 32431276 32183389 32259371 32657532 33402254 34208290 34999750 35303321 35162841 34485425
4864 34485425 33221708 31683409 30139395 28723539 27550367 26529645 25649885 24961508
4856 24961508 24394820 23908835 23624620 23406959 23285885 23171155 23077700 23008679 22906082 22797344
4846 22797344 22706107 22671033 22674393 22626141 22611997 22791075 22979985 23321927 23713050 24247842
4836 24247842 24924228 25585631 26096493 26458940 26777715 26932574 27021960 27136003 27218382 27452904
4826 27452904 27794006 28218292 28758162 29404116 30032475 30747332 31537799 32385285 33435875
$$ packed form
4891E3721365m189563l385372k668126j992999j574322j082833p51644m24470
4883C7652036k48953m6455k30040l20028n02146p28069q98512j030188p28076
4874C2919569m88293k47887P5982L98161P44722Q06036P91460L03571j40480o77416
4864C4485425j263717j538299j544014j415856j173172j020722q79760o88377
4856B4961508n66688m85985k84215k17661j21074j14730r3455o9021j02597j08738
4846B2797344r1237l5074L360m8252j4144J79078J88910L41942L91123N34792
4836B4247842O76386O61403N10862L62447L18775J54859Q9386J14043Q2379K34522
4826B7452904L41102M24286N39870O45954O28359P14857P90467Q47486J050590
$$ plain form
4817 33435875 34605855 35963280 37354271 38654750 39849838 40911725 42011950 43147843
4809 43147843 44576429 46212615 48044691 50193188 52710395 55623972 59249750 63537861
4801 63537861 68474551 73917689 80223468 87432553 95789993 105484379 117240249 131943344
4793 131943344 151579212 178906359 215966637 258118436 295716732 318303165 327289840
4786 327289840 315177194 282508250 241378191 199636690 164767014 137639136 117363545
4779 117363545 101480027 89352890 79756765 72243771 66129282 61191737 56717529 52918781
4771 52918781 49424730 46346777 43538279 41169849 38993474 37024037 35100727 33334441
4763 33334441 31647386 30168636 28721556 27522303 26485812 25690229 24984194 24289036 23488502
$$ packed form
4817C3435875J169980J357425J390991J300479J195088J061887J100225J135893
4809D3147843J428586J636186J832076K148497K517207K913577L625778M288111
4801F3537861M936690N443138O305779P209085Q357440R694386J1755870J4703095
4793A31943344J9635868K7327147L7060278M2151799L7598296K2586433Q986675
4786C27289840j2112646l2668944m1130059m1741501l4869676k7127878k0275591
4779A17363545j5883518j2127137r596125p512994o114489m937545m474208l798748
4771E2918781l494051l077953k808498k368430k176375j969437j923310j766286
4763C3334441j687055j478750j447080j199253j036491p95583p06035o95158q00534
$$ plain form
4754 23488502 22762258 21939928 21229629 20514505 19883416 19329903 18835360 18344009 17936251
4745 17936251 17481116 17213195 17047525 16860765 16686643 16628443 16520038 16436377 16313261 16089274
4735 16089274 15933138 15819865 15659210 15449309 15170276 14961399 14742137 14540688 14458403 14275202
4725 14275202 14099189 13983927 13847690 13799031 13834556 13876775 13892150 13808782 13720557 13684026 13631772
4714 13631772 13593191 13551428 13451830 13451637 13551903 13647504 13816215 14017942 14190509 14367437 14563042
4703 14563042 14804154 14918372 15039302 15195690 15388789 15652816 16015501 16352875 16747210
4694 16747210 17297718 18045771 18920652 19795673 20422024 20785798 20734878 20236175 19367743 18484776
4684 18484776 17638393 16890943 16306063 15799312 15384406 15032175 14730334 14495550 14265762
$$ packed form
4754B3488502p26244q22330p10299p15124o31089n53513m94543m91351m07758
4745A7936251m55135k67921j65670j86760j74122n8200j08405q3661j23116k23987
4735A6089274j56136j13273j60655k09901k79033k08877k19262k01449q2285j83201
4725A4275202j76013j15262j36237m8659L5525M2219J5375q3368q8225l6531n2254
4714A3631772l8581m1763r9598j93J00266R5601J68711K01727J72567J76928J95605
4703A4563042K41112J14218J20930J56388J93099K64027L62685L37374L94335
4694A6747210N50508P48053Q74881Q75021O26351L63774n0920m98703q68432q82967
4684A8484776q46383p47450n84880n06751m14906l52231l01841k34784k29788
$$ plain form
4675 14265762 14218589 14169032 14056384 13937229 13770032 13661594 13653570 13536318 13462096 13364597
4665 13364597 13391027 13376020 13337255 13208229 13102633 12929333 12667327 12529007 12390767 12277964
4655 12277964 12192217 12076152 12030594 12050181 12008288 11920573 11848845 11839106 11796242 11752361 11759245
4644 11759245 11749238 11773828 11755436 11670025 11685286 11658030 11563049 11507712 11370064 11300086 11301890
4633 11301890 11220734 11092363 11089232 11034613 11099118 11159680 11149945 11136482 11150631 11208435 11281477
4622 11281477 11371419 11452713 11568981 11662016 11752759 11887149 12013841 12089694 12096297 12197422 12390585
4611 12390585 12563996 12736467 12970935 13218243 13435750 13883280 14413500 15066299 15834181
4602 15834181 16422832 16916561 17134459 17112930 16796662 16316472 15851240 15231520 14612946 13991658
$$ packed form
4675A4265762m7173m9557j12648j19155j67197j08438q024j17252p4222r7499
4665A3364597K6430j5007l8765j29026j05596j73300k62006j38320j38240j12803
4655A2277964q5747j16065m5558J9587m1893q7715p1728r739m2864m3881O884
4644A1759245j0007K4590j8392q5411J5261k7256r4981n5337j37648o9978J804
4633A1301890q1156j28371l131n4619O4505O0562r735j3463J4149N7804P3042
4622A1281477Q9942Q1294J16268R3035R0743J34390J26692P5853O603J01125J93163
4611A2390585J73411J72471K34468K47308K17507M47530N30220O52799P67882
4602A5834181N88651M93729K17898k1529l16268m80190m65232o19720o18574o21288
$$ plain form
4592 13991658 13503683 13180561 12938254 12728471 12628929 12587250 12588506 12541676 12498594 12504368 12556405
4581 12556405 12585519 12577599 12649932 12654894 12661517 12772065 12843536 12892728 12925866 12973217 12959836 13003263
4569 13003263 13041705 13126479 13165132 13168646 13269798 13403386 13558420 13716346 13882653 14088506
4559 14088506 14260007 14439192 14652732 15003067 15311257 15678012 16042851 16384584 16769683
4550 16769683 17171295 17538969 18021316 18453102 18932014 19438039 19956294 20507975 21059847
4541 21059847 21699068 22436100 23153906 23975408 24751819 25506347 26289822 27127514 27995020
4532 27995020 28875922 29964576 31177162 32524814 34095435 35938661 38096465 40615626
4524 40615626 43569171 46909345 50618356 54763128 59633193 65355167 72072739 80163582
$$ packed form
4592A3991658m87975l23122k42307k09783r9542m1679J256m6830m3082N774N2037
4581A2556405K9114p920P2333M962O623J10548P1471M9192L3138M7351j3381M3427
4569A3003263L8442Q4774L8653L514J01152J33588J55034J57926J66307K05853
4559A4088506J71501J79185K13540L50335L08190L66755L64839L41733L85099
4550A6769683M01612L67674M82347M31786M78912N06025N18255N51681N51872
4541B1059847O39221P37032P17806Q21502P76411P54528P83475Q37692Q67506
4532B7995020Q80902J088654J212586J347652J570621J843226K157804K519161
4524D0615626K953545L340174L709011M144772M870065N721974O717572Q090843
$$ plain form
4516 80163582 90279652 103180199 119150794 137202223 154422334 167098479 173167432
4509 173167432 171502828 161146926 144946205 126309207 108425395 93061635 80465147
4502 80465147 70235880 62139976 55686080 50458871 46171319 42526457 39434813 36746377
4494 36746377 34327484 32257446 30375766 28698783 27179511 25791579 24578414 23411696
4486 23411696 22429959 21406896 20568722 19825560 19104105 18501849 18033812 17650923 17232300
4477 17232300 16786938 16388004 15985371 15708097 15512328 15320395 15062134 14794573 14495413
4468 14495413 14133465 13757723 13382812 13029060 12754005 12506503 12277862 12097059 11941696
4459 11941696 11792122 11606665 11425677 11296264 11152282 10971957 10790929 10679266 10473949
$$ packed form
4516H0163582J0116070J2900547J5970595J8051429J7220111J2676145O068953
4509A73167432j664604j0355902j6200721j8636998j7883812j5363760j2596488
4502H0465147j0229267q095904o453896n227209m287552l644862l091644k688436
4494C6746377k418893k070038j881680j676983j519272j387932j213165j166718
4486B3411696r81737j023063q38174p43162p21455o02256m68037l82889m18623
4477A7232300m45362l98934m02633k77274j95769j91933k58261k67561k99160
4468A4495413l61948l75742l74911l53752k75055k47502k28641j80803j55363
4459A1941696j49574j85457j80988j29413j43982j80325j81028j11663k05317
$$ plain form
4450 10473949 10328250 10199846 10038145 9921129 9860047 9783228 9673715 9520276 9373945 9262672
4440 9262672 9126888 8981076 8959621 8771605 8661071 8564807 8443803 8413544 8385229 8275330
4430 8275330 8179760 8234912 8176678 8150520 8067411 8072527 8020464 7957571 7835660 7836817 7851655 7874617
4418 7874617 7765907 7729748 7718364 7666445 7619596 7612571 7575482 7519113 7470312 7442447 7451978 7434507
4406 7434507 7370255 7277747 7286907 7275020 7227794 7224089 7271839 7232979 7147099 7124653 7167211 7196202
4394 7196202 7089477 7027950 7065103 7140942 7139646 7109080 7106230 7161114 7162167 7078692 7051108 7061857
4382 7061857 7040699 7007671 6948740 6907630 6915273 6893772 6851527 6841121 6852528 6793940 6793274 6749715
4370 6749715 6743898 6719267 6661003 6652227 6671900 6612709 6611560 6682267 6657997 6571803 6610646 6616817
$$ packed form
4450A0473949j45699j28404j61701j17016o1082p6819j09513j53439j46331j11273
4440I262672j35784j45812k1455j88016j10534r6264j21004l0259k8315j09899
4430H275330r5570N5152n8234k6158q3109N116n2063o2893j21911J157J4838K2962
4418G874617j08710l6159j1384n1919m6849p025l7089n6369m8801k7865R531j7471
4406G434507o4252r2508R160j1887m7226l705M7750l8860q5880k2446M2558K8991
4394G196202j06725o1527L7153P5839j296l0566k850N4884J053q3475k7584J0749
4382G061857k1158l3028n8931m1110P643k1501m2245j0406J1407n8588o66m3559
4370F749715n817k4631n8264q776J9673n9191j149P0707k4270q6194L8843O171
$$ plain form
4358 6616817 6580866 6577487 6530141 6521882 6524276 6503934 6508803 6430908 6340079 6318923 6328258 6251971
4346 6251971 6230448 6248312 6276334 6210841 6144636 6143480 6162409 6182923 6146656 6184851 6277699 6215730
4334 6215730 6157357 6126469 6099221 6111441 6109038 6122458 6130115 6154662 6149072 6145174 6142013 6102117
4322 6102117 6073680 6000040 5951054 5964641 5985083 5943165 5972807 5995991 5941750 5969246 6007983
4311 6007983 5985484 5971018 5993305 6007397 6038737 6058827 6057192 6068337 6055425 6039979 6059094 6102935
4299 6102935 6137642 6183512 6159306 6113428 6159008 6127071 6154531 6206875 6198648 6167840 6230709 6267373
4287 6267373 6297987 6316130 6290606 6357153 6374105 6367246 6346009 6326027 6321495 6345538 6378904 6380132
4275 6380132 6382105 6380393 6373581 6332646 6319334 6332374 6351475 6388863 6424036 6428615 6436939 6453559
$$ packed form
4358F616817l5951l379m7346q259K394k0342M869p7895r0829k1156R335p6287
4346F251971k1523J7864K8022o5493o6205j156J8929K0514l6267L8195R2848o1969
4334F215730n8373l0888k7248J2220k403J3420P657K4547n590l898l161l9896
4322F102117k8437p3640m8986J3587K0442m1918K9642K3184n4241K7496L8737
4311F007983k2499j4466K2287J4092L1340K0090j635J1145j2912j5446J9115M3841
4299F102935L4707M5870k4206m5878M5580l1937K7460N2344q227l0808O2869L6664
4287F267373L0614J8143k5524O6547J6952o859k1237j9982m532K4043L3366J228
4275F380132J973j712o812m0935j3312J3040J9101L7388L5173M579Q324J6620
$$ plain form
4263 6453559 6491828 6482969 6467277 6539832 6580010 6572641 6618523 6632442 6689114 6642272 6625713 6651273
4251 6651273 6741456 6703092 6734818 6731207 6715845 6785845 6767387 6803822 6859622 6906135 6903363 6965742
4239 6965742 6954524 6954834 6993666 6995133 7041726 7039764 6989194 7052141 7089348 7124892 7165323 7116885
4227 7116885 7129297 7152199 7220043 7268712 7234900 7227525 7171378 7258115 7314647 7256202 7206493 7222096
4215 7222096 7230743 7240662 7271025 7355155 7454852 7452745 7521006 7586411 7727102 7758807 7812400 7850783
4203 7850783 7770895 7768614 7657526 7528401 7448272 7329812 7253783 7227364 7147337 7188421 7080676
4192 7080676 7076494 7112751 7076663 6997011 6973355 6925036 6918948 6939575 6939830 6974879 6921070 6891584
4180 6891584 6815282 6826721 6823341 6823394 6819206 6831141 6827555 6811390 6788678 6763896 6704295 6739649 6746097
$$ packed form
4263F453559L8269q859j5692P2555M0178p369M5882J3919N6672m6842j6559K5560
4251F651273R0183l8364L1726l611j5362P0000j8458L6435N5800M6513k772O2379
4239F965742j1218L10L8832J467M6593j962n0570O2947L7207L5544M0431m8438
4227G116885J2412K2902O7844M8669l3812p375n6147Q6737N6532n8445m9709J5603
4215G222096Q647R919L0363Q4130R9697k107O8261O5405J40691L1705N3593L8383
4203G850783p9888k281j11088j29125q0129j18460p6029k6419q0027M1084j07745
4192G080676m182L6257l6088p9652k3656m8319o088K0627K55L5049n3809k9486
4180F891584p6302J1439l380N3m188J1935l586j6165k2712k4782n9601L5354O448
$$ plain form
4167 6746097 6758802 6797704 6730295 6746676 6823629 6858192 6845487 6881252 6910596 6852956 6806047
4156 6806047 6819884 6832325 6853893 6861815 6882472 6824367 6855744 6855224 6869198 6976347 7036473 7066167
4144 7066167 7150522 7179339 7199955 7189647 7226132 7268447 7287035 7354825 7433533 7511156 7502693 7623628
4132 7623628 7678209 7744828 7789328 7849038 7914017 7926701 8002283 8054632 8135044 8162706 8258068
4121 8258068 8353826 8370970 8488449 8519481 8532591 8595511 8635970 8593161 8652327 8640027 8604368
4110 8604368 8640663 8692776 8706497 8726122 8750856 8776895 8804826 8810659 8884787 8934197 8943264 8942786
4098 8942786 8951143 9060157 9111914 9235210 9298530 9404787 9514575 9616276 9771606 9853562
4088 9853562 9959112 10020424 10139904 10278651 10351711 10509916 10675559 10788181 10882629 10972738
$$ packed form
4167F746097J2705L8902o7409J6381P6953L4563j2705L5765K9344n7640m6909
4156F806047J3837J2441K1568P922K0657n8105L1377n20J3974J07149O0126K9694
4144G066167Q4355K8817K0616j0308L6485M2315J8588O7790P8708P7623q463J20935
4132G623628N4581O6619M4500N9710O4979J2684P5582N2349Q0412K7662R5362
4121H258068R5758J7144J17479L1032J3110O2920M0459m2809N9166j2300l5659
4110H604368L6295N2113J3721J9625K4734K6039K7931N833P4128M9410R067m78
4098H942786Q357J09014N1757J23296O3320J06257J09788J01701J55330Q1956
4088I853562J05550O1312J19480J38747P3060J58205J65643J12622R4448R0109
$$ plain form
4078 10972738 11050061 11138518 11270388 11268059 11230975 11179471 11235345 11194170 11236096 11271326 11149949
4067 11149949 11063337 11015550 10991286 11001170 10953328 10908954 10875068 10870937 10804392 10719116 10695557 10757501
4055 10757501 10792529 10713753 10677360 10723667 10718677 10715334 10699875 10790235 10916748 11022258 11107553
4044 11107553 11127698 11203281 11286281 11331912 11366366 11440801 11545529 11641857 11717791 11786623 11939271
4033 11939271 12083214 12152539 12286992 12359743 12438742 12564532 12660754 12756392 12877007 13033720
4023 13033720 13102438 13217417 13397075 13555508 13748813 13937848 14123333 14277820 14466363 14707283
4013 14707283 14918700 15150083 15428801 15739511 15972633 16189730 16452316 16634658 16863759
4004 16863759 17078583 17383760 17655066 17856505 17991035 18144945 18439394 18617948 18696758 18880246
$$ packed form
4078A0972738P7323Q8457J31870k329l7084n1504N5874m1175M1926L5230j21377
4067A1149949q6612m7787k4264R884m7842m4374l3886m131o6545q5276k3559O1944
4055A0757501L5028p8776l6393M6307m990l343j5459R0360J26513J05510Q5295
4044A1107553K0145P5583Q3000M5631L4454P4435J04728R6328P5934O8832J52648
4033A1939271J43943O9325J34453P2751P8999J25790R6222R5638J20615J56713
4023A3033720O8718J14979J79658J58433J93305J89035J85485J54487J88543K40920
4013A4707283K11417K31383K78718L10710K33122K17097K62586J82342K29101
4004A6863759K14824L05177K71306K01439J34530J53910K94449J78554P8810J83488
$$ plain form
3994 18880246 18975603 19104342 19184340 19261079 19461477 19542049 19598248 19722176 19866216 19918408
3984 19918408 20034260 20167052 20351085 20580564 20707728 21031241 21408366 21803392 22233802
3975 22233802 22703303 23088336 23470285 23810315 24068213 24361915 24621696 24956006 25259218
3966 25259218 25616105 26023231 26520995 27080722 27601691 28115445 28743947 29285714 29649425
3957 29649425 29935836 30153960 30298802 30311142 30285002 30278979 30160508 30030129 30024996 30003532 30006622
3946 30006622 30109772 30182261 30305852 30384049 30431418 30447871 30419182 30294702 30158279 30118980
3936 30118980 30044288 30031007 30156703 30411607 30675566 31003217 31489559 32074724 32566574 33017031
3926 33017031 33352958 33627330 33960306 34119295 34375147 34558330 34814480 35319073 35897403
$$ packed form
3994A8880246R5357J28739P9998P6739K00398Q0572N6199J23928J44040N2192
3984A9918408J15852J32792J84033K29479J27164L23513L77125L95026M30410
3975B2233802M69501L85033L81949L40030K57898K93702K59781L34310L03212
3966B5259218L56887M07126M97764N59727N20969N13754O28502N41767L63711
3957B9649425K86411K18124J44842J2340k6140o023j18471j30379n133k1464L090
3946C0006622J03150P2489J23591P8197M7369J6453k8689j24480j36423l9299
3936C0118980p4692j3281J25696K54904K63959L27651M86342N85165M91850M50457
3926C3017031L35927K74372L32976J58989K55852J83183K56150N04593N78330
$$ plain form
3917 35897403 36671116 37537718 38392915 39195225 39812437 40143289 40133911 39898543 39489967 38766281
3907 38766281 37985385 37195196 36546976 35953286 35459321 35067283 34781070 34684007 34662886 34519539
3897 34519539 34259378 33785020 33277503 32706004 32003156 31219709 30477570 29842415 29440511
3888 29440511 29108292 28834895 28781070 28780803 28888738 29044648 29252626 29482711 29618891 29714636
3878 29714636 29728280 29744798 29760353 29777700 29881137 29970692 30277333 30647972 31100837 31507360
3868 31507360 31960347 32360642 32634055 32718655 32553685 32269075 31896377 31409941 30850826 30349582
3858 30349582 29897936 29531687 29260192 28967020 28757317 28565210 28334663 27993574 27610326
3849 27610326 27174747 26649787 26057419 25421028 24800453 24240357 23756353 23342716 22925745
$$ packed form
3917C5897403P73713Q66602Q55197Q02310O17212L30852r378k35368m08576p23686
3907C8766281p80896p90189o48220n93690m93965l92038k86213r7063k1121j43347
3897C4519539k60161m74358n07517n71499p02848p83447p42139o35155m01904
3888B9440511l32219k73397n3825k67J07935J55910K07978K30085J36180R5745
3878B9714636J3644J6518J5555J7347J03437Q9555L06641L70639M52865M06523
3868C1507360M52987M00295K73413Q4600j64970k84610l72698m86436n59115n01244
3858C0349582m51646l66249k71495k93172k09703j92107k30547l41089l83248
3849B7610326m35579n24960n92368o36391o20575n60096m84004m13637m16971
$$ plain form
3840 22925745 22528926 22207489 21961054 21680890 21431813 21223100 21023391 20915944 20761115
3831 20761115 20613943 20574152 20545619 20572318 20525680 20499203 20605048 20640459 20686251 20854921 21065338
3820 21065338 21226209 21374125 21618086 21872983 22118845 22288323 22450580 22563391 22475642 22492677
3810 22492677 22508338 22536864 22616836 22711138 22795296 22890616 23034235 23083313 23172414 23269933 23300236
3799 23300236 23327484 23353487 23404104 23386676 23428130 23331695 23290380 23272903 23189571 23022085 22873150
3788 22873150 22774984 22621456 22396989 22247650 22101154 21891449 21682492 21508394 21384458 21188959
3778 21188959 21025994 20942872 20843430 20745152 20684935 20572215 20498002 20424263 20428762 20425937 20410655
3767 20410655 20523117 20558778 20561141 20627621 20698592 20843885 20996095 21113962 21210208 21406822
$$ packed form
3840B2925745l96819l21437k46435k80164k49077k08713j99709j07447j54829
3831B0761115j47172l9791k8533K6699m6638k6477J05845L5411M5792J68670K10417
3820B1065338J60871J47916K43961K54897K45862J69478J62257J12811q7749J7035
3810B2492677J5661K8526P9972R4302Q4158R5320J43619M9078Q9101R7519L0303
3799B3300236K7248K6003N0617j7428M1454r6435m1315j7477q3332j67486j48935
3788B2873150r8166j53528k24467j49339j46496k09705k08957j74098j23936j95499
3778B1188959j62965q3122r9442r8278o0217j12720p4213p3739M499k825j5282
3767B0410655J12462L5661K363O6480P0971J45293J52210J17867R6246J96614
$$ plain form
3757 21406822 21608452 21756908 21860354 22071447 22308471 22522278 22682472 22833443 23086635
3748 23086635 23384089 23570378 23693532 23912320 24138743 24385637 24591436 24769261 24934217
3739 24934217 25188995 25321206 25536637 25703148 25892638 26080820 26206085 26424919 26651828
3730 26651828 26800966 26979547 27123321 27285138 27572205 27760116 27858772 28089323 28329531 28468996
3720 28468996 28645621 28824042 29152741 29431168 29694739 29867777 30123226 30414471 30613409
3711 30613409 30908169 31197529 31428597 31660827 31897630 32210373 32568784 32824444 33114240
3702 33114240 33438812 33765208 34099863 34438124 34803789 35137392 35403970 35753128 36128404
3693 36128404 36445640 36817077 37138783 37502906 37767474 38101820 38498265 38802240 39139090
$$ packed form
3757B1406822K01630J48456J03446K11093K37024K13807J60194J50971K53192
3748B3086635K97454J86289J23154K18788K26423K46894K05799J77825J64956
3739B4934217K54778J32211K15431J66511J89490J88182J25265K18834K26909
3730B6651828J49138J78581J43774J61817K87067J87911R8656K30551K40208J39465
3720B8468996J76625J78421L28699K78427K63571J73038K55449K91245J98938
3711C0613409K94760K89360K31068K32230K36803L12743L58411K55660K89796
3702C3114240L24572L26396L34655L38261L65665L33603K66578L49158L75276
3693C6128404L17236L71437L21706L64123K64568L34346L96445L03975L36850
$$ plain form
3684 39139090 39504266 39811926 40122956 40460547 40767735 41096519 41470989 41857240 42223501
3675 42223501 42661442 43036386 43413595 43808265 44122935 44533260 45011223 45448792 46013824
3666 46013824 46634456 47183499 47724879 48304394 48983578 49638221 50372846 51145960 52055610
3657 52055610 52925624 53688191 54503289 55419089 56310026 57165173 58121410 59126655 60148806
3648 60148806 61191201 62331854 63479164 64733619 66086718 67460648 68859339 70354994
3640 70354994 71881349 73453821 75008723 76491111 78011738 79557867 81133761 82709999
3632 82709999 84273291 85960961 87703275 89457578 91415358 93508769 95624933 97797522
3624 97797522 100017787 102195901 104208191 106118274 107983661 109593838 110861734 111992052
$$ packed form
3684C9139090L65176L07660L11030L37591L07188L28784L74470L86251L66261
3675D2223501M37941L74944L77209L94670L14670M10325M77963M37569N65032
3666D6013824O20632N49043N41380N79515O79184O54643P34625P73114R09650
3657E2055610Q70014P62567Q15098R15800Q90937Q55147R56237J005245J022151
3648F0148806J042395J140653J147310J254455J353099J373930J398691J495655
3640G0354994J526355J572472J554902J482388J520627J546129J575894J576238
3632H2709999J563292J687670J742314J754303J957780K093411K116164K172589
3624I7797522K220265K178114K012290J910083J865387J610177J267896J130318
$$ plain form
3616 111992052 112995034 113804740 114395317 114933806 115457969 115803949 116021507 116131272 116159154
3607 116159154 116116536 116082877 115983376 115876420 115735668 115513616 115311119 114934130 114476495 113788652
3597 113788652 112984178 112140204 111212020 110419260 109740147 109250947 109044612 109126704 109501032
3588 109501032 110231835 111468814 112982134 114724361 116781540 119041588 121348093 123705082
3580 123705082 125990192 128250490 130481101 132468735 134292213 135977691 137494788 138800809
3572 138800809 139904794 140795074 141309863 141371398 141052496 140402249 139415025 138275523 136956526
3563 136956526 135553435 134108803 132631014 131141710 129535497 127925960 126308923 124701160
3555 124701160 122930874 121146191 119182231 117017295 114799019 112530090 110256230 107946623
$$ packed form
3616A11992052J002982Q09706N90577N38489N24163L45980K17558J09765K7882
3607A16159154m2618l3659r9501j06956j40752k22052k02497l76989m57635o87843
3597A13788652q04474q43974r28184p92760o79113m89200k06335Q2092L74328
3588A09501032P30803J236979J513320J742227K057179K260048K306505K356989
3580A23705082K285110K260298K230611J987634J823478J685478J517097J306021
3572A38800809J103985Q90280N14789O1535l18902o50247r87224j139502j318997
3563A36956526j403091j444632j477789j489304j606213j609537j617037j607763
3555A24701160j770286j784683j963960k164936k218276k268929k273860k309607
$$ plain form
3547 107946623 105683366 103513897 101447681 99529647 97569608 95636026 93675837 91802115
3539 91802115 90035461 88200209 86430139 84774438 83229192 81601241 80032578 78639610
3531 78639610 77236837 75877228 74544437 73131214 71844862 70662146 69617675 68610193
3523 68610193 67750781 67030886 66357913 65832376 65439998 65067003 64746789 64437847 64196216
3514 64196216 64069391 63854362 63657313 63479616 63284582 63120155 62962064 62789411 62700787 62646270
3504 62646270 62673358 62583928 62434553 62243964 62029612 61784617 61469044 61027371 60593602 60214507
3494 60214507 59793966 59349021 58847824 58416611 57982945 57471860 56997406 56548132 56055866
3485 56055866 55573175 55129457 54708164 54224517 53828955 53408554 52972808 52568175 52195234
$$ packed form
3547A07946623k263257k169469k066216j918034j960039j933582j960189j873722
3539I1802115j766654j835252j770070j655701j545246j627951j568663j392968
3531G8639610j402773j359609j332791j413223j286352j182716j044471j007482
3523F8610193q59412p19895o72973n25537l92378l72995l20214l08942k41631
3514F4196216j26825k15029j97049j77697j95034j64427j58091j72653q8624n4517
3504F2646270K7088q9430j49375j90589k14352k44995l15573m41673m33769l79095
3494F0214507m20541m44945n01197m31213m33666n11085m74454m49274m92266
3485E6055866m82691m43718m21293m83647l95562m20401m35746m04633l72941
$$ plain form
3476 52195234 51932414 51575362 51151360 50784197 50389977 49989134 49570612 49126123 48689432
3467 48689432 48270482 47831947 47358140 46972863 46505406 46042766 45617978 45157019 44701774
3458 44701774 44202952 43727994 43318569 42885205 42432139 42029737 41604194 41184645 40803520
3449 40803520 40393030 40086187 39784877 39308839 38917759 38602975 38243362 37853406 37415234
3440 37415234 36947660 36501879 35996773 35509200 34954070 34379201 33840002 33392389 32908328
3431 32908328 32444186 32053257 31713328 31304217 30967232 30739343 30453424 30129229 29821396
3422 29821396 29488616 29202829 28965438 28622589 28222583 27802561 27401728 26978319 26701624
3413 26701624 26330444 26046115 25830464 25541498 25301898 25083658 24841633 24643569 24454051
$$ packed form
3476E2195234k62820l57052m24002l67163l94220m00843m18522m44489m36691
3467D8689432m18950m38535m73807l85277m67457m62640m24788m60959m55245
3458D4701774m98822m74958m09425m33364m53066m02402m25543m19549l81125
3449D0803520m10490l06843l01310m76038l91080l14784l59613l89956m38172
3440C7415234m67574m45781n05106m87573n55130n74869n39199m47613m84061
3431C2908328m64142l90929l39929m09111l36985k27889k85919l24195l07833
3422B9821396l32780k85787k37391l42849m00006m20022m00833m23409k76695
3413B6701624l71180k84329k15651k88966k39600k18240k42025j98064j89518
$$ plain form
3404 24454051 24226172 24059711 23886450 23701961 23607131 23436786 23281423 23239588 23049771 22938453
3394 22938453 22871680 22740053 22648760 22588889 22593970 22562566 22541314 22553281 22499826 22358762 22339330
3383 22339330 22344838 22354364 22364412 22373288 22398896 22374906 22375760 22439489 22511753 22600088 22660156 22666513
3371 22666513 22716240 22813268 22892464 22926122 22870152 22932975 23002550 23080081 23165563 23197753 23214822
3360 23214822 23220988 23279851 23279786 23308461 23269779 23185919 23174377 23227862 23280124 23286577 23324092 23342399
3348 23342399 23336763 23353085 23405644 23404069 23362439 23436510 23599457 23622130 23630348 23797645 23895917
3337 23895917 24057112 24157531 24343287 24488165 24664421 24868011 24988712 25147441 25280986
3328 25280986 25346419 25566507 25815850 25951738 26142232 26301125 26556378 26810540 27087302 27358988
$$ packed form
3404B4454051k27879j66461j73261j84489r4830j70345j55363m1835j89817j11318
3394B2938453o6773j31627r1293n9871N081l1404k1252J1967n3455j41064j9432
3383B2339330N508R526J0048Q876K5608k3990Q54O3729P2264Q8335O0068O357
3371B2666513M9727R7028P9196L3658n5970O2823O9575P7531Q5482L2190J7069
3360B3214822O166N8863o5K8675l8682q3860j1542N3485N2262O453L7515J8307
3348B3342399n636J6322N2559j575m1630P4071J62947K2673Q218J67297R8272
3337B3895917J61195J00419J85756J44878J76256K03590J20701J58729J33545
3328B5280986O5433K20088K49343J35888J90494J58893K55253K54162K76762K71686
$$ plain form
3318 27358988 27588757 27882469 28121636 28383456 28576328 28771338 29025205 29213453 29440102
3309 29440102 29822616 30178559 30593700 31052875 31520867 32037738 32539939 33181955 33836436
3300 33836436 34618417 35593167 36830670 38295613 39767488 40899406 41566191 41735574 41280509
3291 41280509 40371692 39200267 38007467 36981951 36165788 35464789 34930086 34519831 34219351
3282 34219351 34077735 34011175 33926901 34008668 34049440 34180060 34501439 34841564 35289861 35822093
3272 35822093 36323602 37006661 37857090 38829762 40009591 41459682 43332250 45677292 48501774
3263 48501774 51389550 53823030 55397462 55891736 55185081 53404542 51092203 48844708
3255 48844708 46927493 45462155 44359271 43473928 42949855 42520136 42227565 42054104 41831212
$$ packed form
3318B7358988K29769K93712K39167K61820J92872J95010K53867J88248K26649
3309B9440102L82514L55943M15141M59175M67992N16871N02201O42016O54481
3300C3836436P81981R74750J237503J464943J471875J131918O66785J69383m55065
3291D1280509r08817j171425j192800j025516q16163p00999n34703m10255l00480
3282C4219351j41616o6560q4274Q1767M0772J30620L21379L40125M48297N32232
3272C5822093N01509O83059Q50429R72672J179829J450091J872568K345042K824482
3263D8501774K887776K433480J574432M94274p06655j780539k312339k247495
3255D8844708j917215j465338j102884q85343n24073m29719k92571j73461k22892
$$ plain form
3246 41831212 41848147 41775100 41789834 41773596 41804791 41943022 42175373 42377321 42626862 42945056
3236 42945056 43398625 43919131 44585728 45419872 46572421 47899644 49265237 50504463 51369943
3227 51369943 51769102 51650047 51045457 50226724 49330833 48582327 47975551 47537033 47297793
3218 47297793 47147981 47102467 47070864 47099091 47149194 47250812 47300392 47382465 47476826 47666108 47875966
3207 47875966 48090879 48304652 48461044 48639104 48873494 49167023 49501367 49956871 50407028
3198 50407028 50831976 51299140 51792489 52322284 52771423 53266466 53711289 54218059 54744309
3189 54744309 55317107 55891071 56435631 56989562 57498198 58075898 58697117 59263320 59806689
3180 59806689 60423984 61111396 61791005 62469717 63197216 64000845 64764681 65583789 66283315
$$ packed form
3246D1831212J6935p3047J4734j6238L1195J38231K32351K01948K49541L18194
3236D2945056M53569N20506O66597Q34144J152549J327223J365593J239226Q65480
3227E1369943L99159j19055o04590q18733q95891p48506o06776m38518k39240
3218D7297793j49812m5514l1603K8227N0103J01618M9580Q2073R4361J89282K09858
3207D7875966K14913K13773J56392J78060K34390K93529L34344M55504M50157
3198E0407028M24948M67164M93349N29795M49139M95043M44823N06770N26250
3189E4744309N72798N73964N44560N53931N08636N77700O21219N66203N43369
3180E9806689O17295O87412O79609O78712P27499Q03629P63836Q19108O99526
$$ plain form
3171 66283315 67003391 67773376 68602343 69319610 70088706 70941673 71682220 72331150 73031821
3162 73031821 73680938 74230615 74559886 74871202 75139908 75200089 75322295 75416347 75503046 75531620
3152 75531620 75528029 75538068 75524774 75541708 75568209 75732929 75879611 76037972 76243866 76638787
3142 76638787 77212952 77802105 78432192 79132352 79914070 80741293 81620886 82398750 83437903
3133 83437903 84577153 85743746 86996758 88440446 90027204 91616566 93186876 94654170
3125 94654170 96094252 97460994 98721290 100000961 101239696 102432746 103595857 104726438
3117 104726438 105849354 106935265 107952193 108910216 109777653 110394044 110841380 111058226 111037768
3108 111037768 110857352 110453541 109879684 109165439 108310058 107376957 106288671 105054927 103857742
$$ packed form
3171F6283315P20076P69985Q28967P17267P69096Q52967P40547O48930P00671
3162G3031821O49117N49677L29271L11316K68706O0181J22206R4052Q6699K8574
3152G5531620l591J0039j3294J6934K6501J64720J46682J58361K05894L94921
3142G6638787N74165N89153O30087P00160P81718Q27223Q79593P77864J039153
3133H3437903J139250J166593J253012J443688J586758J589362J570310J467294
3125I4654170J440082J366742J260296J279671J238735J193050J163111J130581
3117A04726438J122916J085911J016928R58023Q67437O16391M47336K16846k0458
3108A11037768j80416m03811n73857p14245q55381r33101j088286j233744j197185
$$ plain form
3099 103857742 102628440 101468141 100300711 99158773 98059638 96879616 95757528 94520444
3091 94520444 93341572 92242706 91185522 90281150 89445828 88826325 88391233 88028146 87770159
3082 87770159 87722869 87775678 87824597 87962964 88105304 88241377 88369431 88499091 88539755 88524024
3072 88524024 88548915 88444486 88154433 87700185 87169565 86417639 85484925 84385724 83068016
3063 83068016 81606364 80011629 78220621 76380508 74498431 72601042 70675782 68801562
3055 68801562 67044202 65318933 63634345 62091990 60517718 59147405 57883849 56649043
3047 56649043 55544481 54609187 53766697 52916719 52167689 51487060 50894408 50338311 49894527
3038 49894527 49457553 49023072 48721169 48386854 48068280 47857608 47532736 47237035 47065739
$$ packed form
3099A03857742j229302j160299j167430j141938j099135j180022j122088j237084
3091I4520444j178872j098866j057184r04372q35322o19503m35092l63087k57987
3082H7770159m7290N2809M8919J38367J42340J36073J28054J29660M0664j5731
3072H8524024K4891j04429k90053m54248n30620p51926r32714j099201j317708
3063H3068016j461652j594735j791008j840113j882077j897389j925260j874220
3055F8801562j757360j725269j684588j542355j574272j370313j263556j234806
3047E6649043j104562r35294q42490q49978p49030o80629n92652n56097m43784
3038D9894527m36974m34481l01903l34315l18574k10672l24872k95701j71296
$$ plain form
3029 47065739 46876472 46779299 46619808 46551749 46521341 46533649 46581241 46583504 46517102 46396142 46205498
3018 46205498 45908464 45633706 45395024 45107278 44789810 44569475 44520191 44388032 44219961 44080492
3008 44080492 43989265 43947926 43883051 43790592 43743244 43871272 44002424 44124342 44273321 44539148
2998 44539148 44894720 45267243 45623606 46009445 46508774 47040197 47571798 48020387 48317623
2989 48317623 48636783 48846835 48915385 48844234 48596854 48237235 47890146 47391556 46841523 46218862
2979 46218862 45699015 45248014 44765788 44239083 43896816 43606391 43326974 43157894 43091130 43030672
2969 43030672 43067593 43031416 43091108 43203595 43336117 43509520 43693656 43975615 44238105 44507301
2959 44507301 44864529 45240259 45640184 46175288 46743051 47431158 48152782 48915388 49805022
$$ packed form
3029D7065739j89267r7173j59491o8059l0408J2308M7592K263o6402j20960j90644
3018D6205498k97034k74758k38682k87746l17468k20335m9284j32159j68071j39469
3008D4080492r1227m1339o4875r2459m7348J28028J31152J21918J48979K65827
2998D4539148L55572L72523L56363L85839M99329N31423N31601M48589K97236
2989D8317623L19160K10052O8550p1151k47380l59619l47089m98590n50033o22661
2979D6218862n19847m51001m82226n26705l42267k90425k79417j69080o6764o0458
2969D3030672L6921l6177N9692J12487J32522J73403J84136K81959K62490K69196
2959D4507301L57228L75730L99925N35104N67763O88107P21624P62606Q89634
$$ plain form
2950 49805022 50784552 51829599 52839424 53844378 54792425 55712926 56390576 56937823 57404822
2941 57404822 57657694 57763890 57744166 57574028 57155616 56581387 55941084 55119378 54162798 53107653
2931 53107653 52009225 50901924 49838628 48747986 47716504 46744484 45724903 44817590
2923 44817590 44055732 43447852 42838758 42232544 41785835 41431809 41093237 40869448 40630243
2914 40630243 40542560 40490955 40427758 40369531 40434420 40550182 40653416 40852606 41115151 41442147
2904 41442147 41837081 42183567 42629909 42922071 43174256 43341581 43496745 43591708 43590504 43543577
2894 43543577 43433658 43337218 43085757 42817218 42535931 42085444 41520625 40957609 40301522 39595442
2884 39595442 38955489 38262317 37576520 36888523 36160077 35403576 34650398 33739032 32822034
$$ packed form
2950D9805022R79530J045047J009825J004954R48047R20501O77650N47247M66999
2941E7404822K52872J06196j9724j70138m18412n74229o40303q21706r56580j055145
2931E3107653j098428j107301j063296j090642j031482r72020j019581r07313
2923D4817590p61858o07880o09094o06214m46709l54026l38572k23789k39205
2914D0630243q7683n1605o3197n8227O4889J15762J03234J99190K62545L26996
2904D1442147L94934L46486M46342K92162K52185J67325J55164R4963j204m6927
2894D3543577j09919r6440k51461k68539k81287m50487n64819n63016o56087p06080
2884C9595442o39953o93172o85797o87997p28446p56501p53178r11366r16998
$$ plain form
2875 32822034 31941065 31021442 30100545 29210538 28339890 27456737 26685090 25885608 25108691
2866 25108691 24375162 23626004 22925816 22363928 21812684 21342816 20948894 20625647 20337949
2857 20337949 20105364 19965899 19764893 19720377 19682965 19617513 19540255 19516732 19504804 19473743 19414788
2846 19414788 19295134 19063238 18753295 18415481 18077809 17863332 17515167 17214958 16951506
2837 16951506 16681268 16497242 16260312 15946515 15558853 15308022 14850955 14386146 13951254
2828 13951254 13484919 13050080 12672832 12336717 11988998 11675035 11344364 11079244 10723967
2819 10723967 10455320 10093538 9755725 9509846 9217037 8970771 8816359 8624361 8433103
2810 8433103 8371140 8293459 8181721 8172764 8021842 7764706 7541931 7355661 7120963 6921768
$$ packed form
2875C2822034q80969r19623r20897q90007q70648q83153p71647p99482p76917
2866B5108691p33529p49158p00188n61888n51244m69868l93922l23247k87698
2857B0337949k32585j39465k01006m4516l7412o5452p7258k3523j1928l1061n8955
2846A9414788j19654k31896l09943l37814l37672k14477l48165l00209k63452
2837A6951506k70238j84026k36930l13797l87662k50831m57067m64809m34892
2828A3951254m66335m34839l77248l36115l47719l13963l30671k65120l55277
2819A0723967k68647l61782l37813k45879k92809k46266j54412j91998j91258
2810H433103o1963p7681j11738q957j50922k57136k22775j86270k34698j99195
$$ plain form
2800 6921768 6802391 6620028 6510774 6413042 6327048 6312909 6217253 6076503 6004292 5915403 5743658
2789 5743658 5646820 5437318 5277698 5179254 5098155 4989731 4819899 4784309 4749070 4691705 4650163
2778 4650163 4559788 4530896 4430647 4328249 4216060 4104982 4093549 4014204 3875679 3851243
2768 3851243 3778744 3643867 3534487 3524987 3482446 3421310 3313200 3245806 3158305 3154032 3170061
2757 3170061 3107489 3066436 2943342 2933113 2896606 2801545 2704351 2721895 2715595 2696456 2646883
2746 2646883 2632085 2689471 2667230 2600033 2535704 2472431 2441734 2395971 2358771 2344948 2311857
2735 2311857 2302756 2277914 2224376 2186757 2163250 2157326 2132907 2118072 2090505 2051503 2043796 2046933
2723 2046933 1974742 1989756 1958042 1876496 1905217 1882244 1878782 1847615 1833267 1780177 1690289 1690134
$$ packed form
2800F921768j19377j82363j09254r7732q5994j4139r5656j40750p2211q8889j71745
2789E743658r6838k09502j59620r8444q1099j08424j69832l5590l5239n7365m1542
2778D650163r0375k8892j00249j02398j12189j11078j1433p9345j38525k4436
2768C851243p2499j34877j09380r500m2541o1136j08110o7394q7501m273J6029
2757C170061o2572m1053j23094j0229l6507r5061r7194J7544o300j9139m9573
2746B646883j4798N7386k2241o7197o4329o3273l0697m5763l7200j3823l3091
2735B311857r101k4842n3538l7619k3507n924k4419j4835k7567l9002p707L137
2723B046933p2191J5014l1714q1546K8721k2973l462l1167j4348n3090q9888j55
$$ plain form
2711 1690134 1754556 1750593 1696672 1669375 1632001 1640268 1694750 1671074 1630737 1686575 1596268 1585518
2699 1585518 1564075 1563930 1535990 1491311 1503694 1513728 1532731 1454120 1477846 1439154 1406489 1372990
2687 1372990 1380107 1386178 1379131 1417313 1346355 1361697 1399961 1373058 1270555 1242744 1262838 1362926
2675 1362926 1339495 1348370 1325205 1380525 1399132 1332249 1265599 1299503 1372256 1319378 1347361 1279769
2663 1279769 1231971 1229492 1246546 1241402 1305619 1335791 1227594 1210784 1207845 1201615 1240559 1242528
2651 1242528 1195525 1172785 1180196 1154908 1065345 1075834 1171593 1124648 1100458 1083019 1049012 1045177
2639 1045177 1010935 1008735 1058918 1008096 1048313 1102706 1054070 987858 1000893 998475 1024983 990264
2627 990264 987205 882111 893584 909431 842518 920288 952592 933730 946167 973364 962789 981726
$$ packed form
2711A690134O4422l963n3921k7297l7374Q267N4482k3676m0337N5838r0307j0750
2699A585518k1443j45k7940m4679J2383J0034J9003p8611K3726l8692l2665l3499
2687A372990P117O071p047L8182p0958J5342L8264k6903j02503k7811K0094J00088
2675A362926k3431Q875k3165N5320J8607o6883o6650L3904P2753n2878K7983o7592
2663A279769m7798k479J7054n144O4217L0172j08197j6810k939o230L8944J969
2651A242528m7003k2740P411k5288q9563J0489R5759m6945k4190j7439l4007l835
2639A045177l4242k200N0183n0822M0217N4393m8636o6212J3035k418K6508l4719
2627I90264l059j05094J1473J5847o6913P7770L2304j8862J2437K7197j0575J8937
$$ plain form
2615 981726 1011637 961114 899475 864642 930458 935967 923462 910759 933564 904257 846820 882836
2603 882836 843518 852544 885433 903319 835272 807157 823542 882341 858187 828727 812855 781825
2591 781825 719731 717689 714506 739804 760090 792933 753762 727474 742695 652930 693839 769530
2579 769530 794428 751583 743407 767334 708846 639427 662793 727063 687253 677384 675312 715851
2567 715851 747332 789069 771585 755188 790275 795206 779214 749958 723631 735044 744155 692179
2555 692179 711235 712940 740007 742883 771165 809283 821738 793868 700829 736512 724578 722413
2543 722413 762240 695507 702681 760880 789501 810129 817667 787051 782136 721145 727797 789937
2531 789937 762433 778185 782664 740256 752953 744885 762883 769899 733135 761016 745880 745875 761799
$$ packed form
2615I81726K9911n0523o1639l4833O5816N509j2505j2703K2805k9307n7437L6016
2603H82836l9318R026L2889J7886o8047k8115J6385N8799k4154k9460j5872l1030
2591G81825o2094k042l183K5298K0286L2843l9171k6288J5221q9765M0909P5691
2579G69530K4898m2845q176K3927n8488o9419K3366O4270l9810r869k072M0539
2567G15851L1481M1737j7484j6397L5087M931j5992k9256k6327J1413R111n1976
2555F92179J9056J705K7067K876K8282L8118J2455k7870r3039L5683j1934k165
2543G22413L9827o6733P174N8199K8621K0628P538l0616m915o0991O652O2140
2531G89937k7504J5752M479m2408J2697q068J7998P016l6764K7881j5136nJ5924
$$ plain form
2518 761799 718048 661476 715423 726766 734409 673613 687176 747108 696683 714658 819930 835541
2506 835541 786539 837504 891048 865874 804309 757138 739782 772593 768390 768660 740688 713220
2494 713220 708399 717459 663117 677730 692008 714321 675812 665616 634550 732510 748441 705001
2482 705001 681611 600412 599293 645777 654693 626861 663953 688398 764025 642718 664548 694124
2470 694124 655574 633949 628034 611436 599884 596923 545500 550607 534686 487809 499143 504528
2458 504528 476815 471216 439104 445495 458944 516699 475869 510535 466970 438602 428404 424552
2446 424552 512990 515390 417595 391443 431192 467700 439373 462430 387903 402087 399459 373081
2434 373081 447460 427427 381370 364151 381510 372910 373140 322154 281187 346731 376120 319207
$$ packed form
2518G61799m3751n6572N3947J1343P643o0796J3563N9932n0425J7975J05272J5611
2506H35541m9002N0965N3544k5174o1565m7171j7356L2811m203K70k7972k7468
2494G13220m821R060n4342J4613J4278K2313l8509j0196l1066R7960J5931m3440
2482G05001k3390q1199j119M6484Q916k7832L7092K4445P5627j21307K1830K9576
2470F94124l8550k1625n915j6598j1552k961n1423N107j5921m6877J1334N385
2458E04528k7713n599l2112O391J3449N7755m0830L4666m3565k8368j0198l852
2446D24552Q8438K400r7795k6152L9749L6508k8327K3057p4527J4184k628k6378
2434C73081P4379k0033m6057j7219J7359q600K30n0986m0967O5544K9389n6913
$$ plain form
2422 319207 342248 300074 305421 237361 301752 245373 294185 288978 311372 298165 213140 321367
2410 321367 330294 306303 303302 332509 260022 279176 287825 288947 296457 261575 247965 242324 300151
2397 300151 234961 210736 200337 321493 350819 294301 253253 248175 285819 209652 223839 213749
2385 213749 206117 242955 219458 255251 247418 213316 205057 224609 230079 185876 195362 227297 231129
2372 231129 221843 266636 219527 208827 156740 189603 212033 200511 186836 215226 228751 241329
2360 241329 284311 192928 199326 217641 233768 240067 214893 197629 175741 181918 184531 169900
2348 169900 193535 186686 189803 223181 239367 233337 283215 271456 292988 230690 216166 230597
2336 230597 172654 131849 65030 98540 151088 188574 191615 200673 153553 145518 143384 151588 217020
$$ packed form
2422C19207K3041m2174N347o8060O4391n6379M8812n207K2394j3207q5025J08227
2410C21367Q927k3991l001K9207p2487J9154Q649J122P510l4882j3610n641N7827
2397C00151o5190k4225j0399J21156K9326n6518m1048n078L7644p6167J4187j0090
2385B13749p632L6838k3497L5793p833l4102q259J9552N470m4203R486L1935L832
2372B31129r286M4793m7109j0700n2087L2863K2430j1522j3675K8390J3525J2578
2360B41329M2982r1383O398J8315J6127O299k5174j7264k1888O177K613j4631
2348A69900K3635o849L117L3378J6186o030M9878j1759K1532o2298j4524J4431
2336B30597n7943m0805o6819L3510N2548L7486L041R058m7120q035k134Q204O5432
$$ plain form
2323 217020 168233 110097 100848 120229 146722 117859 138741 136448 123151 142608 164213 96384
2311 96384 186462 173977 168118 228419 244842 114289 144585 199017 207885 204705 155672 177095
2299 177095 156501 180689 180813 192997 195889 228108 272352 307432 336538 364982 300996 276381
2287 276381 257388 264862 251372 251953 229421 189288 208403 274985 194692 178993 244962 152339
2275 152339 134691 152490 186030 181143 148887 146768 122233 159206 174302 165611 156283 174173
2263 174173 124872 137027 140243 134682 129665 74541 151857 173124 196845 171496 154443 154873 141014
2250 141014 147515 153348 161455 168961 169409 159788 194589 226514 193951 170439 213770 195023 154406
2237 154406 210867 219065 229841 105684 128593 183754 163654 156125 176894 187782 184813 176727
$$ packed form
2323B17020m8787n8136r249J9381K6493k8863K0882k293j3297J9457K1605o7829
2311I6384R0078j2485n859O0301J6423j30553L0296N4432Q868l180m9033K1423
2299A77095k0594K4188J24J2184K892L2219M4244L5080K9106K8444o3986k4615
2287B76381j8993P474j3490N81k2532m0133J9115O6582q0293j5699O5969r2623
2275A52339j7648J7799L3540m887l2256k119k4535L6973J5096q691r328J7890
2263A74173m9301J2155L216n561n017n5124P7316K1267K3721k5349j7053M30j3859
2250A41014O501N833Q107P506M48r621L4801L1925l2563k3512M3331j8747m0617
2237A54406N6461Q198J0776j24157K2909N5161k0100p529K0769J0888k969q086
$$ plain form
2225 176727 126270 107807 163157 213350 192678 195116 161265 140416 142832 197510 225852 222101
2213 222101 122957 85800 99199 94670 210713 232016 142796 109302 152255 148482 124229 172117
2201 172117 183101 222938 262765 210797 188201 169516 134833 123599 170798 196003 185460 205132
2189 205132 182953 171025 172348 258580 194802 202436 188196 117871 128167 209682 228779 133310
2177 133310 163960 179983 138784 175944 131741 146229 168659 178633 172264 202681 213856 252470
2165 252470 233227 221992 290426 258585 215354 186748 201738 206540 189818 181854 183903 191999
2153 191999 221793 212132 256799 293953 278888 250368 213223 167659 234601 272475 222324 245858
2141 245858 269887 240911 273868 280042 243690 275370 237034 242951 250696 249776 292067 190845
$$ packed form
2225A76727n0457j8463N5350N0193k0672K438l3851k0849K416N4678K8342l751
2213B22101r9144l7157J3399m529J16043K1303q9220l3494M2953l773k4253M7888
2201A72117J0984L9837L9827n1968k2596j8685l4683j1234M7199K5205j0543J9672
2189B05132k2179j1928J323Q6232o3778P634j4240p0325J0296Q1515J9097r5469
2177A33310L0650J6023m1199L7160m4203J4488K2430R974o369L0417J1175L8614
2165B52470j9243j1235O8434l1841m3231k8606J4990M802j6722p964K049Q096
2153A91999K9794r661M4667L7154j5065k8520l7145m5564O6942L7874n0151K3534
2141B45858K4029k8976L2957O174l6352L1680l8336N917P745r20M2291j01222
$$ plain form
2129 190845 213344 283857 260064 234849 230693 261660 314232 348065 358626 306830 323266 275289
2117 275289 311077 372283 366911 405893 352699 392633 425361 383066 378890 478720 507578 445034
2105 445034 452822 525695 478939 527277 621191 620625 597230 615462 542447 571002 568609 634084
2093 634084 612099 580351 621182 649738 718234 673980 714550 785699 773287 770596 766192 719276
2081 719276 727029 726768 709796 725093 835546 830467 842495 890411 880448 836582 874109 878347 987825
2068 987825 1037158 1068035 1131817 1204419 1203804 1248145 1333991 1358182 1392172 1472384 1474737 1522257
2056 1522257 1645672 1752927 1747585 1887845 2032056 2161488 2271627 2361853 2474110 2545099
2046 2545099 2636979 2747079 2844376 3033258 3302391 3546909 3844133 4160365 4490586 4813474
$$ packed form
2129A90845K2499P0513k3793k5215m156L0967N2572L3833J0561n1796J6436m7977
2117B75289L5788O1206n372L8982n3194L9934L2728m2295m176R9830K8858o2544
2105D45034P788P2873m6756M8338R3914n66k3395J8232p3015K8555k393O5475
2093F34084k1985l1748M0831K8556O8496m4254M0570P1149j2412k691m404m6916
2081G19276P753k61j6972J5297J10453n079J2028M7916r963m3866L7527M238J09478
2068I87825M9333L0877O3782P2602o15M4341Q5846K4191L3990Q0212K353M7520
2056A522257J23415J07255n342J40260J44211J29432J10139R0226J12257P0989
2046B545099R1880J10100R7297J88882K69133K44518K97224L16232L30221L22888
$$ plain form
2036 4813474 5163851 5525233 5977490 6527692 7090312 7872280 8819506 10131655 11887088
2027 11887088 14718787 18234352 21759380 23917448 25061674 24688165 22043869 18785263
2019 18785263 15251060 12349161 10180780 8660180 7480694 6528849 5815872 5315420 4868897
2010 4868897 4677732 4361216 4146222 3846141 3573844 3291078 3025372 2809449 2642474 2513210
2000 2513210 2287546 2125251 1942488 1836114 1789175 1696018 1577654 1502475 1492008 1410782
1990 1410782 1350331 1364237 1322697 1234890 1152847 1073561 1056063 1065533 978921 898016 922644 895089
1978 895089 893662 811927 787959 856592 847578 838961 782233 771953 771790 758605 781600 750593 680072
1965 680072 611761 612908 590517 581724 544284 558362 558933 533391 592499 593893 577786 565992 535209
$$ packed form
2036D813474L50377L61382M52257N50202N62620P81968R47226J312149J755433
2027A1887088K831699L515565L525028K158068J144226l73509k644296l258606
2019A8785263l534203k901899k168381j520600j179486r51845p12977n00452m46523
2010D868897j91165l16516k14994l00081k72297k82766k65706k15923j66975j29264
2000B513210k25664j62295j82763j06374m6939r3157j18364p5179j0467q1226
1990A410782o0451J3906m1540q7807q2043p9286j7498R470q6612q0905K4628k7555
1978H95089j427q1735k3968O8633r014q617n6728j0280j63j3185K2995l1007p0521
1965F80072o8311J147k2391q793l7440J4078N71k5542N9108J394j6107j1794l0783
$$ plain form
1952 535209 488011 484241 504983 507413 538992 503477 391084 398936 368530 368509 393031 381347 389073
1939 389073 407710 392386 412192 323469 353158 350847 349178 342540 331407 300467 352435 365008
$$ packed form
1952E35209m7198l770K0742K430L1579l5515j12393P852l0406k1K4522j1684P726
1939C89073J8637j5324J9806q8723K9689k311j669o638j1133l0940N1968J2573
$$ [...]
##END NTUPLES=NMR SPECTRUM
##END=
