##TITLE=1H_CA-9121-2
 CDCl3
 8 sc, 
 20.2.2023
##JCAMPDX= 6.0         $$ Bruker NMR JCAMP-DX V2.0
##DATA TYPE= NMR SPECTRUM
##DATA CLASS= NTUPLES
##ORIGIN= UXNMR, Bruker Analytische Messtechnik GmbH
##OWNER= root
$$ XWIN-NMR		Version 3.5
$$ Mon Feb 20 14:13:37 2023 Russian Standard Time (UT+4h)  she@DPX200
##.OBSERVE FREQUENCY= 200.13135
##.OBSERVE NUCLEUS= ^1H
##.ACQUISITION MODE= SIMULTANEOUS
##.ACQUISITION SCHEME= undefined
##.AVERAGES= 8
##.DIGITISER RES= 18
##SPECTROMETER/DATA SYSTEM= spect
##.PULSE SEQUENCE= zg30
##.SOLVENT NAME= CDCl3
##.SHIFT REFERENCE= (INTERNAL, CDCl3, 0, 15.824)
##AUDIT TRAIL= $$ (NUMBER, WHEN, WHO, WHERE, WHAT)
$$ ##TITLE= Audit trail, XWIN-NMR		Version 3.5
$$ ##JCAMPDX= 5.01
$$ ##ORIGIN= Bruker BioSpin GmbH
$$ ##OWNER= she
$$ F:/spectra/data/she/nmr/H-F/1/pdata/1/auditp.txt
$$ ##AUDIT TRAIL=  $$ (NUMBER, WHEN, WHO, WHERE, WHAT)
(   1,<2023-02-20 14:12:16.76 +0400>,<she>,<DPX200>,
      <created by zg, POWCHK disabled, PULCHK disabled
       configuration hash MD5:
       00 E9 B6 7A A2 85 ED C7 34 08 36 98 17 FE 4E 26
       data hash MD5: 16K
       57 7A 8E BE EF 63 74 30 7C 52 39 07 7A 0E 85 85>)
(   2,<2023-02-20 14:12:19.71 +0400>,<she>,<DPX200>,
      <Start of raw data processing
       efp BC_mod = 2 LB = 0.24 FT_mod = 6 PKNL = 1 PHC0 = -19269.56 PHC1 = 16.60078 SI = 16K 
       data hash MD5: 16K
       3E 28 2A 72 64 32 EC 66 3E C3 8C BB F9 BC 0F BA>)
(   3,<2023-02-20 14:12:39.09 +0400>,<she>,<DPX200>,
      <pk PHC0 = -4.747305 PHC1 = 0 
       data hash MD5: 16K
       AD C3 78 4A D3 B3 1E C8 51 84 D6 44 5B CF B7 81>)
(   4,<2023-02-20 14:12:42.29 +0400>,<she>,<DPX200>,
      <abs ABSG = 5 
       data hash MD5: 16K
       A2 69 C5 60 0E 41 2B 9B 86 DC 54 27 CA 3E E4 BC>)
$$ ##END=
$$ 
$$ hash MD5
$$ 7A 30 92 24 D4 3F 02 B0 2A 2B 6C 01 51 D4 31 3E
##$RELAX= 
##$RELAX= 
##$RELAX= 
##$RELAX= 
##$RELAX= 
##$RELAX= 
$$ Bruker specific parameters
$$ --------------------------
##$DU= <F:/spectra>
##$EXPNO= 1
##$NAME= <H-F>
##$PROCNO= 1
##$TYPE= <nmr>
##$USER= <she>
##$AMP= (0..31)
100 100 100 100 100 100 100 100 100 100 100 100 100 100 100 100 100 100 
100 100 100 100 100 100 100 100 100 100 100 100 100 100 
##$AQSEQ= 0
##$AQ_mod= 1
##$AUNM= <au_zg>
##$AUTOPOS= <>
##$BF1= 200.13
##$BF2= 200.13
##$BF3= 200.13
##$BF4= 200.13
##$BF5= 200.13
##$BF6= 200.13
##$BF7= 200.13
##$BF8= 200.13
##$BYTORDA= 1
##$CFDGTYP= 0
##$CFRGTYP= 5
##$CHEMSTR= <none>
##$CNST= (0..31)
1 1 145 1 1 1 1 1 1 1 1 1 1 1 1 1 1 1 1 1 1 1 1 1 1 1 1 1 1 1 1 1 
##$CPDPRG= <>
##$CPDPRG1= <>
##$CPDPRG2= <>
##$CPDPRG3= <>
##$CPDPRG4= <mlev>
##$CPDPRG5= <mlev>
##$CPDPRG6= <mlev>
##$CPDPRG7= <mlev>
##$CPDPRG8= <mlev>
##$CPDPRGB= <>
##$CPDPRGT= <>
##$D= (0..31)
0 1.2 0 0 0 0 0 0 0 0.06 0 0.03 0 0 0 0 0.0002 0 0 0 0 0 0 0 0 0 0 0 0 
0 0 0 
##$DATE= 1676887936
##$DBL= (0..7)
120 120 120 120 120 120 120 120 
##$DBP= (0..7)
150 150 150 150 150 150 150 150 
##$DBP07= 0
##$DBPNAM0= <>
##$DBPNAM1= <>
##$DBPNAM2= <>
##$DBPNAM3= <>
##$DBPNAM4= <>
##$DBPNAM5= <>
$$ [...]
##$SUBNAM3= <"">
##$SUBNAM4= <"">
##$SUBNAM5= <"">
##$SUBNAM6= <"">
##$SUBNAM7= <"">
##$SUBNAM8= <"">
##$SUBNAM9= <"">
##$SW= 18.05172834244
##$SWIBOX= (0..15)
0 0 2 0 0 0 0 0 0 0 0 0 0 0 0 0 
##$SW_h= 3612.71676300578
##$TD= 16384
##$TD0= 1
##$TE= 0
##$TE2= 300
##$TE3= 300
##$TEG= 300
##$TL= (0..7)
0 120 120 120 120 120 120 120 
##$TP= (0..7)
150 150 150 150 150 150 150 150 
##$TP07= 0
##$TPNAME0= <>
##$TPNAME1= <>
##$TPNAME2= <>
##$TPNAME3= <>
##$TPNAME4= <>
##$TPNAME5= <>
##$TPNAME6= <>
##$TPNAME7= <>
##$TPOAL= (0..7)
0.5 0.5 0.5 0.5 0.5 0.5 0.5 0.5 
##$TPOFFS= (0..7)
0 0 0 0 0 0 0 0 
##$TUNHIN= 0
##$TUNHOUT= 0
##$TUNXOUT= 0
##$USERA1= <user>
##$USERA2= <user>
##$USERA3= <user>
##$USERA4= <user>
##$USERA5= <user>
##$V9= 5
##$VALIST= <valist>
##$VCLIST= <CCCCCCCCCCCCCCC>
##$VD= 0
##$VDLIST= <DDDDDDDDDDDDDDD>
##$VPLIST= <PPPPPPPPPPPPPPP>
##$VTLIST= <TTTTTTTTTTTTTTT>
##$WBST= 1024
##$WBSW= 4
##$XGAIN= (0..3)
0 0 0 0 
##$XL= 0
##$YL= 0
##$YMAX_a= 578754
##$YMIN_a= -327614
##$ZGOPTNS= <>
##$ZL1= 120
##$ZL2= 120
##$ZL3= 120
##$ZL4= 120
##$ABSF1= 15.82292
##$ABSF2= -2.228931
##$ABSG= 5
##$ABSL= 3
##$ALPHA= 0
##$AQORDER= 0
##$ASSFAC= 0
##$ASSFACI= 0
##$ASSFACX= 0
##$ASSWID= 0
##$AUNMP= <proc_1d>
##$AZFE= 0.1
##$AZFW= 0.1
##$BCFW= 0
##$BC_mod= 2
##$BYTORDP= 0
##$COROFFS= 0
##$CY= -3
##$DATMOD= 1
##$DC= 0
##$DFILT= <>
##$DTYPP= 0
##$F1P= 0
##$F2P= 0
##$FCOR= 1
##$FTSIZE= 16384
##$FT_mod= 6
##$GAMMA= 0
##$GB= 0
##$INTBC= 1
##$INTSCL= 3.70164e-10
##$ISEN= 128
##$LB= 0.24
##$LEV0= 0
##$LPBIN= 0
##$MAXI= 10000
##$MC2= 0
##$MEAN= 0
##$ME_mod= 0
##$MI= 1.114404
##$NCOEF= 0
##$NC_proc= -8
##$NLEV= 6
##$NOISF1= 3.799351
##$NOISF2= 2.8
##$NSP= 0
##$NTH_PI= 0
##$NZP= 0
##$OFFSET= 15.82402
##$PC= 1
##$PHC0= -19274.31
##$PHC1= 16.60078
##$PH_mod= 1
##$PKNL= yes
##$PPARMOD= 0
##$PSCAL= 0
##$PSIGN= 0
##$REVERSE= no
##$SF= 200.129989498649
##$SI= 16384
##$SIGF1= 3
##$SIGF2= 2
##$SINO= 5.538805
##$SIOLD= 16384
##$SREGLST= <1H.CDCl3>
##$SSB= 0
##$STSI= 16384
##$STSR= 0
##$SW_p= 3612.71676300578
##$SYMM= 0
##$S_DEV= 0
##$TDeff= 16384
##$TDoff= 0
##$TI= <>
##$TILT= no
##$TM1= 0
##$TM2= 0
##$TOPLEV= 0
##$USERP1= <user>
##$USERP2= <user>
##$USERP3= <user>
##$USERP4= <user>
##$USERP5= <user>
##$WDW= 1
##$XDIM= 16384
##$YMAX_p= 405934479
##$YMIN_p= -325649
$$ End of Bruker specific parameters
$$ ---------------------------------
##NTUPLES= NMR SPECTRUM
##VAR_NAME=  FREQUENCY,     SPECTRUM/REAL,   SPECTRUM/IMAG
##SYMBOL=    X,             R,               I
##VAR_TYPE=  INDEPENDENT,   DEPENDENT,       DEPENDENT
##VAR_FORM=  AFFN,          ASDF,            ASDF
##VAR_DIM=   16384,         16384,           16384
##UNITS=     HZ,            ARBITRARY UNITS, ARBITRARY UNITS
##FACTOR=    0.220516191357247, 1,           1
##FIRST=     3166.86103362499, 0,            0
##LAST=      -445.855729380788, 0,           0
##MIN=       -445.855729380788, -325649,     0
##MAX=       3166.86103362499, 405934479,    0
$$ Real data points
##PAGE= N=1
##DATA TABLE= (X++(R..R)), XYDATA
$$ [...]
7498B608323J81705p5145Q210P5375j03895J59782j0725J1234r5192J04887P0557
$$ 2608323 2790028 2714883 2723093 2798468 2694573 2854355 2843630 2854864 2759672 2864559 2935116
7487B935116l8841K2336J43140J20357j9423n0770p0806J8773J88551J51661O209
$$ 2935116 2896275 2918611 3061751 3182108 3162685 3111915 3041109 3059882 3248433 3400094 3406303
7476C406303L9427r0449r9956J3579Q3156n0034L3195J01701O8289J802n7251
$$ 3406303 3445730 3355281 3255325 3268904 3352060 3302026 3335221 3436922 3505211 3507013 3449762
7465C449762j22544J29928P0672N8116l4249q1457o6287J43578J14233k7257r3504
$$ 3449762 3327218 3457146 3527818 3585934 3551685 3470228 3403941 3547519 3661752 3634495 3540991
7454C540991J32595n9986J07692l1153l4168M2032Q0069N517l983q270o1884J15768
$$ 3540991 3673586 3613600 3721292 3690139 3655971 3698003 3778072 3783589 3779606 3771336 3709452 3825220
7442C825220K4222n3077j57469m22N8449R9632q3737P9086k1691n1522L3168q1416
$$ 3825220 3849442 3796365 3638896 3638474 3696923 3796555 3712818 3791904 3770213 3718691 3751859 3670443
7430C670443n4750k9767K4018K688q3182J45819o1651m0093N2049K7175M2221
$$ 3670443 3615693 3585926 3609944 3612632 3529450 3675269 3613618 3573525 3625574 3652749 3694970
7419C694970L5554j55515j31190p8359J3004j9455N3841L4007j47042n5204J39095
$$ 3694970 3730524 3575009 3443819 3365460 3378464 3359009 3412850 3446857 3299815 3244611 3383706
7408C383706L1141j1304J7280j51256m7313j671O6717K0178p9844J4209q3271
$$ 3383706 3414847 3403543 3420823 3269567 3222254 3220583 3287300 3307478 3227634 3241843 3158572
7397C158572j8513N1747J02142p3375q5626P1803Q1992o6053j46972l3416L4563
$$ 3158572 3140059 3191806 3293948 3220573 3134947 3206750 3288742 3222689 3075717 3042301 3076864
7386C076864O6757j2354j04995O7652K8182K4063o2897j7003N9828Q7861j66672
$$ 3076864 3143621 3131267 3026272 3093924 3122106 3146169 3083272 3066269 3126097 3213958 3047286
7375C047286K0215O8227m2736j55341j05671R5431J53978N3851j14893m5608o053
$$ 3047286 3067501 3135728 3092992 2937651 2831980 2927411 3081389 3135240 3020347 2974739 2968686
7364B968686k8548P7605M9629j46486O1403Q926n0284j14899K8423j20450K6708
$$ 2968686 2940138 3017743 3067372 2920886 2982289 2991215 2940931 2826032 2854455 2734005 2760713
7353B760713J6306K36741j68678r0442k198o7425K16268L9446K6626N2068O156
$$ 2760713 2777019 3013760 2845082 2754640 2752442 2685017 2901285 2940731 2967357 3019425 3025581
7342C025581R876l8047m9070K7996P1319k0362r3921n1666O7357k3396J60932
$$ 3025581 3035457 2997410 2948340 2976336 3047655 3027293 2933372 2881706 2949063 2925667 3086599
7331C086599l1663j21999L8476p0098L3918P9051K4178m2997o8488N9197q7096
$$ 3086599 3054936 2932937 2971413 2901315 2935233 3014284 3038462 2995465 2926977 2986174 2899078
7320B899078P6393J72336j02346l3810O5229p7337p6972O0693Q2036l5832J8811
$$ 2899078 2975471 3147807 3045461 3011651 3076880 2999543 2922571 2983264 3065300 3029468 3048279
7309C048279M061k3445P9857j16704n787n115N7108J54953R3798p3239j04935
$$ 3048279 3052340 3028895 3108752 2992048 2986261 2981146 3038254 3193207 3287005 3213766 3108831
7298C108831j7689P0729j6996J53683N8541n7373k2985L3475P5384m7928K681
$$ 3108831 3091142 3161871 3144875 3298558 3357099 3299726 3276741 3310216 3385600 3337672 3340353
7287C340353P0359J21039J0968N7650M2155L8267l2844J12899P59J4537O8536
$$ 3340353 3410712 3531751 3542719 3600369 3642524 3680791 3647947 3760846 3761605 3776142 3844678
7276C844678n0916L7254R2459Q1553k7279R2095n7443J40184J61311Q6494K75199
$$ 3844678 3793762 3831016 3923475 4005028 3977749 4069844 4012401 4152585 4313896 4400390 4675589
7265D675589J17944N4502K29500J96018R7936M9939j36973j44928o2669J06829
$$ 4675589 4793533 4848035 5077535 5273553 5371489 5421428 5284455 5139527 5076858 5183687
7255E183687q9483j17466k5819n3725P0793n322R7311j22677j34531J10955K35962
$$ 5183687 5094204 4976738 4950919 4897194 4967987 4962665 5059976 4937299 4802768 4913723 5149685
7244E149685K16199o0962j41482M2509K52172K6641k8659P9798J0837k3036K3591
$$ 5149685 5365884 5304922 5163440 5205949 5458121 5484762 5456103 5535901 5546738 5523702 5547293
7233E547293m250J04836N2088p2969p7186J56211J8546J2729J37684q79P9067
$$ 5547293 5543043 5647879 5699967 5626998 5549812 5706023 5724569 5737298 5874982 5874103 5953170
7222E953170P3387l341J44239o5121L5679J09367O6937l6847J1308J67552q2689
$$ 5953170 6026557 6023216 6167455 6102334 6138013 6247380 6314317 6277470 6288778 6456330 6373641
7211F373641J29264m0934m406P2614M075j40279N1144r4793j19332J4033L7026
$$ 6373641 6502905 6461971 6457565 6530179 6534254 6393975 6445119 6350326 6230994 6245027 6282053
7200F282053j49494J8572N4931r4371n6518M1875n3701J21249j12327p4039O1143
$$ 6282053 6132559 6151131 6206062 6111691 6055173 6097048 6043347 6164596 6052269 5978230 6039373
7189F039373j3539J2389l1210j4477q8866m280m6280l5475p1381p2277K1129R3402
$$ 6039373 6025834 6038223 6007013 5992536 5903670 5899390 5853110 5817635 5746254 5673977 5695106 5788508
7177E788508r0866j01576j48716l3253J3557J3755m6320k11247k35083j963K673
$$ 5788508 5697642 5596066 5447350 5414097 5427654 5441409 5395089 5183842 4948759 4946796 4949469
7166D949469k7070J9833j06984l7334q675M9925K4956r5441p3201J7698O9223
$$ 4949469 4922399 4942232 4835248 4797914 4789239 4839164 4864120 4768679 4695478 4713176 4782399
7155D782399L8218j29262n4704L9138m0473q9002Q3144j13656j44703N9535j08720
$$ 4782399 4820617 4691355 4636651 4675789 4635316 4546314 4629458 4515802 4371099 4430634 4321914
7144D321914j21338l7436m7864n8122J14602k0660l4364l8298l6355K37795j14794
$$ 4321914 4200576 4163140 4115276 4057154 4171756 4151096 4116732 4078434 4042079 4279874 4165080
7133D165080p9023p0490r6034N3150J9614l448J459j2396L9214J02466p2701J1759
$$ 4165080 4086057 4015567 3919533 3972683 3992297 3988849 3990308 3977912 4017126 4119592 4046891 4058650
7121D058650n4928R5257M3279j23132m6573J07192J32358P3639j23906q4376O8627
$$ 4058650 4003722 4098979 4142258 4019126 3972553 4079745 4212103 4285742 4161836 4077460 4146087
7110D146087o6582k166N5582l5634O7856L3748j1851J07528k420j9176k105j7969
$$ 4146087 4079505 4077339 4132921 4097287 4165143 4198891 4187040 4294568 4292148 4272972 4270867 4252898
7098D252898N7133Q33J96517r3775J41297p7900j5851m2061o3466N991j8550n3183
$$ 4252898 4310031 4310864 4507381 4413606 4554903 4477003 4461152 4419091 4355625 4361616 4343066 4289883
7086D289883j00427J5293M7444N483J9817K4725L8329O2412n4075N3646J11608
$$ 4289883 4189456 4204749 4252193 4257676 4277493 4302218 4340547 4402959 4348884 4402530 4514138
7075D514138O7194n2j54249L3639R2205J1116N2667M2995P943J2071J07340k0000
$$ 4514138 4581332 4581280 4427031 4460670 4552875 4563991 4616658 4659653 4667596 4679667 4787007 4767007
7063D767007R0322K6035r8482p1668J35930L06227M8895k60457k5457R9655j53303
$$ 4767007 4857329 4883364 4784882 4713214 4849144 5155371 5204266 4943809 4918352 5018007 4864704
7052D864704Q4839P3830j10165J55914J08118M816q6684K6015K3172m036J31915
$$ 4864704 4949543 5023373 4913208 5069122 5177240 5182056 5095372 5121387 5144559 5140523 5272438
7041E272438R4552N1213O9371L3975J19439L4339J61015K0231o732K2902n8438
$$ 5272438 5366990 5418203 5487574 5521549 5640988 5675327 5836342 5856573 5849841 5872743 5814305
7030E814305l7213l7423j16605J57458J53361o6010r3721O2576J99360j12447
$$ 5814305 5777092 5739669 5623064 5780522 5933883 5867873 5774152 5836728 6036088 5923641
7020E923641k1708J00943m6814J05523l8061m565O3963Q8533Q5756p6681M3162
$$ 5923641 5901933 6002876 5956062 6061585 6023524 6018959 6082922 6171455 6257211 6180530 6223692
7009F223692m6697J67474N9087o2136J01795n1538P6253J9182l5074k1231J09129
$$ 6223692 6176995 6344469 6403556 6341420 6443215 6391677 6467930 6487112 6452038 6430807 6539936
6998F539936j02367J64174J54699p7019j9799k8186J87624J27672R4693q3420
$$ 6539936 6437569 6601743 6756442 6679423 6659624 6631438 6819062 6946734 7041427 6958007
6988F958007k45J98496j7023j3641k3009R5256J10434O6878K26880r1175L5877
$$ 6958007 6957762 7156258 7139235 7125594 7102585 7197841 7308275 7375153 7602033 7510858 7546735
6977G546735L7070J1888K15406M3992k8984J6479j01431O253Q5769P3898Q5005
$$ 7546735 7583805 7595693 7811099 7855091 7826107 7842586 7741155 7747408 7833177 7907075 7992080
6966G992080K0680J10750J51366K7434j22816J3876J5737O9100N4271K7278M9579
$$ 7992080 8012760 8123510 8274876 8302310 8179494 8193370 8209107 8278207 8332478 8359756 8409335
6955H409335J40960r890J42437K32796R1175p015M1514K31764J54285R899L10800
$$ 8409335 8550295 8540405 8682842 8915638 9006813 8999798 9041312 9273076 9427361 9437260 9748060
6944I748060K93515J61657K09519J46227J02105M9141K39254J63336K29165J5312
$$ 9748060 10041575 10203232 10412751 10558978 10661083 10710224 10949478 11112814 11341979 11357291
6934A1357291J55670K50511J82908J34082J64884J73776K08259L81153K88808
$$ 11357291 11512961 11763472 11946380 12080462 12245346 12419122 12627381 13008534 13297342
6925A3297342K43208M3907K77254M59865J96583K49659L10767K99338K88143K97458
$$ 13297342 13540550 13584457 13861711 14321576 14518159 14767818 15078585 15377923 15666066 15963524
6915A5963524K18493K60079M08704J80274K42012M09027K45239K49064N29267
$$ 15963524 16182017 16442096 16850800 17031074 17273086 17682113 17927352 18176416 18705683
6906A8705683L52729K53704M94170M15907M47616L84364L35601M59425M93620
$$ 18705683 19058412 19312116 19806286 20222193 20669809 21054173 21389774 21849199 22342819
6897B2342819N42644O36325N43424N13505O40040P78691O27743P66519Q87960
$$ 22342819 22885463 23521788 24065212 24578717 25218757 25997448 26625191 27391710 28279670
6888B8279670J172175J088840J117709J304009J570526J709966J741009J824355
$$ 28279670 29451845 30540685 31658394 32962403 34532929 36242895 37983904 39808259
6880C9808259K389435K555656K845756K790947L346436L492363L800926M436477
$$ 39808259 42197694 44753350 47599106 50390053 53736489 57228852 61029778 65466255
6872F5466255N116071N519404O571501P930218R756929J1867501J4054769J6157074
$$ 65466255 70582326 76101730 82673231 90603449 100360378 112227879 126282648 142439722
6864A42439722J9135768K2389604K6060937K5386688J5194848m565437k2566272
$$ 142439722 161575490 183965094 210026031 235412719 250607567 246042130 223475858
6857B23475858k3382986j7856487j4897413k1827549k6321242k0756856j4256523
$$ 223475858 200092872 182236385 167338972 145511423 119190181 98433325 84176802
6850H4176802j0340250q354786o876497n232796l920486l409906k793682k350231
$$ 84176802 73836552 65481766 58605269 53372473 49451987 46042081 43248399 40898168
6842D0898168j712204j400997j013982r81004j067848r15965p28402p69134p34614
$$ 40898168 39185964 37784967 36770985 35789981 34722133 33806168 33077766 32308632 31574018
6833C1574018q37936j220281j053525j009062q88477r20160q92838q71377q54606
$$ 31574018 30736082 29515801 28462276 27453214 26564737 25644577 24751739 23880362 23025756
6824B3025756o82778o79128p92117p14547m64963m75523l34043k68453l93880
$$ 23025756 22342978 21663850 20871733 20157186 19692223 19216700 18882657 18614204 18220324
6815A8220324l37408k36093k95179j70541j00431l8637k24402k42390N6019q4529
$$ 18220324 17882916 17646823 17351644 17181103 17080672 17042035 16817633 16575243 16631262 16546733
6805A6546733n8890J6036k4335n5858j28202j19248J02511M3611o2460j84073
$$ 16546733 16487843 16503879 16479544 16423686 16295484 16176236 16278747 16322358 16259898 16075825
6795A6075825q2743K916Q6421n3388j45903M3772j57485k09503O855p4364p3882
$$ 16075825 15993082 15995998 16082419 16029031 15883128 15926900 15769415 15559912 15566767 15492403 15418521
6784A5418521Q7483q7515R6840J46008P7631j07805j8897K7034P3394J15705j55745
$$ 15418521 15506004 15418489 15515329 15661337 15738968 15631163 15612266 15639300 15712694 15828399 15672654
6773A5672654q9910k0256j11769q5110k89864k31303j71388j59219j46010l4502
$$ 15672654 15582744 15562488 15450719 15365609 15075745 14844442 14673054 14513835 14367825 14333323
6763A4333323K4734j24406k30152l7115p2403j83606j18054k2189j18950j27330
$$ 14333323 14358057 14233651 14003499 13966384 13893981 13710375 13592321 13570132 13451182 13323852
6753A3323852R0791k1340N4518o2594o6651J33721k7728m5557R3830K2153R7335
$$ 13323852 13414643 13393303 13447821 13385227 13318576 13452297 13424569 13379012 13472842 13494995 13592330
6742A3592330J32907J13816P9452r0993O9753k7440n0026o7740p6838j61060j51656
$$ 13592330 13725237 13839053 13918505 13827512 13897265 13869825 13819799 13752059 13675221 13514161 13362505
6731A3362505L437r3790j64849j06892r5542j8387r1894n4238j7022j15798l4540
$$ 13362505 13365942 13272152 13107303 13000411 12904869 12886482 12794588 12740350 12723328 12607530 12572990
6720A2572990O2724n2457j04550N1331O6471k0503p4523J6728k780p8386o3289
$$ 12572990 12635714 12583257 12478707 12530038 12596509 12576006 12501483 12518211 12515431 12437045 12373756
6709A2373756j07098K0004J00791m9444O0007O5161J10957n458J31213K75286
$$ 12373756 12266658 12286662 12387453 12338009 12398016 12463177 12574134 12568676 12699889 12975175
6699A2975175J07542J76930Q1118J12188J75618J08044J42706K67481J51523J9058
$$ 12975175 13082717 13259647 13340765 13452953 13628571 13736615 13879321 14146802 14298325 14317383
6689A4317383J19106J53724J25174K24544K69156K51927K90206K24392K42120
$$ 14317383 14436489 14590213 14715387 14939931 15209087 15461014 15751220 15975612 16217732
6680A6217732K19352K98504K91994M81213M36934M32109L99234M89226O83578
$$ 16217732 16437084 16735588 17027582 17508795 17945729 18377838 18777072 19266298 19949876
6671A9949876P49858O59215N46384Q41685P81031O00416O01057M35214J86409
$$ 19949876 20699734 21358949 21905333 22747018 23528049 24128465 24729522 25164736 25351145
6662B5351145J2984L4106J94390k0826J33392J49284L80874N22361N02740O88210
$$ 25351145 25364129 25398235 25592625 25571799 25705191 25854475 26235349 26757710 27260450 27948660
6652B7948660Q33162J003706R57734J336936J222047J523099J581767J735945
$$ 27948660 28781822 29785528 30743262 32080198 33302245 34825344 36407111 38143056
6644C8143056K157077K096552K118252K187673J764904J169304M87982l18435
$$ 38143056 40300133 42396685 44514937 46702610 48467514 49636818 50124800 49806365
6636D9806365n79706q99212r63772j031558r65789o66007n69128k59348J74696
$$ 49806365 49226659 48327447 47363675 46332117 45366328 44700321 44131193 43871845 44046541
6627D4046541L41744Q70127R46598J102654J265506J362631J902374K139621K007035
$$ 44046541 44388285 45258412 46205010 47307664 48573170 49935801 51838175 53977796 55984831
6618E5984831K422781K705987K598339K500216K287199J473630L30408o35593
$$ 55984831 58407612 61113599 63711938 66212154 68499353 69972983 70303391 69667798
6610F9667798j653390k058846k208934k379841k492600k252985j847431j242728
$$ 69667798 68014408 65955562 63746628 61366787 58874187 56621202 54773771 53531043
6602E3531043j090233p69809o19002n59965k57130J22847K61455K86013M39712
$$ 53531043 52440810 51671001 51051999 50492034 50234904 50357751 50619206 50905219 51344931
6593E1344931N52567Q30187J000308J033602J008268R26598O16615p0612p09523
$$ 51344931 51897498 52727685 53727993 54761595 55769863 56696461 57313076 57242464 56532941
6584E6532941j321565j731879j935227k231987k093238j951943j806775j590319
$$ 56532941 55211376 53479497 51544270 49312283 47219045 45267102 43460327 41870008
6576D1870008j490930j430785j309878j229248j068640r34903r33978r03991n67828
$$ 41870008 40379078 38948293 37638415 36409167 35340527 34405624 33471646 32567655 31999827
6567C1999827m73192n42473m32735m69146k85839k65577k56218m31033n45309
$$ 31999827 31526635 30984162 30551427 30082281 29796442 29530865 29274647 28843614 28298305
6558B8298305o00415r00565r27067q21935p58982p82179p70315o40387n03868
$$ 28298305 27697890 26797325 25870258 25048323 24289341 23507162 22736847 22096460 21592592
6549B1592592m44146n64342p11711o42659m05196m04458n01892n44941n04779
$$ 21592592 21148446 20584104 19872393 19229734 18824538 18420080 17918188 17373247 16868468
6540A6868468l56806m27986l19701m11907m05276l04479j33014k15407j74211
$$ 16868468 16511662 16083676 15763975 15352068 14946792 14642313 14509299 14293892 14119681
6531A4119681j47568j54073j66200j22910k39957j24732k06461k3288r9682n0523
$$ 14119681 13972113 13818040 13651840 13528930 13288973 13164241 12957780 12934492 12834810 12784287
6521A2784287J2110j64822o8929j04883p965j12420j82041q2481O6317K6798j3545
$$ 12784287 12796397 12631575 12562646 12457763 12449798 12337378 12155337 12072856 12139173 12165971 12152426
6510A2152426K6447j0257j03190P9815J10958M7439k10555l7221n0739l1124j81
$$ 12152426 12178873 12168616 12065426 12145241 12256199 12303638 12093083 12055862 12005123 11973999 11973818
6499A1973818J7669q2516n2424P7578j24938M3549O4574l5945k056k3117J67538
$$ 11973818 11991487 11908971 11856547 11934125 11809187 11852736 11917310 11881365 11879309 11856192 12023730
6488A2023730O0754k9479k3837K540J26400N6411p8694n4649M7424k0167J5182
$$ 12023730 12084484 12055005 12031168 12033708 12160108 12216519 12137825 12083176 12130600 12110433 12125615
6477A2125615J82999M3828j373k142J03394J85804j00393K3887J05810M27M6475
$$ 12125615 12308614 12352442 12351069 12348927 12452321 12638125 12537732 12561619 12667429 12667856 12714331
6466A2714331P9487J05805r5124P4980M9613L1503J71247K8933K60532L58654
$$ 12714331 12793818 12899623 12804499 12879479 12929092 12960595 13131842 13160775 13421307 13779961
6456A3779961R7177J71575J00365o6023j7192k9748j06161q7307j63163p9513
$$ 13779961 13877138 14048713 14149078 14083055 14065863 14036115 13929954 13842647 13679484 13599971
6446A3599971P2382n3665m8442R4463J74278m6282q2010j3642j3888K0691J0916
$$ 13599971 13672353 13618688 13570246 13664709 13838987 13792705 13710695 13697053 13683165 13703856 13714772
6435A3714772j2135n1639p6296R8476J97777O8911O6967J188j5827J5811k3703
$$ 13714772 13702637 13650998 13574702 13673178 13870955 13939866 14006833 14008021 13992194 14008005 13984302
6424A3984302O6373J23520j1305P7087n1166Q6665l125R3365J56094N1532o4560
$$ 13984302 14050675 14174195 14162890 14239977 14188811 14275476 14272351 14365716 14521810 14573342 14508782
6413A4508782j51375N9909l2480P9284N98j44773P2118Q9358j17947O042O8949
$$ 14508782 14357407 14417316 14384836 14464120 14464718 14319945 14392063 14481421 14363474 14369516 14438465
6402A4438465J68165o1534O0807J68953N969p8502j731R2179R6280J66602M8475
$$ 14438465 14606630 14545096 14605903 14774856 14780825 14702323 14700592 14792771 14889051 15055653 15104128
6391A5104128n0778J27278o8682r3665M1168R0957N5038R2599J07123q4053n1865
$$ 15104128 15053350 15180628 15111946 15018281 15059449 15150406 15205444 15298043 15405166 15321113 15269248
6380A5269248P1326n2781J90580M9688J77053Q2547j26762O0452O4388M8958M1180
$$ 15269248 15340574 15287793 15478373 15528061 15705114 15787661 15660899 15721351 15785739 15834697 15875877
6369A5875877J17221k7806N9103K0434j53346M2644Q0305m8763l3159q3849k05545
$$ 15875877 15993098 15965292 16024395 16044829 15891483 15934127 16014432 15965669 15932510 15848661 15643116
6358A5643116p4899J1881m5960M3278p2281j5134m4965j14032r7554L2557j18821
$$ 15643116 15568217 15580098 15534138 15577416 15505135 15490001 15445036 15331004 15233450 15266007 15147186
6347A5147186q5834J04266q6735k962J16880j73651K5849l7864j52677j09606
$$ 15147186 15061352 15165618 15078883 15075921 15192801 15019150 15044999 15007135 14854458 14744852
6337A4744852p6218j79819j5990J13346m7126j14734m5303q8207j17374j4694
$$ 14744852 14668634 14488815 14472825 14586171 14539045 14424311 14379008 14290801 14173427 14158733
6327A4158733O5687J239r1727N6811p1224M3415N7542K6227O2689p021j3346O2938
$$ 14158733 14224420 14225659 14133932 14190743 14119519 14162934 14220476 14246703 14309392 14302371 14289025 14351963
6315A4351963j284M4490l970O5065N2225j67594P554n9092R006Q7776q0597n6663
$$ 14351963 14350679 14395169 14391199 14456264 14508489 14340895 14348449 14289357 14298363 14386139 14305542 14248879
6303A4248879j22946o4185O8518J7717Q818J13448O2209Q230o3167j3879p7137
$$ 14248879 14125933 14061748 14130266 14147983 14156801 14270249 14332458 14340688 14277521 14263642 14186505
6292A4186505n4307j13341J58236j14806j14283j17459l0859j9872k38089R0116
$$ 14186505 14132198 14018857 14177093 14062287 13948004 13830545 13799686 13779814 13541725 13631841
6282A3631841r6372r7005P4035J44884k2524j06647J1890J46400Q7053R3150k2763
$$ 13631841 13535469 13438464 13512499 13657383 13634859 13528212 13540102 13686502 13773555 13866705 13843942
6271A3843942J40q5961J84805K05844q7131J1486P609J71733M9927n927K25036
$$ 13843942 13844082 13758121 13942926 14148770 14061639 14073125 14080734 14252467 14302394 14296467 14521503
6260A4521503J63575R4175M8151M2246J43508K25545o5450O4476J43052K90629
$$ 14521503 14685078 14779253 14827404 14869650 15013158 15238703 15173253 15237729 15380781 15671410
6250A5671410J51683k632O0642K43387K605J2118M8812R9402K9253k34684j5110
$$ 15671410 15823093 15820461 15881103 16124490 16127095 16139213 16188025 16287427 16316680 16081996 16066886
6239A6066886K3945o7095k6455j11682k61345K7864K3885l1569M3835j72144O3341
$$ 16066886 16090831 16023736 15997281 15885599 15624254 15652118 15676003 15644434 15688269 15516125 15579466
6228A5579466j5996j8645o3022j26754o7570l18160P4616j15001k33773j24281
$$ 15579466 15563470 15544825 15481803 15355049 15287479 14969319 15043935 14928934 14695161 14570880
6218A4570880j32392k18217j85120m7901j01056L9297k53636l15878j16806J07705
$$ 14570880 14438488 14220271 14035151 13987250 13886194 13925491 13671855 13355977 13239171 13346876
6208A3346876r117j16125p630M951m5722n2792R682o9233K91382n0310J19406
$$ 13346876 13337759 13221634 13214004 13218955 13173233 13120441 13130123 13060890 13352272 13301962 13421368
6197A3421368M3146P3933J04102n1867P3006M7016j959P3004J43822N1294m7932
$$ 13421368 13464514 13538447 13642549 13590682 13663688 13710704 13708745 13781749 13925571 13976865 13928933
6186A3928933K4388O1037O2441r091k21531J173m6144o3483R9095J14713j06537
$$ 13928933 13953321 14014358 14076799 14067708 13846177 13847350 13801206 13737723 13836818 13951531 13844994
6175A3844994j09766M0016o9664p2087O2575L1739m7939L111P0683r0017j37451
$$ 13844994 13735228 13775244 13705580 13633493 13696068 13727807 13679868 13682979 13753662 13663645 13526194
6164A3526194j00391j05381j20027o5312N2172m32402k16571j60305j63822r0398
$$ 13526194 13425803 13320422 13200395 13135083 13187255 12754853 12538282 12377977 12214155 12123757
6154A2123757j68033n7553k11842j56683j71090n1450l1481q2507K0374j51693
$$ 12123757 11955724 11898171 11686329 11529646 11358556 11307106 11275625 11193118 11213492 11061799
6144A1061799m4408m0844O1045j88284j83630Q8163l5278j579Q4574p7552k1359
$$ 11061799 11017391 10976547 11037592 10849308 10665678 10753841 10718563 10716984 10801558 10724006 10702647
6133A0702647K2677l5731j96786l6451J56786l0896K7103k3134N620m86L0704
$$ 10702647 10725324 10689593 10492807 10456356 10613142 10582246 10609349 10586215 10591835 10591349 10622053
6122A0622053m4881q1485J30923j6651j10354J52724J52875N8816m5369M4508
$$ 10622053 10577172 10495687 10626610 10609959 10499605 10652329 10805204 10864020 10818651 10863159
6112A0863159Q5193l5763J36114O3516Q4662J57711J09593l8502P862L15827K29863
$$ 10863159 10948352 10912589 11048703 11112219 11196881 11354592 11464185 11425683 11433545 11749372 11979235
6101A1979235J8897j95660n1829J6280o7275j32658N9821o5505L5266Q6263N7529
$$ 11979235 11998132 11802472 11750643 11766923 11699648 11566990 11626811 11561306 11596572 11682835 11740364
6090A1740364O427L3518N887N297J34903J15341J04948K00862J27694K84597K90223
$$ 11740364 11746791 11780309 11786196 11791493 11926396 12041737 12146685 12347547 12475241 12759838 13050061
6079A3050061J35430L43182K29070K88352M87952L33411M34591P8417j02666j61143
$$ 13050061 13185491 13528673 13757743 14046095 14534047 14867458 15302049 15380466 15277800 15116657
6069A5116657j72046l24984l43513j84003l26987m36945l11326o7711j6876k01567
$$ 15116657 14944611 14619627 14276114 14092111 13765124 13328179 13016853 12949142 12932266 12730699
6059A2730699J14413J41163n3864K7309K54476K72997J07671L05092M92437L43845
$$ 12730699 12845112 12986275 12932411 12959720 13214196 13487193 13594864 13899956 14392393 14736238
6049A4736238N52534N75737O09717Q71708N45045L04849O5186r6973l44540m99134
$$ 14736238 15288772 15864509 16474226 17345934 17890979 18195828 18261014 18164041 17819501 17320367
6039A7320367m77019n69089o73030m12576k94090m75017l81246j16026n9112n6358
$$ 17320367 16843348 16274259 15601229 15188653 14894563 14419546 14038300 13922274 13863162 13806804
6029A3806804k0503k6016K5435J40197O3274K03769J26343J80727L17796M01474
$$ 13806804 13786301 13760285 13785720 13925917 13989191 14192960 14319303 14500030 14817826 15219300
6019A5219300L61974L36665M96911M15287K97395m4803l63281j75508l49625l71192
$$ 15219300 15581274 15917939 16414850 16830137 17127532 17082729 16719448 16543940 16194315 15823123
6009A5823123l73485m33032l98503l35457k82970j93721j7189n5794j94503j29494
$$ 15823123 15449638 15016606 14618103 14282646 13999676 13805955 13788766 13732972 13538469 13408975
5999A3408975q6074K9818J78612K5573l1388J30041N6640J30992J87006K78561
$$ 13408975 13322901 13352719 13531331 13556904 13525516 13655557 13712197 13843189 14030195 14308756
5989A4308756J86103J86675O026P1272J054m5842M5813m2236Q2660O3581j89132
$$ 14308756 14494859 14681534 14687560 14758832 14759886 14714044 14759857 14717621 14800281 14863862 14674730
5978A4674730j02889K344Q181r1485L6048n6035J01342J58895P3676J23446M2941
$$ 14674730 14571841 14574185 14582366 14490881 14526929 14470894 14572236 14731131 14804807 14928253 14971194
5967A4971194J4331J0407L6003j9892J77494N7114R9797o635K8659K04683K560
$$ 14971194 14985525 14995932 15031935 15012043 15189537 15246651 15346448 15339813 15368472 15573155 15575715
5956A5575715L115K63957J8633N1424J81404R2498K50274K70680J93926L04280
$$ 15575715 15578830 15842787 15861420 15912844 16094248 16186746 16437020 16707700 16901626 17205906
5946A7205906j99118j30144j49688j88105K4569q2337r4041k65469k96991K9423
$$ 17205906 17006788 16876644 16726956 16538851 16563420 16481083 16387042 16121573 15824582 15854005
5936A5854005j1474j85394j64469j9948O7902q3587q173P8247n9716P3604J11855
$$ 15854005 15842531 15657137 15492668 15472720 15540622 15457035 15448862 15527109 15467393 15540997 15652852
5925A5652852K8875L0440R3461Q2358O1681J53800J55739Q3916K02727L14644
$$ 15652852 15681727 15712167 15805628 15887986 15949667 16103467 16259206 16343122 16545849 16860493
5915A6860493J92198j05118j91278k21141p1115j98636l79375j85416o6252j43222
$$ 16860493 17052691 16947573 16756295 16535154 16464039 16265403 15886028 15700612 15634360 15491138
5905A5491138k51382q3679k03400j21676k1482N2610q1186j0956R901k5473p4095
$$ 15491138 15239756 15156077 14952677 14831001 14809519 14862129 14780943 14769987 14779888 14754415 14680320
5894A4680320L4408J0704J294J11116k9247m6330K8420k9386N9570n8837J3177
$$ 14680320 14714728 14725432 14726726 14837842 14808595 14762265 14790685 14761299 14820869 14762032 14775209
5883A4775209R0792o9727j9522k12257j23115j02241n6349j53892l8569j08612
$$ 14775209 14866001 14796274 14776752 14564495 14441380 14339139 14282790 14128898 14090329 13981717
5873A3981717k3j4701l0480L2616j21427L030j12448M007O9887k60j8337j20079
$$ 13981717 13981694 13966993 13936513 13969129 13847702 13850732 13738284 13742291 13812178 13811918 13793581 13673502
5861A3673502n1810j486J19518Q2196j40786l7470m0876j26183q7276j55634N1639
$$ 13673502 13621692 13620206 13739724 13821920 13681134 13643664 13602788 13476605 13389329 13233695 13285334
5850A3285334K0610l0898R4625K3319j02355l5241N6138l293r5229n9889k1050
$$ 13285334 13305944 13275046 13369671 13392990 13290635 13255394 13311532 13308239 13213010 13153121 13132071
5839A3132071J32602m6448M3678m873p8075R108J12541P6430M8879R1816j27238
$$ 13132071 13264673 13218225 13261903 13257030 13178955 13188063 13300604 13377034 13425913 13517729 13390491
5828A3390491j18793R0717J9491n3918N8771K5754L2768o7739j9434j0145R2700
$$ 13390491 13271698 13362415 13381906 13327988 13386759 13412513 13445281 13377542 13358108 13347963 13440663
5817A3440663j35081J14354l5924j2573o0182j07230K38709K0516J11910l3294
$$ 13440663 13305582 13419936 13384012 13371439 13311257 13204027 13442736 13463252 13575162 13541868
5807A3541868m3938J12274l9516J20562J7860j02089L8267K9893q2315O1356q26
$$ 13541868 13497930 13610204 13570688 13691250 13709110 13607021 13645288 13675181 13592866 13654222 13653396
5796A3653396L0663N5408k2557L7624J66838Q2547K2711L6485P0478L7857n195
$$ 13653396 13684059 13739467 13716910 13754534 13921372 14003919 14026630 14063115 14133593 14171450 14166255
5785A4166255Q360N7153R6049P8049N1009R4580J43689R1219O3769L9450J30797
$$ 14166255 14174615 14231768 14327817 14405866 14456875 14551455 14695144 14786363 14850132 14889582 15020379
5774A5020379l8084Q5699P2205L0273J39417L1110n3018K20492k0170j04018J80337
$$ 15020379 14982295 15067994 15140199 15170472 15309889 15340999 15287981 15508473 15488303 15384285 15564622
5763A5564622O5461Q4116m6761j5447O8931P7803n6089q4175O9380O9189m5318
$$ 15564622 15630083 15714199 15667438 15651991 15720922 15798725 15742636 15658461 15727841 15797030 15751712
5752A5751712K9573J31609j1544J16617J728P588Q6279K1270J2785J13514P8072
$$ 15751712 15781285 15912894 15901350 16017967 16019695 16027283 16113562 16134832 16147617 16261131 16339203
5741A6339203J17105O5281j5811J03130o813J89963N8723J11097J41981J12722
$$ 16339203 16456308 16521589 16505778 16608908 16602095 16792058 16850781 16961878 17103859 17216581
5731A7216581p4225P871J43574k1161l8294q2039K17210R4513o0226J46402R8318
$$ 17216581 17142356 17150227 17293801 17272640 17234346 17152307 17369517 17464030 17403804 17550206 17648524
5720A7648524M3117J26727R014L351J33078J24937Q5351J40764J94430j1654R3539
$$ 17648524 17691641 17818368 17827382 17830733 17963811 18088748 18174099 18314863 18509293 18497639 18591178
5709A8591178J16963Q1077R5422Q8931O0972J68544N6987n5052P6867K02139J35474
$$ 18591178 18708141 18789218 18884640 18973571 19034543 19203087 19260074 19205022 19281889 19484028 19619502
5698A9619502q6176K52467M1427m8253K23877J13785Q9012J7972Q1721J42564
$$ 19619502 19533326 19785793 19827220 19778967 20002844 20116629 20205641 20223613 20305334 20447898
5688B0447898P5795M4476K92861K04980L9315J26257J24929J02040J70912L54650
$$ 20447898 20523693 20568169 20861030 21066010 21105325 21231582 21356511 21458551 21629463 21984113
5678B1984113P6169K13735K88518K49136K38836J31226J57032J35488K64734K62205
$$ 21984113 22060282 22274017 22562535 22811671 23050507 23181733 23338765 23474253 23738987 24001192
5668B4001192L15988M29880K48591M08572J68383M11624P09892O66761N43579
$$ 24001192 24317180 24747060 24995651 25404223 25572606 25984230 26694122 27360883 27904462
5659B7904462O79354O59133Q41574J060381J104540J167807J143892R19806N25291
$$ 27904462 28583816 29242949 30084523 31144904 32249444 33417251 34561143 35480949 36006240
5650C6006240J58060k30264l43362l99531m84912o10715m69222k94009N9685P1367
$$ 36006240 36164300 35934036 35590674 35191143 34706231 34095516 33626294 33332285 33391970 33463337
5640C3463337J93440L13853O04689P39961P66050R16280O89875K76633k83030
$$ 33463337 33656777 33970630 34575319 35315280 36081330 36997610 37687485 37964118 37681088
5631C7681088n40597o07157o33321p10936p75023p88790o41592n70624k80434
$$ 37681088 37140491 36533334 35900013 35189077 34414054 33625264 32983672 32413048 32132614
5622C2132614j13543k03399N3700N9608P4770J80850J06754K20468M23695K65503
$$ 32132614 32019071 31815672 31869372 31928980 32003750 32184600 32291354 32511822 32935517 33201020
5612C3201020K48541M33821N23527M43001N28878P84245Q34882O96875Q13570
$$ 33201020 33449561 33883382 34406909 34849910 35378788 36163033 36997915 37694790 38508360
5603C8508360J115714J322235J321506J580916J823634J809246K036464J936531
$$ 38508360 39624074 40946309 42267815 43848731 45672365 47481611 49518075 51454606
5595E1454606J706851J146670L29476m97147p13490p94280r40101r98530q90060
$$ 51454606 53161457 54308127 54637603 54140456 53426966 52632686 51692585 50694055 49803995
5586D9803995p52482l31165M4987L51278N58242Q72910J144052J073171J265981
$$ 49803995 49051513 48720348 48765335 49116613 49674855 50547765 51691817 52764988 54030969
5577E4030969R47781K71842l40665j023460j388138j369519j434006j485151j662544
$$ 54030969 54978750 55250592 54909927 53886467 52498329 51128810 49694804 48209653 46547109
5568D6547109j224843j105114r02708p59210n46876m48574j93319j55362m1734
$$ 46547109 45322266 44217152 43314444 42555234 42008358 41559784 41366465 41211103 41169369
5559D1169369j63253J63527K03081J97356J13764L29870L20596K43027L11861
$$ 41169369 41006116 41169643 41372724 41570080 41683844 42013714 42334310 42577337 42889198
5550D2889198L76002M07451L25788K77312L13863N66457O33557M73945M56616
$$ 42889198 43265200 43672651 43998439 44275751 44589614 45156071 45789628 46263573 46720189
5541D6720189O33514N95632O30593L53511L68870J83580p0386p2166q2002l24897
$$ 46720189 47353703 47949335 48579928 48933439 49302309 49485889 49415503 49343337 49261335 48936438
5531D8936438j65538k15780m3607n8099M0665N7030K51221J16911K31705K11313
$$ 48936438 48770900 48555120 48511513 48453414 48494079 48551109 48802330 48919241 49150946 49362259
5521D9362259K29375J79915R4811J98025R9869M8809K08379K51943Q1062R3545
$$ 49362259 49591634 49771549 49866360 50064385 50164254 50213063 50421442 50673385 50754447 50847992
5511E0847992J00959j33079o7098j53340k3280J90604J10895L31776K10363O0188
$$ 50847992 50948951 50815872 50748774 50595434 50572154 50762758 50873653 51205429 51415792 51475980
5501E1475980M60261N04354M59128P64462O38340O51415P16225Q40491P41227
$$ 51475980 51936241 52440595 52899723 53664185 54302525 54953940 55670165 56510656 57251883
5492E7251883Q43128J007801R33511P09502N49798J88839p6082l3965K02765K19565
$$ 57251883 58095011 59102812 60036323 60745825 61295623 61484462 61408380 61374415 61577180 61796745
5482F1796745k6789J27045K01075P5560M1543j2239n166K26738J63644J04024
$$ 61796745 61769956 61897001 62098076 62173636 62215179 62202940 62197774 62424512 62588156 62692180
5472F2692180J82747M12234N91732N25709Q10209R44102J264135J187548J492200
$$ 62692180 62874927 63287161 63878893 64404602 65214811 66158913 67423048 68610596 70102796
5463G0102796J659083J894790K106057K267511K393863J715441J624285J470135
$$ 70102796 71761879 73656669 75762726 78030237 80424100 82139541 83763826 85233961
5455H5233961J436129J528964J787552K087796K106866J688184J066825J92470
$$ 85233961 86670090 88199054 89986606 92074402 94181268 95869452 96936277 97128747
5447I7128747q34767j531158j521705j423296j372750j485633r89396n16554m155
$$ 97128747 96293980 94762822 93241117 91817821 90445071 88959438 87970042 87453488 87449333
5438H7449333O19806J175771J775934K141936K831422L580580M059262M696596
$$ 87449333 88069139 89244910 91020844 93162780 95994202 99574782 103634044 108330640
5430A08330640N209893N491303N113173L922195K209566L60349p95160j251209
$$ 108330640 113540533 119031836 124145009 128067204 130276770 130637119 129841959 128590750
5422A28590750j670139k253475k303093k317836k507473k908733l275649l208510
$$ 128590750 126920611 124667136 122364043 120046207 117538734 114630001 111354352 108145842
5414A08145842k708456k252049k002249j660301j021611j91383O30120J248474
$$ 108145842 105437386 103185337 101183088 99522787 98501176 98309793 98939913 100188387
5406A00188387K131060K842875L358073M131284M727106N325885N031192M002131
$$ 100188387 102319447 105162322 108520395 112651679 117378785 122704670 127735862 131737993
5398A31737993K725772J740457J755661J853189J323947K69812m30303n35379
$$ 131737993 134463765 136204222 137959883 139813072 141137019 141406831 140976528 140441149
5390A40441149m21844o94534r11157q44972j122835j733225l412796n027084n177983
$$ 140441149 140019305 139324771 138413614 137568642 136445807 134712582 131299786 126272702 121094719
5381A21094719m745631m162993l912292l630065l070143k101768j188208k89265
$$ 121094719 116349088 112186095 108273803 104643738 101573595 99471827 98283619 97994354
5373I7994354M28845R95089J503037J690686K217076K097704J376654P52745k62629
$$ 97994354 98423199 99418288 100921325 102612011 104829087 106926791 108303445 109056190 108793561
5364A08793561m75570k05262L1027J44140L81372M46263J88326q76526k576954
$$ 108793561 108317991 108112729 108143756 108287896 108669268 109115531 109303857 108427331 105850377
5355A05850377l770998m191347m090085l747396l956760l951515l360416k734020
$$ 105850377 102079379 97888032 93797947 90050551 86093791 82142276 78781860 76047840
5347G6047840k148968j809547j317626j139633q50993n02245n15435m27962k33048
$$ 76047840 73898872 72089325 70771699 69632066 68781073 68278828 67763393 67335431 67102383
5338F7102383j57017j57910J22850J13640J74674J42520K02912J46077J30707
$$ 67102383 66945366 66787456 66910306 67023946 67198620 67341140 67544052 67690129 67820836
5329F7820836N3260p255J87137K04712J04405J47693O4836m7456J04019J29225
$$ 67820836 67874096 67866841 68053978 68258690 68363095 68510788 68575624 68528168 68632187 68761412
5319F8761412J38361N7506J45246J71099M02363L01375L33827M35164L87350L38522
$$ 68761412 68899773 68957279 69102525 69273624 69675987 69977362 70311189 70746353 71133703 71472225
5309G1472225K24804O0006q8388j23709m3665j47419j61062q0480J3746m9702
$$ 71472225 71697029 71757035 71668647 71544938 71501273 71353854 71192792 71112312 71126058 71076356
5299G1076356J76416L26592J53180L05001K67077K18754M36991L07956K42360
$$ 71076356 71252772 71579364 71732544 72037545 72304622 72523376 72960367 73268323 73510683
5290G3510683N12799K84454L98924L59230K53034O1651Q7374J90800p1975Q3862
$$ 73510683 74023482 74307936 74706860 75066090 75319124 75380775 75468149 75658949 75586974 75670836
5280G5670836n1109N6218n4155k4725j30461Q4662j5899j40368J18195L00020
$$ 75670836 75619727 75675945 75621790 75597065 75466604 75551266 75535367 75394999 75513194 75813214
5270G5813214K04139J25157L07744K43601K50431L67903K77316J03418K53167
$$ 75813214 76017353 76142510 76450254 76693855 76944286 77312189 77589505 77692923 77946090
5261G7946090K31455J33877J41447j41254l09130l70647n70786o52808p72372
$$ 77946090 78177545 78311422 78452869 78311615 78002485 77631838 77061052 76408244 75635872
5252G5635872n91756n75986o95767n85949l88316m15538m83692k96503l40792
$$ 75635872 75044116 74468130 73772363 73186414 72798098 72382560 71898868 71602365 71261573
5243G1261573l23563l36071l01494n35387p29976o47184n35136p66260o69262
$$ 71261573 70938010 70601939 70300445 69765058 69035082 68387898 67852762 67086502 66417240
5234F6417240o04595p04266m66073l63331l01719m06879l28488k4070K0640j13801
$$ 66417240 65812645 65108379 64642306 64278975 63977256 63570377 63241889 63217819 63238459 63124658
5224F3124658J22030K30482N6707J17700K17849P8163L08672K89139L00138K28915
$$ 63124658 63246688 63477170 63533877 63651577 63869426 63947589 64256261 64545400 64845538 65074453
5214F5074453J37728K58722L97592K63720M47894O28455M67820O21834M66269
$$ 65074453 65212181 65470903 65868495 66132215 66580109 67208564 67676384 68298218 68764487
5205F8764487P41044P76337O42700P41300P80394P70180P35663R17637Q75780
$$ 68764487 69505531 70281868 70924568 71665868 72446262 73216442 73952105 74869742 75745522
5196G5745522J123970J338346J453845J626834J949128K271061K574196K817529
$$ 75745522 76869492 78207838 79661683 81288517 83237645 85508706 88082902 90900431
5188I0900431L121049L313894L316330L197037K376929J142850l81710j882693
$$ 90900431 94021480 97335374 100651704 103848741 106225670 107368520 106986810 105104117
5180A05104117k782440l166666l414840l781175l774078l418874l129141k446352
$$ 105104117 102321677 99155011 95740171 91958996 88184918 84766044 81636903 79190551
5172G9190551k032398j424302j104759q33094m58409j49929J90391M82920O76867
$$ 79190551 77158153 75733851 74629092 73795998 73337589 73187660 73378051 73860971 74537838
5163G4537838J214488J494188J781493K311687K705796K746900K786080K587025
$$ 74537838 75752326 77246514 79028007 81339694 84045490 86792390 89578470 92165495
5155I2165495J733944Q33277p58476j990749l203564l868324m053182m206672
$$ 92165495 93899439 94732716 93974240 91983491 88779927 84911603 80858421 76651749
5147G6651749m386210m042519l779711l318015k806461k286719k230119k113936
$$ 76651749 72265539 68223020 64443309 61125294 58318833 56032114 53801995 51688059
5139E1688059j644174j294929j132040j022009j121652q29494p15703n86644n41212
$$ 51688059 50043885 48748956 47616916 46594907 45473255 44643761 43928058 43341414 42800202
5130D2800202m02540m93077m99997k61996l98260n06987l56926m30531n98913
$$ 42800202 42397662 41904585 41404588 41142592 40744332 40237345 39880419 39449888 38850975
5121C8850975k63058l03514m11542l27379k68697l56756j98150k78247k16555
$$ 38850975 38587917 38284403 37872861 37545482 37276785 36920029 36721879 36443632 36227077
5112C6227077m0386j78975l32772j96916j57713k32707k63231j74407j20245k42855
$$ 36227077 36186691 36007716 35674944 35478028 35320315 35087608 34824377 34649970 34529725 34286870
5102C4286870j54099r3525j51357m4727P7738J02342J41327L2782l2874O9827
$$ 34286870 34132771 34039246 33887889 33843162 33920900 34023242 34164569 34197351 34164477 34234304
5092C4234304J17888J77108L33173L83342J11122J2125K94622J81592l7262j708
$$ 34234304 34352192 34529300 34862473 35245815 35356937 35369062 35663684 35845276 35808014 35806306
5082C5806306l1639J57579J59792J12592J09436L74343N36697L21308L54716O45060
$$ 35806306 35774667 35932246 36092038 36204630 36314066 36688409 37225106 37546414 37901130 38546190
5072C8546190N64528N72486P51723R05783P92280Q04086Q45722J034142J059827
$$ 38546190 39110718 39683204 40434927 41340710 42132990 42937076 43782798 44816940 45876767
5063D5876767J222181J449146J531162J774949J815520K050550K234668J909837
$$ 45876767 47098948 48548094 50079256 51854205 53669725 55720275 57954943 59864780
5055E9864780J796337J139776L85696l77125r78201j177914j511620j726039j668858
$$ 59864780 61661117 62800893 63186589 62809464 61831263 60653349 59141729 57415690 55746832
5046E5746832j572540j608794j473941j078031j125543r26640q79579p57245p01762
$$ 55746832 54174292 52565498 51091557 50013526 48887983 47961343 47081764 46324519 45622757
5037D5622757n83869o25433m11753l92719j76835k78064k71198J0642L8883O7081
$$ 45622757 45038888 44413455 44001702 43608983 43432148 43154084 42882886 42893528 42932411 42999492
5027D2999492K3009K73760K69478K83702K52501L76977L98097M93688O65124O67517
$$ 42999492 43022501 43296261 43565739 43849441 44101942 44478919 44877016 45370704 46035828 46703345
5017D6703345P32420P71146O21132R45872Q50488O39236N55865L68404L52662
$$ 46703345 47435765 48206911 48828043 49773915 50624403 51263639 51819504 52187908 52540570
5008E2540570J42395Q0128K60754J85210J04091M1400K09063L08799L86025N14894
$$ 52540570 52682965 52763093 53023847 53209057 53313148 53354548 53563611 53872410 54258435 54773329
4998E4773329O58869Q13528R43980Q79757R80655R09605Q66008P02459K96499
$$ 54773329 55432198 56245726 57189706 58069463 59050118 59959723 60825731 61528190 61824689
4989F1824689K1147k29680l55207k74752j35851k10534M0859J18779K38156J56542
$$ 61824689 61845836 61616156 61260949 60986197 60850346 60639812 60680671 60799450 61037606 61194148
4979F1194148P3789j25066j68943j39020j80904l1543l57475l00969l72907j31591
$$ 61194148 61267937 61142871 60973928 60834908 60654004 60622461 60264986 59964017 59591110 59459519
4969E9459519l4200n4901J3716K42824K36496K26108M19314M67303K74667O90782
$$ 59459519 59425319 59370418 59384134 59626958 59863454 60089562 60508876 60976179 61250846 61941628
4959F1941628P40219N62716P20032R02547P16682P38018R61770J019692J059019
$$ 61941628 62681847 63244563 63964595 64867142 65583824 66321842 67283612 68303304 69362323
4950F9362323J132324J030137J324139J254581J250000J247788J404451J394099
$$ 69362323 70494647 71524784 72848923 74103504 75353504 76601292 78005743 79399842
4942G9399842J530761J749409J740652J708776J792840K082950K338522K345226
$$ 79399842 80930603 82680012 84420664 86129440 87922280 90005230 92343752 94688978
4934I4688978K464230K695655L061300L431368L739743M315322M767599N400081
$$ 94688978 97153208 99848863 102910163 106341531 110081274 114396596 119164195 124564276
4926A24564276N741790N539730M910159L330641J439103L94337j05454n7999L29417
$$ 124564276 130306066 135845796 140755955 144086596 145525699 145920036 145814582 145756583 146086000
4917A46086000L85963N87050J129135J622339J827388J387963J091096P94086
$$ 146086000 146471963 147059013 148188148 149810487 151637875 153025838 154116934 154911020
4909A54911020J351250J988636K780681L628016M455843N602307P039926Q456426
$$ 154911020 156262270 158250906 161031587 164659603 169115446 174717753 181757679 190214105
4901A90214105R476659J0464235J1728646J1905718J1681570J1300696J1764968
$$ 190214105 199690764 210154999 221883645 233789363 245470933 256771629 268536597
4894B68536597J3573317J5586698J7434139J8844644J9391445J6619564R025565
$$ 268536597 282109914 297696612 315130751 333975395 353366840 369986404 379011969
4887C79011969k103369j0710960j2823087j1788880j1675855j4808753j7025066
$$ 379011969 376908600 366197640 353374553 341585673 329909818 315101065 298075999
4880B98075999j6252605j4144154j2185238r999937p890232o555952o115674o017810
$$ 298075999 281823394 267679240 255494002 245494065 237603833 231047881 224932207 218914397
4872B18914397o243494o545514o065891n101418m450505m445434m370408m197381
$$ 218914397 212670903 206125389 200059498 194958080 190507575 186062141 181691733 177494352
4864A77494352l900337l319614k777873k170321j686539j302446r12342r68667
$$ 177494352 173594015 170274401 167496528 165326207 163639668 162337222 161424880 160456213
4856A60456213j820491l557972n558621o484095o421651o384144o555046o421258
$$ 160456213 158635722 155077750 149519129 143035034 136613383 130229239 123674193 117252935
4848A17252935o044200n183666m321783l490420k778879k370208k189823j772453
$$ 117252935 111208735 106025069 101703286 98212866 95433987 93063779 90873956 89101503
4840H9101503j695640j678221j726488j538529j378471j291660j185513j226188
$$ 89101503 87405863 85727642 84001154 82462625 81084154 79792494 78606981 77380793
4832G7380793j140727r71562p09640o39465o47081n59994l64743l86671l12642
$$ 77380793 76240066 75268504 74558864 73919399 73272318 72712324 72347581 71960910 71648268
4823G1648268k94408q8748k60989O1862P6756J64945J36357M17700K68140L22167
$$ 71648268 71353860 71265112 71004123 71065985 71142741 71307686 71444043 71861743 72129883 72452050
4813G2452050M03857M60272M06248M60664M74795N49500P68259O27375O46700
$$ 72452050 72855907 73316179 73722427 74183091 74657886 75207386 75975645 76603020 77249720
4804G7249720R18969J130700J400949J526053J607321J991378K311214K305241
$$ 77249720 78168689 79299389 80700338 82226391 83833712 85825090 88136304 90441545
4796I0441545K463245L019030L418697L950229M383250M646796N042089N589025
$$ 90441545 92904790 95923820 99342517 103292746 107675996 112322792 117364881 122953906
4788A22953906O205701P084688Q042873R161654J0656324J2640445J5530650J8345065
$$ 122953906 129159607 136244295 144287168 153448822 164105146 176745591 192276241 210621306
4780B10621306K1664943K5199480K9134647L3013913L6214973L2472388J7612829
$$ 210621306 232286249 257485729 286620376 319634289 355849262 388321650 405934479
4773D05934479o376668k6143527k9514571k5548126k4521377l1142515l4474201
$$ 405934479 399557811 373414284 343899713 318351587 293830210 262687695 228213494
4766B28213494k9266610k2459624j7369143j3970188j1290867r071569p666406
$$ 228213494 198946884 176487260 159118117 145147929 133857062 124785493 117119087
4759A17119087o603527n371299m340308l303001k725222k268208j726699j626330
$$ 117119087 110515560 105144261 100803953 97500952 94775730 92507522 90780823 89154493
4751H9154493j548909j283801j234868j065936j356681j263228j304855j437588
$$ 89154493 87605584 86321783 85086915 84020979 82664298 81401070 80096215 78658627
4743G8658627j176626j024604r95497q50850p42956p63201p06728m84222m00723
$$ 78658627 77482001 76457397 75461900 74611050 73868094 73104893 72398165 71913943 71513220
4734G1513220l33140m401j37875q3030O9316L33872Q7891L12356O51218M39992
$$ 71513220 71180080 71175679 71037804 70954774 71024090 71357962 71445853 71758209 72409427 72849419
4724G2849419M78019M83958N80711Q02591Q31428Q54531R80888J175992J376005
$$ 72849419 73327438 73811396 74392107 75194698 76026126 76880657 77861545 79037537 80413542
4715H0413542J255759J435461J650422J732522J880263K182525K357087K441454
$$ 80413542 81669301 83104762 84755184 86487706 88367969 90550494 92907581 95349035
4707I5349035K665466K990835K958115L378631L783490L930078M329083M513236
$$ 95349035 98014501 101005336 103963451 107342082 111125572 115055650 119384733 123897969
4699A23897969M599569M680808N247636N698258O397301P293763Q137893R096441
$$ 123897969 128497538 133178346 138425982 144124240 150521541 157815304 165953197 175049638
4691A75049638J0193632J1316822J2375156J3811524J5149823J6027455J5478655
$$ 175049638 185243270 196560092 208935248 222746772 237896595 253924050 269402705
4684B69402705J1269890L489038n834863j2249502j4234519j4421815j5357193
$$ 269402705 280672595 284161633 278326770 266077268 251842749 237420934 222063741
4677B22063741j7262170j7331210j5264143j2469911j0159594q350562p006905
$$ 222063741 204801571 187470361 172206218 159736307 149576713 141226151 134219246
4670A34219246n944667m900062m040808l459530l084888k868008k549274k479865
$$ 134219246 128274579 123374517 119333709 115874179 112789291 109921283 107372009 104892144
4662A04892144k119311j876914j910081j537113j820714j844573k011059k185543
$$ 104892144 102772833 100895919 98985838 97448725 95628011 93783438 91772379 89586836
4654H9586836k119045k063905j880712j575099j683828j546363j232990j107965
$$ 89586836 87467791 85403886 83523174 81948075 80264247 78717884 77484894 76376929
4646G6376929j138076q96002p83822o58681o44914n01448m53100m13013m36895
$$ 76376929 75238853 74342851 73559029 72900348 72255434 71753986 71300886 70887873 70450978
4637G0450978p25625k82209m65422m22663m39726l15957j74331r1883j62341j13799
$$ 70450978 69725353 69443144 68977722 68555059 68115333 67799376 67625045 67533162 67370821 67257022
4627F7257022j42275j61468j87433j11242j43840n7019k0701j9911l98j14296
$$ 67257022 67114747 66953279 66765846 66654604 66510764 66453745 66433044 66413133 66412735 66298439
4617F6298439m370M7078J51689M3295J51590J59766Q0349L9275J00912K79242
$$ 66298439 66294069 66341147 66492836 66536131 66687721 66847487 66927836 66967111 67068023 67347265
4607F7347265K21103K65331L13553K96992L73277L33968P08179R11318J169791
$$ 67347265 67568368 67833699 68147252 68444244 68817521 69151489 69859668 70770986 71940777
4598G1940777J212473J413736J627662J481939R32206J05087m72129p04687p78240
$$ 71940777 73153250 74566986 76194648 77676587 78608793 78713880 78241751 77537064 76758824
4589G6758824j301615j944010k028099j719183j280593j392351j246833r17439
$$ 76758824 75457209 73513199 71485100 69765917 68485324 67092973 65846140 64928701
4581F4928701p15915m94384m13885k72928k88730j83893k10178r7845m5627j94183
$$ 64928701 64212786 63718402 63304517 63031589 62742859 62558966 62348788 62250943 62205316 62011133
4571F2011133n5162j0373r1546j80451k58449k32631l0517j77126j00024N5753
$$ 62011133 61955971 61945598 61854052 61673601 61415152 61182521 61152004 60974878 60874854 60930607
4561F0930607K4991O7766o8405j36570J9346K16389J60862K5722O6708J66758
$$ 60930607 60955598 61023364 60954959 60818389 60837735 61054124 61214986 61240708 61307416 61474174
4551F1474174L75479L56864J55268M45457M12298M05952M25980N71730P43583
$$ 61474174 61849653 62206517 62361785 62807242 63219540 63625492 64051472 64623202 65366785
4542F5366785O97390O87699P01058O96063J083917J006056J132833J066981J252971
$$ 65366785 66064175 66751874 67452932 68148995 69232912 70238968 71371801 72438782 73691753
4533G3691753J369594J376645J815769J929317J959658K290324K423554K753357
$$ 73691753 75061347 76437992 78253761 80183078 82142736 84433060 86856614 89609971
4525H9609971L053718L350660L691041M120132M776418N255174O080364O939492
$$ 89609971 92663689 96014349 99705390 103825522 108601940 113857114 119937478 126876970
4517A26876970P666084Q163657Q725020Q670477P936225O221072L187826n15063
$$ 126876970 134543054 142706711 151431731 160102208 168038433 174259505 177447331 176932268
4509A76932268l908433o408673p821693q486832r122106r403976q957423p922721
$$ 176932268 173023835 166615162 158793469 150306637 141184531 131780555 122823132 114900411
4501A14900411o921404n878335m960310m375181l537024k982155k641485k138097
$$ 114900411 107979007 102100672 97140362 92765181 89228157 86246002 83604517 81466420
4493H1466420j895133j512144j489197j345547j074812q92816q63193r12926q23202
$$ 81466420 79571287 78059143 76569946 75224399 74149587 73256771 72393578 71480652 70657450
4484G0657450p91423p99011j027893o35619o99712o37570o42766o63574o02264
$$ 70657450 69866027 69067016 68039123 67403504 66703792 66066222 65423456 64759882 64157618
4475F4157618o29387n09930m96252m56872l83833l62940k65337j79218k37841
$$ 64157618 63528231 63018301 62522049 62065177 61681344 61318404 61053067 60873849 60636008
4466F0636008j90476j13240j23788j36043K3033r8760P5191q2376j06465O2463
$$ 60636008 60445532 60332292 60208504 60072461 60095494 59996734 60071925 59989549 59883084 59945547
4456E9945547j45918l27166l55683j75701j29532j50826k74627j98421j59890
$$ 59945547 59799629 59472463 59116780 58941079 58811547 58660721 58386094 58187673 58027783
4447E8027783j29154k13033M1036j71712l5494j611o6630j2926p6821J6244M7084
$$ 58027783 57898629 57685596 57726632 57554920 57519426 57517815 57451185 57438259 57361438 57377682 57424766
4436E7424766K3394k0044K22771o7957p4194Q1821m0322K4050M2830l3784O4024
$$ 57424766 57448160 57428116 57650887 57582930 57508736 57590557 57550235 57574285 57617115 57583331 57647355
4425E7647355l4008l192J03226j70469q5872J12013J40117J00712R8233K0187
$$ 57647355 57613347 57610155 57713381 57542912 57457040 57569053 57709170 57809882 57908115 57928302
4415E7928302J4151J30976J07632J28431m3776J75212K01118J57924P0327m1029
$$ 57928302 57942453 58073429 58181061 58309492 58265716 58440928 58642046 58799970 58870297 58829268
4405E8829268Q0804J7520N1906J63511J03172N9309O7384J45559j486j09015J07069
$$ 58829268 58910072 58927592 58979498 59143009 59246181 59305490 59372874 59518433 59516947 59407932 59515001
4394E9515001l9760J68247j0908Q6941K45049J96162O2900J22901J74328O3636
$$ 59515001 59475241 59643488 59632580 59719521 59964570 60160732 60223632 60346533 60520861 60584497
4384F0584497K59852J78965m3811P4275L00362J03870J00539L3347J16881K57070
$$ 60584497 60844349 61023314 60979503 61053778 61354140 61458010 61558549 61591896 61708777 61965847
4374F1965847J84528K3942J25454O8358O045L2074J83176n2684q0842n8770K8885
$$ 61965847 62150375 62174317 62299771 62368129 62374174 62406248 62589424 62536740 62455898 62397128 62426013
4363F2426013j95700j51699m1293o7792p4083k04888j00946q4466L438J9125L1690
$$ 62426013 62230313 62078614 62037321 61969529 61895446 61690558 61589612 61505146 61508584 61527709 61559399
4352F1559399k2583o5075o7077L6637R0807N5022j05221k2539m7822N2154j58487
$$ 61559399 61536816 61471741 61404664 61441301 61532108 61587130 61481909 61459370 61411548 61463702 61305215
4341F1305215q9127J11508L4731l179J02693O8395n2950n2206J41710J00540J66050
$$ 61305215 61216088 61327596 61362327 61359148 61461841 61530236 61477286 61425080 61566790 61667330 61833380
4330F1833380J3424m2297q3788k0842K32032N138M6035k5328j1120L3485j2930
$$ 61833380 61846804 61804507 61720719 61699877 61931909 61937047 61983082 61957754 61946634 61980119 61967189
4319F1967189j05680O8697l6717n4085r3944M9712n347O0638L1049L6424k0823
$$ 61967189 61861509 61930206 61893489 61839404 61745460 61795172 61789825 61850463 61881512 61917936 61897113
4308F1897113r0405k3694q7409o580k8836J55635p9596j23209j13491N7609m7580
$$ 61897113 61806708 61783014 61695605 61689025 61660189 61815824 61736228 61613019 61499528 61557137 61509557
4297F1509557m0203r6472k5887j5370j14583n9824R4096m7064o0529j39661j36916
$$ 61509557 61469354 61372882 61346995 61331625 61217042 61157218 61251314 61204250 61143721 61004060 60867144
4286F0867144l5835K888O168o2366J7423p3319K011M6678Q998q7617j04685j91559
$$ 60867144 60831309 60834197 60840365 60777999 60795422 60722103 60724114 60770792 60779790 60692173 60587488 60395929
4274F0395929j5863l9166j13142r4040k202j82161o8432j4604q0899k11369j11322
$$ 60395929 60380066 60340900 60227758 60133718 60131516 59949355 59880923 59866319 59785420 59574051 59462729
4263E9462729j16041p7787j9267K3151j13415j66562j40196j88483M52j67058
$$ 59462729 59346688 59268901 59249634 59272785 59159370 58992808 58852612 58664129 58664581 58497523
4253E8497523j63352k48203q5967k2458j80871j86115k93427l5120r5072j83462
$$ 58497523 58334171 58085968 58000001 57977543 57796672 57610557 57317130 57282010 57186938 57003476
4243E7003476j86731j14949j53540k30370k04646j96457j13768j95324j17262
$$ 57003476 56816745 56701796 56548256 56317886 56113240 55916783 55803015 55607691 55490429
4234E5490429k36012k20862k57389j12505j19195k05289k72257l06217r3496m04446
$$ 55490429 55254417 55033555 54776166 54663661 54544466 54339177 54066920 53760703 53667207 53262761
4224E3262761j68115k02663l31668k50209j40570j93250k49961k51313k90715
$$ 53262761 53094646 52891983 52560315 52310106 52169536 51976286 51726325 51475012 51184297
4215E1184297k49152j56025l02716k40005j23036j45096l23608k36384j97774
$$ 51184297 50935145 50779120 50476404 50236399 50113363 49968267 49644659 49408275 49210501
4206D9210501k31730k56140l54734l31772m29240k44503m17464k39587l41088
$$ 49210501 48978771 48722631 48367897 48036125 47606885 47362382 46944918 46705331 46364243
4197D6364243m00902l74057l82500k94977k33994l61457m42056l97668k10800
$$ 46364243 45963341 45589284 45206784 44911807 44677813 44316356 43874300 43476632 43265832
4188D3265832k92051k65148l61030l32722k99570l61561m40708k12016l24988
$$ 43265832 42973781 42708633 42347603 42014881 41715311 41353750 40913042 40701026 40376038
4179D0376038l21293l53948k77521l35778l02175k82331k89324k60035m48890
$$ 40376038 40054745 39700797 39423276 39087498 38785323 38502992 38213668 37953633 37504743
4170C7504743k72223j54623m54168l80028j62591l08794k64133l35537m15662
$$ 37504743 37232520 37077897 36623729 36243701 36081110 35772316 35508183 35172646 34756984
4161C4756984k26445k56311k30220j43696k04117l20885k03892j85473k33447
$$ 34756984 34530539 34274228 34044008 33900312 33696195 33375310 33171418 32985945 32752498
4152C2752498l60164m10227j38958j55769k38784k34967k90630l63131j86263
$$ 32752498 32392334 31982107 31843149 31687380 31448596 31213629 30922999 30559868 30373605
4143C0373605j49657j60151l27788j04624j42517j57876l56740k44988n6919r4650
$$ 30373605 30223948 30063797 29736009 29631385 29488868 29330992 28974252 28729264 28672345 28577695
4133B8577695k35678j26473j24348l01669j92542l22366n6278j29205j56663j00552
$$ 28577695 28342017 28215544 28091196 27789527 27596985 27274619 27218341 27089136 26932473 26831921
4123B6831921k21044j66119j75358k6214j66796o4954j0903j73232q1206N5528
$$ 26831921 26610877 26444758 26269400 26243186 26076390 26011436 26000533 25827301 25746095 25801623
4113B5801623j17840k37966n0228N482j36557L415q4807j59922l5250K4039J8381
$$ 25801623 25683783 25445817 25395589 25401071 25264514 25267929 25183122 25023200 24987950 25011989 25030370
4102B5030370j72318n7684n0351k1022M2129o5021m7170L6355n528j26831J01324
$$ 25030370 24858052 24800368 24750017 24728995 24771124 24706103 24658933 24695288 24689760 24562929 24664253
4091B4664253J49569O7133J0462J19772j1851N6936j7375J33268J44474J40483
$$ 24664253 24813822 24880955 24891417 25011189 24999338 25056274 25038899 25172167 25316641 25457124
4081B5457124J99741K38684M20491K64690M17978N80202K28596P9309k35427l90332
$$ 25457124 25656865 25895549 26316040 26580730 26998708 27578910 27807506 27886815 27651388 27261056
4071B7261056j94864j46461k31305k94588l32132l10124j19642j10311l9562o1430
$$ 27261056 27066192 26919731 26688426 26393838 26061706 25751582 25631940 25521629 25482067 25420637
4061B5420637o3471j22574l1771P1427o293L5092J67195J0717O8548J27715R7354
$$ 25420637 25357166 25234592 25202821 25274248 25267955 25303047 25470242 25480959 25549507 25677222 25774576
4050B5774576Q4785L6198l1283m9398J34717O6307k9107J9765J4711J60819J16284
$$ 25774576 25859361 25895559 25864276 25814878 25949595 26015902 25986795 26006560 26021271 26182090 26298374
4039B6298374j5032j0057o2483K4733j551J72560q684j85377j0793l8774J90221
$$ 26298374 26283342 26273285 26210802 26235535 26233984 26406544 26397860 26212483 26201690 26162916 26353137
4028B6353137K2661M3319o9887J80328J19806p2662J92926J48653O9514K36225
$$ 26353137 26375798 26419117 26349230 26529558 26649364 26576702 26769628 26918281 26987795 27224020
4018B7224020m9855J05290l7449J80051J94800M9930K28252J91646K96086P8863
$$ 27224020 27174165 27279455 27242006 27422057 27616857 27666787 27895039 28086685 28382771 28461634
4008B8461634K25599J10970J97893K05043P7684J53939L51645K73342J36164J93084
$$ 28461634 28687233 28798203 28996096 29201139 29278823 29432762 29784407 30057749 30193913 30386997
3998C0386997K09246L09349Q4009J59350J25150K47108J29270p1612J32048K42845
$$ 30386997 30596243 30905592 30989601 31148951 31274101 31521209 31650479 31578867 31710915 31953760
3988C1953760R0739J61289J02113m9418J34212R4818Q0229J02737l8991m2287
$$ 31953760 32044499 32205788 32307901 32258483 32392695 32487513 32567742 32670479 32631488 32589201
3978C2589201J06569l6408O4040k9199O4949o773M0215J77780N6037K4488J47095
$$ 32589201 32695770 32659362 32723402 32694203 32759152 32752379 32792594 32970374 33026411 33050899 33197994
3967C3197994M7801J9623J66747J80177J05099J05036K41058K87750L2074L43103
$$ 33197994 33245795 33265418 33432165 33612342 33717441 33822477 34063535 34351285 34383359 34726462
3957C4726462K87532K62149M06527L00810L01468L81453K13951K11905M46419
$$ 34726462 35013994 35276143 35682670 35983480 36284948 36666401 36880352 37092257 37538676
3948C7538676M18737L92308L91947L57849K80767L51611N91364N06121O06515
$$ 37538676 37957413 38349721 38741668 39099517 39380284 39731895 40323259 40829380 41435895
3939D1435895N90399N33951N49554M82363O87607N61234M95784M57794M17562
$$ 41435895 42026294 42560245 43109799 43592162 44279769 44841003 45336787 45794581 46212143
3930D6212143M27493M34024K45159L33084M75979L71002L82056M38501M01899
$$ 46212143 46639636 47073660 47318819 47651903 48127882 48498884 48880940 49319441 49721340
3921D9721340N27425M92589O13647N88301N19552M37295J83581P2983M508K04692
$$ 49721340 50248765 50741354 51355001 51943302 52462854 52900149 53083730 53156713 53161221 53365913
3911E3365913J89692N3161K02376Q2486O953L734K07390J90110K14450J17211
$$ 53365913 53555605 53608766 53811142 53893628 53900581 53904315 54111705 54301815 54516265 54633476
3901E4633476J96363K63931K05012K60741J92729K50393K73281M58758N91494
$$ 54633476 54829839 55093770 55298782 55559523 55752252 56002645 56275926 56734684 57326178
3892E7326178O71502N28952O16045O30293O47951Q36450O42636O72064P03606
$$ 57326178 57997680 58526632 59142677 59772970 60420921 61257371 61900007 62572071 63275677
3883F3275677N39412N31590N50174N50474N81248O63295O67837P40820Q03774
$$ 63275677 63815089 64346679 64896853 65447327 66028575 66691870 67359707 68100527 68904301
3874F8904301P85282P31775N63140O40498M75505P9382k94957l99648o02844o02359
$$ 68904301 69689583 70421358 70984498 71624996 72100501 72179883 71884926 71485278 70882434 70280075
3864G0280075n94399o09101n90667l36894j60175k09017j82094k02387p1861l11839
$$ 70280075 69685676 69076575 68485908 68149014 67988839 67779822 67597728 67395341 67323480 67011641
3854F7011641m16223m75454n80653o78020n68938o28875l93683k89340l70017
$$ 67011641 66595418 66119964 65539311 64861291 64292353 63663478 63269795 62980455 62610438
3845F2610438j27248J1774J13287K33097N57M6503L10102R4873P3432j1766J6118
$$ 62610438 62483190 62494964 62608251 62841348 62841905 62888408 63198510 63293383 63366815 63355049 63371167
3834F3371167L71592L03034L44659K37747L27515L28548M60513L67414O19589
$$ 63371167 63742759 64045793 64390452 64628199 64955714 65284262 65744775 66112189 66731778
3825F6731778N10576J52769J10710j30850r3423l31668l25918l48967l38050R5876
$$ 66731778 67242354 67395123 67505833 67374983 67281560 66949892 66623974 66275007 65936957 66032833
3815F6032833R0726m0659Q1398O7350K00231R6727j02975Q100N7116j84659j24131
$$ 66032833 66123559 66082900 66164298 66231648 66431879 66528606 66425631 66433731 66490847 66306188 66182057
3804F6182057j82171j05303J53923K45967P8639M6360N2906K39832L40384L23513
$$ 66182057 65999886 65894583 66048506 66294473 66373112 66419472 66472378 66712210 67052594 67376107
3794F7376107N84568K34594M22297M25502N02330N19030N75630N69718N68069
$$ 67376107 67960675 68195269 68617566 69043068 69545398 70064428 70640058 71209776 71777845
3785G1777845N65151O82793P98845O67360P41519O26872P84530R07914R49128
$$ 71777845 72342996 73025789 73824634 74491994 75233513 75860385 76644915 77552829 78501957
3776G8501957Q56001J106833R88630J173525J231509J128388J353101J383459
$$ 78501957 79357958 80464791 81453421 82626946 83858455 84986843 86339944 87723403
3768H7723403J364764J566555J526390J594442J694620J804212K008999K035305
$$ 87723403 89088167 90654722 92181112 93775554 95470174 97274386 99283385 101318690
3760A01318690K091369K311959K144935K280540K452973K384935K620080K646645
$$ 101318690 103410059 105722018 107866953 110147493 112600466 114985401 117605481 120252126
3752A20252126K423102K704152K780823K565632K557220K578887K752366K732319
$$ 120252126 122675228 125379380 128160203 130725835 133283055 135861942 138614308 141346627
3744A41346627K693804K448628K434040K604290K570031K235510K260268K261942
$$ 141346627 144040431 146489059 148923099 151527389 154097420 156332930 158593198 160855140
3736A60855140K270551J919425J904256K060043J889233J761405J693965J858410
$$ 160855140 163125691 165045116 166949372 169009415 170898648 172660053 174354018 176212428
3728A76212428J887479J780459J657141J753725J655281J893729J904736J853236
$$ 176212428 178099907 179880366 181537507 183291232 184946513 186840242 188744978 190598214
3720A90598214J835177J950234K008231J984847J992590K182987K404810K275844
$$ 190598214 192433391 194383625 196391856 198376703 200369293 202552280 204957090 207232934
3712B07232934K228470K449423K685953K603540K653020K827627K948534K742692
$$ 207232934 209461404 211910827 214596780 217200320 219853340 222680967 225629501 228372193
3704B28372193K756925K918360K863448K883079K879437L047747K982866K939207
$$ 228372193 231129118 234047478 236910926 239794005 242673442 245721189 248704055 251643262
3696B51643262K728059K786817K899265K873159K792588K497197K532848K506013
$$ 251643262 254371321 257158138 260057403 262930562 265723150 268220347 270753195 273259208
3688B73259208K320142K146111K027128K011267J819660J652757J615637J386741
$$ 273259208 275579350 277725461 279752589 281763856 283583516 285236273 286851910 288238651
3680B88238651J323982J330218J165594R92936R52599Q48165Q48953P08761N86496
$$ 288238651 289562633 290892851 292058445 293051381 294003980 294852145 295701098 296409859 296996355
3671B96996355N98964O23752M87866L20133L20476L49100K50102L39377K03887
$$ 296996355 297595319 298219071 298706937 299027070 299347546 299696646 299946748 300286125 300490012
3662C00490012J18796J67064J84984J22125J08352Q0449J02619J37267J81591
$$ 300490012 300608808 300775872 300960856 301082981 301191333 301271782 301374401 301511668 301693259
3653C01693259K02255J17391K99587K10129O9656J92537r4992J31483K8244k1901
$$ 301693259 301895514 302012905 302312492 302522621 302592277 302784814 302689822 302821305 302849549 302827648
3643C02827648l9200k14868j97754l37843j82024k79875m74946l80654k27573
$$ 302827648 302788448 302573580 302375826 302037983 301855959 301576084 301101138 300720484 300492911
3634C00492911l48986m18323l32495m59953m59179l36030j10737k04596l51846
$$ 300492911 300143925 299725602 299393107 298933154 298473975 298137945 298027208 297822612 297470766
3625B97470766m79324m86899k18691k93449l43230j07655j5074p9802K73621L16106
$$ 297470766 296991442 296504543 296285852 295992403 295649173 295541518 295526444 295446642 295720263 296036369
3615B96036369O57455M88806O58260N71026N66324O44433M32028K45196J50503
$$ 296036369 296693824 297182630 297840890 298411916 298978240 299622673 300054701 300299897 300450400
3606C00450400o793k70977l86930o24085n37822p17465q80555j091410j192439
$$ 300450400 300443607 300172630 299785700 299161615 298623793 297906328 297025773 295934363 294741924
3597B94741924j286630j208786j394432j426893j276637j360504j474370j656102
$$ 294741924 293455294 292246508 290852076 289425183 288148546 286788042 285313672 283657570
3589B83657570j619690j628251j895344j929293j768385j705980j659751j529026
$$ 283657570 282037880 280409629 278514285 276584992 274816607 273110627 271450876 269921850
3581B69921850j139274r26214n53734m1890K14495Q11878J002829J596218J991807
$$ 269921850 268782576 267856362 267302628 267260738 267475233 268287111 269289940 270886158 272877965
3572B72877965K131615K330382K575811K587852K738068K828679K840193K739828
$$ 272877965 275009580 277339962 279915773 282503625 285241693 288070372 290910565 293650393
3564B93650393K495449K496689K231754J928657J402064J070258N70803K7955
$$ 293650393 296145842 298642531 300874285 302802942 304205006 305275264 305846067 305874022
3556C05874022n22021p96157j200989j705269j854985k072361k430863k509890
$$ 305874022 305352001 304555844 303354855 301649586 299794601 297722240 295291377 292781487
3548B92781487k427785k380563k575599k488903k494680k677370k510965k523600
$$ 292781487 290353702 287973139 285397540 282908637 280413957 277736587 275225622 272702022
3540B72702022k697127k692874k652520k730817k765058k759231k798266k701906
$$ 272702022 270004895 267312021 264659501 261928684 259163626 256404395 253606129 250904223
3532B50904223k889332k648678k663548k638764k669034k395757k218333k171746
$$ 250904223 248014891 245366213 242702665 240063901 237394867 234999110 232780777 230609031
3524B30609031k052556j923021j816385j830106j726040j591577j516697j492464
$$ 230609031 228556475 226633454 224817069 222986963 221260923 219669346 218152649 216660185
3516B16660185j291780j221192j111709j192766r08855q53192r20028p64856o44726
$$ 216660185 215368405 214147213 213035504 211842738 210933883 210080691 209160663 208395807 207751081
3507B07751081o30176n25063n79861l53866l78919k73273l48434l90184m28140
$$ 207751081 207120905 206595842 206015981 205662115 205283196 205009923 204661489 204271305 203843165
3498B03843165l93842n51778n20078m21111o63004o18751p56211q71167r61508
$$ 203843165 203449323 202897545 202377467 201956356 201293352 200674601 199918390 199047223 198085715
3489A98085715r24882j195650j206132j374275j385089j323481j433403j428876
$$ 198085715 197160833 195965183 194759051 193384776 191999687 190676206 189242803 187813927
3481A87813927j446858j471690j439899j514698j260744j440121j634287j450497
$$ 187813927 186367069 184895379 183455480 181940782 180680038 179239917 177605630 176155133
3473A76155133j421795j477254j467644j512793j771490j443831j649809j749584
$$ 176155133 174733338 173256084 171788440 170275647 168504157 167060326 165410517 163660933
3465A63660933j818540j838367k072370j954894j875632j881882j880241k003032
$$ 163660933 161842393 160004026 157931656 155976762 154101130 152219248 150339007 148335975
3457A48335975j971244j966500j740742j860667j633424j747683j820990j586010
$$ 148335975 146364731 144398231 142657489 140796822 139163398 137415715 135594725 134008715
3449A34008715j584759j611469j337642j347343j260167j163453j057842j027049
$$ 134008715 132423956 130812487 129474845 128127502 126867335 125703882 124646040 123618991
3441A23618991r20233q72559q07160o70248n85193p27221o91342m76937o73689
$$ 123618991 122698758 121826199 121019039 120348791 119763598 119036377 118345035 117868098 117194409
3432A17194409m78883n24824p13285p78120r00988p82132p61264o98451q03076
$$ 117194409 116715526 116190702 115477417 114699297 113798309 113016177 112254913 111556462 110753386
3423A10753386r30663p56226p18884o02802q02779p37507o64681p69121q29950
$$ 110753386 109822723 109066497 108347613 107744811 106942032 106204525 105539844 104770723 103940773
3414A03940773r12430j001551r56394j093090j071683j155437r13995r89670j121672
$$ 103940773 103028343 102026792 101070398 99977308 98905625 97750188 96836193 95846523 94724851
3405I4724851j104675j205372j177142r89930j072026r20184q84020q25335p17199
$$ 94724851 93620176 92414804 91237662 90247732 89175706 88255522 87371502 86546167 85828968
3396H5828968n95089l48579n50578n23953k45289j19787j69957K8429P1097Q0262
$$ 85828968 85233879 84885300 84334722 83810769 83565480 83445693 83275736 83304165 83375262 83455524
3386H3455524L74733M32525L13594L39944N18102P11889N49594O15532P24414
$$ 83455524 83830257 84262782 84576376 84916320 85434422 86146311 86695905 87311437 88035851
3377H8035851Q54070N33193O88300O77335P12741N83759N40197N93293N56263
$$ 88035851 88889921 89423114 90111414 90788749 91501490 92085249 92625446 93218739 93775002
3368I3775002M83176L72937M25940K08519J91555K6314j73942o8528k65192l19079
$$ 93775002 94258178 94631115 95057055 95265574 95457129 95483443 95309501 95240973 94975781 94656702
3358I4656702l34289l69661m90012o32060m44064m05272m52356m74678l75136
$$ 94656702 94322413 93952752 93462740 92830680 92386616 91981344 91528988 91054310 90679174
3349I0679174k92609k89581m3634R3653O9875N1178L3645q5201K3515L74261L71920
$$ 90679174 90386565 90096984 90053350 90147003 90216878 90268056 90301701 90216500 90240015 90614276 90986196
3338I0986196L38012L50253M76420N43495R02711R49067J094748J019121Q41346
$$ 90986196 91324208 91674461 92150881 92694376 93597087 94546154 95640902 96660023 97501369
3329I7501369J046585R83814J115959R49237O77149P24514O83860O63649N07406
$$ 97501369 98547954 99531768 100647727 101596964 102274113 102998627 103682487 104346136 104853542
3320A04853542O10194O44096N19858N28681M51512N21644N08647J92639j72585
$$ 104853542 105463736 106107832 106627690 107156371 107607883 108129527 108638174 108830813 108658228
3311A08658228m20379o38389o17999p60863q03834p05795n26065n00253l96618
$$ 108658228 108237849 107599460 106981461 106220598 105416764 104710969 104184904 103684651 103288033
3302A03288033j20112n1962m533M5627M4552M91120N73795N79579N71456O76454
$$ 103288033 103167921 103115959 103111426 103157053 103201605 103692725 104266520 104846099 105417555 106094009
3292A06094009Q29721Q65172P88125Q18394R00746R54330J063479Q98720J000514
$$ 106094009 106923730 107788902 108577027 109395421 110296167 111250497 112313976 113212696 114213210
3283A14213210R81931J073716J097384R31052Q49287P72907N64574O46820N73533
$$ 114213210 115195141 116268857 117366241 118297293 119146580 119919487 120484061 121130881 121704414
3274A21704414N18869L42623M15727K13798J61420J77708J45612L10041L09285
$$ 121704414 122223283 122565906 122981633 123195431 123356851 123534559 123680171 123990212 124299497
3265A24299497K01469L69747K60332K95453J78153K13095J51709K55271K9827
$$ 124299497 124500966 124870713 125131045 125426498 125604651 125817746 125969455 126224726 126254553
3256A26254553n6181K11459J9619J34915K30142K19942J55179L82802K41265L39491
$$ 126254553 126198372 126409831 126429450 126564365 126794507 127014449 127169628 127552430 127793695 128133186
3246A28133186M61984N26494N09717O25035P10934Q52814P61679R73220J018500
$$ 128133186 128595170 129121664 129631381 130256416 130967350 131820164 132581843 133555063 134573563
3237A34573563R68341J160260J145245J328590J294344J259930J353213J395116
$$ 134573563 135541904 136702164 137847409 139175999 140470343 141730273 143083486 144478602
3229A44478602J318852J389221J375894J467746J566021J556484J402915J363777
$$ 144478602 145797454 147186675 148562569 150030315 151596336 153152820 154555735 155919512
3221A55919512J346466J365847J352678J307889J188690Q20268Q76610Q43503
$$ 155919512 157265978 158631825 159984503 161292392 162481082 163301350 164177960 165021463
3213A65021463P68674P57891P96685N59223P05599N78759M82873M19306M07431
$$ 165021463 165790137 166548028 167344713 167903936 168609535 169188294 169671167 170090473 170497904
3204A70497904M25513N54772M50810M16696M18707N21794N13334N99671P33265
$$ 170497904 170923417 171478189 171928999 172345695 172764402 173286196 173799530 174399201 175132466
3195A75132466Q39231R73006J002332J188953J227885J255249J175631J294206
$$ 175132466 175971697 176944703 177947035 179135988 180363873 181619122 182794753 184088959
3187A84088959J287938J423722J694557J681426J545649J852102J767528J928923
$$ 184088959 185376897 186800619 188495176 190176602 191722251 193574353 195341881 197270804
3179A97270804J988219K028215K030095K172382K050527K135670K106444K081931
$$ 197270804 199259023 201287238 203317333 205489715 207540242 209675912 211782356 213864287
3171B13864287K080995K228977K275650K154960K066243K153957K342002K133593
$$ 213864287 215945282 218174259 220449909 222604869 224671112 226825069 229167071 231300664
3163B31300664K275625K092184K027425J858493J664215J484187J370895J027008
$$ 231300664 233576289 235668473 237695898 239554391 241218606 242702793 244073688 245100696
3155B45100696J183573O12124L24543K81573K39426K75587R345j93400j6731J24650
$$ 245100696 246284269 246896393 247220936 247502509 247741935 248017522 248026867 247833467 247816736 247941386
3145B47941386K74369K62419K88793N45532M96225P47405R19217J057656J134251
$$ 247941386 248215755 248478174 248766967 249312499 249808724 250556129 251475346 252533002 253667253
3136B53667253J336366J448474J594506J810150K061308K276571K543894K462596
$$ 253667253 255003619 256452093 258046599 259856749 261918057 264194628 266738522 269201118
3128B69201118K793254L016160L306834L646418L605664L498158L238336K579709
$$ 269201118 271994372 275010532 278317366 281963784 285569448 289067606 292305942 294885651
3120B94885651K574623K485331K342492K078275J784459J684159J679748J642636
$$ 294885651 297460274 299945605 302288097 304366372 306150831 307834990 309514738 311157374
3112C11157374J556609J367661J343311J231613J108028Q69047O67729L29951
$$ 311157374 312713983 314081644 315424955 316656568 317764596 318633643 319301372 319631323
3104C19631323p8380l55370o32275q43570j049306j284337j531875j737771j971618
$$ 319631323 319552943 319197573 318565298 317721728 316672422 315388085 313856210 312118439 310146821
3095C10146821j636324j716665j824926j702264j721187k085172k184411k328143
$$ 310146821 308510497 306793832 304968906 303266642 301545455 299460283 297275872 294947729
3087B94947729k329921k064349k050760k051604k069360j776220j269314j303338
$$ 294947729 292617808 290553459 288502699 286451095 284381735 282605515 281336201 280032863
3079B80032863j095228q94875p41476o35806n16091l16339k91715l52903m43727
$$ 280032863 278937635 278042760 277301284 276665478 276149387 275833048 275541333 275188430 274744703
3070B74744703n09601n08295m77042p55892r97773r54885j396810j689456j701421
$$ 274744703 274235102 273726807 273249765 272493873 271496100 270541215 269144405 267454949 265753528
3061B65753528j946889k259141k375747k816080k949550l051542l229400l300357
$$ 265753528 263806639 261547498 259171751 256355671 253406121 250354579 247125179 243824822
3053B43824822l411996l442087l490593l451851l316008l301260l321873l279468
$$ 243824822 240412826 236970739 233480146 230028295 226712287 223411027 220089154 216809686
3045B16809686l358764l210596k932486k927053l004653k888179k632614k435361
$$ 216809686 213450922 210240326 207307840 204380787 201376134 198487955 195855341 193419980
3037A93419980k504750k512319k361241k176593k279077j827479j923739j894113
$$ 193419980 190915230 188402911 186041670 183865077 181586000 179758521 177834782 175940669
3029A75940669j755151j903105j693143j605007j622258j658705j390468j251216
$$ 175940669 174185518 172282413 170589270 168984263 167362005 165703300 164312832 163061616
3021A63061616j361675j281836j277610j332550j125318j043884j123149j209346
$$ 163061616 161699941 160418105 159140495 157807945 156682627 155638743 154515594 153306248
3013A53306248j170199j055404r83308j107648r41076j025869q76586q43478j042044
$$ 153306248 152136049 151080645 150097337 148989689 148048613 147022744 146146158 145302680 144260636
3004A44260636p52898q24720p27407p02123q05916o78409p45990q18424p83766
$$ 144260636 143507738 142683018 141955611 141253488 140447572 139769163 139023173 138204749 137420983
2995A37420983p56557p84099p70605p64431q97047p56896o18475o27480o30179
$$ 137420983 136664426 135880327 135109722 134345291 133448244 132691348 132072873 131445393 130815214
2986A30815214m26378m18476m92316m07749l66525l72375j74756k96648k00330
$$ 130815214 130388836 129970360 129478044 129070295 128703770 128331395 128156639 127859991 127659661
2977A27659661k47209k32361k73257n21319o42697p67332q11833q65389p36717
$$ 127659661 127412452 127180091 126906834 126385515 125742818 124975486 124163653 123298264 122561547
2968A22561547j060853j234591j201563j151507j272667j260705j109682r50823
$$ 122561547 121500694 120266103 119064540 117913033 116640366 115379661 114269979 113319156
2960A13319156q86748r52173r30441p51820p13213o12684n85374l88517k99297
$$ 113319156 112432408 111480235 110549794 109797974 109084761 108472077 107886703 107498186 107198889
2951A07198889l88154l32287k57945j82166L3317k47127m2618N2382J14443K26637
$$ 107198889 106810735 106478448 106220503 106038337 106071654 105824527 105781909 105834291 105948734 106175371
2941A06175371J19624J28884L44491L71322M29279M66446M99047O33166O50624
$$ 106175371 106294995 106423879 106768370 107139692 107568971 108035417 108534464 109167630 109818254
2932A09818254N86125N41621L37801L31836K14050k0173n968l20473l30338m52001
$$ 109818254 110404379 110946000 111283801 111615637 111829687 111809514 111803546 111483073 111152735 110700734
2922A10700734o60593r02509j022813j215831j302317j351011j290691j515313
$$ 110700734 110040141 109137632 108114819 106898988 105596671 104245660 102954969 101439656
2914A01439656j430604j331062j327067j601238j370441j369746j169567j331939
$$ 101439656 100009052 98677990 97350923 95749685 94379244 93009498 91839931 90507992
2906I0507992j427844j299464j198378j122752r56286j068270q22140q32452p15222
$$ 90507992 89080148 87780684 86582306 85459554 84503268 83434998 82612858 81780406 81065184
2897H1065184m37410l20944j80195l44911j29665N0679J54286K6800j06955J57026
$$ 81065184 80627774 80306830 80126635 79781724 79652059 79702738 79857024 79883824 79776869 79933895
2887G9933895Q1401J66113K60540J2310J41470o4348Q5904L5469j82862j73751
$$ 79933895 80015296 80181409 80441949 80454259 80595729 80531381 80617285 80652754 80469892 80296141
2877H0296141j99133n80154o44353o93088j056268j142636j135547j101848j032573
$$ 80296141 80097008 79516854 78872501 78179413 77123145 75980509 74844962 73743114 72710541
2868G2710541j054147j067554j009531j206430j239625j039333j268829j070833
$$ 72710541 71656394 70588840 69579309 68372879 67133254 66093921 64825092 63754259
2860F3754259j142583j188121r74755j093998j279735j223844j241253j173942
$$ 63754259 62611676 61423555 60448800 59354802 58075067 56851223 55609970 54436028
2852E4436028j215375j057296j032198j059679q80349q00035p06180m99386p12481
$$ 54436028 53220653 52163357 51131159 50071480 49191131 48391096 47684916 47185530 46473049
2843D6473049m50673l84361l74729k12404r1330k7682J53157O0363P7981K05966
$$ 46473049 46022376 45638015 45263286 45050882 44959552 44931870 45085027 45145390 45223371 45429337
2833D5429337J90513K51056J48228P0605j14673l70699r43026j070421j044605
$$ 45429337 45619850 45870906 46019134 46089739 45975066 45604367 44661341 43590920 42546315
2824D2546315r81191p88147r81188j076670r85279r06617q34733r57804p99253
$$ 42546315 41565124 40776977 39795789 38719119 37733840 36827223 35992490 35034686 34235433
2815C4235433p61781n76719l98666n48054n41130k97752r7929o3671Q929J15933
$$ 34235433 33473652 32896933 32498267 31950213 31409083 31111331 31013402 30949731 30958660 31074593
2805C1074593l3717l91940p59094j001734r76942j088890q54261r63558j122425
$$ 31074593 31040876 30648936 29889842 28888108 27911166 26822276 25968015 25004457 23882032
2796B3882032q16692o60060o12539o83963m20454l77924m09518m85485l82925
$$ 23882032 23065340 22405280 21792741 21108778 20688324 20310400 19900882 19415397 19032472
2787A9032472l63949k79160j83761j41523j9261l6059J84577J81085L57044R8474
$$ 19032472 18668523 18389363 18205602 18064079 18044818 18008759 18193336 18374421 18731465 18829939
2777A8829939j87486m68498o46740m76496m73197l33893m75079m37898l07293
$$ 18829939 18642453 18173955 17527215 17050719 16577522 16243629 15768550 15330652 15023359
2768A5023359k05825l10556k59696l30655j49434j56930p8681q7749k79500j21325
$$ 15023359 14817534 14506978 14247282 13916627 13767193 13610263 13531582 13443833 13164333 13043008
2758A3043008J4481j60569l51621k96232k47788k10710m62227j59877j28857l67416
$$ 13043008 13057489 12896920 12545299 12249067 12001279 11790569 11328342 11168465 11039608 10672192
2748A0672192j32738j83855j21936J42931j44110j21592l64r4224o849L6297R9637
$$ 10672192 10539454 10355599 10233663 10376594 10232484 10110892 10110528 10016304 10009455 10045752 10145389
2737A0145389j04741j53687k43542P7804r1358K2743l9098j42352Q0359J9788
$$ 10145389 10040648 9886961 9643419 9721223 9629865 9652608 9613510 9471158 9551517 9571305
2727I571305o236j09772k50062k00322j97629k01042j88684k33568k48397k03563
$$ 9571305 9565069 9455297 9205235 9004913 8807284 8606242 8417558 8183990 7935593 7732030
2717G732030R0359o0943j96537M776q1801M0291k5378o6581m0611k54309j37756
$$ 7732030 7822389 7761446 7564909 7569685 7487884 7528175 7502797 7436216 7395605 7141296 7003540
2706G003540K24642N9516K4750m4108r0645J00769j95001k65595k04127j10534
$$ 7003540 7228182 7287698 7312448 7268340 7177695 7278464 7083463 6817868 6613741 6503207
2696F503207k56444M4345k09798k47431p4398j15174q7330k15026j28597Q2843
$$ 6503207 6246763 6291108 6081310 5833879 5759481 5644307 5556977 5341951 5213354 5296197
2686E296197K4291k4267p4185l7337L5670J05137l48K378n9769O735J1572q9834
$$ 5296197 5320488 5296221 5222036 5184699 5220369 5325506 5325158 5327536 5267767 5274502 5286074 5196240
2674E196240l6837L6944k5390K2991j18967j35115k46696O2837r3721j76242J02585
$$ 5196240 5159403 5196347 5170957 5193948 5074981 4939866 4693170 4756007 4662286 4486044 4588629
2663D588629m5087j5440r3054K7223q4163r1269n7806K0502n103j76631n5478
$$ 4588629 4543542 4528102 4435048 4462271 4378108 4286839 4229033 4249535 4244432 4067801 4012323
2652D012323Q171m1929k6639P0215n3401j08118m2751j24580J19919J17928j2762
$$ 4012323 4020494 3978565 3951926 4022141 3968740 3860622 3817871 3693291 3813210 3931138 3918376
2641C918376j75666p2752J53428M3659q174j17174m8838P6774j06772m9481q424
$$ 3918376 3742710 3669958 3823386 3867045 3858871 3741697 3692859 3769633 3662861 3613380 3604956
2630C604956q2093p938j07158j08327J46107n8047j14566l8997P6742M5316j76116
$$ 3604956 3522863 3514925 3407767 3299440 3445547 3387500 3272934 3233937 3310679 3355995 3179879
2619C179879j77668J6679J37543q3862M3218O8730R463l9588q1607K9965o7058
$$ 3179879 3002211 3018890 3156433 3072571 3115789 3184519 3193982 3154394 3072787 3102752 3035694
2608C035694K05909J3119O6910j09241j02989m1207m7574O540M2148J296j74408
$$ 3035694 3241603 3254722 3321632 3212391 3109402 3068195 3020621 3027161 3069309 3070605 2896197
2597B896197o8444j18308l8758R1479n1374m6015J10972O796j2489J20193l8956
$$ 2896197 2827753 2709445 2670687 2762166 2710792 2664777 2775749 2782545 2770056 2890249 2851293
2586B851293j31202o1972q6658l6892J8060J39995j4772M7829k1187n1704k564
$$ 2851293 2720091 2658119 2571461 2534569 2552629 2692624 2677852 2725681 2704494 2652790 2650226
2575B650226J5421r0407m0805m2682N6305j33074M2973J33067O5230j17562j5948
$$ 2650226 2665647 2575240 2534435 2491753 2548058 2414984 2457957 2591024 2656254 2538692 2522744
2564B522744P6482O15r7347j08566J26736p9983j06841R9370r729r0355R7969
$$ 2522744 2599226 2599841 2502494 2393928 2520664 2440681 2333840 2433210 2423481 2333126 2431095
2553B431095j02419n9751l2929n524K3418j19986Q5723J65851O1074n1768r4073
$$ 2431095 2328676 2268925 2235996 2230472 2253890 2133904 2219627 2385478 2446552 2394784 2300711
2542B300711K2943j4099L155m6040R523J9215k5964l9428J8190j3988J42422M4948
$$ 2300711 2323654 2309555 2312710 2266670 2276193 2295408 2269444 2230016 2248206 2234218 2376640 2421588
2530B421588j01894j42322j21177j50515J97217J726P4611l9089k2423N5367m2640
$$ 2421588 2319694 2177372 2056195 1905680 2102897 2104623 2179234 2140145 2117722 2173089 2130449
2519B130449j26133k8269j8710K85921l6263j69238j7344L9404m6580j57935K16062
$$ 2130449 2004316 1976047 1957337 2243258 2206995 2037757 2020413 2059817 2013237 1855302 2071364
2508B071364n0140j3764p9687P9555j9697L8404L1304O3503o1284l513j48174
$$ 2071364 2021224 2007460 1927773 2007328 1987631 2026035 2057339 2120842 2059558 2056045 1907871
2497A907871n5380P2292n0169j84144J7589m5969O5029J07720N4651j29301Q2498
$$ 1907871 1852491 1924783 1874614 1690470 1708059 1662090 1727119 1834839 1889490 1760189 1842687
2486A842687q993q0185J4925m1660J98574P2056j94956q0860J71104j44337j02440
$$ 1842687 1833694 1753509 1768434 1726774 1925348 1997404 1802448 1721588 1892692 1748355 1645915
2475A645915n200J424o5849K5251r4809N2627J67498j54772m8795k51L3043r9365
$$ 1645915 1640715 1642139 1576290 1601541 1506732 1559359 1726857 1572085 1523290 1523039 1556082 1456717
2463A456717L4593p5848L0386P0236N7214P2837j82505k1731k1046p4248J15289
$$ 1456717 1491310 1415462 1445848 1516084 1573298 1646135 1463630 1441899 1420853 1346605 1461894
2452A461894O1980j12863j31533j06234J41179P5467J5013m3377J47726r3719
$$ 1461894 1523874 1411011 1279478 1173244 1314423 1389890 1404903 1361526 1509252 1415533
2442A415533m9721o3486o4944J23893r9847P2161K9606j06703L4899j4108j3690
$$ 1415533 1365812 1302326 1237382 1361275 1261428 1333589 1363195 1256492 1291391 1277283 1263593
2431A263593L7630J9961q8564J4069j38522k42166Q7707K13688J79042j2873m712
$$ 1263593 1301223 1321184 1232620 1246689 1108167 866001 953708 1167396 1346438 1333565 1328853
2420A328853K2483o6913j35470J35317K4127j71129N4695K9381K8602l4092j85451
$$ 1328853 1351336 1284423 1148953 1284270 1308397 1137268 1191963 1221344 1249946 1215854 1030403
2409A030403p5527J6357L9100k6287L897K6801P118K8418p0376j50326R4162N1834
$$ 1030403 954876 971233 1010333 984046 987943 1014744 1021862 1050280 979904 829578 923740 975574
2397I75574N0491M2563r8389M321j0514n350p4124P7728M9030M473l4823N848
$$ 975574 1026065 1068628 970239 974560 964046 958696 884572 962300 1011330 1015803 980980 986828
2385I86828j09136K5060P7504n6084n3266K3470r785Q5776J24995j15510o2279
$$ 986828 877692 902752 980256 924172 870906 894376 884591 970367 1095362 979852 917573
2374I17573R3309m8374l8799J12148j03346n5112L6817M1276m1013n5610J17195
$$ 917573 1010882 962508 923709 1035857 932511 877399 914216 955492 914479 858869 976064
2363I76064Q800r6244n9103j14088Q5087R0745R3830K8809m8200L4384j31135
$$ 976064 984864 888620 829517 715429 800516 891261 985091 1013900 965700 1000084 868949
2352H68949M1725r1107o1810P4454P133m6523j12023N1823m4585L0843J56519
$$ 868949 910674 819567 757757 832211 839344 792821 680798 732621 688036 718879 875398
2341H75398j1957M6791l2446j07057k2872Q845r7600o5226Q1353L983p725O9030
$$ 875398 863441 910232 877786 770729 747857 756702 659102 593876 675229 679212 671487 740517
2329G40517P0876k7385r2758M2119J7817q1322N7858Q6975R647n4777n0604n6667
$$ 740517 811393 784008 691250 733369 751186 669864 727722 814697 824344 769567 718963 662296
2317F62296j01593M6170N0734J00091J23115o2579K3081j1382m3278j05627P0432
$$ 662296 560703 606873 657607 757698 880813 818234 841315 829933 786655 681028 751460
2306G51460J30420m3168o7917R8098k407K9032p1610m4409M0998j75818J004J69931
$$ 751460 881880 838712 770795 868893 866486 895518 823908 779499 820497 644679 645683 815614
2294H15614l1989O466P4041O3419j45452j27557J99097J78992l2416j51096q3273
$$ 815614 783625 790091 864132 927551 782099 654542 853639 1032631 1000215 849119 765846
2283G65846K1156O9304j51826r5976J37920p9989J74124N447m0497J5088j1745
$$ 765846 787002 856306 704480 608504 746424 666435 840559 846006 805509 820597 808852
2272H08852j87194O8461J54392R529J4256j54603L0550j34472N1647m2555M4033
$$ 808852 621658 690119 844511 854040 868296 713693 744243 609771 661418 618863 662896
2261F62896P0506j02091n5994K11666J3035q7204J05369J10625j4202l8983l3835
$$ 662896 733402 631311 575317 786983 800018 712814 818183 928808 914606 875623 841788
2250H41788N6410p8266j44338M9198n0558j4986J2583m0938L0027o5617K9220
$$ 841788 898198 819932 675594 724792 674234 659248 671831 630893 660920 595303 624523
2239F24523M6523m4098j78994J42223R4792j4378r2668n0692M3859M4290O730
$$ 624523 671046 626948 447954 590177 684969 670591 577923 527231 571090 615380 622110
2228F22110J8295m6128l1514Q0258j37871J5651J968P8919n2240O7776Q2874n9889
$$ 622110 640405 594277 562763 643021 505150 520801 522769 601688 549448 617224 700098 640209
2216F40209m986k4067p518J9207J25079r3632k6205J1992k68561J52124J27058
$$ 640209 635223 611156 603638 622845 747924 654292 628087 640079 371518 523642 650700
2205F50700o2383j23749O2711J6651N6563P2247P2134k1289R61K2455q0129Q8825
$$ 650700 588317 464568 527279 543930 600493 672740 744874 723585 724546 747001 666872 755697
2193G55697n5907j16317l371Q3167j16626q4358J28122J20748p7248K1479O239
$$ 755697 699790 583473 580102 663269 546643 462285 590407 711155 633907 655386 661625
2182F61625j45445L1719p4351O5412r6615M8588J39219r3239M5148J25212j4148
$$ 661625 516180 547899 473548 538960 442345 490933 630152 536913 582061 707273 693125
2171F93125J7635M7678m4168n1243j0546l4828q8459J10632l4150m4904J05235
$$ 693125 710760 758438 714270 663027 652481 617653 529194 639826 605676 560772 666007
2160F66007n3373j25641O7803l7208K06892n2195l6538j2768J14770j08194N023
$$ 666007 612634 486993 554796 517588 724480 672285 635747 622979 737749 629555 634578
2149F34578J26538j27284j26634M3530N5764O7743n2622J11733j5470j14460k8459
$$ 634578 761116 633832 507198 550728 606492 674235 621613 733346 717876 603416 574957
$$ [...]
##END NTUPLES=NMR SPECTRUM
##END=
