##TITLE=1H_CA-9120-2
 CDCl3
 8 sc, 
 15.2.2023
##JCAMPDX= 6.0         $$ Bruker NMR JCAMP-DX V2.0
##DATA TYPE= NMR SPECTRUM
##DATA CLASS= NTUPLES
##ORIGIN= UXNMR, Bruker Analytische Messtechnik GmbH
##OWNER= root
$$ XWIN-NMR		Version 3.5
$$ Wed Feb 15 13:56:25 2023 Russian Standard Time (UT+4h)  she@DPX200
##.OBSERVE FREQUENCY= 200.13135
##.OBSERVE NUCLEUS= ^1H
##.ACQUISITION MODE= SIMULTANEOUS
##.ACQUISITION SCHEME= undefined
##.AVERAGES= 8
##.DIGITISER RES= 18
##SPECTROMETER/DATA SYSTEM= spect
##.PULSE SEQUENCE= zg30
##.SOLVENT NAME= CDCl3
##.SHIFT REFERENCE= (INTERNAL, CDCl3, 0, 15.8483)
##AUDIT TRAIL= $$ (NUMBER, WHEN, WHO, WHERE, WHAT)
$$ ##TITLE= Audit trail, XWIN-NMR		Version 3.5
$$ ##JCAMPDX= 5.01
$$ ##ORIGIN= Bruker BioSpin GmbH
$$ ##OWNER= she
$$ F:/spectra/data/she/nmr/H-F/1/pdata/1/auditp.txt
$$ ##AUDIT TRAIL=  $$ (NUMBER, WHEN, WHO, WHERE, WHAT)
(   1,<2023-02-15 13:54:55.40 +0400>,<she>,<DPX200>,
      <created by zg, POWCHK disabled, PULCHK disabled
       configuration hash MD5:
       00 E9 B6 7A A2 85 ED C7 34 08 36 98 17 FE 4E 26
       data hash MD5: 16K
       CE F8 11 64 5C 77 0E 9A 18 6B 7A D6 56 94 A2 A5>)
(   2,<2023-02-15 13:55:24.23 +0400>,<she>,<DPX200>,
      <Start of raw data processing
       efp BC_mod = 2 LB = 0.24 FT_mod = 6 PKNL = 1 PHC0 = -19109.67 PHC1 = 9.20078 SI = 16K 
       data hash MD5: 16K
       29 78 A3 60 4D 02 B8 63 B5 BC 7A CC 80 21 2F B4>)
(   3,<2023-02-15 13:55:40.29 +0400>,<she>,<DPX200>,
      <pk PHC0 = 0.5834644 PHC1 = 0.9999998 
       data hash MD5: 16K
       E8 6B 02 83 2B D8 44 0B C6 85 80 FE 96 06 2B 9C>)
(   4,<2023-02-15 13:55:43.65 +0400>,<she>,<DPX200>,
      <abs ABSG = 5 
       data hash MD5: 16K
       FB 10 94 CE E9 B6 F5 BB 2E A0 AB D6 79 B8 4F D9>)
$$ ##END=
$$ 
$$ hash MD5
$$ 76 AE 3E CE 20 6C 1D 46 7F AC 00 75 8E B2 40 5F
##$RELAX= 
##$RELAX= 
##$RELAX= 
##$RELAX= 
##$RELAX= 
##$RELAX= 
$$ Bruker specific parameters
$$ --------------------------
##$DU= <F:/spectra>
##$EXPNO= 1
##$NAME= <H-F>
##$PROCNO= 1
##$TYPE= <nmr>
##$USER= <she>
##$AMP= (0..31)
100 100 100 100 100 100 100 100 100 100 100 100 100 100 100 100 100 100 
100 100 100 100 100 100 100 100 100 100 100 100 100 100 
##$AQSEQ= 0
##$AQ_mod= 1
##$AUNM= <au_zg>
##$AUTOPOS= <>
##$BF1= 200.13
##$BF2= 200.13
##$BF3= 200.13
##$BF4= 200.13
##$BF5= 200.13
##$BF6= 200.13
##$BF7= 200.13
##$BF8= 200.13
##$BYTORDA= 1
##$CFDGTYP= 0
##$CFRGTYP= 5
##$CHEMSTR= <none>
##$CNST= (0..31)
1 1 145 1 1 1 1 1 1 1 1 1 1 1 1 1 1 1 1 1 1 1 1 1 1 1 1 1 1 1 1 1 
##$CPDPRG= <>
##$CPDPRG1= <>
##$CPDPRG2= <>
##$CPDPRG3= <>
##$CPDPRG4= <mlev>
##$CPDPRG5= <mlev>
##$CPDPRG6= <mlev>
##$CPDPRG7= <mlev>
##$CPDPRG8= <mlev>
##$CPDPRGB= <>
##$CPDPRGT= <>
##$D= (0..31)
0 1.2 0 0 0 0 0 0 0 0.06 0 0.03 0 0 0 0 0.0002 0 0 0 0 0 0 0 0 0 0 0 0 
0 0 0 
##$DATE= 1676454894
##$DBL= (0..7)
120 120 120 120 120 120 120 120 
##$DBP= (0..7)
150 150 150 150 150 150 150 150 
##$DBP07= 0
##$DBPNAM0= <>
##$DBPNAM1= <>
##$DBPNAM2= <>
##$DBPNAM3= <>
##$DBPNAM4= <>
$$ [...]
##$SUBNAM3= <"">
##$SUBNAM4= <"">
##$SUBNAM5= <"">
##$SUBNAM6= <"">
##$SUBNAM7= <"">
##$SUBNAM8= <"">
##$SUBNAM9= <"">
##$SW= 18.05172834244
##$SWIBOX= (0..15)
0 0 2 0 0 0 0 0 0 0 0 0 0 0 0 0 
##$SW_h= 3612.71676300578
##$TD= 16384
##$TD0= 1
##$TE= 0
##$TE2= 300
##$TE3= 300
##$TEG= 300
##$TL= (0..7)
0 120 120 120 120 120 120 120 
##$TP= (0..7)
150 150 150 150 150 150 150 150 
##$TP07= 0
##$TPNAME0= <>
##$TPNAME1= <>
##$TPNAME2= <>
##$TPNAME3= <>
##$TPNAME4= <>
##$TPNAME5= <>
##$TPNAME6= <>
##$TPNAME7= <>
##$TPOAL= (0..7)
0.5 0.5 0.5 0.5 0.5 0.5 0.5 0.5 
##$TPOFFS= (0..7)
0 0 0 0 0 0 0 0 
##$TUNHIN= 0
##$TUNHOUT= 0
##$TUNXOUT= 0
##$USERA1= <user>
##$USERA2= <user>
##$USERA3= <user>
##$USERA4= <user>
##$USERA5= <user>
##$V9= 5
##$VALIST= <valist>
##$VCLIST= <CCCCCCCCCCCCCCC>
##$VD= 0
##$VDLIST= <DDDDDDDDDDDDDDD>
##$VPLIST= <PPPPPPPPPPPPPPP>
##$VTLIST= <TTTTTTTTTTTTTTT>
##$WBST= 1024
##$WBSW= 4
##$XGAIN= (0..3)
0 0 0 0 
##$XL= 0
##$YL= 0
##$YMAX_a= 294715
##$YMIN_a= -318628
##$ZGOPTNS= <>
##$ZL1= 120
##$ZL2= 120
##$ZL3= 120
##$ZL4= 120
##$ABSF1= 15.72705
##$ABSF2= -2.3248
##$ABSG= 5
##$ABSL= 3
##$ALPHA= 0
##$AQORDER= 0
##$ASSFAC= 0
##$ASSFACI= 0
##$ASSFACX= 0
##$ASSWID= 0
##$AUNMP= <proc_1d>
##$AZFE= 0.1
##$AZFW= 0.1
##$BCFW= 0
##$BC_mod= 2
##$BYTORDP= 0
##$COROFFS= 0
##$CY= -3
##$DATMOD= 1
##$DC= 0
##$DFILT= <>
##$DTYPP= 0
##$F1P= 0
##$F2P= 0
##$FCOR= 1
##$FTSIZE= 16384
##$FT_mod= 6
##$GAMMA= 0
##$GB= 0
##$INTBC= 1
##$INTSCL= 3.70164e-10
##$ISEN= 128
##$LB= 0.24
##$LEV0= 0
##$LPBIN= 0
##$MAXI= 10000
##$MC2= 0
##$MEAN= 0
##$ME_mod= 0
##$MI= 1.114404
##$NCOEF= 0
##$NC_proc= -7
##$NLEV= 6
##$NOISF1= 3.799351
##$NOISF2= 2.8
##$NSP= 0
##$NTH_PI= 0
##$NZP= 0
##$OFFSET= 15.84826
##$PC= 1
##$PHC0= -19109.09
##$PHC1= 10.20078
##$PH_mod= 1
##$PKNL= yes
##$PPARMOD= 0
##$PSCAL= 0
##$PSIGN= 0
##$REVERSE= no
##$SF= 200.129984646544
##$SI= 16384
##$SIGF1= 3
##$SIGF2= 2
##$SINO= 5.538805
##$SIOLD= 16384
##$SREGLST= <1H.CDCl3>
##$SSB= 0
##$STSI= 16384
##$STSR= 0
##$SW_p= 3612.71676300578
##$SYMM= 0
##$S_DEV= 0
##$TDeff= 16384
##$TDoff= 0
##$TI= <>
##$TILT= no
##$TM1= 0
##$TM2= 0
##$TOPLEV= 0
##$USERP1= <user>
##$USERP2= <user>
##$USERP3= <user>
##$USERP4= <user>
##$USERP5= <user>
##$WDW= 1
##$XDIM= 16384
##$YMAX_p= 412993308
##$YMIN_p= -766692
$$ End of Bruker specific parameters
$$ ---------------------------------
##NTUPLES= NMR SPECTRUM
##VAR_NAME=  FREQUENCY,     SPECTRUM/REAL,   SPECTRUM/IMAG
##SYMBOL=    X,             R,               I
##VAR_TYPE=  INDEPENDENT,   DEPENDENT,       DEPENDENT
##VAR_FORM=  AFFN,          ASDF,            ASDF
##VAR_DIM=   16384,         16384,           16384
##UNITS=     HZ,            ARBITRARY UNITS, ARBITRARY UNITS
##FACTOR=    0.220516191357247, 1,           1
##FIRST=     3171.71201563325, 0,            0
##LAST=      -441.004747372525, 0,           0
##MIN=       -441.004747372525, -766692,     0
##MAX=       3171.71201563325, 412993308,    0
$$ Real data points
##PAGE= N=1
##DATA TABLE= (X++(R..R)), XYDATA
$$ [...]
6880E51026J9430J0631K6009l0830k7682r5957J40341J3604j81972K47548M7852
$$ 551026 570456 581087 607096 576266 548584 452627 592968 606572 424600 672148 720000
6869G20000J51907R9762L9231J01582j42017j03012J41349k0065K7383J64486
$$ 720000 871907 971669 1010900 1112482 970465 867453 1008802 988737 1016120 1180606
6859A180606o0246m6693Q290m0698R331K45401K16275q536K20381m8274K38159
$$ 1180606 1120360 1073667 1081957 1041259 1050590 1295991 1512266 1503730 1724111 1675837 1913996
6848A913996K23788k6970L72045K33984R3784M75742O36480N82405P51161J050935
$$ 1913996 2137784 2110814 2482859 2716843 2810627 3286369 3922849 4505254 5256415 6307350
6838F307350J050986J394967J787741J611569Q01377o34228j586260j792623j914696
$$ 6307350 7358336 8753303 10541044 12152613 12953990 12319762 10733502 8940879 7026183
6829G026183j314347r46449o44285n26526m81153j86461n72113k12639j9658J16560
$$ 7026183 5711836 4765387 4121102 3594576 3113423 2926962 2354849 2142210 2122552 2239112
6819B239112j04584l74379j39535p7624j16296j01916j0726N2906l02691j24285
$$ 2239112 2134528 1760149 1620614 1542990 1426694 1324778 1314052 1366958 1064267 939982
6809I39982P5780M934K34338r6470p4949j02927j75291N9961J11222j22267l8919
$$ 939982 1015762 1020696 1255034 1158564 1083615 980688 805397 865358 976580 854313 815394
6798H15394q8285j16937p2696K5670O80K53818r808n1890j68463N3797j20610
$$ 815394 727109 610172 537476 563146 563826 817644 807836 755946 587483 641280 520670
6787E20670L4550O4121j68885J26088R090m2977J72231J45031j78938k88332j39418
$$ 520670 555220 619341 450456 576544 585634 542657 714888 859919 680981 392649 253231
6776B53231K84400j0171r8541k21663l4503K80710J04232j84760j8484J31593
$$ 253231 537631 527460 428919 207256 172753 453463 557695 372935 354451 486044
6766D86044L2301N3086l8169k10742Q5943L19833j00116j12293n1020K4077k7917
$$ 486044 518345 571431 533262 322520 408463 728296 628180 515887 464867 488944 461027
6755D61027N0919K42804K8957k94171k4253Q8565J42006K06161j05865k06769
$$ 461027 511946 754750 783707 489536 465283 553848 695854 902015 796150 589381
6745E89381Q3709k26303k20064Q0908K5869J12223j75308J19349m3059J27320
$$ 589381 673090 446787 226723 307631 333500 445723 270415 389764 346705 474025
6735D74025l6120K8979k02523O3159l4436J2447P5297j92147n2762K32383j08712
$$ 474025 437905 466884 264361 327520 293084 305531 380828 188681 135919 368302 259590
6724B59590k61979J73979K00651o3022p338k24616p1780K80830K041J15289l2636
$$ 259590 -2389 171590 372241 309219 301881 77265 5485 286315 288356 403645 371009
6713C71009l6897j5093j7715J08507J00065m6072j43522m0920Q0402J18077M7638
$$ 371009 334112 319019 301304 409811 509876 463804 320282 279362 359764 477841 525479
6702E25479K545Q941m2392k67673J82570J62016k35677Q1693J11478j29394O4368
$$ 525479 528024 536965 494573 226900 409470 571486 335809 417502 528980 399586 463954
6691D63954q0637J32985J79941r9050L4416j49910J6510k4038P538r8098q4523
$$ 463954 383317 516302 696243 597193 631609 481699 498209 474171 481709 383611 299088
6680B99088J53055J48794k95468K01301k580k49965N4475R4821N8753j6472k42712
$$ 299088 452143 600937 305469 506770 504190 254225 308700 403521 462274 445802 203090
6669B03090J56266R7548J89603K5125k85625j69201J43728J84718k7401j8440
$$ 203090 359356 456904 646507 671632 386007 216806 360534 545252 517851 499411
6659D99411j49103j03238N1781l9019K11750J14715j19771k0819k27565J45056
$$ 499411 350308 247070 298851 259832 471582 586297 466526 445707 218142 363198
6649C63198j1953p5296K93023J06177M6483j1441r0064Q0393p4923j40608o0272
$$ 363198 351245 275949 568972 675149 721632 710191 620127 700520 625597 484989 424717
6638D24717K24186J58698k17934J5564j28664l8257n3976N7748o0173J52734M2758
$$ 424717 648903 807601 589667 605231 476567 438310 384334 442082 381909 534643 577401
6627E77401M6151J48121r3061Q6576K3016L23464j29932r8708K1646R2208j97113
$$ 577401 623552 771673 678612 765188 788204 1111668 981736 883028 904674 996882 799769
6616G99769M246r320K21548k00278j19605J842J79779L5802j8161J67630k79494
$$ 799769 804015 794695 1016243 815965 696360 698202 877981 913783 895622 1063252 783758
6605G83758N5312j13108J18876L79M9303k3316j51421J61734J59514K48201p6163
$$ 783758 839070 725962 844838 845217 894520 871204 719783 881517 1041031 1289232 1213069
6594A213069K5077l866l12874M1924k19357K75242J15133j16549J20790j30831
$$ 1213069 1238146 1234280 921406 963330 743973 1019215 1134348 1017799 1138589 1007758
6584A007758K77268J68984j49721j15572J35441J5482M9422q8705j24319K95644
$$ 1007758 1285026 1454010 1304289 1188717 1324158 1339640 1389062 1300357 1176038 1471682
6574A471682J21202J43497j6045J04471j8685j43583R4786Q0999K05083J42963
$$ 1471682 1592884 1736381 1720336 1824807 1806122 1662539 1757325 1838324 2043407 2186370
6564B186370J7736j19054l7756K60299K7051j78J97499r2269L5344J10207r5133
$$ 2186370 2204106 2085052 2047296 2307595 2334646 2334468 2531967 2439698 2475042 2585249 2490116
6553B490116K68205K7093J4102n6234J7546R3509K50871j36901J2967K39721N3215
$$ 2490116 2758321 2785414 2799516 2743282 2760828 2854337 3105208 2968307 2981274 3220995 3274210
6542C274210l6039j61563M00313J39934l8738n5369L56917J75277l6055j0765
$$ 3274210 3238171 3076608 3476921 3616855 3578117 3522748 3879665 4054942 4018887 4008122
6532D008122J09067K37652K68962J06182J57174J78137J86566J64610J1554Q7439
$$ 4008122 4117189 4354841 4623803 4729985 4887159 5065296 5251862 5416472 5428026 5515465
6522E515465L14658j7336K26767K58170O05182N65986J29450K70147L42778M39801
$$ 5515465 5830123 5812787 6039554 6297724 6902906 7468892 7598342 7868489 8211267 8651068
6512H651068L19814M03411N20033N04059M31264M92023O33050O45398P32356P76995
$$ 8651068 8970882 9374293 9894326 10398385 10829649 11321672 11954722 12600120 13332476 14109471
6502A4109471Q74433J015385J061399J219504J372203J589426J928798J923296
$$ 14109471 14983904 15999289 17060688 18280192 19652395 21241821 23170619 25093915
6494B5093915K297185L004214L529743M160408M855654N168558M739762L643968
$$ 25093915 27391100 30395314 33925057 38085465 42941119 48109677 52849439 56493407
6486E6493407K233026l54286l040837m336686n071094n061888m487437l991051
$$ 56493407 58726433 58372147 55331310 50994624 45923530 40861642 36374205 32383154
6478C2383154l393904k544276k331647j780674j499204j453830r34638o39829
$$ 32383154 28989250 26444974 24113327 22332653 20833449 19379619 18444981 17805152
6470A7805152p85904o23202p37793k43653k04926j82054n77j15109j80814l0630
$$ 17805152 17019248 16396046 15658253 15414600 15209674 15027620 15027043 14911934 14731120 14700490
6460A4700490J50586L00012L06479J43567L00677N65011L01106N66823L99702
$$ 14700490 14851076 15151088 15457567 15601134 15901811 16466822 16767928 17334751 17734453
6451A7734453N70470O99138Q47678Q97809J010005J410221J449420J673411K005353
$$ 17734453 18304923 19004061 19851739 20749548 21759553 23169774 24619194 26292605 28297958
6442B8297958K358539K961744L275253M013796M712882N195316N764052N729913
$$ 28297958 30656497 33618241 36893494 40907290 45620172 50815488 56579540 62309453
6434F2309453M898543K530024l81542l309278n659020o438126o377947n866881
$$ 62309453 67207996 69738020 69356478 66047200 60388180 53950054 47572107 41705226
6426D1705226n093703m315107l357786l155737k574610k208916j645480j448170
$$ 41705226 36611523 32296416 28938630 25782893 23208283 20999367 19353887 17905717
6418A7905717j274174j023765r80064r41412r47552n58099m86025p02175q34395
$$ 17905717 16631543 15607778 14627714 13686302 12738750 12180651 11694626 10992451 10158056
6409A0158056l73815k51208l76812m94973k66617m10078l77337j54652l7105k55853
$$ 10158056 9784241 9533033 9156221 8661248 8394631 7984553 7607216 7452564 7415459 7159606
6399G159606l89313k40971k34856p9269l88230J5836j03206o0892j65053j11469
$$ 7159606 6770293 6529322 6294466 6215197 5826967 5842803 5739597 5678705 5513652 5402183
6389E402183J12936m6708j33994J56589J05085k0688j31294q0701j16538j07721
$$ 5402183 5515119 5468411 5334417 5491006 5596091 5575403 5444109 5363408 5246870 5139149
6379E139149k74061k97878j29304p3560p2207p5213k44322m5210J9974l6069j11826
$$ 5139149 4865088 4567210 4437906 4364346 4292139 4216926 3972604 3927394 3947368 3911299 3799473
6368C799473k3158k16142l52101L188P6029r9283K05545q0071o5986n1232j72090
$$ 3799473 3776315 3560173 3208072 3211260 3287289 3188006 3393551 3313480 3247494 3196262 3024172
6357C024172K1212o522K35731k6123J00578n8557p9364M5196O3748Q5550r0915
$$ 3024172 3045384 3038862 3274593 3248470 3349048 3290491 3211127 3256323 3320071 3405621 3314706
6346C314706J14272J05343K6509P9654K3587Q981M209J13435J63548J70311j33758
$$ 3314706 3428978 3534321 3560830 3640484 3664071 3673052 3677261 3790696 3954244 4124555 3990797
6335C990797j07273L77585l6231J76165K13165L62606J68315n7322K45380K40233
$$ 3990797 3883524 4261109 4224878 4401043 4614208 4976814 5145129 5087807 5333187 5573420
6325E573420K70394j03860l7419J27440K50594l9206K60255M69721L73598M57266
$$ 5573420 5843814 5739954 5702535 5829975 6080569 6041363 6301618 6771339 7144937 7602203
6315G602203L93349L85540O66096O87691J016522R60065J185560J575561J780642
$$ 7602203 7995552 8381092 9047188 9734879 10751401 11711466 12897026 14472587 16253229
6306A6253229K148590K129404J848515J107680q3088j292938j994798j976047
$$ 16253229 18401819 20531223 22379738 23487418 23404330 22111392 20116594 18140547
6298A8140547k069988j924434j771104j274454q89840q49017r05660n30035m02153
$$ 18140547 16070559 14146125 12375021 11100567 10210727 9361710 8456050 7926015 7523862
6289G523862n64768l53452j08045p6908j48452m5446K298k95931k02840J03629
$$ 7523862 6959094 6605642 6497597 6420689 6272237 6226791 6229089 5933158 5730318 5833947
6279E833947O8697K1347J57164J06724q2670j27181K12581L15932K30074L30401
$$ 5833947 5902644 5923991 6081155 6187879 6105209 5978028 6190609 6506541 6736615 7067016
6269G067016J33969K1435J31618K29052L40820L86957M94063N28858Q16798Q60956
$$ 7067016 7200985 7222420 7354038 7583090 7923910 8310867 8804930 9333788 10150586 11011542
6259A1011542P44281Q74759J373490J553984J786025K013312K497773K582498
$$ 11011542 11755823 12630582 14004072 15558056 17344081 19357393 21855166 24437664
6251B4437664K281415J177623n43814j290958k431934k922471k865127k496920
$$ 24437664 26719079 27896702 27352888 26061930 23629996 20707525 17842398 15345478
6243A5345478j976056j683744j348513j004077q79603p34902p40396p53935l87645
$$ 15345478 13369422 11685678 10337165 9333088 8453485 7718583 6978187 6224252 5836607
6234E836607j19400j78118l86138m41915k17579l50838k14407j16010j85255j0561
$$ 5836607 5717207 5539089 5152951 4711036 4493457 4142619 3928212 3812202 3626947 3616386
6224C616386q1472k32148k64458j035k23389l19871K40673k04221j78824M3989
$$ 3616386 3534914 3302766 3038308 3037273 2813884 2494013 2734686 2530465 2351641 2395630
6214B395630l01824o130Q0947M4903P6515k03470r5584J9089j65298r6026J43743
$$ 2395630 2093806 2087676 2168623 2213526 2290041 2086571 1990987 2010076 1844778 1748752 1892495
6203A892495j69454o5817k43804J28450L07991k50628j28106o5830j26857R3285
$$ 1892495 1723041 1657224 1413420 1541870 1849861 1599233 1471127 1405297 1278440 1371725
6193A371725J53335J8017l45353P578L05320j27805k11392K23535R2629j05070
$$ 1371725 1525060 1543077 1197724 1205302 1510622 1382817 1171425 1394960 1487589 1382519
6183A382519j32773L3154N472j68274Q048n2322R0866o3078K51505J53402p8044
$$ 1382519 1249746 1282900 1288372 1120098 1128146 1075824 1166690 1103612 1355117 1508519 1430475
6172A430475l6635j43903J57323K926J473N9760n7391p7162l8121j01340j23729
$$ 1430475 1393840 1249937 1407260 1410186 1411659 1471419 1414028 1336866 1298745 1197405 1073676
6161A073676o3604J84990k23301k55298K0477J03496L656K9927R3645R7966k20380
$$ 1073676 1010072 1195062 971761 716463 736940 840436 844092 874019 967664 1065630 845250
6150H45250j26912M8972j94527P4647J85599j2350J2504Q2621o1080J63879n3434
$$ 845250 718338 767310 572783 647430 833029 820679 833183 915804 854724 1018603 965169
6139I65169J0368O9758j77989O3793q9489m3575P7391q4072m6031K00540J25980
$$ 965169 975537 1045295 867306 931099 841610 798035 875426 791354 745323 945863 1071843
6128A071843P0522n7136j07745P1765K6195m4640L0276L40923k99576j12361o2814
$$ 1071843 1142365 1085229 977484 1049249 1075444 1030804 1061080 1402003 1102427 990066 927252
6117I27252J46296N6669j02861J53500P620k59530J39278L212K4759m58461J44440
$$ 927252 1073548 1130217 1027356 1180856 1188476 928946 1068224 1071436 1096195 637734 782174
6106G82174K97878j02537Q898m6301J9612j77903m6442m3464r9942L5518M700
$$ 782174 1080052 977515 986413 940112 959724 781821 735379 691915 591973 627491 632191
6095F32191L0540K32997m4548P5781j26451j29357Q5338p2035j4818J60599j97304
$$ 632191 662731 895728 851180 926961 800510 671153 756491 684456 669638 830237 632933
6084F32933J65005O4439J46630j32119O7355P2500j99655q1208L4146R9744k28598
$$ 632933 797938 862377 1009007 876888 944243 1016743 817088 735880 770026 869770 641172
6073F41172J12225j59685J66280k4373P7793j2624r6267n2653P5745J29062k56306
$$ 641172 753397 593712 759992 735619 813412 800788 704521 651868 727613 856675 600369
6062F00369j38651O0022J4486K11708P3324j63013J27210q4041j0830J74445l2663
$$ 600369 461718 521740 536226 747934 821258 658245 785455 701414 690584 865029 832366
6051H32366l8986k39760O1387K53297J3338m1701j92471o6802K39095J47002k19043
$$ 832366 793380 553620 615007 868304 881642 839941 647470 580668 819763 966765 747722
6040G47722j03896K6515K90317k02643J16053m6109o6683Q2502r4565l8675J7832
$$ 747722 643826 670341 960658 758015 874068 827959 761276 843778 749213 710538 728370
6029G28370J7682J61804J93786j16619O482N329p5408Q7782j40375P7030l3492
$$ 728370 746052 907856 1101642 985023 991505 996834 921426 1009208 868833 945863 912371
6018I12371J69257q0951r4370l9994m8419K54703J88401L4724j00938j61412j8799
$$ 912371 1081628 1000677 906307 866313 817894 1072597 1260998 1295722 1194784 1033372 1014573
6007A014573K19027j54129l5178J2355k0168J6804P2421j34190l3858R8642k37530
$$ 1014573 1233600 1079471 1044293 1056648 1036480 1053284 1125705 991515 957657 1056299 818769
5996H18769J65255K46413J9182Q2533j46030j9830j9633K09975J63124P135k02471
$$ 818769 984024 1230437 1249619 1332152 1186122 1166292 1146659 1356634 1519758 1526893 1324422
5985A324422n4628k49k6416K90613J06995k3504j40213o2373J69755L1232R1115
$$ 1324422 1269794 1269545 1243129 1533742 1640737 1617233 1477020 1414647 1584402 1615634 1706749
5974A706749J28861P7663k19299m1123J38679K78373j47677j79022P3840K8396
$$ 1706749 1835610 1913273 1693974 1652851 1791530 2069903 1922226 1743204 1817044 1845440
5964A845440J7222K11629O2096n8418Q3730J72760j1473j11671J96951J20302
$$ 1845440 1862662 2074291 2136387 2077969 2161699 2334459 2322986 2211315 2408266 2528568
5954B528568K33394j45832j06849j3068l5580Q9887J20624o1649L58888L16881
$$ 2528568 2761962 2616130 2509281 2496213 2460633 2550520 2671144 2609495 2968383 3285264
5944C285264N7542l1034k50628J20984J71721J17681J23558J89390k31233k3757
$$ 3285264 3342806 3311772 3061144 3182128 3353849 3471530 3595088 3784478 3553245 3529488
5934C529488L65460K29062r5225j71480R2049N1993M5899M25291K57233L162J5311
$$ 3529488 3894948 4124010 4028785 3857305 3949354 4001347 4047246 4472537 4729770 4732932 4748243
5923D748243R607m3406J42957J58517j22778K05652J95787p3493J97979L18012
$$ 4748243 4757850 4714444 4857401 5015918 4893140 5098792 5294579 5221086 5419065 5737077
5913E737077J36330K03625L80403K99365j2164N20913K33649J26054M19042L99419
$$ 5737077 5873407 6077032 6457435 6756800 6744636 7265549 7499198 7625252 8044294 8443713
5903H443713L31751M22878M12758M99193K27209M63403P02460N80937P51778N58480
$$ 8443713 8775464 9198342 9611100 10110293 10337502 10800905 11503365 12084302 12836080 13394560
5893A3394560P52918Q79359P59121J100043J121830J188061J344226J376384J389921
$$ 13394560 14147478 15026837 15785958 16886001 18007831 19195892 20540118 21916502 23306423
5884B3306423J798803K038828K405866L089519L281920L771462M669661N304921
$$ 23306423 25105226 27144054 29549920 32639439 35921359 39692821 44362482 49667403
5876D9667403N733746N918272M842903K658832J39874k513516m598096n760620
$$ 49667403 55401149 61319421 66162324 68821156 68961030 66447514 61849418 56088798
5868E6088798o035612n377721n056950m045584l108573k754255k312631j614411
$$ 56088798 50053186 44675465 39618515 35572931 32464358 29710103 27397472 25783061
5860B5783061j429310j439676r78888r09631r57745n59996m59752n24000n95599
$$ 25783061 24353751 22914075 21935187 21025556 20067811 19507815 19048063 18524063 17928464
5851A7928464k70506J36359k83521J8688K83019l0532J09541L40800M62656J77465
$$ 17928464 17657958 17794317 17510796 17529484 17812503 17781971 17891512 18232312 18694968 18872433
5841A8872433M09741N96369P82251O57258Q50072R82384J032850J064255J326023
$$ 18872433 19282174 19878543 20660794 21318052 22168124 23150508 24183358 25247613 26573636
5832B6573636J612679J652239K010165K294568K804336L167796L720128M638133
$$ 26573636 28186315 29838554 31848719 34143287 36947623 40115419 43835547 48473680
5824D8473680N040650N743873N993536N404864M499972K219778J23175j960603
$$ 48473680 53514330 59258203 65251739 70656603 75156575 77376353 77499528 75538925
5816G5538925l580637m734214n742938n764488n811965n554526m999637m291633
$$ 75538925 71958288 67224074 61481136 55716648 49904683 44350157 39350520 35058887
5808C5058887l407491k977675k268790j888717j772200j599706j465539j329364
$$ 35058887 31651396 28673721 26404931 24516214 22744014 21144308 19678769 18349405
5800A8349405j071926p35973o29547r03700p78825n78434m07603l64323n68098
$$ 18349405 17277479 16541506 15911959 15008259 14229434 13651000 13243397 12879074 12310976
5791A2310976l39697p5943m56179j46928r6631k11234j96846r8938J40023j00293
$$ 12310976 11971279 11895336 11439157 11292229 11195598 10984364 10787518 10688580 10828603 10728310
5781A0728310o3089k9567K75378J88799N1254K32194M33550m4057M69266Q09059
$$ 10728310 10665221 10635654 10911032 11099831 11151085 11383279 11816829 11772772 12242038 13051097
5771A3051097O23243P87817J253473J282183J254462J519504J679876J539976
$$ 13051097 13674340 14462157 15715630 16997813 18252275 19771779 21451655 22991631
5763B2991631J058671K44705p09408j453405j862394j856575k120047j849540
$$ 22991631 24050302 24295007 23585599 22132194 20269800 18413225 16293178 14443638
5755A4443638j570976j332743j142177n86290o95966o61316n56093m89540j96071
$$ 14443638 12872662 11539919 10397742 9811452 9115486 8454170 7898077 7408537 7212466
5746G212466n04859m90544k46927m0581k11670k84907j91017k79966k64076M7152
$$ 7212466 6707607 6217063 5970136 5929555 5717885 5432978 5241961 4961995 4697919 4745071
5736D745071j65839j90347j12179J62458K6121k56408n6053k56019o5960k12793
$$ 4745071 4579232 4388885 4276706 4439164 4465285 4208877 4152824 3896805 3830845 3618052
5726C618052K61344n5260k10381l8224j14790N3322J00060l81735j94877o6177
$$ 3618052 3879396 3824136 3613755 3575531 3460741 3514063 3614123 3232388 3037511 2971334
5716B971334K2976J3420J55412K7715k79187K82346n5947j8001n0846l6955m0092
$$ 2971334 2994310 3007730 3163142 3190857 2911670 3194016 3138069 3120068 3069222 3032267 2992175
5705B992175J51284j43323j51728j36423j72574J69176l3423k32629o0061K8206
$$ 2992175 3143459 3000136 2848408 2711985 2539411 2708587 2675164 2442535 2382474 2410680
5695B410680o0334Q426j91706K2430N7925J1577j09975q6015L1345K1919K0675
$$ 2410680 2350346 2358772 2167066 2189496 2247421 2258998 2149023 2063008 2094353 2116272 2136947
5684B136947J7707J84999n4270k5201k35024j31320M8678j68314j53946r5659
$$ 2136947 2154654 2339653 2285383 2260182 2025158 1893838 1942516 1774202 1620256 1524597
5674A524597J3695K5443M2674m6504o2358n7896K3673P448N1264J59523k3381
$$ 1524597 1538292 1563735 1606409 1559905 1497547 1439651 1463324 1470772 1522036 1681559 1658178
5663A658178k28829J81196K01944k93797J861L13149j35966j44949J02479L1686
$$ 1658178 1429349 1610545 1812489 1518692 1520553 1833702 1697736 1552787 1655266 1686952
5653A686952k08486j03521J28193J06841j26338o6300J3120j85263j1550J72635
$$ 1686952 1478466 1374945 1503138 1609979 1483641 1417341 1430461 1245198 1233648 1406283
5643A406283n1683k774J88069J4800J88339R7890L385r1869O2135r9424o9469
$$ 1406283 1354600 1351826 1539895 1554695 1743034 1840924 1844309 1752440 1814575 1715151 1645682
5632A645682P617J71690k3252j85390l06737r688p9146j5558R7001R3381l7907
$$ 1645682 1653299 1824989 1801737 1616347 1309610 1299922 1220776 1205218 1302219 1395600 1357693
5621A357693r254J74606m4157j77600J58161j9984k57905k8405N5970r9874K47730
$$ 1357693 1348439 1523045 1478888 1301288 1459449 1439465 1181560 1153155 1209125 1109251 1356981
5610A356981q3594k02223J93663J21470J27504j88973R8490N2370m6137j62206
$$ 1356981 1273387 1071164 1264827 1386297 1513801 1324828 1423318 1475688 1429551 1267345
5600A267345Q5701n6178J53770j31941j78636j13131O5935O909k356J84164J06609
$$ 1267345 1353046 1296868 1450638 1318697 1140061 1026930 1092865 1099774 1097418 1281582 1388191
5589A388191j28594m0044Q9074O5614J21999J08030p6580k08742P1345K2313O1470
$$ 1388191 1259597 1219553 1308627 1374241 1496240 1604270 1527690 1318948 1390293 1412606 1474076
5578A474076J10174k46145J4273J69017n8466J62916r6582K9847K7025J093k33986
$$ 1474076 1584250 1338105 1352378 1521395 1462929 1625845 1529263 1559110 1586135 1587228 1353242
5567A353242k13837N1435L7620o8158R0967Q5290j21032J81977J36640j37625
$$ 1353242 1139405 1190840 1228460 1160302 1251269 1336559 1215527 1397504 1534144 1396519
5557A396519j59178J87458k57398n9985J57087L8156j1894j96397m4898N4928
$$ 1396519 1237341 1424799 1167401 1107416 1264503 1302659 1290765 1094368 1049470 1104398
5547A104398j7839J16572R9006O4344R828k69645M4246m9514J2634L3805P8599
$$ 1104398 1086559 1203131 1302137 1366481 1376309 1106664 1150910 1101396 1114030 1147835 1226434
5536A226434J28992j22372J3307J2503J90592j41726j10256J07572J19603j19281
$$ 1226434 1355426 1233054 1246361 1258864 1449456 1307730 1197474 1305046 1424649 1305368
5526A305368k16955M1291J70594P7379r422j16048K0008K3534j39355n26J67346
$$ 1305368 1088413 1129704 1300298 1377677 1368255 1252207 1272215 1295749 1156394 1155868 1323214
5515A323214j01245j1141N2290j89759j15339K57392L10502k08623k11319K627
$$ 1323214 1221969 1210828 1263118 1073359 958020 1215412 1525914 1317291 1105972 1108599
5505A108599P4096J87463K02046j99823J6974J36673j1729k65664K9317M6139
$$ 1108599 1182695 1370158 1572204 1372381 1389355 1526028 1514299 1248635 1277952 1324091
5495A324091K7103j35545j15316J59546Q5950j73204j4277n8125J09467j70909
$$ 1324091 1351194 1215649 1100333 1259879 1345829 1172625 1158348 1100223 1209690 1038781
5485A038781R5365K06535J13928k30803j00387J27665j09781L3178j18121K25231
$$ 1038781 1134146 1340681 1454609 1223806 1123419 1251084 1141303 1174481 1056360 1281591
5475A281591J49068l9317k03191j01301r0210j7394P8607N595J88800J78038j93354
$$ 1281591 1430659 1391342 1188151 1086850 996640 979246 1057853 1063448 1252248 1430286 1236932
5464A236932M2224L0576m270P8048R382R3486j45898K2508R420k191J38765J77840
$$ 1236932 1279156 1309732 1305462 1383510 1392892 1486378 1340480 1362988 1372408 1370217 1508982 1686822
5452A686822K1363k78849K16839q16j93707O0471K1556K54998o0341j20024M6192
$$ 1686822 1708185 1429336 1646175 1645359 1451652 1512123 1533679 1788677 1728336 1608312 1654504
5441A654504L1871R6650j39159J39463m2452k3950J85759n2623J62812L38328
$$ 1654504 1686375 1783025 1643866 1783329 1740877 1716927 1902686 1850063 2012875 2351203
5431B351203L9686j36380p2641J54317J13252k8547J1643N8941m605K02004L0046
$$ 2351203 2390889 2254509 2181868 2336185 2449437 2420890 2432533 2491474 2486869 2688873 2718919
5420B718919p9772Q0287P8526J66003J51025N11638K97110K71003J02929K02931
$$ 2718919 2639147 2719434 2797960 2963963 3114988 3626626 3923736 4194739 4297668 4500599
5410D500599R8654j78215o6164k01123j70578o6597J77161l7891o2414K1024J64865
$$ 4500599 4599253 4421038 4354874 4153751 3983173 3916576 4093737 4055846 3993432 4014456 4179321
5399D179321K77841L02236j65112k40263P7044J58510R2841K29624j70541r2811
$$ 4179321 4457162 4759398 4594286 4354023 4431067 4589577 4682418 4912042 4741501 4648690
5389D648690P9758J10776K53886L0130J12621n0255J91927J56252L608K75711
$$ 4648690 4728448 4839224 5093110 5123240 5235861 5185606 5377533 5533785 5537393 5813104
5379E813104j32003j65656J60677L30670J4053O2382J96148j22193l6163J67455
$$ 5813104 5681101 5515445 5676122 6006792 6020845 6083227 6279375 6157182 6121019 6288474
5369F288474J26779J46738K20013R0946J67562P6386J64395O6790L22326M11181
$$ 6288474 6415253 6561991 6782004 6872950 7040512 7116898 7281293 7348083 7670409 8081590
5359H081590K5974l9263K67512K40678L5362J7147J21112K21404K22212J0654
$$ 8081590 8107564 8068301 8335813 8576491 8611853 8629000 8750112 8971516 9193728 9204382
5349I204382J50670K46901J70461Q6157j47864K51456J85295J41505k9412J91558
$$ 9204382 9355052 9601953 9772414 9858571 9710707 9962163 10147458 10288963 10259551 10451109
5339A0451109K05730N4626J78092J47608J1500k96117q5592k20686Q4315p3911
$$ 10451109 10656839 10711465 10889557 11037165 11048665 10752548 10666956 10446270 10530585 10456674
5329A0456674j04351l698J24939r1276l29474J92852J67403o948J19055R6004
$$ 10456674 10352323 10348625 10473564 10382288 10052814 10245666 10413069 10406121 10525176 10621180
5319A0621180L74N1557K4304j82466O1943K32004O8538k16182J28929K62261j27848
$$ 10621180 10621554 10673111 10697415 10514949 10576892 10808896 10877434 10661252 10790181 11052442 10924594
5308A0924594J8339o6343Q8807K90582k13977r3961m5209J5287K29917m4703K9386
$$ 10924594 10942933 10876590 10965397 11255979 11042002 10948041 10902832 10918119 11148036 11103333 11132719
5297A1132719j89192k4267K44416j91443l14967J3028k60274j92575j02039k30339
$$ 11132719 10943527 10919260 11163676 10972233 10657266 10670294 10410020 10217445 10115406 9885067
5287I885067p0127j88226l90408L6138L8357l12834l08235k05385j721r4395R6741
$$ 9885067 9814940 9626714 9236306 9272444 9310801 8997967 8689732 8484347 8482626 8388231 8484972
5276H484972L6713k34191k40543n9887o4817P1238m9264j82279p173k72345j80593
$$ 8484972 8521685 8287494 8046951 7987064 7922247 7993485 7944221 7761942 7754769 7482424 7301831
5265G301831K5282k15154j8035k25737j67247P269R403J73464p9912O91J08735
$$ 7301831 7327113 7111959 7093924 6868187 6700940 6708209 6717612 6891076 6811164 6811855 6920590
5254F920590j84212j53147k33230J28471J98332k1689M4212j97415j57339j54831
$$ 6920590 6736378 6583231 6350001 6478472 6676804 6655115 6699327 6501912 6344573 6189742
5244F189742J3655N6751j11156N9928K22341j26161O8329L27527Q0834J18957
$$ 6189742 6203397 6260148 6148992 6208920 6431261 6305100 6373429 6700956 6781790 6900747
5234F900747L60177J76862Q1836j30155j37510j56314J22802q4157k09451k98294
$$ 6900747 7260924 7437786 7519622 7389467 7251957 7095643 7218445 7134288 6924837 6626543
5224F626543M491J74830Q0421m5997J82611K35708L75233J07596j8010J30908
$$ 6626543 6631034 6805864 6886285 6840288 7022899 7258607 7633840 7741436 7723426 7854334
5214G854334N5222Q3259R081K8430k62835J67190K01715j40104L54665J87996
$$ 7854334 7909556 7992815 8001896 8030326 7767491 7934681 8136396 7996292 8350957 8538953
5204H538953r4122J21319J90853M15903k2292m0049J58695L34127M594K12262
$$ 8538953 8444831 8566150 8757003 9172906 9150614 9110565 9269260 9603387 9607981 9820243
5194I820243K88289J84385K14332L47623K14381J32915M42368K18424L02322N21632
$$ 9820243 10108532 10292917 10507249 10854872 11069253 11202168 11644536 11862960 12165282 12686914
5184A2686914K4048J43016K09147J88347Q2159Q2118K12808R5154J17403J1314
$$ 12686914 12710962 12853978 13063125 13251472 13333631 13415749 13628557 13723711 13841114 13852428
5174A3852428L83543M77587J93927L29179M79455L79383M26231L95306K73173
$$ 13852428 14235971 14713558 14907485 15236664 15716119 16095502 16521733 16917039 17190212
5165A7190212N21300L59224K08485M68344N37524M85965K83367L84219O94206
$$ 17190212 17711512 18070736 18279221 18747565 19285089 19771054 20054421 20438640 21132846
5156B1132846O78371M12915N42938M14252J3518M19358K15683K33999L88861J20542
$$ 21132846 21811217 22224132 22767070 23181322 23194840 23614198 23829881 24063880 24452741 24573283
5146B4573283J27935M6585L09999J69919K84953L59249j52577K54800K00592P3875
$$ 24573283 24701218 24747803 25057802 25227721 25512674 25871923 25719346 25974146 26174738 26248613
5136B6248613J85303k23215q1047k44615k28235j76268o4478o1978p3780j46514
$$ 26248613 26433916 26210701 26129654 25885039 25656804 25480536 25416058 25354080 25280300 25133786
5126B5133786J23171K05214k4771R0515J37867M1615K86345j03282R1599K07966
$$ 25133786 25256957 25462171 25437400 25527915 25665782 25707397 25993742 25890460 25982059 26190025
5116B6190025j8261J34909k43448k12791J14097P9937j71655L32056M12096J5176
$$ 26190025 26171764 26306673 26063225 25850434 25964531 26044468 25872813 26204869 26616965 26632141
5106B6632141Q7025K58040J46959R3596k1048j3548j67490k80003m6757k72275
$$ 26632141 26719166 26977206 27124165 27217761 27196713 27183165 27015675 26735672 26688915 26416640
5096B6416640l97150n20343l90838j12553q7005j85043k19530l28454l06604l22216
$$ 26416640 26019490 25499147 25108309 24995756 24908751 24723708 24504178 24175724 23869120 23546904
5086B3546904l05226k02014k76692r9281k76357l33255j62132k9644M8813N3684
$$ 23546904 23241678 23039664 22762972 22663691 22387334 22054079 21891947 21862303 21911116 21964800
5076B1964800M79590M84859N74705N41035k55581j131136j077087j111615j285834
$$ 21964800 22444390 22929249 23503954 24044989 23789408 22658272 21581185 20469570 19183736
5067A9183736j186786p39164o60671r25506m98696l26806l23396k47499k85868
$$ 19183736 17996950 17257786 16597115 15671609 15172913 14846107 14522711 14275212 13989344
5058A3989344l21304n4655j89116k44882l09378q7427k83950l38654l84300k76860
$$ 13989344 13668040 13613385 13424269 13179387 12870009 12782582 12498632 12159978 11775678 11498818
5048A1498818m50102m08114l57321n55261l20666k94193k80585j17764l86141
$$ 11498818 11048716 10640602 10283281 9728020 9407354 9113161 8832576 8714812 8328671
5039H328671j16898l33258l97744k39640j08640m75225k18411l80331k98108j97658
$$ 8328671 8211773 7878515 7480771 7241131 7132491 6657266 6438855 6058524 5760416 5562758
5029E562758k75527j23088k80554q6385l35800J04600j10337j11699j88931j87036
$$ 5562758 5287231 5164143 4883589 4797204 4461404 4566004 4455667 4343968 4155037 3968001
5019C968001k54475k63328j25328J40671p0798l8490l6960k73996J37279m7014
$$ 3968001 3713526 3450198 3324870 3465541 3394743 3356253 3319293 3045297 3182576 3135562
5009C135562q8920k2537j65366k39826J66852k9694m40281j65944M5504J5611
$$ 3135562 3046642 3024105 2858739 2618913 2785765 2756071 2315790 2149846 2195350 2210961
4999B210961J26986k30350M2569J69467j00349j78206j18043J49334j50320M0490
$$ 2210961 2337947 2107597 2150166 2319633 2219284 2041078 1923035 2072369 1922049 1962539
4989A962539j8938j00643q5039j51577J02285Q7516k00188Q3067k6763k94232
$$ 1962539 1943601 1842958 1757919 1606342 1708627 1796143 1595955 1679022 1652259 1358027
4979A358027k21158n2862K38746J94118k04281K9955j37696J24520j56350O6393
$$ 1358027 1136869 1084007 1322753 1516871 1312590 1342545 1204849 1329369 1173019 1239412
4969A239412l124J8248J99157k05106N752m1186j45896J53989l6785l7499j36789
$$ 1239412 1236288 1254536 1453693 1248587 1254339 1213153 1067257 1221246 1184461 1146962 1010173
4958A010173p4441K51476J29636r0937j1642k96407K5938M4499Q3098J75883j20521
$$ 1010173 935732 1187208 1316844 1225907 1214265 917858 943796 988295 1071393 1247276 1126755
4947A126755j03180K29585j74156k34612J02791m7826k1295J20466R6551J16689
$$ 1126755 1023575 1253160 1079004 844392 947183 899357 878062 998528 1095079 1211768
4937A211768O9640m6280K8806m2107j29837j41205J98458l51267n1247R9966J04987
$$ 1211768 1281408 1235128 1263934 1221827 1091990 950785 1149243 797976 746729 846695 951682
4926I51682R152J55105m4852j67225K7782J054K31332J02489j81134o5654j45471
$$ 951682 960834 1115939 1071087 903862 931644 932698 1164030 1266519 1085385 1019731 874260
4915H74260k1977K34009Q1518q8923j69615j022R6627R7965m8237k24105J6710
$$ 874260 852283 1086292 1167810 1078887 909272 908250 1004877 1102842 1054605 830500 847210
4904H47210j32678K59099M4466q464j30098k49852p7559R7180J60388j85038j16252
$$ 847210 714532 973631 1018097 1009633 879535 629683 552124 649304 809692 624654 508402
4893E08402R6388o9234O1288K73464j9575j09599k8387k65796j94019K14714j709
$$ 508402 604790 535556 596844 870308 850733 741134 712747 446951 252932 467646 465937
4882D65937P9567J01470l7905K3879K0556j02860o4411L01144P7763j13756n7811
$$ 465937 545504 646974 609069 632948 653504 550644 486233 787377 865140 751384 693573
4871F93573p1409k9119k3212O1300M1064R8954K08856j03870o6817j07076L1411
$$ 693573 622164 593045 569833 631133 672197 771151 980007 876137 809320 702244 733655
4860G33655J75692p360j51010m14j20106k00150N2002P0730J7032K26276J17959
$$ 733655 909347 901987 750977 750563 630457 430307 482309 553039 570071 796347 914306
4849I14306l1424l9259n232n6071n0057J42133R5375j3441k46908r9865K41568
$$ 914306 882882 843623 838391 782320 732263 874396 969771 956330 709422 609557 851125
4838H51125K4569K2510J92524n0482j62975J01320p3937o0037J43103j9948Q6190
$$ 851125 875694 898204 1090728 1040246 877271 978591 904654 844617 987720 967772 1053962
4827A053962j30430R983P6527N4977q4440o2520J79573k06625k08324M18406l1751
$$ 1053962 923532 933515 1010042 1065019 980579 918059 1097632 891007 682683 1101089 1069338
4816A069338q7680J18583o0303l35668J7848J10183j35120j20723R1419J70182
$$ 1069338 981658 1100241 1039938 704270 722118 832301 697181 576458 667877 838059
4806H38059J09831j22166l1971J738J57399P1346j47952J40378r3437M1770k367
$$ 838059 947890 825724 793753 795491 952890 1024236 876284 1016662 923225 964995 962628
4795I62628j3731k67057J49841M3076j52140M28889r4789k14564j17567p5672
$$ 962628 948897 681840 831681 874757 722617 1151506 1056717 842153 724586 648914
4785F48914J45680Q8362r5077J52921j09782q0955J45920j23132j34896O8983
$$ 648914 794594 882956 787879 940800 831018 750063 895983 772851 637955 706938
4775G06938L9328k65014R6252M3447J35021J12262k74510p0143J25790J73437
$$ 706938 746266 481252 577504 620951 755972 868234 593724 523581 649371 822808
4765H22808q9853J11681k25685o6251k7640l1172J66985k6369P4773n6820J80076
$$ 822808 732955 844636 618951 552700 525060 493888 660873 634504 709277 652457 832533
4754H32533q9379j19635J7517k26833J63262o6049P8563K2903K8491k09967j62083
$$ 832533 743154 623519 641036 414203 577465 511416 589979 612882 641373 431406 269323
4743B69323K45626J43088k5720k95115n8130J72650j50802R0840M5976J55672
$$ 269323 514949 658037 632317 337202 279072 451722 300920 391760 437736 593408
4733E93408K29775k27104j72756J00448R4367j61582j07766Q4403j28682L2422
$$ 593408 823183 596079 423323 523771 618138 456556 348790 433193 304511 336933
4723C36933K08514k87691o09J77028P9720M7927J0313L4924j97946j2741N8784
$$ 336933 545447 257756 257147 434175 513895 561822 572135 607059 409113 396372 455156
4712D55156j47318N8573k8564n2108n5176R0537K9239L70685j33755J68348o3068
$$ 455156 307838 366411 337847 285739 230563 321100 350339 721024 587269 755617 692549
4701F92549k71694J30609n4494j40778R2091Q3769m8669m0560J8747k9839J88075
$$ 692549 420855 551464 496970 356192 448283 532052 483383 442823 461570 431731 619806
4690F19806o0012j17640l2493J4476R6322O0696N0762n5219K1724o336K5789j0122
$$ 619806 559794 442154 409661 424137 520459 581155 631917 576698 598422 592086 617875 607753
4678F07753n7648k68720J235L42189k81075k3060M3416O3881R7526l06528J11862
$$ 607753 550105 281385 282620 624809 343734 320674 364090 427971 525497 218969 330831
4667C30831R0901M9912O83j8622O3771K2954j03651j41706P9300K05990o5277
$$ 330831 421732 471644 472327 453705 517476 540430 436779 295073 374373 580363 515086
4656E15086P6792P1964o3404q6569j51818J15738P422k97164j46528K51855J64646
$$ 515086 591878 663842 600438 513869 362051 477789 485211 188047 41519 293374 458020
4645D58020m6606Q7097L4430j4074p0011l3305J63949N6998m8445p1056j25674
$$ 458020 411414 498511 532941 518867 448856 415551 579500 636498 588053 516997 391323
4634C91323n8957J7004J11007k80764j01737Q3439M5855P5051k39365M3137K43467
$$ 391323 332366 349370 460377 179613 77876 161315 207170 282221 42856 85993 329460
4623C29460l9562k8859J90656K2126J34312j09042k8198K5093O8786n6431j09571
$$ 329460 289898 261039 451695 473821 608133 499091 470893 495986 564772 508341 398770
4612C98770N493k5172J47392N0035J13732l20253k14558J12615K15037R1507j835
$$ 398770 404263 379091 526483 576518 690250 369997 155439 268054 483091 574598 572763
4601E72763m6520o6045j36417k51648K33032K32781r2552O9124k81818j18077
$$ 572763 526243 460198 323781 72133 305165 537946 445394 514518 232700 114623
4591A14623K22651J75887j02260m1723j00118r6564j01948L11251J11298O9201
$$ 114623 337274 513161 410901 369178 269060 172496 70548 381799 493097 562298
4581E62298n1836n9299j34697K65286k20228j51301J66461J44283J21053j3095
$$ 562298 510462 451163 316466 581752 361524 210223 376684 520967 642020 628925
4571F28925l383j05238q5850k02713J877q2307n5363L2016J54943j8406o3228
$$ 628925 625542 520304 434454 231741 233618 151311 95948 127964 282907 264501 201273
4560B01273j22664J67499K05424j51135J79387m4571j67039l4142j42977J34180
$$ 201273 78609 246108 451532 300397 479784 435213 268174 234032 91055 225235
4550B25235p1408q5562J41262J35675j13597K3045J37951J18824l33716L5879
$$ 225235 153827 68265 209527 345202 231605 254650 392601 511425 177709 213588
4540B13588K34836o5322q4918K5787Q5744P430j83988L18152l3704j91768J44186
$$ 213588 448424 383102 298184 323971 409715 417145 233157 551309 517605 325837 470023
4529D70023J4800N2664J93736q7854j54188P6418L5970j75710J4515J5916j57713
$$ 470023 484823 537487 731223 643369 489181 565599 601569 425859 440374 456290 298577
4518B98577q5723L48644J12562k09507k28084q8325P4918J51359p414l9941J83291
$$ 298577 212854 561498 674060 464553 236469 148144 223062 374421 367007 327066 510357
4507E10357K5257J3220K7598j5762o5797l5043n5429j719L2723P0792J4277J64427
$$ 510357 535614 548834 576432 560670 494873 459830 404401 402682 435405 506197 520474 684901
4495F84901K8126j43868j6814j35576L7219Q7753k2510l5804O6214P5541Q407
$$ 684901 713027 569159 552345 416769 453988 541741 519231 483427 549641 625182 633589
4484F33589L0532J63631q6916j06473n0262j34349J38568j8363j40612K02568
$$ 633589 664121 827752 740836 634363 584101 449752 588320 569957 429345 631913
4474F31913R4571L8398j00140j16162J5269R074N1004K9062j38642J67303R5384
$$ 631913 726484 764882 664742 548580 563849 572923 623927 652989 514347 681650 777034
4463G77034k12877J3443j52792P8757J9249J55297M5620L1539p1648N6330o2446
$$ 777034 564157 577600 424808 503565 522814 678111 723731 755270 683622 739952 677506
4452F77506J3224J87710j58139p5978J83535R2648m4333q7495O5772K59253J5485
$$ 677506 690730 878440 720301 644323 827858 920506 876173 788678 854450 1113703 1129188
4441A129188k03660j34543k48523j30328M774K08543Q1887L007J1550J03783P5712
$$ 1129188 925528 790985 542462 412134 416908 625451 707338 710345 721895 825678 901390
4430I01390O2116j47066l4069L0552k5434j24555j73037O5393K50922l8031j29744
$$ 901390 963506 816440 782371 812923 787489 662934 489897 555290 806212 768181 638437
4419F38437K31132J15159j25160o7901k18728q65P2227J94940R286m8560O1958
$$ 638437 869569 984728 859568 791667 572939 572074 644301 839241 848527 799967 861925
4408H61925O1761J47898L7116j23383J12379O1788j20024K32730J42376j4495
$$ 861925 923686 1071584 1108700 985317 1097696 1159484 1039460 1272190 1414566 1400071
4398A400071k22916K9425M8056M7860P7749K23685j10601j13203M6980K2877p5373
$$ 1400071 1177155 1206580 1254636 1302496 1380245 1603930 1493329 1380126 1427106 1449983 1374610
4387A374610Q201K405J04789P6547N596J19935o4377o190K68594K22680J31195
$$ 1374610 1382811 1385216 1490005 1566552 1572148 1692083 1627706 1621516 1890110 2112790 2243985
4376B243985J54988J40631J92550K67006k4671M9717J26032J13354Q574L46175
$$ 2243985 2398973 2539604 2732154 2999160 2974489 3024206 3150238 3263592 3272166 3618341
4366C618341K44240k9149J58972p1948r8811K75141J93054K4145j14182J82237
$$ 3618341 3862581 3833432 3992404 3920456 3821645 4096786 4289840 4313985 4199803 4382040
4356D382040J8673k10563j88573k40148q186R5259r7380R2863r9677k48973j41903
$$ 4382040 4400713 4190150 4001577 3761429 3753243 3848502 3751122 3843985 3744308 3495335 3353432
4345C353432k60475r1508K970o0235k091k08046k63362p4736n3122l80180k36480
$$ 3353432 3092957 3001449 3004419 2944184 2942093 2734047 2470685 2395949 2342827 1962647 1726167
4334A726167L2432j06598j05266j1240l3473j31690K7871J84586P1456q9397M5857
$$ 1726167 1758599 1652001 1546735 1535495 1502022 1370332 1398203 1582789 1654245 1564848 1610705
4323A610705J1333J31821j29206M35p8498j470J40770J56986J01926j81693n9840
$$ 1610705 1622038 1753859 1624653 1625088 1546590 1545120 1685890 1842876 1944802 1763109 1703269
4312A703269J68155k1552j99925r6486J79019J45024J13861j08123j66294o3200
$$ 1703269 1871424 1849872 1649947 1553461 1732480 1877504 1991365 1883242 1716948 1653748
4302A653748L51478j89660l4736L76338J37390P6313J50408n4176L18716L09488
$$ 1653748 2005226 1815566 1780830 2157168 2294558 2370871 2521279 2467103 2785819 3095307
4292C095307L1558L9585j13845j77821j43850P0254p6729k75619l9268j58979
$$ 3095307 3126865 3166450 3052605 2874784 2730934 2801188 2724459 2448840 2409572 2250593
4282B250593j78082K87749j38381j58917M2711L9490K21591j56604j99381K28306
$$ 2250593 2072511 2360260 2221879 2062962 2105673 2145163 2366754 2210150 2010769 2239075
4272B239075r0797J90493j33008j16146l9296J76710J87625M3997J86125L70850
$$ 2239075 2148278 2338771 2205763 2089617 2050321 2227031 2414656 2458653 2644778 3015628
4262C015628L57102J36944r1207J73240N5352l43902j56459o8267k03389j64090
$$ 3015628 3372730 3509674 3418467 3591707 3647059 3303157 3146698 3078431 2875042 2710952
4252B710952j06032l72174j07799R2375K7438j61952m1642r6845k00533N2220
$$ 2710952 2604920 2232746 2124947 2217322 2244760 2082808 2041166 1944321 1743788 1796008
4242A796008K15195O6553J17366J6305M4103J23267n5471m7603n266M4514j34761
$$ 1796008 2011203 2077756 2195122 2211427 2255530 2378797 2323326 2275723 2270457 2314971 2180210
4231B180210J51883O5589J43210j1584k51280q1210O9594M25421m0586J50800
$$ 2180210 2332093 2397682 2540892 2529308 2278028 2196818 2266412 2691833 2651247 2802047
4221B802047J06328P991p5337k0427J39320K6675n6008K1520m4962j58907j54106
$$ 2802047 2908375 2916366 2841029 2820602 2959922 2986597 2930589 2952109 2907147 2748240 2594134
4210B594134l7281J23421p14J75515J18185l6859j79320J68309O2993K123R317
$$ 2594134 2556853 2680274 2679560 2855075 2973260 2936401 2757081 2925390 2988383 2990506 2999823
4199B999823J75703l1325l39002l6785J07465O1246q6086J94275p9358k11587
$$ 2999823 3175526 3144201 2805199 2768414 2875879 2937125 2851039 3045314 2965956 2754369
4189B754369Q9748J61281J04138L5981j8212l7945P2867J85202j27331o4279r4058
$$ 2754369 2844117 3005398 3109536 3145517 3127305 3089360 3162227 3347429 3220098 3155819 3061761
4178C061761L0121J57931q2P6499j76773N035l7995m2294J35749o3150j0533K0963
$$ 3061761 3091882 3249813 3249731 3326230 3149457 3154492 3116497 3074203 3209952 3146802 3136269 3157232
4166C157232N1765N2969J34542l3372M9314J17882K36448K03197M2731J57654
$$ 3157232 3208997 3261966 3396508 3363136 3412450 3530332 3766780 3969977 4012708 4170362
4156D170362R0560j89863k1374N2649j36445J07764N5777l0646J10288K20133
$$ 4170362 4260922 4071059 4049685 4102334 3965889 4073653 4129430 4098784 4209072 4429205
4146D429205J8902p5876J03012m6652m4276K1852J31257j1956Q1453J85487J53709
$$ 4429205 4448107 4372231 4475243 4428591 4384315 4406167 4537424 4525468 4606921 4792408 4946117
4135D946117L25882L87070J28859m4623J95444N9100K26265L63491N0797L9830
$$ 4946117 5271999 5659069 5787928 5743305 5938749 5997849 6224114 6587605 6638402 6678232
4125F678232K39606K95242L53022L82073L35514K53528N05237M27000N42658Q86128
$$ 6678232 6917838 7213080 7566102 7948175 8283689 8537217 9042454 9469454 10012112 10898240
4115A0898240Q40607R94531J528813J580783J700285J054454J49205q99131j241020
$$ 10898240 11738847 12733378 14262191 15842974 17543259 18597713 18746918 17847787 16606767
4106A6606767j548079j302683j102667p65580o42968n71254k38021N367r4479
$$ 16606767 15058688 13756005 12653338 11887758 11244790 10673536 10435515 10440882 10346403
4097A0346403j06787r5823j26859K8759J90360K3430m295M5404K36773K12275
$$ 10346403 10239616 10143793 10016934 10045693 10236053 10259483 10255188 10300592 10537365 10749640
4087A0749640j601K64422L17971K66077M78594K75111L64774K34425K0189L39267
$$ 10749640 10748039 11012461 11330432 11596509 12075103 12350214 12714988 12949413 12969602 13308869
4077A3308869K98139K80895L68472M22719N3767Q3350P66289N37100K04475M39322
$$ 13308869 13607008 13887903 14256375 14679094 14732861 14816211 15582500 16119600 16324075 16763397
4067A6763397K73296L11191M97813O20704N48265N14285J81377M40185N72470
$$ 16763397 17036693 17347884 17845697 18466401 19014666 19528951 19710328 20150513 20722983
4058B0722983O28326O05964N60034Q33717R58383N95165N92795M96648N65475
$$ 20722983 21351309 21957273 22517307 23351024 24309407 24904572 25497367 25994015 26559490
4049B6559490M62996M15933L52786N46935P50091R67447M56334Q92857Q08584
$$ 26559490 27022486 27438419 27791205 28338140 29088231 30055678 30512012 31404869 32213453
4040C2213453J028810Q12420J024950J103537J326810J167037J349911J581902
$$ 32213453 33242263 34054683 35079633 36183170 37509980 38677017 40026928 41608830
4032D1608830J665348J919900J918402K107118K269128K213014K084340K142190
$$ 41608830 43274178 45194078 47112480 49219598 51488726 53701740 55786080 57928270
4024E7928270K469255K458688K691803L141401L171032L538155L797965M252777
$$ 57928270 60397525 62856213 65548016 68689417 71860449 75398604 79196569 83449346
4016H3449346M682109N371662N715880O184575P175845Q537477R446158J0708618
$$ 83449346 88131455 93503117 99218997 105403572 112579417 121116894 130563052 141271670
4008A41271670J2381976J4088901J6454952J9243728K2933239K6667171L0071366
$$ 141271670 153653646 167742547 184197499 203441227 226374466 253041637 283113003
4001B83113003L3395902L5572591L3852285K3105138L954389j6059988k9710657
$$ 283113003 316508905 352081496 385933781 409038919 412993308 396933320 367222663
3994C67222663l4426316l4902428l1004820k5743165k0349919j5834130j1580793
$$ 367222663 332796347 297893919 266889099 241145934 220796015 204961885 193381092
3987A93381092p999780n146959k868212k63912K279467N069512Q835481J3835819
$$ 193381092 185381312 180234353 177366141 177102229 179381696 184451208 193286689 207122508
3979B07122508J9521411K3962393L0606860M4124678M9478903L0314174l099117
$$ 207122508 226643919 250606312 281213172 325337850 374816753 405130927 402031810
3972D02031810m0209420m8537099m6954773m4445854l3751657k5027978j9046602
$$ 402031810 361822390 313285291 266330518 221884664 188133007 163105029 144058427
3965A44058427j4496430j1701425r124831p385394o004218m705924l987655l959337
$$ 144058427 129561997 117860572 108735741 101350347 95346129 90640205 86652550 82693213
3957H2693213l699149l005942k976815k400843j694877j076849j036685p46123
$$ 82693213 78994064 75988122 73011307 70610464 68915587 67838738 66802053 66055930
3949F6055930p55197k50615k63955K35832K07286M75448P21764J046612R45820
$$ 66055930 65300733 65050118 64786163 65021995 65229281 65704729 66426493 67473105 68418925
3940F8418925J417885J877935K491398K881994L597873M530786N710112P032663
$$ 68418925 69836810 71714745 74206143 77088137 80686010 85216796 90926908 97959571
3932I7959571Q864829J0032938J1607443J2745528J2899825Q946717J791757o440451
$$ 97959571 106824400 116857338 128464781 141210309 154110134 163056851 164848608 158408157
3924A58408157j2777569j4803612j5183902j4124225j1971183r859866q200106
$$ 158408157 145630588 130826976 115643074 101518849 89547666 79687800 71487694
3917G1487694o487623n516648m536226l863891l346397k776676k418659j978746
$$ 71487694 65000071 59483423 54947197 51083306 47736909 44960233 42541574 40562828
3909D0562828k203043j966399j972995j549419j148213j209834q88913p48897
$$ 40562828 38359785 36393386 34420391 32870972 31722759 30512925 29624012 28875115
3901B8875115q06137n80175m70137l50578n10148k06674p49399l97478l26551
$$ 28875115 28068978 27488803 27018666 26668088 26157940 25951266 25201867 24804389 24477838
3892B4477838q61350o76877o52282o06733m62939o20172o08185o72898l35140
$$ 24477838 23616488 22939611 22287329 21680596 21217657 20597485 19989300 19316402 18981262
3883A8981262k10636m93769k33244j95371k95263k35795l11688j05723k49614
$$ 18981262 18770626 18276857 18043613 17848242 17552979 17317184 17005496 16899773 16650159
3874A6650159l11396J50237N2706k32102j8076N7925K96554J8772m35982o71056
$$ 16650159 16338763 16489000 16541706 16309604 16291528 16349453 16646007 16664779 16228797 15557741
3864A5557741o73999n68794n98976m56869k78099m56829k69160k12972k76014
$$ 15557741 14883742 14314948 13715972 13259103 12981004 12524175 12255015 12042043 11766029
3855A1766029j57683m32944k33333j52904j65445O143M5975m03666m2566k51833
$$ 11766029 11608346 11175402 10942069 10789165 10623720 10629863 10675838 10272172 10229606 9977773
3845I977773J12937O2847Q2232J91466L3980o034J48683J78666J81034L67212
$$ 9977773 10090710 10153557 10235789 10427255 10461235 10455201 10603884 10782550 10963584 11330796
3835A1330796K35161K43612M42250j21622l07625k71795k20836l26189k39640
$$ 11330796 11565957 11809569 12251819 12130197 11822572 11550777 11329941 11003752 10764112
3826A0764112l2534r9006M7868J61233L5095M9837L30071L00082K50885J44242
$$ 10764112 10731578 10632572 10680440 10841673 10876768 10926605 11256676 11556758 11807643 11951885
3816A1951885L46456N03692N85809N84242L61548M11827J49635J4695k46066m95560
$$ 11951885 12298341 12802033 13387842 13972084 14333632 14745459 14895094 14909789 14663723 14168163
3806A4168163n66040r65856q32868n12660o75724k53837l03084m72482l00218
$$ 14168163 13602123 12636267 11803399 11290739 10615015 10361178 10058094 9585612 9285394
3797I285394l22143l99615l09145p3775k45515k25651n7604k53231j08532K65127
$$ 9285394 8963251 8563636 8254491 8180716 7935201 7709550 7651946 7398715 7290183 7555310
3787G555310j62333l05591K8479J38186n1920j58864j39302J75353J81830k22310
$$ 7555310 7392977 7087386 7115865 7254051 7202131 7043267 6903965 7079318 7261148 7038838
3777G038838J16787P5771j00444N7897K59587r1735K326k1955o9422R9472j16317
$$ 7038838 7155625 7231396 7130952 7188849 7448436 7356701 7359027 7337072 7267650 7367122 7250805
3766G250805j50785J53490J57355j67933K96726N9167J42872k53K0031k7680J25569
$$ 7250805 7100020 7253510 7410865 7242932 7539658 7598825 7741697 7741444 7761475 7733795 7859364
3755G859364q125J29383K22457k29851r7605K09990K94827O3114O5913N1196j0969
$$ 7859364 7851239 7980622 8203079 7973228 7875623 8085613 8380440 8443554 8509467 8560663 8549694
3744H549694L03034K47913O1621L16086K74556J8228J82269L27307K99201J21700
$$ 8549694 8852728 9100641 9162262 9478348 9752904 9771132 9953401 10280708 10579909 10701609
3734A0701609L95585J73566J35451Q5116M50312L48554J69230M14079J48598J95484
$$ 10701609 11097194 11270760 11406211 11491327 11941639 12290193 12459423 12873502 13022100 13217584
3724A3217584K93938M87939K92063L51358R7200K36607L56629K62208K91261O09000
$$ 13217584 13511522 13999461 14291524 14642882 14740082 14976689 15333318 15595526 15886787 16495787
3714A6495787L44672K50360K19755M21737M50385L6877J71040L09441J30586K03345
$$ 16495787 16840459 17090819 17310574 17732311 18182696 18219573 18390613 18700054 18830640 19033985
3704A9033985L38754j76825J9985J11303n6371p0932n8381j44907k16228j37855
$$ 19033985 19372739 19195914 19215899 19327202 19270831 19199899 19141518 18996611 18780383 18642528
3694A8642528k16849k1398m4082J85360r6237K23036M7769j09649R0041M5707
$$ 18642528 18425679 18404281 18360199 18545559 18449322 18672358 18720127 18610478 18700519 18746226
3684A8746226J22035j72490p8677j96132l24704j97447k91430j88447N4094J0244
$$ 18746226 18868261 18695771 18617094 18420962 18096258 17898811 17607381 17418934 17473028 17483272
3674A7483272j63790J69988J49116J76634J17901K19369R2138j16824K53210J10577
$$ 17483272 17319482 17489470 17638586 17815220 17933121 18152490 18244628 18127804 18381014 18491591
3664A8491591P1595J64763J44897k7668O1942l4104J7184j03837J04168J25607
$$ 18491591 18563186 18727949 18872846 18845178 18907120 18873016 18890200 18786363 18890531 19016138
3654A9016138K045j42185J74440k5066j84854J43005N8074Q5036p9851j61668
$$ 19016138 19018183 18875998 19050438 19025372 18840518 18983523 19041597 19126633 19046782 18885114
3644A8885114J47201J92455j35952k7209K12367J23451J31883L74338p9321K48011
$$ 18885114 19032315 19224770 19088818 19061609 19273976 19397427 19529310 19903648 19824327 20072338
3634B0072338J74851K01687L98348L62496N24951O25352K87781M66342P45094
$$ 20072338 20247189 20448876 20847224 21209720 21734671 22360023 22647804 23114146 23859240
3625B3859240N74155M56196M43878P12829P86907P76348O42589J012427Q27653
$$ 23859240 24433395 24889591 25333469 26046298 26833205 27609553 28252142 29264569 30092222
3616C0092222Q26980Q17985R40995P59224P94933J036267Q55964Q13204O56323
$$ 30092222 30919202 31737187 32678182 33437406 34232339 35268606 36124570 36937774 37594097
3607C7594097N13113Q40122R47431P58864N68680N28800P55783N69121K87765
$$ 37594097 38107210 38947332 39894763 40653627 41222307 41751107 42506890 43076011 43363776
3598D3363776L66693L05681M26736l3189P4606J05189P1386O2725l37976j58291
$$ 43363776 43730469 44036150 44462886 44429697 44504303 44609492 44680878 44743603 44405627 44247336
3588D4247336j09311l6756j74419m61245l4146j5432K30566J2992l8727M8693
$$ 44247336 44138025 44101269 43926850 43465605 43431459 43416027 43646593 43659585 43620858 43669551
3578D3669551N1657l1305K1023o5033N6999n7894j32252J00886j60125J4969N0385
$$ 43669551 43721208 43689903 43710926 43645893 43702892 43644998 43512746 43613632 43453507 43468476 43518861
3567D3518861K08970L82269K48348J59934K66506L92971N60576N63648N99418
$$ 43518861 43727831 44110100 44358448 44518382 44784888 45177859 45738435 46302083 46901501
3558D6901501N09583Q30763N48082P14371O79742N47515M94003M56005N19410
$$ 46901501 47411084 48241847 48789929 49504300 50184042 50731557 51225560 51681565 52200975
3549E2200975K25406O83669M36627J70883N84124K69784K40584L39318M35003
$$ 52200975 52426381 53110050 53546677 53717560 54301684 54571468 54812052 55151370 55586373
3540E5586373K87118K68058K74317L98410K36820j39225J94450J43893n2888J65167
$$ 55586373 55873491 56141549 56415866 56814276 57051096 56911871 57106321 57250214 57197326 57362493
3530E7362493J03102K32751m0557k4423k9336p8752r2876k83972j59042j60827
$$ 57362493 57465595 57698346 57657789 57633366 57604030 57525278 57432402 57148430 56989388 56828561
3520E6828561l87792N8822p4245l05345j94936j11416p2227p1830j50927M0314
$$ 56828561 56440769 56499591 56425346 56120001 55925065 55813649 55741422 55669592 55518665 55558979
3510E5558979K25529n7144k83891J17169J84595r6372k254K23318P3224j54751
$$ 55558979 55784508 55727364 55443473 55560642 55745237 55648865 55646611 55869929 55943153 55788402
3500E5788402k28054p4202J33606j23092J73777j43378j7658j19516l11185l38606
$$ 55788402 55560348 55486146 55619752 55496660 55670437 55527059 55509401 55389885 55078700 54740094
3490E4740094j81246J0442j32101k33086j64435P0004O4228J84451J36986P0430
$$ 54740094 54558848 54569290 54437189 54204103 54039668 54109672 54173900 54358351 54495337 54565767
3480E4565767R8823J89426K46100M61943L73340N66629K25651P66355R66153P87332
$$ 54565767 54664590 54854016 55100116 55562059 55935399 56502028 56727679 57494034 58460187 59247519
3470E9247519Q91315P25415R20978R13536Q69808J078243Q50557Q42334P33438
$$ 59247519 60138834 60864249 61785227 62698763 63568571 64646814 65497371 66339705 67073143
3461F7073143P13668P60393N57087M97355L85944J90628l0804O2894k62757M4129
$$ 67073143 67786811 68547204 69104291 69601646 69987590 70178218 70147414 70210308 69947551 69991680
3451F9991680m58608o17832j76108j67293k74906l19073l53233k99155l72853
$$ 69991680 69533072 68915240 68739132 68571839 68296933 67977860 67624627 67325472 66952619
3442F6952619n05022p45417o11376l58199o47325q06108p73539r74421p10633
$$ 66952619 66447597 65702180 65090804 64732605 64085280 63279172 62505633 61531212 60820579
3433F0820579j164825r49406j014273j381891j182883j049962j421985j349390
$$ 60820579 59655754 58706348 57692075 56310184 55127301 54077339 52655354 51305964
3425E1305964q20781q58639j415008j083748r71456j037746j030058j186482r43303
$$ 51305964 50485183 49626544 48211536 47127788 46156332 45118586 44088528 42902046 41958743
3416D1958743q67999p84311q14063o54089n56142q17077p65277o93052p80863
$$ 41958743 41090744 40306433 39492370 38838281 38282139 37465062 36699785 36006733 35225870
3407C5225870m77320m64171l19226l91332l79606m23357j31943j15206j85593
$$ 35225870 34748550 34284379 33965153 33573821 33194215 32770858 32638915 32523709 32338116
3398C2338116j75681n3202K2598j04427P8373K01510M50002J58449L78335L43036
$$ 32338116 32162435 32109233 32131831 32027404 32105777 32307287 32757289 32915738 33294073 33637109
3388C3637109J23150L03034L51051K99970M84393N17250M59536O72460N48000
$$ 33637109 33760259 34063293 34414344 34714314 35198707 35715957 36175493 36847953 37395953
3379C7395953O26250N10479N34116N89407N52571M96143O48736O50950L22992
$$ 37395953 38022203 38532682 39066798 39656205 40208776 40704919 41353655 42004605 42327597
3370D2327597M19433L32861L53568L42553O56131O87954K97409L99502M53083
$$ 42327597 42747030 43079891 43433459 43776012 44432143 45120097 45417506 45817008 46270091
3361D6270091L89769L26376O6671J29523J08027K16007N77849L1310l1121J06502
$$ 46270091 46659860 46986236 47052907 47182430 47290457 47506464 48084313 48115623 48084502 48191004
3351D8191004K47210J90387l9438j88217J10140K29108R5262J45963j3818J76224
$$ 48191004 48438214 48628601 48589163 48400946 48511086 48740194 48835456 48981419 48967601 49143825
3341D9143825J09597J09277N01546L66813M11416L19990L68680M33596M93311
$$ 49143825 49253422 49362699 49864245 50231058 50642474 50962464 51331144 51764740 52258051
3332E2258051K78231N34200N10492O20235K33586L88348K22123J93157L22867
$$ 52258051 52536282 53070482 53580974 54201209 54434795 54823143 55045266 55238423 55561290
3323E5561290L48803J00061J72254J00418k86191Q5351r6743o6725J51375J10275
$$ 55561290 55910093 56010154 56182408 56282826 55996635 56081986 55985243 55918518 56069893 56180168
3313E6180168r9169p4790k25275k40660j53217j2559j42168p2457k18586k83023
$$ 56180168 56080999 56006209 55780934 55540274 55387057 55374498 55232330 55159873 54941287 54658264
3303E4658264l10337k81297k18021j99721l50570j96123j67921l74809k82985
$$ 54658264 54347927 54066630 53848609 53648888 53298318 53102195 52934274 52559465 52276480
3294E2276480m9756M3128m3243j36300O2967q4753k7061N4488L7882L1053j60048
$$ 52276480 52226724 52269852 52226609 52090309 52153276 52068523 52041462 52095950 52133832 52164885 52004837
3283E2004837l4990k73331m84440k66634l34216m02475l21893m34038m48518l72739
$$ 52004837 51969847 51696516 51212076 50945442 50611226 50208751 49886858 49452820 49004302 48631563
3273D8631563n61211n62816n31599l81598l75247m98366o14329l94302k97473
$$ 48631563 48070352 47507536 46975937 46594339 46219092 45720726 45106397 44712095 44414622
3264D4414622m95861m46744o06998m81861l80241n94620o01948p86975p40657
$$ 44414622 43918761 43472017 42865019 42383158 42002917 41408297 40806349 40019374 39278717
3255C9278717n41328n34167j058030q19838n35910n57649q05420o41671n26960
$$ 39278717 38737389 38203222 37145192 36325354 35789444 35231795 34426375 33784704 33257744
3246C3257744p53531l57593m52511o41209m87455l26115l49237l3038l50177l42579
$$ 33257744 32504213 32146620 31694109 31052900 30565445 30239330 29890093 29857055 29506878 29164299
3236B9164299o3551j97856l27998m20454k45990o8435J18340N2263j96593j00390
$$ 29164299 29100748 28902892 28574894 28154440 27908450 27840015 27958355 28010618 27814025 27713635
3226B7713635p61Q4556J40521J44456j3435J0110K17473k4754J00991q2736J51619
$$ 27713635 27712874 27797430 27937951 28082407 28068972 28079082 28296555 28271801 28372792 28290056 28441675
3215B8441675J68196l2757o93K74819L57633J09736K09814Q7215K19312L69221
$$ 28441675 28609871 28577114 28576421 28851240 29208873 29318609 29528423 29615638 29834950 30204171
3205C0204171K93736M6808L17287J76371P9614N3987J47268M9502K51398L52741
$$ 30204171 30497907 30544715 30862002 31038373 31117987 31171974 31319242 31368744 31620142 31972883
3195C1972883K76130N0141L82943M83337L10733K41825K09024K64909J84071L43054
$$ 31972883 32249013 32299154 32682097 33165434 33476167 33717992 33927016 34191925 34375996 34719050
3185C4719050K80321N12322L73090J70688J33821M21303J61860J25439L06659
$$ 34719050 34999371 35511693 35884783 36055471 36189292 36610595 36772455 36897894 37204553
3176C7204553K64346M25543K94887N31681J52380O592O18408L39581P319L08780
$$ 37204553 37468899 37894442 38189329 38721010 38873390 38879982 39498390 39837971 39845290 40154070
3166D0154070N39875J41326L55669N25917M95910N81023N39084N02795P40783
$$ 40154070 40693945 40835271 41190940 41716857 42212767 42793790 43332874 43835669 44576452
3157D4576452Q65881N92881P06941Q02066Q08321Q87477P25497P90772P26842
$$ 44576452 45442333 46035214 46742155 47544221 48352542 49240019 49965516 50756288 51483130
3148E1483130O58282R53476P90879Q23185Q12688P16284O44002N54820L73387
$$ 51483130 52141412 53094888 53885767 54708952 55521640 56237924 56881926 57436746 57810133
3139E7810133J7611K9875n1234J3670j12960k62079O46k37061j79241J20812N6151
$$ 57810133 57827744 57857619 57806385 57820055 57707095 57445016 57445662 57208601 57029360 57150172 57206323
3128E7206323K7235l09593P6170L66071J13081J49164k2647M11319L88756L13134
$$ 57206323 57233558 56923965 57000135 57366206 57479287 57628451 57605804 58017123 58405879 58719013
3118E8719013L78438K71899J52041L27228M24133K15967L17627J30954M34280
$$ 58719013 59097451 59369350 59521391 59848619 60272752 60488719 60806346 60937300 61371580
3109F1371580K26048p8022J16094K81701P9484K04247J85474J23097L43821L10507
$$ 61371580 61597628 61519606 61635700 61917401 61996885 62201132 62386606 62509703 62853524 63164031
3099F3164031M94679K77128L46267M81966M06428P41532N29976O12633N67037
$$ 63164031 63658710 63935838 64282105 64764071 65170499 65912031 66442007 67054640 67621677
3090F7621677M35064O96782M25973L68327M37099K64853K90290K96015N24429
$$ 67621677 68056741 68753523 69179496 69547823 69984922 70249775 70540065 70836080 71360509
3081G1360509J596O9203M39015K34947N1872M50578L10467L63814O82516N79817
$$ 71360509 71362105 71431308 71870323 72105270 72157142 72607720 72918187 73282001 73964517 74544334
3071G4544334O45827N74921O28655P33547R69392N70529J104947J019697J180720
$$ 74544334 75190161 75765082 76393737 77127284 78096676 78667205 79772152 80791849 81972569
3062H1972569J340120J321646J514221J632273J492601J563492J417579J419780
$$ 81972569 83312689 84634335 86148556 87780829 89273430 90836922 92254501 93674281
3054I3674281J681090J261146J256657J136196Q93299P89401N42785M37799M11868
$$ 93674281 95355371 96616517 97873174 99009370 99902669 100692070 101234855 101672654 102084522
3045A02084522N37704M34857N39719N0096O8105K92401k6737j20037J8099l44636
$$ 102084522 102622226 103057083 103596802 103646898 103715003 104007404 103980667 103860630 103878729 103534093
3035A03534093k62067k35772j35048j69658n04443k91721k09510P6579j66870
$$ 103534093 103272026 103036254 102901206 102731548 102227105 101935384 101725874 101802453 101635583
3026A01635583P8048L8774l70539q2363J63411K09518m1886K10253K05610J57110
$$ 101635583 101713631 101752405 101381866 101299503 101462914 101672432 101630546 101840799 102046409 102203519
3016A02203519L40639J13726L46775L53587L13221J60752J32315K23375J29502
$$ 102203519 102544158 102657884 103004659 103358246 103671467 103832219 103964534 104187909 104317411
3007A04317411K66775K16442o1573L81583K88618J13566K92525L20653K59480
$$ 104317411 104584186 104800628 104739055 105120638 105409256 105522822 105815347 106136000 106395480
2998A06395480K02847K68543L86561O94767P93582P82729P10023R34048J095138
$$ 106395480 106598327 106866870 107253431 107948198 108741780 109524509 110234532 111168580 112263718
2989A12263718J016316J192687O19605O82864N12823K52102q5054n36674o51850
$$ 112263718 113280034 114472721 115092326 115775190 116288013 116540115 116455061 115918387 115266537
2980A15266537m36539r43748j126323j161525j331191j570824j584484j713007
$$ 115266537 114829998 113886250 112759927 111598402 110267211 108696387 107111903 105398896
2972A05398896j752327j445576j797443j761226j527319j537307j673351j820969
$$ 105398896 103646569 102200993 100403550 98642324 97115005 95577698 93904347 92083378
2964I2083378j894154j818281j678122j705725j477003j229502j203451q84969
$$ 92083378 90189224 88370943 86692821 84987096 83510093 82280591 81077140 80192171
2956H0192171r45013r44048p40747q04729q94180j033704r11309j029585p17232
$$ 80192171 79247158 78303110 77562363 76757634 75863454 74829750 73918441 72888856 72171624
2947G2171624q56043p55584m05533o12247k35853l71553l6123n1606j23522j91254
$$ 72171624 71315581 70559997 70154464 69542217 69306364 68934811 68898688 68847082 68723560 68532306
2937F8532306l62110n69823m08076m40396o28861j057513q27744p64803j010328
$$ 68532306 68170196 67600373 67192297 66751901 66123040 65065527 64237783 63472980 62462652
2928F2462652j055067j027469j003736j129109j169042j227936j335381j231306
$$ 62462652 61407585 60380116 59376380 58247271 57078229 55850293 54514912 53283606
2920E3283606j552369j564487j424516j481023j460856j379932j405055j271603
$$ 53283606 51731237 50166750 48742234 47261211 45800355 44420423 43015368 41743765
2912D1743765j270472j510199q72423p90233r97814o88874n58227p01143m05493
$$ 41743765 40473293 38963094 38090671 37300438 36302624 35613750 35055523 34354380 33948887
2903C3948887n14016o90009l46518k52115l97998o35650o32339m00701j62408
$$ 33948887 33434871 32744862 32398344 32146229 31748231 31112581 30480242 30079541 29917133
2894B9917133l36119m80121o89607m56004k7504m02978j45997k52450m62688k08795
$$ 29917133 29581014 29100893 28411286 27955282 27927778 27524800 27378803 27126353 26663665 26454870
2884B6454870k70359l34094o22502n50149n60952m17663m29954n26154n50161
$$ 26454870 26184511 25850417 25227915 24677766 24116814 23699151 23269197 22743043 22192882
2875B2192882k01974l30016m44361k76737n67590o99220o81794m79368o01367
$$ 22192882 21990908 21660892 21216531 20939794 20372204 19672984 18991190 18511822 17910455
2866A7910455n81583n74691m29816m66619l60358m38539m95750m24516l98827
$$ 17910455 17328872 16754181 16324365 15857746 15497388 15058849 14563099 14138583 13739756
2857A3739756m39635j36935m78698n69694j12614j19066k27378k29915j95448
$$ 13739756 13300121 13163186 12684488 12114794 12002180 11883114 11655736 11425821 11230373
2848A1230373j38764m25511j6661j36838M2626l04355j92313n3577l63126O3518
$$ 11230373 11091609 10666098 10649437 10512599 10555225 10250870 10058557 10004980 9641854 9705372
2838I705372k51687k97181R3668j02391m0089j16415k10649m0434k51348J2006
$$ 9705372 9453685 9156504 9250172 9147781 9107692 8991277 8780628 8740194 8488846 8500852
2828H500852j46380k20426p1605j50442j04641k26660j55785k30776k25140j39276
$$ 8500852 8354472 8134046 8062441 7911999 7807358 7580698 7424913 7194137 6968997 6829721
2818F829721n6185L1629o8399N3805k21546k16678j91216j87930j42406n2767
$$ 6829721 6773536 6805165 6736766 6790571 6569025 6352347 6161131 5973201 5830795 5778028
2808E778028J59613j5647k22219j27800j9985m3899j56375j07967k28865k1981
$$ 5778028 5937641 5921994 5699775 5571975 5551990 5508091 5351716 5243749 5014884 4992903
2798D992903j46511L5433j45368k55561k07655p8720l9094o7005m0534K16024
$$ 4992903 4846392 4881825 4736457 4480896 4273241 4194521 4155427 4088422 4047888 4263912
2788D263912j59205J08859k21896Q7918o9870k58198K7466P7134l3023l4592K49
$$ 4263912 4104707 4213566 3991670 4079588 4009718 3751520 3778986 3856120 3823097 3788505 3788754
2777C788754l1703M197l55567o1915J8659L715N7636J64930n1604J1742l07825
$$ 3788754 3757051 3761248 3405681 3343766 3362425 3366140 3423776 3588706 3537102 3548844 3241019
2766C241019k6516J06259j62308N7861P5656J04471n57L3089N960j15868m880
$$ 3241019 3214503 3320762 3158454 3216315 3291971 3396442 3395885 3428974 3434934 3319066 3314186
2755C314186k30059J73558N4049k09783P9195j1407j16347k2384k79480P0026
$$ 3314186 3084127 3257685 3311734 3101951 3181146 3169739 3053392 3031008 2751528 2821554
2745B821554k6971m1641J18557J65956L6681j10808j58066q2294J5524R349J20494
$$ 2821554 2794583 2752942 2871499 3037455 3074136 2963328 2805262 2722968 2738492 2747841 2868335
2734B868335L5948k33683N5284L2564m5177j6521J13203l5021k9162n314K22973
$$ 2868335 2904283 2670600 2725884 2758448 2713271 2696750 2809953 2774932 2745770 2740456 2963429
2723B963429q8296j5228o7623J25846R7585j78440r2288N1783J36263j53020q1351
$$ 2963429 2875133 2859905 2792282 2918128 3015713 2837273 2744985 2796768 2933031 2780011 2698660
2712B698660l0640J26591j13493K62450P3529l5762j20410N4938K89370q9615
$$ 2698660 2668020 2794611 2681118 2943568 3017097 2981335 2860925 2915863 3205233 3115618
2702C115618l66076K00028L11632J10259j08668J19705J9970n3067J0352l4658
$$ 3115618 2749542 2949570 3261202 3371461 3262793 3382498 3402468 3349401 3359753 3325095
2692C325095M5951m2113J8831R8157l991k3281l1677J81860J07100J03012j0330
$$ 3325095 3371046 3328933 3347764 3445921 3441930 3418649 3386972 3568832 3675932 3778944 3768614
2681C768614J5257K78161Q3780k36342o3351K73093J12828Q8843r0132O2102N0842
$$ 3768614 3783871 4062032 4145812 3909470 3846119 4119212 4232040 4320883 4230751 4292853 4343695
2670D343695K74061L68868J8572J36855j08437r4757K78789p9595j1334K14872
$$ 4343695 4617756 4986624 5005196 5142051 5033614 4938857 5217646 5138051 5126717 5341589
2660E341589P6909L57249K36773l7146M00260J85624J48161M78209K57458K58515
$$ 5341589 5418498 5775747 6012520 5975374 6375634 6561258 6709419 7187628 7445086 7703601
2650G703601L5997N19096M21017K96129K74815K94008J79676J54681K23238K27848
$$ 7703601 7739598 8258694 8679711 8975840 9250655 9544663 9724339 9879020 10102258 10330106
2640A0330106L43394K89376M73174R1850K63384M73728L56129J00635K90956J47016
$$ 10330106 10673500 10962876 11436050 11527900 11791284 12265012 12621141 12721776 13012732 13159748
2630A3159748L72588L69664L49336J83818j7857J17126J02193k02368j96018P7885
$$ 13159748 13532336 13902000 14251336 14435154 14417297 14534423 14636616 14434248 14238230 14316115
2620A4316115j37991j69008j41585j76414k66110j84300j03675N5071J45401m6059
$$ 14316115 14178124 14009116 13867531 13691117 13425007 13240707 13137032 13192103 13337504 13291445
2610A3291445L39533J16922M9872J12743L45330L63455J3922K45546K45382N39976
$$ 13291445 13630978 13747900 13797772 13910515 14255845 14619300 14633222 14878768 15124150 15664126
2600A5664126N62141M97426N32889N93825O81660M94043N97875N29122N59578
$$ 15664126 16226267 16723693 17256582 17850407 18532067 19026110 19623985 20153107 20712685
2591B0712685M26178O71893M22313L57528O99624K48827K58806O02729M86668
$$ 20712685 21138863 21810756 22233069 22590597 23290221 23539048 23797854 24400583 24887251
2582B4887251L58651M99228J43052J52512L79241L18637j5599M13K64318J32111
$$ 24887251 25245902 25745130 25888182 26040694 26419935 26738572 26722973 26723386 26987704 27119815
2572B7119815l01359p7045k50756n98231n24969m86323n49035o97188p85726p97634
$$ 27119815 26818456 26741411 26490655 25892424 25367455 24881132 24332097 23634909 22849183 22051549
2562B2051549n84786p02550n81725l69519m78217n28600m19687k85874j17643
$$ 22051549 21466763 20764213 20182488 19812969 19334752 18806152 18386465 18100591 17982948
2553A7982948k60045j60848k18839j23260K87278J22623R8775M06361N34834N0077
$$ 17982948 17722903 17562055 17343216 17219956 17507234 17629857 17728632 18134993 18669827 18719904
2543A8719904J71405M29864M15970L11481M91773L62567M66443L10604K5557L01923
$$ 18719904 18891309 19321173 19737143 20048624 20540397 20902964 21369407 21680011 21705568 22007491
2533B2007491L14704l6049J22146l0672j35056k62620r6984j87059o4801k39800
$$ 22007491 22322195 22286146 22408292 22377620 22242564 21979944 21882960 21695901 21631100 21391300
2523B1391300J36471O7750k13465l38579o78533l77432l83471o22098n28849n84665
$$ 21391300 21527771 21595521 21382056 21043477 20364944 19987512 19604041 18981943 18453094 17868429
2513A7868429o44801o89666n48914p50556p75813n13394n35922m46915m38177
$$ 17868429 17223628 16533962 15985048 15234492 14458679 13945285 13409363 12962448 12524271
2504A2524271m01771m59979k43400k19320l51421l64495m45320l17578J34333
$$ 12524271 12122500 11662521 11419121 11199801 10848380 10483885 10038565 9720987 9855320
2495I855320k10412k37385o7720K68580j62823P4974q5284m0831k06727j73309
$$ 9855320 9644908 9407523 9339803 9608383 9445560 9520534 9435250 9394419 9187692 9014383
2485I014383J780j15686j56731j61573q8375p8128k73258j64651m726k73875j72512
$$ 9014383 9016163 8900477 8743746 8582173 8493798 8415670 8142412 7977761 7973035 7699160 7526648
2474G526648k30612l9471K06035k7452j24673j71001o5093L8988k54953Q125p3862
$$ 7526648 7296036 7256565 7462600 7435148 7310475 7139474 7074381 7113369 6858416 6866541 6792679
2463F792679j69162k23615j78168l98508k28457j76236m53889l8943n56094k72975
$$ 6792679 6623517 6399902 6221734 5823226 5594769 5418533 4964644 4925701 4369607 4096632
2453D096632j06259j32881j28158n348j16149m8630j30596j71548j23740j63615
$$ 4096632 3990373 3857492 3729334 3723986 3607837 3559207 3428611 3257063 3133323 2969708
2443B969708m3545r9467j80712j05890j0693p1909k43593J73545j23379k13188
$$ 2969708 2926163 2826696 2645984 2540094 2529401 2457492 2213899 2387444 2264065 2050877
2433B050877R0480k2911j20623k8483J30546j52073K248j20453l02755m13392
$$ 2050877 2141357 2118446 1997823 1969340 2099886 1947813 1950061 1829608 1526853 1113461
2423A113461K7190J77719J24085N5082j22718N3346J42488k10216k24336J15437
$$ 1113461 1140651 1318370 1442455 1497537 1374819 1428165 1570653 1360437 1136101 1251538
2413A251538R4334L3441j14645l7855Q3673k72988n7638O213J55729l5499J58412
$$ 1251538 1345872 1379313 1264668 1226813 1310486 1037498 979860 986073 1141802 1106303 1264715
2402A264715o0343r6360j28634p5865k2392J2096J12394M9040q046o795J5353
$$ 1264715 1204372 1108012 979378 903513 881121 893217 1005611 1054651 1046605 1039810 1055163
2391A055163j25021j24137k9646j44724J57189K28493r7136j15054r0517p0944
$$ 1055163 930142 806005 776359 631635 788824 1017317 920181 805127 714610 643666
2381F43666R0660n4497k18772N0950M2377L4446r5806J63126k714n076n6750K851
$$ 643666 734326 679829 461057 512007 554384 588830 493024 656150 653436 648360 591610 594461
2369E94461m4307R133K5533J4570j35630k12813J47174L9184j37846O013K93557
$$ 594461 550154 559287 584820 599390 463760 250947 398121 437305 299459 305472 599029
2358E99029J10692k1786O4547k43956m7991l9034P0346P8960m1108K4823l7706
$$ 599029 709721 687935 752482 508526 460535 421501 491847 570807 529699 554522 516816
2347E16816q6337M4750P4102j74713P6173l16807J42706K39792L19N6002j01854
$$ 516816 430479 475229 549331 374618 450791 133984 276690 516482 516801 572803 470949
2336D70949R0971p1133k18172K05327j78118J3148J86991J60016m656j91607j3526
$$ 470949 561920 490787 272615 477942 299824 312972 499963 659979 655323 463716 450190
2325D50190O8560j75407Q077J04617r2466M1595J29710j88506N9504j11311Q2125
$$ 450190 518750 343343 351420 456037 363571 405166 534876 346370 405874 294563 376688
2314C76688L15187r5537q4746K39q0748j03751L13053k58010J35934j49296N6425
$$ 376688 691875 596338 511592 511831 431083 327332 640385 382375 518309 369013 425438
2303D25438m6204M1599L6514j72901J96401O9692l0379k0148J45780k25972j87794
$$ 425438 379234 420833 457347 284446 480847 550539 520160 500012 645792 419820 232026
2292B32026J89125l8912j6202J78247Q7726j61072P8999k14190q2454J78392j87666
$$ 232026 421151 382239 366037 544284 632010 470938 549937 335747 253293 431685 244019
2281B44019J07990K53774O4177l8552j23963J36380R7152k00261Q8391j17321
$$ 244019 352009 605783 669960 631408 507445 643825 740977 540716 629107 511786
2271E11786K0040J5753M3630N8314J28644R491J5596j35137n5230k44365j1429
$$ 511786 531826 547579 591209 649523 778167 787658 803254 668117 612887 368522 357093
2260C57093L42850j59493n5710j25200o172O6296o05l9238l9602j0127l0867K0521
$$ 357093 699943 540450 484740 359540 353368 419664 419059 379821 340219 330092 299225 319746
2248C19746J87346j19900j08642k3687J37736R0425J7906o5564n291N8721k40870
$$ 319746 507092 387192 278550 254863 392599 483024 500930 435366 430075 488796 247926
2237B47926L7132Q1040j21699L5582P3278j7186J04573l23294p9002N8424L4654
$$ 247926 285058 366098 244399 279981 353259 336073 440646 117352 38350 96774 131428
2226A31428J57374l336r4913j11565K21774j71203J78382K01215j20977k57117
$$ 131428 288802 285466 190553 78988 300762 129559 307941 509156 388179 131062
2216A31062K27510j063j97036O0852N1114K8770p2180q2831J10952N8880q3673
$$ 131062 358572 357509 160473 221325 272439 301209 229029 146198 257150 316030 232357
2205B32357k2482o6662K8485j04661L6108j8818J65251J05086L6604k70l819j14925
$$ 232357 209875 143213 171698 67037 103145 84327 249578 354664 391268 390998 387179 272254
2193B72254m716m655N7594j4485R9987M1512k3936K9469j35062r8410k08666K28137
$$ 272254 267538 262883 320477 305992 405979 447491 423555 453024 317962 219552 10886 239023
2181B39023N3418k5254j7245J68841m0113j72898k3969K3678j42696J55285J55553
$$ 239023 292441 267187 249942 418783 378670 205772 181803 205481 62785 218070 373623
2170C73623l2174Q4286L9310k34229n8231L53113m4462K21233k12526m6675j99031
$$ 373623 341449 425735 465045 230816 172585 525698 481236 702469 489943 443268 244237
2159B44237K15592m5694m9421j50380o4325J9497M7349R9040q0780O7111j25704
$$ 244237 459829 414135 364714 214334 150009 169506 216855 315895 235115 302226 176522
2148A76522J20252K51302J34805k27729J31043j64721q4599P1519P1332q4790
$$ 176522 296774 548076 682881 455152 586195 421474 336875 408394 479726 394936
2138C94936R4207j16388J01585M9876j59176p3531K9803J02993O9897j17151J13033
$$ 394936 489143 372755 474340 524216 365040 291509 321312 424305 494202 377051 490084
2127D90084j4893l00188J82134J97270j01783n655K75432j58271R6176N5083q2571
$$ 490084 475191 175003 357137 554407 452624 446969 722401 564130 660306 715389 632818
2116F32818M7451r1820o188j12748P8281L06649j59431K13084Q842l8848J04660
$$ 632818 680269 588449 582261 469513 547794 854443 695012 908096 916938 878090 982750
2105I82750n982j28953P9124R4648l0286O821r7583M4611p5759l7381O7095K34693
$$ 982750 976768 847815 926939 1021587 991301 998122 900539 945150 869391 832010 899105 1133798
2093A133798O8145j07212K03188J05093K28429k51710m2922J99217N4330J61999
$$ 1133798 1201943 1094731 1297919 1403012 1631441 1379731 1336809 1536026 1590356 1752355
2083A752355m0106j49768Q6301O8318J91498J99293j27081p9594P0597P6477n0459
$$ 1752355 1712249 1562481 1648782 1717100 1908598 2107891 1980810 1901216 1971813 2048290 1997831
2072A997831l8531J40703J54825J87898K26513j3480R6892q5581r7946N1685J7947
$$ 1997831 1959300 2100003 2254828 2442726 2669239 2655759 2752651 2667070 2569124 2620809 2638756
2061B638756J08048K0082J53055n1518q1657K92518L42445o5913l46128J92908
$$ 2638756 2746804 2766886 2919941 2868423 2786766 3079284 3421729 3355816 3009688 3202596
2051C202596J76482L8531J30219L05626j03533P0217K79899J86913L48231K63913
$$ 3202596 3379078 3417609 3547828 3853454 3749921 3820138 4100037 4286950 4635181 4899094
2041D899094K00559K36277n9033K70456L0914J08198O03314K82909K99184J28743
$$ 4899094 5099653 5335930 5276897 5547353 5578267 5686465 6289779 6572688 6871872 7000615
2031G000615K25908M22971M11276L35369O73073N59686L42230O86746M73036O57851
$$ 7000615 7226523 7649494 8060770 8396139 9069212 9628898 9971128 10657874 11130910 11788761
2021A1788761Q79641R68678R99167J069732J259596J367132J313291J403140J319698
$$ 11788761 12668402 13637080 14636247 15705979 16965575 18332707 19645998 21049138 22368836
2012B2368836J654839J750940K480312K764843M016785M614271O279663P762707
$$ 22368836 24023675 25774615 28254927 31019770 35036555 39650826 45930489 53693196
2004E3693196R217690J1384790J5110707J4236428O409171m906137j3578395j3767749
$$ 53693196 62910886 74295676 89406383 103642811 110051982 105145845 91567450 77799701
1996G7799701j3569285j1856619q968394o780441n155274l726797l305710k329102
$$ 77799701 64230416 52373797 43405403 36624962 31469688 27742891 24437181 22108079
1988B2108079j769721j344016j109664r45494j441058j053780j236348j034328
$$ 22108079 20338358 18994342 17884678 16939184 15498126 14444346 13207998 12173670
1980A2173670r49459q30299n81564n95727l81941n17453k58168m01497l74718
$$ 12173670 11224211 10393912 9812348 9216621 8834680 8317227 8059059 7657562 7282844
1971G282844m15576l37229j30479l01454k77511k76121j96259j29975k26680k00716
$$ 7282844 6867268 6530039 6399560 6098106 5820595 5544474 5348215 5218240 4991560 4790844
1961D790844j53047k34211q2818L9584k65549l22108M5287l28071j60159j6060
$$ 4790844 4637797 4403586 4320768 4360352 4094803 3772695 3817982 3489911 3329752 3313692
1951C313692p8675J22612k64436P275o4201j09927j93863l567j33590n5563M759
$$ 3313692 3235017 3357629 3093193 3100468 3036267 2926340 2732477 2728910 2595320 2539757 2544516
1940B544516J7186j33885j19109K0865r7021k82303j72880j21573N6622l64242
$$ 2544516 2561702 2427817 2308708 2329573 2232552 1950249 1777369 1655796 1712418 1348176
1930A348176p3314P6938N0606q0546K09540p5721k02332K6466o2622P9504p336
$$ 1348176 1274862 1351800 1402406 1321860 1531400 1455679 1253347 1279813 1217191 1296695 1289359
1919A289359l7383R768j40689j97573q4793J49111N0451Q2898j15588j63288L00699
$$ 1289359 1251976 1261744 1121055 923482 838689 987800 1038251 1121149 1005561 842273 1142972
1908A142972m6698j95963q4556J19555J1496j92725J77385K15352k50997O010
$$ 1142972 1096274 900311 815755 935310 946806 754081 931466 1146818 895821 901831
1898I01831m8185k1066j30045o5185j12087L1921Q8072K10990K2652n1556J42518
$$ 901831 853646 832580 702535 637350 525263 557184 645256 856246 878898 827342 969860
1887I69860j40152k03712J15590N8330Q4335k5102m8893j89476J44502j88828
$$ 969860 829708 625996 741586 799916 884251 859149 810256 620780 765282 576454
1877E76454J08163J9747L6240q8285k38009Q035J38067j8309M5523Q4793p7501
$$ 576454 684617 704364 740604 652319 414310 422345 560412 542103 587626 672419 594918
1866E94918j36282k53591o5844J67239J5379J49303O7606j35887j33752J33928
$$ 594918 458636 205045 139201 306440 321819 471122 538728 402841 269089 403017
1856D03017Q1500l152k58444j49370J40175K38844K37395j84639k35085k3502
$$ 403017 484517 481365 222921 73551 213726 452570 689965 505326 270241 246739
1846B46739O4981O0434j06393l16213L8911o6494M20962L5302J76922p2894q2314
$$ 246739 311720 372154 265761 -50452 -11541 -78035 342927 378229 555151 482257 399943
1835C99943j08084p1835J25620r4170l39400M3222O2411K53413j64937j15579
$$ 399943 291859 220024 345644 251474 -87926 -44704 17707 271120 106183 -9396
1825i396M6912L41311j48886j30110L06548j01796K3136n0949j32844O1010K516
$$ -9396 37516 378827 229941 99831 406379 304583 327719 276770 143926 204936 207452
1814B07452j59603J10849R8996J50128k06022M749J03189M5444k20248o3428r9006
$$ 207452 47849 158698 257694 407822 201800 206549 309738 355182 134934 71506 -27500
1803b7500K20185J69259k4023j72605k7391k03568J85914J13368j40748K14296
$$ -27500 192685 361944 337921 165316 137925 -65643 120271 233639 92891 307187
1793C07187m4662m8578l73212J03814M1614j2835p0719K9334J68264M5158J68478
$$ 307187 262525 213947 -159265 -55451 -13837 -26672 -97391 -68057 100207 145365 313843
1782C13843j01556k33592O2401m7144N9120j40970J4514R5210J42779q0337m90
$$ 313843 212287 -21305 41096 -6048 53072 -87898 -73384 21826 164605 84268 83778
1771H3778j27529q6408j7224O9465K82815k42540J3118O7623N3543J09083o5191
$$ 83778 -43751 -130159 -147383 -77918 204897 -37643 -24525 43098 96641 205724 140533
1760A40533P4985j93670j00394K99528J64887J1931o4040k77521L0415J13118
$$ 140533 215518 21848 -78546 220982 385869 397800 333760 56239 86654 199772
1750A99772p3207J07684q8345j00198k7491M066P9530n8054J40899P4036o4013
$$ 199772 126565 234249 145904 45706 18215 22281 101811 43757 184656 258692 194679
1739A94679l7288P2574Q8343N0402K43454n4557k10426N0410L0421J85696O8305
$$ 194679 157391 229965 318308 368710 612164 557607 347181 397591 428012 613708 682013
1728F82013j72129J96881J7171j85968o7566m2614n3912L0252j22622J51712l48564
$$ 682013 509884 706765 723936 537968 470402 427788 373876 404128 281506 433218 84654
1717H4654o6086J72663J213K00551j25616k33331k14709J43960j8145K14308P4596
$$ 84654 18568 191231 192444 392995 267379 34048 -180661 -36701 -54846 159462 234058
1706B34058l3928Q1464L2354l2793j71262J14131k00458J32097j97695j24364
$$ 234058 200130 281594 313948 281155 109893 224024 23566 155663 -42032 -166396
1696a66396M844Q0131p8367p8667Q8656J1096o776R3397R4127k4010j09417K14993
$$ -166396 -161552 -81421 -159788 -238455 -149799 -138703 -145479 -52082 42045 18035 -91382 123611
1684A23611J61629j13280j75498K2821n1737P7082O4162k77801J31185J14000
$$ 123611 285240 171960 -3538 19283 -32454 44628 108790 -169011 -37826 76174
1674G6174J01022j53876K1870j40141L7015Q7624p2570j6945J09147J35015k46396
$$ 76174 177196 23320 45190 -94951 -57936 29688 -42882 -59827 49320 184335 -62061
1663f2061L6289j35050j9185j871j40857K26378J65648q4658j80870Q0995o7155
$$ -62061 -25772 -160822 -180007 -181878 -322735 -96357 69291 -15367 -196237 -115242 -182397
1652a82397K42097J1761j02528P7734r8114K2835m5324r0173J38379R2363j61175
$$ -182397 59700 71461 -31067 46667 -51447 -28612 -73936 -164109 -25730 66633 -94542
1641i4542R7085J45014O6848N5283j39927n7362q0663P5008j02719N9062j61474
$$ -94542 2543 147557 214405 269688 129761 72399 -8264 66744 -35975 23087 -138387
1630a38387k21318L11323Q6883o1100k5386J02105j0247R359K0295R4900k35273
$$ -138387 -359705 -48382 38501 -22599 -47985 54120 43873 53232 73527 168427 -66846
1619f6846L5446m82365N6887L35183J35217q884J3803J43094j37462K0319p8509
$$ -66846 -31400 -513765 -456878 -121695 13522 4638 18441 161535 24073 44392 -34117
1608c4117q3082J27720J84301N6566k33851j55530Q9365R1604k01080p5488J67946
$$ -34117 -117199 10521 194822 251388 17537 -137993 -48628 42976 -158104 -233592 -65646
1597f5646l8212L9374l057J5309j09581J91943J01714r0407N179n4123J69556
$$ -65646 -103858 -64484 -67541 -52232 -161813 30130 131844 41437 46616 -7507 162049
1586A62049p2359N5124Q0558k67917l9878j65830J00072J4247Q9674J25708L3441
$$ 162049 89690 144814 225372 -42545 -82423 -248253 -148181 -133934 -44260 81448 114889
1575A14889k89763j87915K26615O1764j84613J55429K14134J52770j33604L2130
$$ 114889 -174874 -362789 -136174 -74410 -259023 -103594 110540 263310 129706 161836
1565A61836l36361l03j3849J46898N7648M2434j85281J00964P3898j38502M8798
$$ 161836 -174525 -174828 -188677 -41779 15869 58303 -126978 -26014 47884 -90618 -41820
1554d1820k8029O8476J15917j1895o8659o073k246N0983P513K0058j95467J11367
$$ -41820 -69849 -1373 114544 102649 33990 27917 25671 76654 84167 104225 -91242 20125
1542B0125J79830r886k79262j15168K6911J2002O8791R1259k88375L316J88326
$$ 20125 199955 190069 -89193 -204361 -177450 -165448 -96657 -5398 -293773 -290457 -102131
1531a02131J67769n7353j41701M0314r0963j4467o4162M5602J94660j47500L4221
$$ -102131 65638 8285 -133416 -93102 -184065 -198532 -262694 -217092 -22432 -169932 -135711
1520a35711j255J2127L4531K2545J14723j01056q6228r5567j93718O0738N1794
$$ -135711 -136966 -124839 -90308 -67763 46960 -54096 -140324 -235891 -429609 -368871 -317077
1509c17077L7745J21059J06979j82230l8412J76918k02061Q8596m9278J67291
$$ -317077 -279332 -158273 -51294 -233524 -271936 -95018 -297079 -208483 -257761 -90470
1499i0470l7492l1153J7766r6785j8759q0848Q0836L47715J37106k29704j7747
$$ -90470 -127962 -159115 -141349 -238134 -256893 -337741 -256905 90810 227916 -1788 -19535
1488a9535j36423K22014K0868j42160j47565J04524K0516J2748j7406O6359k4540
$$ -19535 -155958 66056 86924 -55236 -202801 -98277 -77761 -65013 -82419 -16060 -40600
1477d0600K38958l0517j71016j34794j1957j00460K75823N0827q0528p2495j52076
$$ -40600 198358 167841 -3175 -137969 -149926 -250386 25437 76264 -4264 -76759 -228835
1466b28835K46737k618J83426P6506j97282O303k25292n7027r0301J53367j07829
$$ -228835 17902 15284 198710 275216 77934 84237 -141055 -198082 -288383 -135016 -242845
1455b42845L3255J87898p8538l0380P337Q1204M5638J33968k7662j08052j42520
$$ -242845 -209590 -21692 -100230 -130610 -123273 -42069 3569 137537 109875 1823 -140697
1444a40697N6797j35244O5926j16596M5120R324p4353M9609K60860j05573O3164
$$ -140697 -83900 -219144 -153218 -269814 -224694 -215370 -289723 -240114 20746 -84827 -21663
1433b1663R0886Q3921j91356j11435j15601L0688J58686j31785K46114m4167m8512
$$ -21663 69223 153144 -38212 -149647 -265248 -234560 -75874 -207659 38455 -5712 -54224
1422e4224n3902j7124o3123j37070R3528O0602o4755P5939m532J03077J47228
$$ -54224 -108126 -125250 -188373 -325443 -231915 -171313 -236068 -160129 -164661 -61584 85644
1411H5644K806k04311K1106j9000j29219J72234m8925K1749r6609j28404J46292
$$ 85644 88450 -115861 -94755 -113755 -242974 -70740 -119665 -97916 -194525 -322929 -176637
1400a76637j06276J84618M0567J24783j7199j74143q9781J26332L44096k01277
$$ -176637 -282913 -98295 -57728 67055 49856 -124287 -214068 -87736 256360 55083
1390E5083O2991j03546R9311j15746m22429J33621J25233K04523l3284j35119
$$ 55083 118074 14528 113839 -1907 -424336 -290715 -165482 39041 5757 -129362
1380a29362J17915J693M05128l1156k87663r3489j89685p2743K00311J33761j71062
$$ -129362 -11447 -9754 395374 364218 76555 -16934 -206619 -279362 -79051 54710 -116352
1369a16352O7290p0941k22489K20138J16287M8404j16577k92841K00797J81539
$$ -116352 -49062 -120003 -342492 -122354 -6067 42337 -74240 -367081 -166284 15255
1359A5255r4652P4495j42547j47126J51184J52719j04603o5855N428R7784Q71
$$ 15255 -79397 -4902 -147449 -294575 -143391 9328 -95275 -161130 -155702 -57918 -57047
1348e7047j29398L3413R3745j56353P1342p8629J90197K20264j76197r809L1987
$$ -57047 -186445 -153032 -59287 -215640 -144298 -222927 -32730 187534 11337 1528 33515
1337C3515k66821o2766K16129J9135P8249o8078j93136K4640J10817N5489M9656
$$ 33515 -233306 -296072 -79943 -60808 17441 -50637 -243773 -219133 -108316 -52827 -3171
1326c171K7069p3074N0180j77690n0369J15121J08015J77744j02798L9441Q4277
$$ -3171 23898 -49176 1004 -176686 -227055 -111934 -3919 173825 71027 110468 194745
1315A94745j79507m9455K0843n4085K2246Q3410J97867j87338l4649L74678j58274
$$ 194745 15238 -34217 -13374 -67459 -45213 38197 236064 48726 14077 388755 230481
1304B30481k03238M693R798k36492Q0492R0790J5799m9024k78992J31620J09075
$$ 230481 27243 31936 41734 -194758 -114266 -23476 -7677 -56701 -335693 -204073 -94998
1293i4998J08543j54739K82356k49196j16516K4198J77218j05272j16692L0982
$$ -94998 13545 -141194 141162 -108034 -224550 -200352 -23134 -128406 -245098 -214116
1283b14116R2970N6388o6921N1522j3718J05614j56442n1400J5922j7794J31062
$$ -214116 -121146 -64758 -131679 -80157 -93875 11739 -144703 -196103 -180181 -197975 -66913
1272f6913R7852J5957k04204Q3775M6477P0575O308o5387l0308p8793l2587m7690
$$ -66913 30939 46896 -157308 -73533 -27056 43519 49827 -15560 -45868 -124661 -157248 -204938
1260b04938l9167Q5418J18770n1850j6677L7012p1261J12049Q1945q8823J66666
$$ -204938 -244105 -158687 -39917 -91767 -108444 -71432 -142693 -30644 51301 -37522 129144
1249A29144j57474o6649o0537p5887J635K17399P9978o9549M4827r1543l09317
$$ 129144 -28330 -94979 -155516 -231403 -229768 -12369 67609 -1940 42887 -48656 -357973
1238c57973K92364P6622k1893R6431l756L9801k2144N2307K34493l62145j42885
$$ -357973 -65609 11013 -10880 85551 81795 121596 99452 151759 386252 24107 -118778
1227a18778K28514j0399j61052j5906K75100k10285j99039r408J23763m2909Q5505
$$ -118778 109736 99337 -61715 -77621 197479 -12806 -211845 -221253 -97490 -140399 -54894
1216e4894k4711J06930m6454j96375P8361J86091l2011r3480k10405O2525J22722
$$ -54894 -79605 27325 -19129 -215504 -137143 48948 16937 -76543 -286948 -224423 -101701
1205a01701J76582o553j51650j48076J28774r3278J36159J08766M8575O1892k46368
$$ -101701 74881 68328 -83322 -231398 -102624 -195902 -59743 49023 97598 159490 -86878
1194h6878l2141N041K34252l8377j92033q3474j42392J84626R5073j94271Q749
$$ -86878 -119019 -113978 120274 81897 -110136 -193610 -336002 -151376 -56303 -250574 -241825
1183b41825q7588J77616J14817k4967n6734J04274j70783k27568m105K19786K19050
$$ -241825 -329413 -151797 -36980 -61947 -118681 -14407 -185190 -412758 -416863 -197077 21973
1172B1973r6473j73567J91947j49721q0202J12994P1595J83823m2681k48723K148
$$ 21973 -74500 -248067 -56120 -205841 -286043 -173049 -101454 82369 39688 -209035 -206887
1161b06887n2266J07913k244k1723O5370K38890J93919k44197j05848J66256K2729
$$ -206887 -259153 -151240 -153484 -175207 -109837 129053 322972 78775 -27073 139183 161912
1150A61912j80089q7748K4423K84995q0315J86251M1392l01k35751k2170J14392
$$ 161912 -18177 -105925 -81502 203493 123178 309429 350821 350520 114769 92599 206991
1139B06991j34752P3414K1715j96776j23399R0680j12573O3254r4730J23822J35206
$$ 206991 72239 145653 167368 -29408 -152807 -62127 -174700 -111446 -206176 -82354 52852
1128E2852L168k4007n5840k8524L5510J9195j20331L09738o0713j67116j55714
$$ 52852 56020 32013 -23827 -52351 -16841 2354 -117977 191761 131048 -36068 -191782
1117a91782n9743N7739K88066j571j78332J509j24426L5932j5781O9017j31368
$$ -191782 -251525 -193786 94280 92709 -85623 -84114 -208540 -172608 -188389 -119372 -250740
1106b50740L4748P5807k3596J50504N4445l10683K80456p9383k40246L3349O1241
$$ -250740 -215992 -140185 -163781 -13277 41168 -269515 10941 -68442 -308688 -275339 -214098
1095b14098r1205J39128J11786M453r1889j02470l7857K76233J60482p5262j07661
$$ -214098 -305303 -166175 -54389 -49936 -141825 -244295 -282152 -5919 154563 79301 -28360
1084b8360j19707J44643J18771m8496j70834N4714N4192J70485j84312R7103j40896
$$ -28360 -148067 -3424 115347 66851 -103983 -49269 4923 175408 -8904 88199 -52697
1073e2697Q4683k6866m4344o1948r6071J63337l7713J84032q7704j51167L8705
$$ -52697 31986 5120 -39224 -101172 -197243 -33906 -71619 112413 24709 -126458 -87753
$$ [...]
##END NTUPLES=NMR SPECTRUM
##END=
