##TITLE=1H_CA-9120-1
 CDCl3+DMSO
 8 sc, 
 28.12.2023
##JCAMPDX= 6.0         $$ Bruker NMR JCAMP-DX V2.0
##DATA TYPE= NMR SPECTRUM
##DATA CLASS= NTUPLES
##ORIGIN= UXNMR, Bruker Analytische Messtechnik GmbH
##OWNER= root
$$ XWIN-NMR		Version 3.5
$$ Thu Dec 28 13:57:08 2023 Russian Standard Time (UT+4h)  she@DPX200
##.OBSERVE FREQUENCY= 200.1313
##.OBSERVE NUCLEUS= ^1H
##.ACQUISITION MODE= SIMULTANEOUS
##.ACQUISITION SCHEME= undefined
##.AVERAGES= 8
##.DIGITISER RES= 18
##SPECTROMETER/DATA SYSTEM= spect
##.PULSE SEQUENCE= zg30
##.SOLVENT NAME= CDCl3
##.SHIFT REFERENCE= (INTERNAL, CDCl3, 0, 15.6643)
##AUDIT TRAIL= $$ (NUMBER, WHEN, WHO, WHERE, WHAT)
$$ ##TITLE= Audit trail, XWIN-NMR		Version 3.5
$$ ##JCAMPDX= 5.01
$$ ##ORIGIN= Bruker BioSpin GmbH
$$ ##OWNER= she
$$ F:/spectra/data/she/nmr/H-F/1/pdata/1/auditp.txt
$$ ##AUDIT TRAIL=  $$ (NUMBER, WHEN, WHO, WHERE, WHAT)
(   1,<2023-12-28 13:55:44.54 +0400>,<she>,<DPX200>,
      <created by zg, POWCHK disabled, PULCHK disabled
       configuration hash MD5:
       00 E9 B6 7A A2 85 ED C7 34 08 36 98 17 FE 4E 26
       data hash MD5: 16K
       FB 36 EE C7 70 25 3B FC F9 25 0C B2 73 A3 D1 08>)
(   2,<2023-12-28 13:56:00.76 +0400>,<she>,<DPX200>,
      <Start of raw data processing
       efp BC_mod = 2 LB = 0.24 FT_mod = 6 PKNL = 1 PHC0 = -24589.5 PHC1 = 6.852731 SI = 16K 
       data hash MD5: 16K
       B7 E4 0C B0 84 AF 68 04 B5 53 D9 C8 32 EA 61 5B>)
(   3,<2023-12-28 13:56:17.81 +0400>,<she>,<DPX200>,
      <pk PHC0 = -0.7136549 PHC1 = 0 
       data hash MD5: 16K
       0F B4 AF 7C 3C CB E7 32 2D 26 A6 97 62 3B EE 2B>)
(   4,<2023-12-28 13:56:20.62 +0400>,<she>,<DPX200>,
      <abs ABSG = 5 
       data hash MD5: 16K
       14 01 0C F2 F9 1C 76 65 53 B9 8B 9C 62 22 DB 4C>)
(   5,<2023-12-28 13:56:36.20 +0400>,<she>,<DPX200>,
      <pk PHC0 = 0.3933505 PHC1 = 0 
       data hash MD5: 16K
       ED F5 97 0D 2C 0D DD EA 1C D6 09 97 78 91 EB 82>)
$$ ##END=
$$ 
$$ hash MD5
$$ F7 1B 25 33 74 90 69 7E 4D EC 1B 3B 38 1E B3 C2
##$RELAX= 
##$RELAX= 
##$RELAX= 
##$RELAX= 
##$RELAX= 
##$RELAX= 
$$ Bruker specific parameters
$$ --------------------------
##$DU= <F:/spectra>
##$EXPNO= 1
##$NAME= <H-F>
##$PROCNO= 1
##$TYPE= <nmr>
##$USER= <she>
##$AMP= (0..31)
100 100 100 100 100 100 100 100 100 100 100 100 100 100 100 100 100 100 
100 100 100 100 100 100 100 100 100 100 100 100 100 100 
##$AQSEQ= 0
##$AQ_mod= 1
##$AUNM= <au_zg>
##$AUTOPOS= <>
##$BF1= 200.13
##$BF2= 200.13
##$BF3= 200.13
##$BF4= 200.13
##$BF5= 200.13
##$BF6= 200.13
##$BF7= 200.13
##$BF8= 200.13
##$BYTORDA= 1
##$CFDGTYP= 0
##$CFRGTYP= 5
##$CHEMSTR= <none>
##$CNST= (0..31)
1 1 145 1 1 1 1 1 1 1 1 1 1 1 1 1 1 1 1 1 1 1 1 1 1 1 1 1 1 1 1 1 
##$CPDPRG= <>
##$CPDPRG1= <>
##$CPDPRG2= <>
##$CPDPRG3= <>
##$CPDPRG4= <mlev>
##$CPDPRG5= <mlev>
##$CPDPRG6= <mlev>
##$CPDPRG7= <mlev>
##$CPDPRG8= <mlev>
##$CPDPRGB= <>
##$CPDPRGT= <>
##$D= (0..31)
0 1.2 0 0 0 0 0 0 0 0.06 0 0.03 0 0 0 0 0.0002 0 0 0 0 0 0 0 0 0 0 0 0 
0 0 0 
##$DATE= 1703757343
##$DBL= (0..7)
$$ [...]
##$SUBNAM3= <"">
##$SUBNAM4= <"">
##$SUBNAM5= <"">
##$SUBNAM6= <"">
##$SUBNAM7= <"">
##$SUBNAM8= <"">
##$SUBNAM9= <"">
##$SW= 18.0517328524113
##$SWIBOX= (0..15)
0 0 2 0 0 0 0 0 0 0 0 0 0 0 0 0 
##$SW_h= 3612.71676300578
##$TD= 16384
##$TD0= 1
##$TE= 0
##$TE2= 300
##$TE3= 300
##$TEG= 300
##$TL= (0..7)
0 120 120 120 120 120 120 120 
##$TP= (0..7)
150 150 150 150 150 150 150 150 
##$TP07= 0
##$TPNAME0= <>
##$TPNAME1= <>
##$TPNAME2= <>
##$TPNAME3= <>
##$TPNAME4= <>
##$TPNAME5= <>
##$TPNAME6= <>
##$TPNAME7= <>
##$TPOAL= (0..7)
0.5 0.5 0.5 0.5 0.5 0.5 0.5 0.5 
##$TPOFFS= (0..7)
0 0 0 0 0 0 0 0 
##$TUNHIN= 0
##$TUNHOUT= 0
##$TUNXOUT= 0
##$USERA1= <user>
##$USERA2= <user>
##$USERA3= <user>
##$USERA4= <user>
##$USERA5= <user>
##$V9= 5
##$VALIST= <valist>
##$VCLIST= <CCCCCCCCCCCCCCC>
##$VD= 0
##$VDLIST= <DDDDDDDDDDDDDDD>
##$VPLIST= <PPPPPPPPPPPPPPP>
##$VTLIST= <TTTTTTTTTTTTTTT>
##$WBST= 1024
##$WBSW= 4
##$XGAIN= (0..3)
0 0 0 0 
##$XL= 0
##$YL= 0
##$YMAX_a= 98606
##$YMIN_a= -153857
##$ZGOPTNS= <>
##$ZL1= 120
##$ZL2= 120
##$ZL3= 120
##$ZL4= 120
##$ABSF1= 15.56619
##$ABSF2= -2.485662
##$ABSG= 5
##$ABSL= 3
##$ALPHA= 0
##$AQORDER= 0
##$ASSFAC= 0
##$ASSFACI= 0
##$ASSFACX= 0
##$ASSWID= 0
##$AUNMP= <proc_1d>
##$AZFE= 0.1
##$AZFW= 0.1
##$BCFW= 0
##$BC_mod= 2
##$BYTORDP= 0
##$COROFFS= 0
##$CY= -3
##$DATMOD= 1
##$DC= 0
##$DFILT= <>
##$DTYPP= 0
##$F1P= 0
##$F2P= 0
##$FCOR= 1
##$FTSIZE= 16384
##$FT_mod= 6
##$GAMMA= 0
##$GB= 0
##$INTBC= 1
##$INTSCL= 3.70164e-10
##$ISEN= 128
##$LB= 0.24
##$LEV0= 0
##$LPBIN= 0
##$MAXI= 10000
##$MC2= 0
##$MEAN= 0
##$ME_mod= 0
##$MI= 1.114404
##$NCOEF= 0
##$NC_proc= -8
##$NLEV= 6
##$NOISF1= 3.799351
##$NOISF2= 2.8
##$NSP= 0
##$NTH_PI= 0
##$NZP= 0
##$OFFSET= 15.66426
##$PC= 1
##$PHC0= -24589.82
##$PHC1= 6.852731
##$PH_mod= 1
##$PKNL= yes
##$PPARMOD= 0
##$PSCAL= 0
##$PSIGN= 0
##$REVERSE= no
##$SF= 200.129971470491
##$SI= 16384
##$SIGF1= 3
##$SIGF2= 2
##$SINO= 5.538805
##$SIOLD= 16384
##$SREGLST= <1H.CDCl3>
##$SSB= 0
##$STSI= 16384
##$STSR= 0
##$SW_p= 3612.71676300578
##$SYMM= 0
##$S_DEV= 0
##$TDeff= 16384
##$TDoff= 0
##$TI= <>
##$TILT= no
##$TM1= 0
##$TM2= 0
##$TOPLEV= 0
##$USERP1= <user>
##$USERP2= <user>
##$USERP3= <user>
##$USERP4= <user>
##$USERP5= <user>
##$WDW= 1
##$XDIM= 16384
##$YMAX_p= 393991800
##$YMIN_p= -3787127
$$ End of Bruker specific parameters
$$ ---------------------------------
##NTUPLES= NMR SPECTRUM
##VAR_NAME=  FREQUENCY,     SPECTRUM/REAL,   SPECTRUM/IMAG
##SYMBOL=    X,             R,               I
##VAR_TYPE=  INDEPENDENT,   DEPENDENT,       DEPENDENT
##VAR_FORM=  AFFN,          ASDF,            ASDF
##VAR_DIM=   16384,         16384,           16384
##UNITS=     HZ,            ARBITRARY UNITS, ARBITRARY UNITS
##FACTOR=    0.220516191357247, 1,           1
##FIRST=     3134.88788901143, 0,            0
##LAST=      -477.828873994349, 0,           0
##MIN=       -477.828873994349, -3787127,    0
##MAX=       3134.88788901143, 393991800,    0
$$ Real data points
##PAGE= N=1
##DATA TABLE= (X++(R..R)), XYDATA
$$ [...]
$$ plain form
11810 15113878 14649457 13993252 13755288 13552813 13135641 12164787 11814972 11426136 11285494
11801 11285494 10868047 10425332 9920698 9162122 8919452 8555307 8882750 8551133 7979931
11792 7979931 7532013 6987889 7177124 7552736 7362647 6767862 6258301 6305107 6125405 5843412
11782 5843412 5595678 5299462 5333005 5306996 5202396 5046019 4925184 4741045 4449006 4650117
11772 4650117 4832000 5165505 4921939 4512304 3943116 4055155 3751754 3749115 3561117 3647515
11762 3647515 3658653 3380168 3821795 3587123 3178048 3186785 3076500 3020769 3715944 3597583
11752 3597583 3448651 3484016 3177769 3263369 3354270 3139402 3011274 2890711 2613143 2883707
11742 2883707 3343998 2919335 2681893 2883217 3209742 2728704 2782782 3218732 3298390 3343726
$$ packed form
11810A5113878m64421o56205k37964k02475m17172r70854l49815l88836j40642
11801A1285494m17447m42715n04634p58576k42670l64145L27443l31617n71202
11792G979931m47918n44124J89235L75612j90089n94785n09561M6806j79702k81993
11782E843412k47734k96216L3543k6009j04600j56377j20835j84139k92039K01111
11772D650117J81883L33505k43566m09635n69188J12039l03401k639j87998Q6398
11762C647515J1138k78485M41627k34672m09075Q737j10285n5731O95175j18361
11752C597583j48932L5365l06247Q5600R0901k14868j28128j20563k77568K70564
11742B883707M60291m24663k37442K01324L26525m81038N4078M35950P9658M5336
$$ plain form
11732 3343726 3128992 2867219 2647218 2322764 2233605 2277057 2330394 2824831 2493239 2507678
11722 2507678 2744180 2625185 2562406 2314198 2646246 2496031 2526119 2508910 2551707 2541504
11712 2541504 2458835 2318870 1893919 2477938 2900175 2565204 2318896 2427322 2609666 2559119
11702 2559119 2531423 2518154 2089184 1915287 2353268 2292808 2017159 2296409 2622666 2298720
11692 2298720 2080076 2378861 2594782 2480948 2360393 2319267 2425586 2153847 1646966 1604170
11682 1604170 1849698 1680046 1932114 1907846 1816985 1744083 1549483 2064569 2357691 2208594
11672 2208594 2266741 2183961 2449664 2305042 2144038 2303948 2165584 2143926 2073985 2143542
11662 2143542 1920077 2290190 2295917 2603331 2728096 2727588 2456944 2196352 2358965 2814695
$$ packed form
11732C343726k14734k61773k20001l24454q9159M3452N3337M94437l31592J4439
11722B507678K36502j18995o2779k48208L32048j50215L0088j7209M2797j0203
11712B541504q2669j39965m24951N84019M22237l34971k46308J08426J82344n0547
11702B559119k7696j3269m28970j73897M37981o0460k75649K79250L26257l23946
11692B298720k18644K98785K15921j13834j20555m1126J06319k71739n06881m2796
11682A604170K45528j69652K52068k4268r0861p2902j94600N15086K93122j49097
11672B208594N8147q2780K65703j44622j61004J59910j38364k1658o9941O9557
11662B143542k23465L70113N727L07414J24765n08k70644k60592J62613M55730
$$ plain form
11652 2814695 2667623 2568848 3047329 2897747 2832129 2569806 2291142 2636487 2351877 2370477
11642 2370477 2634577 2895150 2879266 3113643 2900678 2981178 2911420 3056367 3379902 3309317
11632 3309317 3568027 3915119 4204348 4197137 4671578 4597820 4390663 4460458 5077367 4898195
11622 4898195 5078340 5196565 5191491 5248916 5812991 5689317 5686932 5727259 6182894 6947704
11612 6947704 7184378 6746291 6598431 6944333 7338555 7684118 7133387 7046274 6875968 7110943
11602 7110943 7303843 6952548 6970868 7053664 6978120 7056753 6498219 5959489 6192108 6691836
11592 6691836 5877072 5844286 6217076 6053318 5564140 5551572 5410692 5133442 5062064 4592227
11582 4592227 4422237 4275463 4530981 4443505 4099331 4071485 3962380 3663516 3305122 3199675
$$ packed form
11652B814695j47072r8775M78481j49582o5618k62323k78664L45345k84610J8600
11642B370477K64100K60573j5884K34377k12965Q0500o9758J44947L23535p0585
11632C309317K58710L47092K89229p211M74441p3758k07157O9795O16909j79172
11622D898195J80145J18225n074N7425N64075j23674k385M0327M55635P64810
11612F947704K36674m38087j47860L45902L94222L45563n50731q7113j70306K34975
11602G110943J92900l51295J8320Q2796p5544P8633n58534n38730K32619M99728
11592F691836q14764l2786L72790j63758m89178j2568j40880k77250p1378m69837
11582D592227j69990j46774K55518q7476l44174k7846j09105k98864l58394j05447
$$ plain form
11572 3199675 3976808 4340195 4209356 3808209 3968646 3913982 3600200 3661031 3271051 2873882
11562 2873882 3110394 3215876 3174429 3016235 3047604 3497600 3346978 2894995 2203843 2137362
11552 2137362 1735078 2040073 2215826 2260756 2572260 2388250 2520755 2581413 2290618 2332008
11542 2332008 2492985 2223572 2483485 2480540 2779503 2365661 2146424 2033652 1957200 2499229
11532 2499229 2350356 2223029 2052276 1972697 2264750 2270075 2319793 2401373 2260910 2357222
11522 2357222 2560255 2564089 2345553 2295783 2684191 2473310 2434188 2477028 2277902 2169591
11512 2169591 1885653 1944195 2015756 2451092 2233418 1827406 2256351 2741064 3072790 2870614
11502 2870614 2478047 2499014 2673629 2420711 2779866 2956821 3094807 2986815 2951027 2558072
$$ packed form
11572C199675P77133L63387j30839m01147J60437n4664l13782O0831l89980l97169
11562B873882K36512J05482m1447j58194L1369M49996j50622m51983o91152o6481
11552B137362m02284L04995J75753M4930L11504j84010J32505O0658k90795M1390
11542B332008J60977k69413K59913k945K98963m13842k19237j12772p6452N42029
11532B499229j48873j27327j70753p9579K92053N325M9718Q1580j40463R6312
11522B357222K03033L834k18536m9770L88408k10881l9122M2840j99126j08311
11512B169591k83938N8542P1561M35336k17674m06012M28945M84713L31726k02176
11502B870614l92567K0967J74615k52918L59155J76955J37986j07992l5788l92955
$$ plain form
11492 2558072 2463846 2574475 2248401 2371304 2572833 3212956 3502371 3368168 3184283 3548578
11482 3548578 3497613 3440948 3474493 3551166 3201581 3215592 3553231 3769774 3335570 3162689
11472 3162689 3749291 4270189 3886299 4209171 4356169 4175267 4322547 4474967 4553510 4340268
11462 4340268 4382764 4418261 4619581 4345413 4634504 4554809 4738616 4832560 4712746 5141695
11452 5141695 5049613 5168296 5521261 5385652 5589593 5497071 5494383 5738516 6258533 6051208
11442 6051208 5879770 5915870 6193254 6328761 6458646 6602011 6967611 7066826 7353455 7871481
11432 7871481 7689920 7767030 7605515 8178596 8438270 8369503 8133652 8544470 8716468 9210368
11422 9210368 9197679 9461280 9405341 9262768 9668116 9727495 10066779 10177903 10651584 11133403
$$ packed form
11492B558072r4226J10629l26074J22903K01529O40123K89415j34203j83885L64295
11482C548578n0965n6665L3545P6673l49585J4011L37639K16543m34204j72881
11472C162689N86602N20898l83890L22872J46998j80902J47280J52420P8543k13242
11462D340268M2496L5497K01320k74168K89091p9695J83807R3944j19814M28949
11452E141695r2082J18683L52965j35609K03941r2522k688K44133N20017k07325
11442F051208j71438L6100K77384J35507J29885J43365L65600R9215K86629N18026
11432G871481j81561P7110j61515N73081K59674o8767k35851M10818J71998M93900
11422I210368j2689K63601n5939j42573M05348N9379L39284J11124M73681M81819
$$ plain form
11412 11133403 11637218 11373605 11296718 11464361 11934598 12193956 12668041 12565397 12423162
11403 12423162 12587406 12941731 13860823 14358394 14592334 14664332 15163387 15484793 15984467
11394 15984467 16529693 17196056 17820250 18211761 18735520 19212625 19930072 20236107 20307301
11385 20307301 21137551 21862185 22468619 22885692 23271716 23934058 25037026 25981176 26679028
11376 26679028 27269341 27903399 28537416 29747215 30804556 31743356 32994868 34407177 35280403
11367 35280403 36050364 37278206 38124816 39154041 40925684 42656697 44036516 45499085
11359 45499085 47110848 48377448 49694001 50700733 52223656 53840798 54872725 56196410
11351 56196410 57267267 58001270 59031006 59627091 60161224 60543066 60560877 60749205 60341224
$$ packed form
11412A1133403N03815k63613p6887J67643M70237K59358M74085j02644j42235
11403A2423162J64244L54325R19092M97571K33940P1998M99055L21406M99674
11394A5984467N45226O66363O24194L91511N23759M77105P17447L06035P1194
11385B0307301Q30250P24634O06434M17073L86024O62342J102968R44150O97852
11376B6679028N90313O34058O34017J209799J057341R38800J251512J412309Q73226
11367C5280403P69961J227842Q46610J029225J771643J731013J379819J462569
11359D5499085J611763J266600J316553J006732J522923J617142J031927J323685
11351E6196410J070857P34003J029736N96085N34133L81842J7811J88328m07981
$$ plain form
11342 60341224 59931445 59550710 58780355 57388977 56415625 55265587 54370905 52846906 51199221
11333 51199221 49922261 48483373 46847440 45377868 43979128 42078253 40319246 39186036
11325 39186036 37975948 36384658 35590522 34574213 32945620 31854254 30600861 29527191
11317 29527191 28480926 27927068 26637216 25646068 24892780 23496760 22539354 21934990 21397477
11308 21397477 20800154 19684800 19427546 18739141 17596183 16944672 17076364 16691764 15888787
11299 15888787 15638222 15116045 14333850 14227425 13794307 13344639 13344401 12797129 12625618 12294233
11289 12294233 11588168 11506708 11252865 10951580 10955601 10349836 9785560 9381786 9298528 9138898
11279 9138898 9382098 9161002 8810053 8551165 8294213 7927906 7793186 7306316 7061760
$$ packed form
11342F0341224m09779l80735p70355j391378r73352j150038q94682j523999j647685
11333E1199221j276960j438888j635933j469572j398740j900875j759007j133210
11325C9186036j210088j591290p94136j016309j628593j091366j253393j073670
11317B9527191j046265n53858j289852r91148p53288j396020r57406o04364n37513
11308B1397477n97323j115354k57254o88405j142958o51511J31692l84600q02977
11299A5888787k50565n22177p82195j06425m33118m49668k38n47272j71511l31385
11289A2294233p06065q1460k53843l01285M021o05765n64276m03774q3258j59630
11279I138898K43200k21096l50949k58888k56952l66307j34720m86870k44556
$$ plain form
11270 7061760 6988429 6835533 6829180 6549650 6275302 5827426 5829548 6172145 6381042 6472251
11260 6472251 5995604 5962861 5901445 5667388 5359315 5443798 5082345 5048298 5227856 5262638
11250 5262638 5378089 4925680 4658309 4777215 4710382 4466042 4444624 4250183 3770659 3703256
11240 3703256 3692301 3294109 3204806 3283342 3482132 3520481 3647758 3552400 3099675 3413849
11230 3413849 3549378 3348160 3109354 3201588 3432964 3351185 3023827 2797629 2817991 3132254
11220 3132254 3057440 2891722 3042184 3000054 2926942 2971731 2627638 2860422 2863358 2611241
11210 2611241 2839176 3151965 3052274 2712490 2518204 2300547 2589460 2305977 2278660 2168268
11200 2168268 2227405 2524468 2552677 2679838 2397995 2131357 2129319 2106340 2026731 2044984 2105534
$$ packed form
11270G061760p3331j52896o353k79530k74348m47876K122L42597K08897R1209
11260F472251m76647l2743o1416k34057l08073Q4483l61453l4047J79558L4782
11250E262638J15451m52409k67371J18906o6833k44340k1418j94441m79524o7403
11240C703256j0955l98192q9303P8536J98790L8349J27277r5358m52725L14174
11230C413849J35529k01218k38806R2234K31376q1779l27358k26198K0362L14263
11220C132254p4814j65718J50462m2130p3112M4789l44093K32784K936k52117
11210B611241K27935L12789r9691l39784j94286k17657K88913k83483k7317j10392
11200B168268N9137K97063K8209J27161k81843k66638k038k2979p9609J8253O0550
$$ plain form
11189 2105534 2438594 1910087 2103002 2176329 2362167 2476362 2172064 1878623 1825419 2072517
11179 2072517 1924848 1908928 1740570 1877608 1598887 1928189 1782182 1403557 1031434 1082679
11169 1082679 853168 1264374 1519540 1154078 1143834 1204474 966977 1369074 1418493 1418875
11159 1418875 1014066 1144737 1443703 1420910 1625136 1554274 1131150 1510720 1576803 1184759
11149 1184759 875927 570315 1016801 734041 960092 1298682 1245422 1131270 1017100 1118811
11139 1118811 1105341 883896 1041337 1430843 1651972 1208868 1027126 972761 1250030 1398049
11129 1398049 1283622 1044549 1090007 1302808 1310159 1010913 705038 617333 793859 791389
11119 791389 613240 570374 1088656 910093 648401 1031164 760820 627957 609405 1097457
$$ packed form
11189B105534L33060n28507J92915P3327J85838J14195l04298k93441n3204K47098
11179B072517j47669j5920j68358J37038k78721L29302j46007l78625l72123N1245
11169A082679k29511M11206K55166l65462j0244O0640k37497M02097M9419L82
11159A418875m04809J30671K98966k2793K04226p0862m23124L79570O6083l92044
11149A184759l08832l05612M46486k82760K26051L38590n3260j14152j14170J01711
11139A118811j3470k21445J57441L89506K21129m43104j81742n4365K77269J48019
11129A398049j14427k39073M5458K12801P351k99246l05875q7705J76526k470
11119G91389j78149m2866N18282j78563k61692L82763k70344j32863j8552M88052
$$ plain form
11109 1097457 1208047 1341645 1261562 898349 838810 657039 1279290 1431776 599005 804324
11099 804324 784955 513893 664613 824677 947641 745761 976257 724708 739453 608825
11089 608825 484907 624173 739308 1166479 858714 195874 413461 374151 511359 816417
11079 816417 738913 863797 709314 550002 652812 767039 692614 694128 709176 632549 673700
11068 673700 707656 878731 713752 414210 159340 123948 162796 288525 548910 624450
11058 624450 684047 571531 709791 700032 738594 889703 771311 319590 551242 313784
11048 313784 -4761 359107 131323 253626 748167 686635 108226 307162 82704 98204
11038 98204 129165 258356 710307 904081 800672 282318 310754 525570 656182 377656
$$ packed form
11109A097457J10590J33598q0083l63213n9539j81771O22251J52486q32771K05319
11099H04324j9369k71062J50720J60064J22964k01880K30496k51549J4745j30628
11089F08825j23918J39266J15135M27171l07765o62840K17587l9310J37208L05058
11079H16417p7504J24884j54483j59312J02810J14227p4425J514J5048p6627M1151
11068F73700L3956J71075j64979k99542k54870l5392L8848J25729K60385P5540
11058F24450N9597j12516J38260r759L8562J51109j18392m51721K31652k37458
11048C13784l18545L63868k27784J22303M94541o1532n78409J98936k24458J5500
11038I8204L0961J29191M51951J93774j03409n18354K8436K14816J30612k78526
$$ plain form
11028 377656 344521 23117 89629 65727 359818 679257 619910 894473 832104 479750
11018 479750 263815 22119 390285 585735 293155 191688 608779 469393 216160 333438
11008 333438 209363 629559 493818 -243016 54454 269499 325736 158433 515978 673150
10998 673150 331110 498499 288970 230771 406368 286010 473967 468768 428717 671950
10988 671950 816905 983249 630978 369556 802078 693797 268039 299854 606070 817593
10978 817593 366926 697882 518603 387273 -133652 -128578 314674 171131 169332 369618
10968 369618 192827 217407 349546 645503 711628 333423 146899 393464 607125 314398
10958 314398 158539 354217 75406 120541 489463 763594 760195 405436 -86327 -341503
$$ packed form
11028C77656l3135l21404O6512k3902K94091L19439n9347K74563o2369l52354
11018D79750k15935k41696L68166J95450k92580j01467M17091j39386k53233J17278
11008C33438j24075M20196j35741p36834K97470K15045N6237j67303L57545J57172
10998F73150l42040J67389k09529n8199J75597j20358J87957n199m0051K43233
10988F71950J44955J66344l52271k61422M32522j08281m25758L1815L06216K11523
10978H17593m50667L30956j79279j31330n20925N074M43252j43543j799K00286
10968C69618j76791K4580J32139K95957O6125l78205j86524K46565K13661k92727
10958C14398j55859J95678k78811M5135L68922K74131l399l54759m91763k55176
$$ plain form
10948 -341503 -493998 -144916 116116 120463 245796 300357 452803 160328 54230 -93065
10938 -93065 -196637 -251844 -443338 -321607 -6524 364326 172047 229 -34201 -141913
10928 -141913 -55464 124409 397648 242747 -302689 -509558 -160429 -49446 -238454 167848
10918 167848 909082 727539 382933 -256260 232364 403006 401645 151759 -141173 137942
10908 137942 213224 308471 369216 370385 97832 113851 -79302 -166416 -381750 -346149 225075
10897 225075 -290997 -227175 403615 293948 282115 282274 80319 -157823 -128276 20058 -44397
10886 -44397 -163625 -114230 -99173 280633 -73093 -226633 102652 -22918 -349017 -177255
10876 -177255 127434 289843 122374 -27848 574016 467687 644590 539789 194432 82972
$$ packed form
10948c41503j52495L49082K61032M347J25333N4561J52446k92475j06098j47295
10938i3065j03572n5207j91494J21731L15083L70850j92279j71818l4430j07712
10928a41913Q6449J79873K73239j54901n45436k06869L49129J10983j89008M06302
10918A67848P41234j81543l44606o39193M88624J70642j361k49886k92932K79115
10908A37942P5282R5247O0745J169k72553J6019j93153q7114k15334L5601N71224
10897B25075n16072O3822O30790j09667j1833J59k01955k38142K9547J48334o4455
10886d4397j19228M9395J5057L79806l53726j53540L29285j25570l26099J71762
10876a77255L04689J62409j67469j50222O01864j06329J76903j04801l45357j11460
$$ plain form
10866 82972 94619 350836 459255 364916 196916 45770 457220 425991 -912 -173059
10856 -173059 67538 -68177 275911 432557 8000 56494 183623 -136811 -189287 182916
10846 182916 155802 68655 114837 -159625 -505843 112165 90724 -346119 90610 311891
10836 311891 41978 -324540 149937 108267 142816 -170423 -647811 -454171 -389612 -444945
10826 -444945 -249570 -177413 -59882 198687 344218 412456 246398 -42900 38067 459164
10816 459164 -12172 -166790 -161438 -318680 -182596 281372 297213 209535 246146 16305
10806 16305 -268071 91218 192699 350151 42037 -349053 -17035 253777 194405 355453
10796 355453 87142 -64705 -77167 -91555 81670 257542 -189945 23615 211053 -90828
$$ packed form
10866H2972J1647K56217J08419r4339j68000j51146M11450l1229m26903j72147
10856a73059K40597j35715L44088J56646m24557M8494J27129l20434n2476L72203
10846A82916k7114q7147M6182k74462l46218O18008k1441m36843M36729K21281
10836C11891k69913l66518M74477m1670L4549l13239m77388J93640O4559n5333
10826d44945J95375P2157J17531K58569J45531O8238j66058k89298Q0967M21097
10816D59164m71336j54618N352j57242J36084M63968J5841q7678L6611k29841
10806A6305k84376L59289J01481J57452l08114l91090L32018K70812n9372J61048
10796C55453k68311j51847j2462j4388J73225J75872m47487K13560J87438l01881
$$ plain form
10786 -90828 97139 158099 -207398 -47874 -64310 -215181 -145022 -149024 33706 395164 328678
10775 328678 23321 -180091 49255 114162 208523 286035 284035 236956 -140262 -255720 -254832
10764 -254832 -406562 -235487 -51235 455411 414739 197107 -107953 -558661 -95063 67825
10754 67825 -75872 -45225 -211540 -182553 146219 209129 478762 467245 566237 316010 297333
10743 297333 147678 -318003 -185382 226211 147831 -13785 -22596 356500 292075 217837
10733 217837 130869 316608 489136 309499 199159 112811 347985 338265 202543 100618
10723 100618 214872 236092 299730 34821 219476 542303 575017 220818 52420 151740
10713 151740 147818 250772 245977 411878 355966 822664 777176 901810 900214 605920 414565
$$ packed form
10786i0828J87967O0960l65497J59524j6436j50871P0159m002J82730L61458o6486
10775C28678l05357k03412K29346O4907R4361P7512k000m7079l77218j15458Q88
10764b54832j51730J71075J84252N06646m0672k17632l05060m50708M63598J62888
10754F7825j43697L0647j66315K8987L28772O2910K69633j1517R8992k50227j8677
10743B97333j49655m65681J32621M11593p8380j61616q811L79096o4425p4238
10733B17837q6968J85739J72528j79637j10340q6348K35174r720j35722j01925
10723A00618J14254K1220O3638k64909J84655L22827L2714l54199j68398R9320
10713A51740l922J02954m795J65901n5912M66698m5488J24634j596k94294j91355
$$ plain form
10702 414565 712119 543810 262930 330948 492148 393819 101524 158124 387310 872848
10692 872848 873504 933998 740167 598554 674334 743595 1004208 720844 802135 665825 676096
10681 676096 569415 299619 370763 800660 856279 660144 803172 997028 803405 966870
10671 966870 1259803 966971 990579 1177028 1400064 1754260 1587742 1552519 1423277 1263920
10661 1263920 1014541 502969 768735 1281312 1508304 1289844 1285228 1095639 1054611 1335875
10651 1335875 863217 833739 650908 849440 1444575 1106916 1377896 1252325 1139344 1032332
10641 1032332 1384860 1212475 787967 821389 745821 556900 688929 882501 906011 368047
10631 368047 829600 1272769 1098755 1238639 1173605 995569 1141347 1302977 1548804 1615387
$$ packed form
10702D14565K97554j68309k80880O8018J61200r8329k92295N6600K29186M85538
10692H72848O56O0494j93831j41613P5780O9261K60613k83364Q1291j36310J0271
10681F76096j06681k69796P1144M29897N5619j96135J43028J93856j93623J63465
10671I66870K92933k92832K3608J86449K23036L54196j66518l5223j29242j59357
10661A263920k49379n11572K65766N12577K26992k18460m616j89589m1028K81264
10651A335875m72658k9478j82831J98532N95135l37659K70980j25571j12981j07012
10641A032332L52528j72385m24508L3422p5568j88921J32029J93572K3510n37964
10631C68047M61553M43169j74014J39884o5034j78036J45778J61630K45827O6583
$$ plain form
10621 1615387 1145439 1042116 1389604 1534224 1610534 1790171 1964759 1822745 1463487 1505005
10611 1505005 1429562 2032517 1985712 1816887 2064619 2097632 2224337 2382354 2382972 2503576
10601 2503576 2636557 2797475 2658891 2751610 3097112 3106388 3338801 3612154 3754872 3583068
10591 3583068 3880373 4161283 3973971 4473239 4819821 4889140 4945827 5543844 5539096 5527047
10581 5527047 5721374 5936017 6162079 6025832 5887355 5467936 5245817 5430693 5387944 4768243
10571 4768243 4922264 5064442 4682699 4740128 4792197 4342155 4169176 3835802 3184016 3001346
10561 3001346 2803330 2566406 2922276 3159838 2796570 2580038 2661168 2360878 1918051 1625410
10551 1625410 1591578 1648374 1807928 1284641 1250897 1370782 1498068 1120816 1116204 1332271
$$ packed form
10621A615387m69948j03323L47488J44620P6310J79637J74588j42014l59258M1518
10611A505005p5443O02955m6805j68825K47732L3013J26705J58017O18J20604
10601B503576J32981J60918j38584R2719L45502R276K32413K73353J42718j71804
10591C583068K97305K80910j87312M99268L46582O9319N6687N98017m748j2049
10581E527047J94327K14643K26062j36247j38477m19419k22119J84876m2749o19701
10571D768243J54021J42178l81743N7429N2069m50042j72979l33374o51786j82670
10561C001346j98016k36924L55870K37562l63268k16532Q1130l00290m42827k92641
10551A625410l3832N6796J59554n23287l3744J19885J27286l77252m612K16067
$$ plain form
10541 1332271 1290633 1555355 1334521 1059217 1059533 1129711 1157269 1046155 1436860 1327197
10531 1327197 1170416 1489726 1345124 1159871 723451 381137 526944 549966 400344 149984
10521 149984 497936 931162 1055592 1077746 542963 285659 186386 320350 633095 434638
10511 434638 581144 686062 379649 210990 251619 350651 148733 -205798 -128391 360601
10501 360601 461201 261051 120821 401817 359781 451635 284156 394670 577072 338603
10491 338603 271795 543582 1001423 529057 561805 195963 263058 749217 418275 311549
10481 311549 296109 484288 506968 670965 681388 710720 390356 515731 303653 310616 261027
10470 261027 367056 438268 -66089 -210392 -296319 61929 435599 98164 142048 -115930
$$ packed form
10541A332271m1638K64722k20834k75304L16P0178K7558j11114L90705j09663
10531A327197j56781L19310j44602j85253m36420l42314J45807K3022j49622k50360
10521A49984L47952M33226J24430K2154n34783k57304r9273J33964L12745j98457
10511D34638J46506J04918l06413j68659M0629R9032k01918l54531P7407M88992
10501C60601J00600k00150j40230K80996m2036R1854j67479J10514J82402k38469
10491C38603o6808K71787M57841m72366L2748l65842O7095M86159l30942j06726
10481C11549j5440J88179K2680J63997J0423K9332l20364J25375k12078O963m9589
10470B61027J06029P1212n04357j44303q5927L58248L73670l37435M3884k57978
$$ plain form
10460 -115930 -28021 295596 227731 72373 -229621 -163618 275827 367102 683189 478176
10450 478176 360182 557656 597381 426231 745053 383669 267120 477987 508212 454379
10440 454379 295148 170576 304046 674343 189119 485275 443729 645271 625258 424793
10430 424793 452915 497493 404754 582114 791312 1064522 925027 698899 806791 221034
10420 221034 470949 755029 750795 755292 533722 154362 -64890 251968 -18035 24645
10410 24645 225905 231178 375308 140395 4635 224578 270416 176562 110445 671594 343774
10399 343774 -191740 -177778 -99239 199858 261900 484839 366318 -221157 -31651 198043
10389 198043 63249 653975 434336 -60584 165602 234139 -97855 -158957 -141072 -187851
$$ packed form
10460a15930Q7909L23617o7865j55358l01994O6003M39445R1275L16087k05013
10450D78176j17994J97474L9725j71150L18822l61384j16549K10867L0225n3833
10440D54379j59231j24572J33470L70297m85224K96156m1546K01542k0013k00465
10430D24793K8122M4578r2739J77360K09198K73210j39495k26128J07892n85757
10420B21034K49915K84080m234M497k21570l79360k19252L16858k70003M2680
10410B4645K01260N273J44130k34913j35760K19943M5838r3854o6117N61149l27820
10399C43774n35514J3962P8539K99097O2042K22939j18521n87475J89506K29694
10389A98043j34794N90726k19639m94920K26186O8537l31994o1102J7885m6779
$$ plain form
10379 -187851 73035 108509 170280 93040 185302 -20681 -54261 -50415 90666 223969 395459
10368 395459 -44692 57600 231279 79083 -53247 -111909 104630 185888 -70734 -442791
10358 -442791 -442514 -500883 -308110 172923 75802 -238523 -166527 190905 253400 -69666 -95839
10347 -95839 -281084 -450568 90155 -175787 -214719 120851 -46915 -7863 -99199 -375839
10337 -375839 -303364 -319248 -169236 39468 -246882 -69103 -348483 -546993 -581419 -862915
10327 -862915 -322946 -109621 -517898 -386114 -229007 450905 -40505 -37907 68473 -126517
10317 -126517 -403457 -422599 -9223 -167392 -281797 -288962 -132788 -165398 -338353 -154489
10307 -154489 -356193 -331593 162060 -30525 73457 -100249 -274727 -35031 147415 28366
$$ packed form
10379a87851K60886L5474O1771p7240R2262k05983l3580L846J41081J33303J71490
10368C95459m40151J02292J73679j52196j32330n8662K16539Q1258k56622l72057
10358d42791K77n8369J92773M81033r7121l14325P1996L57432O2495l23066k6173
10347i5839j85245j69484N40723k65942l8932L35570j67766L9052r1336k76640
10337c75839P2475j5884J50012K08704k86350J77779k79380j98510l4426k81496
10327h62915N39969K13325m08277J31784J57107O79912m91410K598J06380j94990
10317a26517k76940j9142M13376j58169j14405p165J56174l2610j72955J83864
10307a54489k01704K4600M93653j92585J03982j73706j74478K39696J82446j19049
$$ plain form
10297 28366 185683 -40821 -131398 179612 202145 -122835 471209 552118 164525 -19537
10287 -19537 -85266 154077 225853 446351 327121 -147926 -498368 -387447 -174980 -537885
10277 -537885 -515147 84139 -99668 -159320 -452966 -294245 -203598 -611832 -591811 -314451
10267 -314451 104858 16084 84657 243196 214274 -84379 -582630 -578448 -301734 81914
10257 81914 -151985 -142784 14103 -71289 -216182 -122389 -131657 250818 68817 151574 391276
10246 391276 398934 403169 249433 386799 75481 -134543 -265685 -132084 -93897 19043
10236 19043 -251501 -367237 433494 424754 575654 176661 -542725 -202911 389122 629913
10226 629913 272057 -186388 26614 170110 206169 -3349 -24051 253076 367056 274911
$$ packed form
10297B8366J57317k26504r0577L11010K2533l24980N94044Q0909l87593j84062
10287a9537o5729K39343P1776K20498j19230m75047l50442J10921K12467l62905
10277e37885K2738N99286j83807n9652k93646J58721R0647m08234K0021K77360
10267c14451M19309q8774O8573J58539k8922k98653m98251M182K76714L83648
10257H1914k33899R201J56887q5392j44893R3793r268L82475j82001Q2757K39702
10246C91276P658M235j53736J37366l11318k10024j31142J33601L8187J12940
10236A9043k70544j15736Q00731q740J50900l98993p19386L39814N92033K40791
10226F29913l57856m58445K13002J43496L6059k09518k0702K77127J13980r2145
$$ plain form
10216 274911 293734 36022 103752 41217 -3728 -84863 -68023 146316 216041 278242 423719
10205 423719 182094 67092 217016 -148627 -382345 -102552 44830 115688 110378 83855
10195 83855 -36352 -236765 -30249 -167465 554065 232439 38726 39165 242908 571696
10185 571696 217567 258708 494483 173757 494021 715790 263944 363315 70253 -148187
10175 -148187 420927 510272 242939 98049 -42597 525229 595612 527150 350716 255203
10165 255203 462863 570982 387569 -204813 -146063 375 380415 300408 317169 -106682
10155 -106682 116648 -78184 -357750 -112249 101963 164958 -12217 211130 657980 653136
10145 653136 501168 262078 -177486 -58960 229547 100786 189431 330507 350012 432431
$$ packed form
10216B74911J8823k57712O7730o2535m4945q1135J6840K14339O9725O2201J45477
10205D23719k41625j15002J49924l65643k33718K79793J47382P0858n310k6523
10195H3855j20207k00413K06516j37216P21530l21626j93713M39K03743L28788
10185E71696l54129M1141K35775l20726L20264K21769m51846R9371k93062k18440
10175a48187N69114Q9345k67333j44890j40646N67826P0383o8462j76434r5513
10165B55203K07660J08119j83413n92382N8750J46438L80040q0007J6761m23851
10155a06682K23330j94832k79566K45501K14212O2995j77175K23347M46850m844
10145F53136j51968k39090m39564J18526K88507j28761Q8645J41076J9505Q2419
$$ plain form
10135 432431 636439 890495 744782 312682 -250390 -160612 -156446 246727 460363 121362
10125 121362 188484 -89130 181646 -167733 -78115 421751 476528 713468 252720 116498
10115 116498 167692 314571 663122 491888 76503 363117 780546 869160 707970 980027
10105 980027 1027320 1265938 1540897 1506082 1641418 1647062 1366612 811491 883613 611676
10095 611676 1123891 1326238 1454067 1467981 975252 854072 745934 1155228 1143869 1168750
10085 1168750 1050292 372133 155502 9333 -146 183924 366905 44820 171868 416252
10075 416252 117476 287538 487480 306171 486604 965412 928573 808646 734341 629338
10065 629338 266187 695662 450986 378617 338140 727531 774758 634073 693654 879184
$$ packed form
10135D32431K04008K54056j45713m32100n63072Q9778M166M03173K13636l39001
10125A21362O7122k77614K70776l49379Q9618M99866N4777K36940m60748j36222
10115A16498N1194J46879L48551j71234m15385K86614M17429Q8614j61190K72057
10105I80027M7293K38618K74959l4815J35336N644k80450n55121P2122k71937
10095F11676N12215K02347J27829J3914m92729j21180j08138M09294j1359K4881
10085A168750j18458o78159k16631j46169r479J84070J82981l22085J27048K44384
10075D16252k98776J70062J99942j81309J80433M78808l6839j19927p4305j05003
10065F29338l63151M29475k44676p2369m0477L89391M7227j40685N9581J85530
$$ plain form
10055 879184 713550 752326 662802 430878 655491 578627 288736 594891 533399 466747
10045 466747 631414 597144 566983 584201 583132 189642 -34023 424847 182138 12486
10035 12486 161461 288350 277868 187653 371714 569776 707719 502076 296079 255554
10025 255554 596300 659603 481071 508219 497574 382899 434013 447660 1436 44009 347151
10014 347151 180499 547580 1008370 922399 706859 824359 653249 777481 726119 801054
10004 801054 1017169 561496 658991 -98277 -387605 152457 304765 424806 419309 322488
9994 322488 576172 725641 590805 659819 797530 900259 331041 342088 348298 145975
9984 145975 414221 351496 -11419 -334868 -306974 -43434 31893 42181 237253 523469
$$ packed form
10055H79184j65634L8776q9524k31924K24613p6864k89891L06155o1492o6652
10045D66747J64667l4270l0161J7218j069l93490k23665M58870k42709j69652
10035A2486J48975J26889j0482r0215J84061J98062J37943k05643k05997m0525
10025B55554L40746O3303j78532K7148j0645j14675N1114J3647m46224M2573L03142
10014C47151j66652L67081M60790q5971k15540J17500j71110J24232n1362P4935
10004H01054K16115m55673R7495p57268k89328N40062J52308J20041n497r6821
9994C22488K53684J49469j34836O9014J37711J02729n69218J1047O210k02323
9984A45975K68246o2725l62915l23449K7894K63540P5327J0288J95072K86216
$$ plain form
9974 523469 497650 240906 -131028 -396710 -121525 150727 40832 303916 671999 599176
9964 599176 401311 791687 546745 651340 493049 298183 783076 647487 363012 459633
9954 459633 371337 44601 267007 399860 388251 526892 -91914 149566 14513 250384
9944 250384 476977 711773 702775 267057 18682 240800 516736 545469 -14787 102398
9934 102398 108606 734684 519237 476428 420546 333770 438048 153637 481035 326184 164459
9923 164459 473639 560513 160394 309227 439094 613715 650110 422214 431243 525243 438518
9912 438518 381592 412777 559186 187420 226025 397945 485224 633163 669094 376329 267723
9901 267723 392935 706058 970326 1172713 1022799 1112382 1365870 1402460 1345489 1096722
$$ packed form
9974E23469k5819k56744l71934k65682K75185K72252j09895K63084L68083p2823
9964E99176j97865L90376k44942J04595j58291j94866M84893j35589k84475R6621
9954D59633q8296l26736K22406J32853j1609J38641o18806K41480j35053K35871
9944B50384K26593K34796q998m35718k48375K22118K75936K8733n60256J17185
9934A02398O208O26078k15447m2809n5882q6776J04278k84411L27398j54851j61725
9923A64459L09180Q6874m00119J48833J29867J74621L6395k27896R029R4000q6725
9912D38518n6926L1185J46409l71766L8605J71920Q7279J47939L5931k92765j08606
9901B67723J25212L13123K64268K02387j49914Q9583K53488L6590n6971k48767
$$ plain form
9891 1096722 973558 1508270 1643492 1465016 1521119 1967093 1496033 1336064 1391556 1412498
9881 1412498 1147687 905747 790575 1055309 926010 970962 1041479 869150 1067027 1059470
9871 1059470 1075940 1252216 1140193 1076508 756391 807813 1134033 1219913 1228089 1365944 1552435
9860 1552435 1677732 1555553 1291072 629694 758143 1191752 1273485 1351284 1378639 1262898
9850 1262898 1232235 1687657 1842071 2014788 2233094 2064037 1968826 1655418 1562815 1934634
9840 1934634 2104871 2146533 1778755 1445385 1944521 1861825 1997474 1762739 1936691 2273949
9830 2273949 1690948 1952800 1984135 2074120 2188787 1833821 2013297 1803366 1435223 1712357
9820 1712357 2321014 2535035 2362587 2062878 1887546 2364111 2304718 2861339 2825980 2956696
$$ packed form
9891A096722j23164N34712J35222j78476N6103M45974m71060j59969N5492K0942
9881A412498k64811k41940j15172K64734j29299M4952P0517j72329J97877p557
9871A059470J6470J76276j12023o3685l20117N1422L26220Q5880Q176J37855J86491
9860A552435J25297j22179k64481o61378J28449M33609Q1733P7799K7355j15741
9850A262898l0663M55422J54414J72717K18306j69057r5211l13408r2603L71819
9840A934634J70237M1662l67778l33370M99136q2696J35649k34735J73952L37258
9830B273949n83001K61852L1335Q9985J14667l54966J79476k09931l68143K77134
9820A712357O08657K14021j72448k99709j75332M76565n9393N56621l5359J30716
$$ plain form
9810 2956696 3205955 3088714 3172022 3554587 3887217 3903634 3773246 3474347 3718707 4390402
9800 4390402 4404764 4820354 4900571 5220760 5623354 5816329 5910644 6115520 6190080 5938694
9790 5938694 5732674 5318193 4594274 4025941 3917678 3884344 3461283 3247649 3239219 2929728
9780 2929728 2685251 2686938 2406824 2568014 2190586 1746933 1920214 1823608 1901422 2106189
9770 2106189 2293082 2037660 2275740 2353135 2185355 2220122 2409586 2480850 2006159 1971770
9760 1971770 1970073 1961587 1740118 1696619 1581320 1956546 2097752 1636018 1624640 1996003 2239883
9749 2239883 2079836 2078838 2234005 1842918 2282965 2236203 1698665 1822435 1833342 2088410
9739 2088410 2055892 2353407 2368704 2278926 2091637 2211479 2194287 2185987 2346453 2319532 2259922
$$ packed form
9810B956696K49259j17241Q3308L82565L32630J6417j30388k98899K44360O71695
9800D390402J4362M15590Q0217L20189M02594J92975R4315K04876P4560k51386
9790E938694k06020m14481p23919n68333j08263l3334m23061k13634q430l09491
9780B929728k44477J687k80114J61190l77428m43653J73281r6606P7814K04767
9770B106189J86893k55422K38080P7395j67780L4767J89464P1264m74691l4389
9760A971770j697q486k21469m3499j15299L75226J41206m61734j1378L71363K43880
9749B239883j60047r98J55167l91087M40047m6762n37538J23770J0907K55068
9739B088410l2518K97515J5297q9778j87289J19842j7192q300J60466k6921n9610
$$ plain form
9728 2259922 2395069 2529685 2309001 1654979 1490752 1595952 2270347 2185865 2058328 2315649
9718 2315649 2447391 2271201 1994836 2486011 2601522 2925465 3044324 3039318 2748801 2888261
9708 2888261 2731530 2473648 2831691 3240562 3067337 2742121 3067243 2834668 2531945 2215095
9698 2215095 2329151 2813530 2994153 2670915 2778321 3152306 2880358 2751055 2795079 2860305
9688 2860305 3165356 3203587 3260384 3313201 2948450 3060380 3148683 3357356 3273128 3297660 3243392
9677 3243392 3050520 3038850 3139834 3452842 3233180 3533805 3448441 3468881 3230774 3590030
9667 3590030 3417536 3269234 3270061 3263296 3421743 3723694 4081843 3901628 3959736 4399757 4080529
9656 4080529 4145948 4485655 4028058 3726093 3916781 4006075 4031619 4610469 5046013 5035127
$$ packed form
9728B259922J35147J34616k20684o54022j64227J05200O74395q4482j27537K57321
9718B315649J31742j76190k76365M91175J15511L23943J18859n006k90517J39460
9708B888261j56731k57882L58043M08871j73225l25216L25122k32575l02723l16850
9698B215095J14056M84379J80623l23238J07406L73985k71948j29303M4024O5226
9688B860305L05051L8231N6797N2817l64751J11930Q8303K08673q4228K4532n4268
9677C243392j92872j1670J00984L13008k19662L00625q5364K0440k38107L59256
9667C590030j72494j48302Q27o765J58447L01951L58149j80215N8108M40021l19228
9656D080529O5419L39707m57597l01965J90688Q9294K5544N78850M35544j0886
$$ plain form
9646 5035127 5012293 4837120 4514760 4442021 4529564 4855912 5156658 5241999 5054277 4986088
9636 4986088 5046803 4895559 4726866 5308663 5397323 5470775 5407180 5538026 6086161 6322781
9626 6322781 5725583 5750461 6423174 6518547 6355187 6733233 6860896 7147706 7326508 7359492
9616 7359492 7693806 7730073 7566882 7914485 8133084 8441126 8501131 8618658 8605743 8956098
9606 8956098 9313720 9340882 9623339 9749559 9887070 9910682 10125432 10560054 11054290 11357887
9596 11357887 11247884 11473873 11909230 12521036 12878753 12679343 12875012 13167227 14022205
9587 14022205 14245606 14264572 14830576 15251633 15323031 15690602 16273949 16586664 17251608 17446564
9577 17446564 17732563 18575056 19313475 19927570 20580163 21224504 21733008 22831395 23976499
$$ packed form
9646E035127k2834j75173l22360p2739Q7543L26348L00746Q5341j87722o8189
9636D986088O0715j51244j68693N81797Q8660P3452o3595J30846N48135K36620
9626F322781n97198K4878O72713R5373j63360L78046J27663K86810J78802L2984
9616G359492L34314L6267j63191L47603K18599L08042O0005J17527j2915L50355
9606H956098L57622K7162K82457J26220J37511K3612K14750M34622M94236L03597
9596A1357887j10003K25989M35357O11806L57717j99410J95669K92215Q54978
9587A4022205K23401J8966N66004M21057P1398L67571N83347L12715O64944J94956
9577A7446564K85999Q42493P38419O14095O52593O44341N08504J098387J145104
$$ plain form
9568 23976499 25395817 26595646 28139751 29350600 30501635 31773666 32580489 33829768
9560 33829768 34573035 35103323 35748019 36306590 37303127 38073062 38707920 39256586 39311025 38716417
9550 38716417 38531729 38731846 38978666 39038597 39268528 39865018 41011576 41949598 42573048
9541 42573048 43791461 44807558 46408767 47647596 49056298 50716585 52281653 54919499
9533 54919499 57315770 60205792 63478924 66633737 71184284 76802714 83125803 90488172
9525 90488172 99100894 109109178 119544182 131059293 142398355 152038221 159382962 164456742
9517 164456742 166484276 167350387 167062744 167729099 169238583 170054150 169829998 166901817 161572849
9508 161572849 153708871 144390793 134637539 126120065 118824783 112825855 109120208 106635621
$$ packed form
9568B3976499J419318J199829J544105J210849J151035J272031Q06823J249279
9560C3829768P43267N30288O44696N58571R96537P69935O34858N48666N4439n94608
9550C8716417j84688K00117K46820N9931K29931N96490J146558R38022O23450
9541D2573048J218413J016097J601209J238829J408702J660287J565068K637846
9533E4919499K396271K890022L273132L154813M550547N618430O323089P362369
9525I0488172Q612722J0008284J0435004J1515111J1339062R639866P344741N073780
9517A64456742K027534Q66111k87643O66355J509484Q15567k24152k928181n328968
9508A61572849p863978r318078r753254q517474p295282n998928l705647k484587
$$ plain form
9500 106635621 104992205 104729966 105321876 107351302 110689537 115047454 120900570 128364739
9492 128364739 136750667 146317619 156803394 167360092 176298224 184486823 190666374 194544352
9484 194544352 195401126 193945459 189535923 183077048 174455332 164908570 154439029 143706850
9476 143706850 133518543 123779980 116040880 109598274 104549738 100686871 97746499 95769931
9468 95769931 94173924 93283617 92904245 92506722 93448921 94692230 97892438 102231172 107292537
9459 107292537 114146415 122627797 132662833 144224856 157146533 170314384 182828246
9452 182828246 193616343 201728498 206850953 209103983 207469226 202804107 195597642 185929398
9444 185929398 174033602 161071578 147193945 133185952 120467426 109039002 99095580
$$ packed form
9500A06635621j643416k62239N91910K029426L338235M357917N853116P464169
9492A28364739Q385928R566952J0485775J0556698Q938132Q188599O179551L877978
9484A94544352Q56774j455667m409536o458875q621716r546762j0469541j0732179
9476A43706850j0188307r738563p739100o442606n048536l862867k940372j976568
9468I5769931j596007q90307l79372l97523R42199J243309L200208M338734N061365
9459A07292537O853878Q481382J0035036J1562023J2921677J3167851J2513862
9452A82828246J0788097Q112155N122455K253030j634757m665119p206465r668244
9444A85929398j1895796j2962024j3877633j4007993j2718526j1428424r943422
$$ plain form
9437 99095580 90688553 83407098 77075152 71655396 66709348 62707887 59037281 55589613
9429 55589613 52409501 49421415 47505631 45399566 43132303 40885714 39260479 37561302
9421 37561302 36413450 34760509 33064699 31645763 30537397 30043080 28934636 28493941
9413 28493941 27459102 27252648 26899041 26494050 26544348 26702864 26989775 27159160 27052791
9404 27052791 26958743 26988921 26720185 26276176 25773407 25071744 24985329 24514362 23647031 22765106
9394 22765106 22187995 21163008 20257996 19598709 19103957 17849979 17253673 16811665 15886045
9385 15886045 15117275 14407583 13707567 13066969 12806668 12702723 12175225 11678946 11304387
9376 11304387 10912549 10467619 10028977 9770071 9992787 9994674 9853035 9956511 9644366 9268354
$$ packed form
9437I9095580q407027p281455o331946n419756m946048m001461l670606l447668
9429E5589613l180112k988086j915784k106065k267263k246589j625235j699177
9421C7561302j147852j652941j695810j418936j108366m94317j108444m40695
9413B8493941j034839k06454l53607m04991N0298J58516K86911J69385j06369
9404B7052791r4048L0178k68736m44009n02769p01663q6415m70967q67331q81925
9394B2765106n77111j024987r05012o59287m94752j253978n96306m42008r25620
9385A5886045p68770p09692p00016o40598k60301j03945n27498m96279l74559
9376A1304387l91838m44930m38642k58906K22716J887j41639J03476l12145l76012
$$ plain form
9366 9268354 8690633 8528891 8815662 8669958 8278923 8447696 8519435 8287816 8130055 7728678
9356 7728678 7669419 7769408 7809622 8170418 8303944 8122448 7826940 7844562 7634920 7357151
9346 7357151 7485598 7187800 6743552 6736584 6655137 6531968 6443501 6510642 6834866 6521191
9336 6521191 6734708 6471344 6297071 6808558 6695402 6216562 6354986 6421099 6422101 6015793
9326 6015793 5650920 5977097 5870591 6065457 5961704 6183163 5893852 6256429 6012103 5779545
9316 5779545 5973313 6359664 6329683 6575844 6370924 6446106 6381136 6276030 6397787 6731497
9306 6731497 6264451 6226609 6474772 6192461 6137059 6120640 5915516 6028391 5977216 6190592
9296 6190592 6338340 6091021 5745205 5681021 6027513 5907318 5774925 5475870 5597060 5681496
$$ packed form
9366I268354n77721j61742K86771j45704l91035J68773P1739k31619j57761m01377
9356G728678n9259R9989M0214L60796J33526j81496k95508J7622k09642k77769
9346G357151J28447k97798m44248o968q1447j23169q8467O7141L24224l13675
9336F521191K13517k63364j74273N11487j13156m78840J38424O6113J002m06308
9326F015793l64873L26177j06506J94866j03753K21459k89311L62577k44326k32558
9316E779545J93768L86351k9981K46161k04920P5182o4970j05106J21757L33710
9306F731497m67046l7842K48163k82311n5402j6419k05124J12875n1175K13376
9296F190592J47748k47319l45816o4184L46492j20195j32393k99055J21190Q4436
$$ plain form
9286 5681496 5780759 5534996 5408119 5919537 6232243 6168702 6410458 6700145 6472591 6081338
9276 6081338 6105170 5910228 6222663 6374032 6172439 6417133 6700897 6213711 6031961 5909829
9266 5909829 6091333 6403140 6602101 6614834 6561738 6942348 7033571 7192475 7806576 7682959
9256 7682959 7333763 7403903 7176755 6865291 6958268 7030637 6950645 6978762 6552160 6472999 6196303
9245 6196303 5949385 6107992 6025861 6237569 6104097 6105960 6495970 6709938 6788390 7134068
9235 7134068 6863859 6413090 6511385 6860199 7459073 7340090 7363695 7540356 8259889 8337068
9225 8337068 7944427 7763391 7897369 8125365 7891673 8210608 8248300 8449976 7989714 8282833
9215 8282833 8120688 8188360 8303553 8315223 8131879 8111249 8643871 8484603 8331337 7867062
$$ packed form
9286E681496R9263k45763j26877N11418L12706o3541K41756K89687k27554l91253
9276F081338K3832j94942L12435J51369k01593K44694K83764m87186j81750j22132
9266E909829J81504L11807J98961J2733n3096L80610R1223J58904O14101j23617
9256G682959l49196P0140k27148l11464R2977P2369p9992K8117m26602p9161k76696
9245F196303k46918J58607q2131K11708j33472J863L90010K13968P8452L45678
9235G134068k70209m50769R8295L48814N98874j18983K3605J76661P19533P7179
9225H337068l92641j81036J33978K27996k33692L18935L7692K01676m60262K93119
9215H282833j62145O7672J15193J1670j83344k0630N32622j59268j53266m64275
$$ plain form
9205 7867062 7775196 8420082 8346383 8408144 8691087 9062523 8800985 8807542 9610288 9422044
9195 9422044 9764309 9565953 9520145 9587161 9486932 9482925 9500511 9982103 9820985 9850790 10489036
9184 10489036 11132544 11453954 11986918 12149840 12008452 12338185 12930429 13371214 13507252
9175 13507252 13884237 14361814 15162373 16328999 17779771 19288676 20903660 23062842 25104131
9166 25104131 27053815 27877711 27170874 26507854 25947411 26133716 26499459 27060877 26751756
9157 26751756 25539280 23714128 21416062 19460169 17793180 16409452 15358228 14560656
9149 14560656 13888549 13062698 12804542 12513546 12256041 12100893 11675194 11396343 11491497 11541023
9139 11541023 11650502 11951340 11885358 12260967 12250389 12168623 12532438 12836527 13060068 13378016
$$ packed form
9205G867062r1866O44886p3699O1761K82943L71436k61538O557Q02746j88244
9195I422044L42265j98356m5808O7016j00229m007J7586M81592j61118K9805O38246
9184A0489036O43508L21410N32964J62922j41388L29733N92244M40785J36038
9175A3507252L76985M77577Q00559J166626J450772J508905J614984K159182K041289
9166B5104131J949684Q23896p06837o63020n60443J86305L65743N61418l09121
9157B6751756j212476j825152k298066j955893j666989j383728j051224p97572
9149A4560656o72107q25851k58156k90996k57505j55148m25699k78851R5154M9526
9139A1541023J09479L00838o5982L75609j0578q1766L63815L04089K23541L17948
$$ plain form
9129 13378016 13896267 14572022 14801563 15185275 16082051 16509525 16470635 16313339 15982328 16022458
9119 16022458 15873859 15557307 15651220 14883266 14235100 13747389 12869697 12511461 11992687 11857776
9109 11857776 11241369 10637698 10495779 10325071 10172910 10198561 9930960 9793887 9868529 9809913
9099 9809913 10372633 10222168 10156738 9763024 9440499 9710450 9812574 10190438 10482479 10316895
9089 10316895 10171307 10529631 10932287 10821657 10867490 10909322 10816126 10968375 11026718 11210649
9079 11210649 10960366 10659824 11352834 11529647 11566242 11467070 11357750 11569524 11446524 11217506
9069 11217506 11673240 11472205 11154040 11574192 12115142 12500336 12442081 12200245 12488804 12647522
9059 12647522 12565322 13089673 13653567 13828303 13718556 13989386 14448954 14339866 14458347 15036900
$$ packed form
9129A3378016N18251O75755K29541L83712Q96776M27474l8890j57296l31011M0130
9119A6022458j48599l16552R3913p67954o48166m87711q77692l58236n18774j34911
9109A1857776o16407o03671j41919j70708j52161K5651k67601j37073P4642n8616
9099I809913N62720j50465o5430l93714l22525K69951J02124L77864K92041j65584
9089A0316895j45588L58324M02656j10630M5833M1832r3196J52249N8343J83931
9079A1210649k50283l00542O93010J76813L6595r9172j09320K11774j23000k29018
9069A1217506M55734k01035l18165M20152N40950L85194n8255k41836K88559J58718
9059A2647522q2200N24351N63894J74736j09747K70830M59568j09088J18481N78553
$$ plain form
9049 15036900 15275443 15094933 15573184 16239179 16593146 16935823 17122074 17527753 17449997 17344968
9039 17344968 17554812 17693090 17580403 17646155 18266428 19064843 19388246 19168955 19301261 20150242
9029 20150242 20734530 20947934 21102008 21191391 21797306 22978396 23047031 23317375 23371831 24064846
9019 24064846 24628526 24794715 25494875 26358876 26921581 27274350 27750536 28529612 29732388
9010 29732388 30393362 31367998 31544271 32089396 32623367 33318008 34330093 35205889 36147598
9001 36147598 36713288 37121467 38012240 39067209 40228158 41473120 42225923 43191617 44342185
8992 44342185 45609818 46479753 47355555 48972748 49870027 50989200 52702094 54354729 55651972
8983 55651972 57184534 58823169 60924539 62752071 65115260 67892086 70585928 74558094
$$ packed form
9049A5036900K38543j80510M78251O65995L53967L42677J86251M05679p7756j05029
9039A7344968K09844J38278j12687O5752O20273P98415L23403k19291J32306Q48981
9029B0150242N84288K13404J54074Q9383O05915J181090O8635K70344N4456O93015
9019B4064846N63680J66189P00160Q64001N62705L52769M76186P79076J202776
9010B9732388O60974R74636J76273N45125N33971O94641J012085Q75796R41709
9001C6147598N65690M08179Q90773J054969J160949J244962P52803R65694J150568
8992D4342185J267633Q69935Q75802J617193Q97279J119173J712894J652635J297243
8983E5651972J532562J638635K101370J827532K363189K776826K693842L972166
$$ plain form
8975 74558094 79004202 83877708 89390730 96038771 103332637 111119509 118969953 125729345
8967 125729345 130614630 134611934 138124748 142527306 148219727 156126903 165145037 173712771
8959 173712771 180923237 185868529 188372900 190048087 191389152 192091582 191964922 191051664
8951 191051664 188017734 182896945 177194503 171066319 163866783 157346022 152915914 149149507
8943 149149507 146919770 147181180 148184090 150280501 153548939 157911733 163560344 170462461
8935 170462461 179296893 190451608 204068983 219918114 238315273 257420091 276579287
8928 276579287 295110544 311292677 325715037 338446535 350900910 364490999 378009666
8921 378009666 388350578 393656673 393991800 389268675 380158484 368155954 354050456 337885889
$$ packed form
8975G4558094M446108M873506N513022O648041P293866P786872P850444O759392
8967A25729345M885285L997304L512814M402558N692421P907176R018134Q567734
8959A73712771P210466M945292K504371J675187J341065P02430j26660r13258
8951A91051664l033930n120789n702442o128184p199536o520761m430108l766407
8943A49149507k229737K61410J002910K096411L268438M362794N648611O902117
8935A70462461Q834432J1154715J3617375J5849131J8397159J9104818J9159196
8928B76579287J8531257J6182133J4422360J2731498J2454375J3590089J3518667
8921C78009666J0340912N306095L35127m723125r110191j2002530j4105498j6164567
$$ plain form
8913 337885889 320445738 301648166 281618472 260603321 241641004 224979939 211029340
8906 211029340 200559636 193177327 188018489 185598883 185960765 187853967 192107595 197372840
8898 197372840 202551352 206950529 209150484 209353118 207432340 204408125 200769761 195316609
8890 195316609 187550778 177350223 166297973 155935752 147370745 140532406 135429984 131131966
8882 131131966 127651271 125199319 123533384 122933852 122201216 122543965 123733367 125908775
8874 125908775 129317894 133924359 140542357 148003310 157400883 168989092 181483776 193563310
8866 193563310 203512898 210447045 214568343 216817315 217911208 217337738 214537177 208735336
8858 208735336 199446175 189751070 181761426 175179319 170585755 167514087 166276995 167953554
$$ packed form
8913C37885889j7440151j8797572k0029694k1015151j8962317j6661065j3950599
8906B11029340j0469704p382309n158838k419606L61882J893202M253628N265245
8898A97372840N178512M399177K199955K02634j920778l024215l638364n453152
8890A95316609p765831j0200555j1052250j0362221q565007o838339n102422m298018
8882A31131966l480695k451952j665935n99532p32636L42749J189402K175408
8874A25908775L409119M606465O617998P460953R397573J1588209J2494684J2079534
8866A93563310R949588O934147M121298K248972J093893n73470k800561n801841
8858B08735336r289161r695105p989644o582107m593564l071668j237092J676559
$$ plain form
8850 167953554 171777873 178571223 187142362 196905005 204876442 209921335 209337939 203592969
8842 203592969 193054356 179543445 164751906 151013748 139674320 130752557 124506769
8835 124506769 120297320 118073482 117467032 118398785 120214209 121915672 123009019 123147670
8827 123147670 121651500 119434652 116754679 113751742 110305422 106051748 100134231 94026695
8819 94026695 88522548 84612533 81798563 80250560 79564448 79935393 80912140 82468876 85526596
8810 85526596 89592124 94824192 100405040 104983643 108102329 107744502 104247352 98139751
8802 98139751 90601821 82045584 74113174 67140539 61257679 56478878 52670009 49379499
8794 49379499 46671963 44216109 42127271 40619828 39340294 38617972 37440992 36375430
$$ packed form
8850A67953554L824319O793350Q571139R762643P971437N044893n83396n744970
8842B03592969j0538613j3510911j4791539j3738158j1339428q921763o245788
8835A24506769m209449k223838o06450R31753J815424J701463J093347J38651
8827A23147670j496170k216848k679973l002937l446320m253674n917517o107536
8819I4026695n504147l910015k813970j548003o86112L70945R76747J556736L057720
8810H5526596M065528N232068N580848M578603L118686l57827l497150o107601
8802I8139751p537930q556237p932410o972635n882860m778801l808869l290510
8794D9379499k707536k455854k088838j507443j279534p22322j176980j065562
$$ plain form
8786 36375430 35596255 34821993 33999458 33081482 32289767 32006649 31418832 31149905 30794192
8777 30794192 30261093 30180661 29869219 29473539 29249828 29000623 28669541 28492137 27975829 27653743
8767 27653743 27100072 26817206 26627083 27004670 26705327 26946627 27065365 27073907 26467271 26410109
8757 26410109 27181345 27119134 27534697 28026082 27967451 28530673 28704043 28931807 29456763 29830630
8747 29830630 30792762 31521142 31619593 31903647 32477228 33407087 33931441 34233426 35710608
8738 35710608 36430792 37003269 37375591 38582915 39636353 40685833 41619752 42608162 43956596
8729 43956596 45866898 48033550 50800251 53747639 57197649 61101135 65438483 70660035
8721 70660035 76657938 83437802 92160908 101705434 111078655 118619928 124111540 127025683
$$ packed form
8786C6375430p79175p74262q22535r17976p91715k83118n87817k68927l55713
8777C0794192n33099q0432l11442l95680k23711k49205l31082j77404n16308l22086
8767B7653743n53671k82866j90123L77587k99343K41300J18738Q542o06636n7162
8757B6410109P71236o2211M15563M91385n8631N63222J73370K27764N24956L73867
8747B9830630R62132P28380R8451K84054N73581R29859N24354L01985J477182
8738C5710608P20184N72477L72322J207324J053438J049480R33919R88410J348434
8729D3956596J910302K166652K766701K947388L450010L903486M337348N221552
8721G0660035N997903O779864Q723106R544526R373221P541273N491612K914143
$$ plain form
8713 127025683 127042913 126773698 126570153 125230936 122767828 118181015 111122719 102002021 93892464
8704 93892464 87308438 82013556 78312132 75964729 73643394 72054004 71778780 72041972
8696 72041972 73457514 75452971 77454884 80175676 84267911 88208415 94186290 101318988
8688 101318988 109806864 119898557 130525078 140703494 149819093 158058195 165235017 170998877
8680 170998877 175067108 176067329 173420259 168341355 161319806 153595230 144532208 134199105
8672 134199105 122838254 110579571 99284586 89571752 81629789 75759577 71112212 66898257
8664 66898257 63733254 61279550 59964451 59081533 58593745 58550677 59018478 60109046 61540802
8655 61540802 63709502 66130588 69927380 74749274 79534473 83281097 85643446 86801959
$$ packed form
8713A27025683J7230k69215k03545j339217k463108m586813p058296r120698q109557
8704I3892464o584026n294882l701424k347403k321335j589390k75224K63192
8696G2041972J415542J995457K001913K720792M092235L940504N977875P132698
8688A01318988Q487876J0091693J0626521J0178416R115599Q239102P176822N763860
8680A70998877M068231J000221k647070n078904p021549p724576r063022j0333103
8672A34199105j1360851j2258683j1294985r712834p941963n870212m647365m213955
8664F6898257l165003k453704j315099q82918m87788m3068M67801J090568J431756
8655F1540802K168700K421086L796792M821894M785199L746624K362349J158513
$$ plain form
8647 86801959 85917195 84656277 83353189 81112421 78109751 73900497 67210932 59892772
8639 59892772 53557188 47941478 43192114 39119709 35807024 33394743 31228662 29125645
8631 29125645 27266242 25927261 24547553 23355270 22917278 22145499 21261694 20594671 19670997
8622 19670997 18723935 18055402 17753736 16987812 16389716 15800935 15075805 14435549 13910429
8613 13910429 13270663 13236899 12493501 11808664 11836604 12044443 11977146 11451658 10827928 10500078
8603 10500078 10676818 10383402 10203335 9892886 9850556 9476344 9140989 9209758 9443452 9522656
8593 9522656 9260594 9662813 9744383 9736375 9753335 9739344 9491288 9420382 10010786 9077915 8727494
8582 8727494 8988716 8504733 7688299 7885759 7904063 7239725 6931898 7092673 7052256 6809843
$$ packed form
8647H6801959q84764j260918j303088k240768l002670m209254o689565p318160
8639E9892772o335584n615710m749364m072405l312685k412281k166081k103017
8631B9125645j859403j338981j379708j192283m37992p71779q83805o67023r23674
8622A9670997r47062o68533l01666p65924n98096n88781p25130o40256n25120
8613A3910429o39766l3764p43398o84837K7940K07839o7297n25488o23730l27850
8603A0500078J76740k93416j80067l10449m2330l74212l35355O8769K33694P9204
8593I522656k62062M02219Q1570q008J6960j3991k48056p0906N90404r32871l50421
8582H727494K61222m83983q16434J97460J8304o64338l07827J60775m0417k42413
$$ plain form
8572 6809843 6616494 6405845 6310787 6457575 6427594 5879026 5644970 5698409 5720204 5853607
8562 5853607 5969947 5959845 6029241 6340559 6396819 6099080 6000840 6031840 5602314 5509010 5807108
8551 5807108 6025965 6382975 6413491 6096236 5897271 5756759 5388944 5349619 5771260 5378318
8541 5378318 5454692 5904137 5717463 5435219 5089799 4980704 4898329 4813843 4706305 4351235
8531 4351235 4579022 4165162 3608182 3973925 4000520 3797516 4061439 3979398 3595292 3563315
8521 3563315 3635571 3525938 3552108 3639574 3558385 3715365 3308455 3873403 4162507 3902336
8511 3902336 4057701 3622658 3231920 3299143 3779854 3821049 3552957 3480542 3580518 3646539
8501 3646539 3680568 3708077 3826816 3813153 3440022 3102825 2957269 3132004 3180063 2836568
$$ packed form
8572F809843j93349k10649r5058J46788k9981n48568k34056N3439K1795J33403
8562E853607J16340j0102O9396L11318N6260k97739r8240L1000m29526r3304K98098
8551E807108K18857L57010L0516l17255j98965j40512l67815l9325M21641l92942
8541E378318P6374M49445j86674k82244l45420j09095q2375q4486j07538l55070
8531D351235K27787m13860n56980L65743K6595k03004K63923q2041l84106l1977
8521C563315P2256j09633K6170Q7466q1189J56980m06910N64948K89104k60171
8511C902336J55365m35043l90738O7223M80711M1195k68092p2415R9976O6021
8501C646539L4029K7509J18739j3663l73131l37197j45556J74735M8059l43495
$$ plain form
8491 2836568 2414644 2364686 2496812 2502949 2546431 2927217 2841146 2817650 2934747 2797013 2573666
8480 2573666 2451979 2821772 3107858 3276731 3250601 2920112 3096577 2971051 2951057 2582636
8470 2582636 2654998 2504254 2297826 2619852 2739255 2558814 2318604 2023450 2158485 2324172
8460 2324172 2598661 2406201 1797419 1968044 1814788 1846534 2036161 2098263 2003456 1753230
8450 1753230 2140730 1982839 1856499 1807234 2037118 2137993 2013160 2147035 1916812 1797898
8440 1797898 1703469 1831605 2019263 1955884 2280534 2233119 1824291 1931421 1972809 2200629
8430 2200629 2020317 1952290 1727386 1941728 1680171 1487480 1126415 1157850 1529619 1355442
8420 1355442 1637977 1377550 1472297 1619141 1329986 1333566 1045787 923831 936943 840275
$$ packed form
8491B836568m21924m9958J32126O137M3482L80786q6071k3496J17097j37734k23347
8480B573666j21687L69793K86086J68873k6130l30489J76465j25526j9994l68421
8470B582636P2362j50744k06428L22026J19403j80441k40210k95154J35035J65687
8460B324172K74489j92460o08782J70625j53256L1746J89627O2102r4807k50226
8450A753230L87500j57891j26340m9265K29884J00875j24833J33875k30223j18914
8440A797898r4429J28136J87658o3379L24650m7415m08828J07130M1388K27820
8430B200629j80312o8027k24904K14342k61557j92691l61065L1435L71769j74177
8420A355442K82535k60427R4747J46844k89155L580k87779j21956J3112r6668
$$ plain form
8410 840275 665038 1057955 1259691 828630 665965 427533 653271 1158508 1181584 1323943
8400 1323943 1026517 1214693 1282465 958590 972766 954912 1060246 1122692 1179906 1099107 976411
8389 976411 1105919 838114 558738 564273 797681 854346 651186 873945 691600 496741
8379 496741 841825 837630 446147 379552 583424 540493 334670 439689 642615 1023152
8369 1023152 1120613 1223084 1452955 1164951 1076010 1324013 1485735 1362989 1167358 488364
8359 488364 722312 1024226 1116294 1304017 1104655 1113744 983982 714817 1296925 1617433
8349 1617433 986094 673653 757940 951679 773516 855672 985207 757240 808199 1173312
8339 1173312 1273000 1238410 893006 982016 1230097 999006 1266527 1092142 1091038 1341153
$$ packed form
8410H40275j75237L92917K01736m31061j62665k38432K25738N05237K3076J42359
8400A323943k97426J88176O7772l23875J4176j7854J05334O2446N7214q0799j22696
8389I76411J29508k67805k79376N535K33408N6665k03160K22759j82345j94859
8379D96741L45084m195l91483o6595K03872m2931k05823J05019K02926L80537
8369A023152R7461J02471K29871k88004q8941K48003J61722j22746j95631o78994
8359D88364K33948L01914R2068J87723j99362R089j29762k69165N82108L20508
8349A617433o31339l12441Q4287J93739j78163Q2156J29535k27967N0959L65113
8339A173312R9688l4590l45404Q9010K48081k31091K67521j74385j104K50115
$$ plain form
8329 1341153 1204073 1236874 1106760 1212190 1170727 1154567 1291457 1435241 1280006 1131951
8319 1131951 1204081 917267 1109386 1375724 1329516 1517703 1368585 1160045 1172146 1671083
8309 1671083 1448116 852493 550255 664713 756353 943720 749776 1075538 1014177 619698
8299 619698 426679 528894 850418 826445 1040581 920248 1158622 1465081 1208458 543062
8289 543062 1015671 1537038 1279039 1209163 1156279 1339142 1253245 985772 828863 1097184
8279 1097184 1313727 729735 788365 563258 584183 894844 491750 397065 355724 732995
8269 732995 752702 360782 112883 -63354 339931 503399 241741 461981 424257 490526
8259 490526 526240 237105 -158698 424632 451148 271207 329623 195797 416372 482960
$$ packed form
8329A341153j37080L2801j30114J05430m1463j6160J36890J43784j55235j48055
8319A131951P2130k86814J92119K66338m6208J88187j49118k08540J2101M98937
8309A671083k22967n95623l02238J14458R1640J87367j93944L25762o1361l94479
8299F19698j93019J02215L21524k3973K14136j20333K38374L06459k56623o65396
8289E43062M72609N21367k57999o9876n2884J82863q5897k67473j56909K68321
8279A097184K16543n83992N8630k25107K0925L10661m03094r4685m1341L77271
8269G32995J9707l91920k47899j76237M03285J63468k61658K20240l7724O6269
8259D90526L5714k89135l95803N83330K6516j79941N8416j33826K20575O6588
$$ plain form
8249 482960 520945 451517 487439 -166448 -219113 -57817 -193124 -366316 88874 -8970 -13770
8238 -13770 148375 418353 321026 167744 45440 295694 322372 -91102 190796 317850
8228 317850 -42123 -137181 -726634 -697248 -360363 -153576 -301037 -640554 -90945 -5596
8218 -5596 -344994 -392337 -123263 -302775 197181 254579 177779 114580 286881 -57561 -45282
8207 -45282 138261 2021 -17512 517533 357387 -124610 -341550 -142515 -148706 -104879 -716917
8196 -716917 -564473 -627219 -698857 -3787127 -2847226 1638168 1190706 1277676 358927 483593
8186 483593 390878 431248 421644 458778 69824 93853 116142 270771 377930 411446 721049
8175 721049 715559 591645 232993 -174144 378146 245630 66732 240510 324894 30776
$$ packed form
8249D82960L7985o9428L5922o53887n2665J61296j35307j73192M55190r7844m800
8238a3770J62145K69978r7327j53282j22304K50254K6678m13474K81898J27054
8228C17850l59973r5058n89453K9386L36885K06787j47461l39517N49609Q5349
8218e596l39398m7343K69074j79512M99956N7398p6800o3199J72301l44442J2279
8207d5282J83543j36240j9533N35045j60146m81997k16940J99035o191M3827o12038
8196g16917J52444o2746p1638l088270R39901M485394m47462Q6970r18749J24666
8186D83593r2715M0370r604L7134l88954K4029K2289J54629J07159L3516L09603
8175G21049n490j23914l58652m07137N52290j32516j78898J73778Q4384k94118
$$ plain form
8165 30776 73281 652773 483438 720327 762644 460136 444786 581706 155232 29261
8155 29261 70746 440622 196769 201202 204142 94936 112290 263022 150966 -18630 151159
8144 151159 530524 214717 443340 618560 684024 446887 292463 8426 -4899 527024
8134 527024 242677 286207 69262 -253319 -190521 -15605 -2913 -131993 -283467 -216563
8124 -216563 -3494 307958 486156 249725 -116246 -227821 -247895 185977 141391 134561
8114 134561 45179 -193275 -169578 120883 3838 52641 20847 -122274 -147032 -60862 -95999
8103 -95999 -76084 -78121 -64883 -96694 194296 331696 217360 199674 281719 195574 2615
8092 2615 77151 223890 124728 -135454 -12966 -126703 150651 109875 20173 314195 524768
$$ packed form
8165C0776M2505N79492j69335K36889M2317l02508j5350J36920m26474j25971
8155B9261M1485L69876k43853M433K940j09206J7354J50732j12056j69596J69789
8144A51159L79365l15807K28623J75220O5464k37137j54424k84037j3325N31923
8134E27024k84347M3530k16945l22581O2798J74916J2692j29080j51474O6904
8124b16563K13069L11452J78198k36431l65971j11575k0074M33872m4586o830
8114A34561q9382k38454K3697K90461j17045M8803l1794j43121k4758Q6170l5137
8103i5999J9915k037J3238l1811K90990J37400j14336j7686Q2045q6145j92959
8092B615P4536J46739r9162k60182J22488j13737K77354m0776q9702K94022K10573
$$ plain form
8081 524768 467520 507564 484619 443659 362829 -81742 87870 429769 48514 -53901 -118693
8070 -118693 -393043 -458796 -651452 -616393 -120943 -95870 160882 193896 250748 177968 205627
8059 205627 356343 20786 400886 -156029 -239167 522734 536645 162253 -451778 -106740
8049 -106740 115568 146558 506665 590958 607700 397073 355399 649486 388480 204737
8039 204737 417269 655334 614055 677813 402595 233721 260628 7487 204884 225934
8029 225934 150974 219417 250884 -84410 -67430 -11464 377112 428966 201494 -190492 -236919
8018 -236919 19084 -29514 75965 -125403 145369 160858 22264 25049 41770 117276 -148260
8007 -148260 -285322 262501 574888 548243 339837 492088 106934 442176 343579 378242
$$ packed form
8081E24768n7248M0044k2945m0960q0830m44571J69612L41899l81255j02415o4792
8070a18693k74350o5753j92656L5059M95450K5073K56752L3014N6852p2780K7659
8059B05627J50716l35557L80100n56915q3138P61901J3911l74392o14031L45038
8049a06740K22308L0990L60107Q4293J6742k10627m1674K94087k61006j83743
8039B04737K12532K38065m1279O3758k75218j68874K6907k53141J97397K1050
8029B25934p4960O8443L1467l35294J6980N5966L88576N1854k27472l91986m6427
8018b36919K56003m8598J05479k01368K70772J5489j38594K785J6721P5506k65536
8007a48260j37062N47823L12387k6645k08406J52251l85154L35242r8597L4663
$$ plain form
7997 378242 115733 -9388 324595 336766 33768 -103946 -36901 187664 153832 -156385
7987 -156385 -140844 -738752 -321539 29582 285492 54512 116685 99947 -333052 187918
7977 187918 294555 -69548 -13282 -334107 -377413 -164485 -115910 -197840 -65195 331935
7967 331935 257649 160360 191842 69636 -163761 -123459 -30452 -82717 -192373 123488 54674
7956 54674 125267 252690 97603 230680 -128731 16563 -141981 -451465 -396338 -110248
7946 -110248 70052 -409938 -542965 121589 333073 52637 -314972 71818 234162 194499
7936 194499 215999 -183139 -553922 -789584 -495495 -500129 -594785 -3864 -303394 -72023
7926 -72023 170943 -293926 -86691 -457512 -394172 296270 -14990 -288508 56071 260921
$$ packed form
7997C78242k62509j25121L33983J2171l02998j37714O7045K24565l3832l10217
7987a56385J5541n97908M17213L51121K55910k30980O2173j6738m32999N20970
7977A87918J06637l64103N6266l20825m3306K12928M8575q1930J32645L97130
7967C31935p4286r7289L1482j22206k33397M0302R3007n2265j09656L15861o8814
7956E4674P0593J27423j55087J33077l59411J45294j58544l09484N5127K86090
7946a10248J80300m79990j33027O64554K11484k80436l67609L86790J62344l9663
7936A94499K1500l99138l70783k35662K94089m634r4656N90921k99530K31371
7926g2023K42966m64869K07235l70821O3340O90442l11260k73518L44579K04850
$$ plain form
7916 260921 61063 -280143 -366854 -479870 -429545 -357989 -632231 -205021 98427 375770
7906 375770 -71797 -457228 -677196 -510271 -525954 -355657 -416208 -286249 -256693 -505094
7896 -505094 -187082 -122924 105094 -119946 -208166 -158796 264243 568982 59208 -309689
7886 -309689 -194817 -175265 7260 -32841 -42932 125863 -66421 -426508 -511194 -110377
7876 -110377 288818 342926 -139051 -244117 -285760 -335387 -161266 -304322 -507288 -304328
7866 -304328 -126273 -230656 -227840 -203787 -488259 -498282 -306053 -174394 68053 -118034
7856 -118034 132606 -169491 -129792 -3874 -77982 -4412 8214 -303680 -489258 -833992
7846 -833992 -540869 127998 -16656 -180982 -78164 -358956 -251387 42528 111072 88659
$$ packed form
7916B60921j99858l41206q6711j13016N0325P1556k74242M27210L03448K77343
7906C75770m47567l85431k19968J66925j5683J70297o0551J29959K9556k48401
7896e05094L18012O4158K28018k25040q8220M9370M23039L04739n09774l68897
7886c09689J14872J9552J82525m0101j0091J68795j92284l60087q4686M00817
7876a10377L99195N4108m81977j05066m1643m9627J74121j43056k02966K02960
7866c04328J78055j04383K816K4053k84472j0023J92229J31659K42447j86087
7856a18034K50640l02097L9699J25918p4108P3570J2626l11894j85578l44734
7846h33992K93123O68867j44654j64326J02818k80792J07569K93915O8544k2413
$$ plain form
7836 88659 -3264 54364 -187163 -607482 -214882 -109855 -316924 -412416 -360930 -32428 -274636
7825 -274636 -261475 406853 -73149 -228271 -322872 -298336 226354 -239337 17189 545556
7815 545556 432134 341497 -132843 -245917 7704 186713 -239897 -348482 -143315 -97850
7805 -97850 -216667 236217 -163060 302618 286903 39665 -355354 -550686 87660 -404600
7795 -404600 -209384 -278836 -421600 -112055 -141746 -300620 -255861 204964 364817 117477
7785 117477 61770 -182048 -9114 95738 -201509 -142632 -97701 -389924 -109338 -443754
7775 -443754 -201463 -88603 -61178 -13335 176352 -182074 -103867 -89001 -459660 -179219
7765 -179219 110647 -412320 -533386 -197877 120269 143713 -21973 -234572 -169700 -169062 -237587
$$ packed form
7836H8659r1923N7628k41527m20319L92600J05027k07069r5492N1486L28502k42208
7825b74636J3161O68328m80002j55122r4601K4536N24690m65691K56526N28367
7815E45556j13422r0637m74340j13074K53621J79009m26610j08585K05167M5465
7805i7850j18817M52884l99277M65678j5715k47238l95019j95332O38346m92260
7795d04600J95216o9452j42764L09545k9691j58874M4759M60825J59853k47340
7785A17477n5707k43818J72934J04852k97247N8877M4931k92223K80586l34416
7775d43754K42291J12860K7425M7843J89687l58426P8207J4866l70659K80441
7765a79219K89866n22967j21066L35509L18146K3444j65686k12599O4872O38o8525
$$ plain form
7754 -237587 -127863 125167 163837 -285817 -199040 -132444 188223 -77484 -92257 -273742
7744 -273742 -416553 -257864 -588549 -532925 -415121 -225988 -97974 -314008 -402379 -152722
7734 -152722 -507667 -180667 70996 -64511 -328938 -210293 -126970 -366482 -327430 -221050
7724 -221050 -633632 -562508 -84901 90747 -195576 -73068 312320 -37637 -138115 -153984
7714 -153984 -5948 -53310 93054 -72020 -223550 23108 228080 36044 352599 344611
7704 344611 77938 -117459 -518332 -552371 -789779 -283523 -360877 -286197 -242264 43118
7694 43118 110411 -413671 -228961 317718 362858 67741 56780 -122636 -244450 -406574
7684 -406574 -358310 -223308 -77802 -67338 -53558 308114 586960 329940 22829 3579
$$ packed form
7754b37587J09724K53030L8670m49654Q6777O6596L20667k65707j4773j81485
7744b73742j42811J58689l30685N5624J17804J89133J28014k16034q8371K49657
7734a52722l54945L27000K51663j35507k64427J18645Q3323k39512L9052J06380
7724b21050m12582P1124M77607J75648k86323J22508L85388l49957j00478j5869
7714a53984J48036m7362J46364j65074j51530K46658K04972j92036L16555p988
7704C44611k66673j95397m00873l4039k37408N06256p7354P4680M3933K85382
7694D3118O7293n24082J84710N46679M5140k95117j0961j79416j21814j62124
7684d06574M8264J35002J45506J0464J3780L61672K78846k57020l07111j9250
$$ plain form
7674 3579 186341 422680 400892 10447 -241283 -119432 -205441 -192004 -224068 -410243 31100
7663 31100 -68155 -185760 -148481 -20078 257639 395379 275535 275869 -126823 -404132 -373028
7652 -373028 93201 83451 154766 246363 189173 -16991 -258587 42091 -153184 -451236 -268063
7641 -268063 -242566 -342604 -89051 257564 482834 54633 -28803 270637 440229 -20609
7631 -20609 -331251 -52753 -237360 -189950 12691 282443 90219 181195 188844 15997 32573
7620 32573 158252 577643 188879 195765 241470 -74965 2751 -55464 43424 151318 -79256
7609 -79256 -440059 -309633 49995 16448 -224629 -325642 -453747 -182246 9906 216086
7599 216086 333520 477632 167810 -189252 365934 157410 195778 208436 245483 231535
$$ packed form
7674C579J82762K36339k1788l90445k51730J21851q6009J3437l2064j86175M41343
7663C1100r9255j17605L7279J28403K77717J37740j19844L34m02692k77309L1104
7652c73028M66229r750P1315R1597n7190k06164k41596L00678j95275k98052J83173
7641b68063K5497j00038K53553L46615K25270m28201q3436K99440J69592m60838
7631b0609l10642K78498j84607M7410K02641K69752j92224R0976P649j72847J6576
7620C2573J25679M19391l88764O886M5705l16435P7716n8215R8888J07894k30574
7609g9256l60803J30426L59628l3547k41077j01013j28105K71501J92152K06180
7599B16086J17434J44112l09822l57062N55186k08524L8368J2658L7047j3948
$$ plain form
7589 231535 -289524 -99054 45201 -318523 -263990 -90370 -365131 -530962 -51293 56725
7579 56725 -69394 2088 -209976 -315080 -472779 -68423 -67082 88264 362523 207203
7569 207203 -93781 -137423 -78391 24148 92953 -346853 -117932 161421 -64289 -244131
7559 -244131 -191261 191851 99979 172059 322287 389253 68175 -140016 185364 -3651
7549 -3651 -174610 106632 -30603 -455250 -65220 71477 33782 -163368 -273254 -44718
7539 -44718 33239 -233441 44656 345039 66163 193062 142698 237488 36285 -6500 244864
7528 244864 -174560 -11859 -306229 -482835 -411434 -6071 82185 -252539 -284864 -183995
7518 -183995 -280684 88427 465311 565309 534207 636643 -19433 -258987 -254111 -663579 -485340
$$ packed form
7589B31535n21059J90470J44255l63724N4533J73620k74761j65831M79669J08018
7579E6725j26119P1482k12064j05104j57699M04356J341J55346K74259j55320
7569B07203l00984m3642N9032J02539O8805m39806K28921K79353k25710j79842
7559b44131N2870L83112r1872P2080J50228O6966l21078k08191L25380j89015
7549c651j70959K81242j37235m24647L90030J36697l7695j97150j09886K28536
7539d4718P7957k66680K78097L00383k78876J26899n0364R4790k01203m2785K51364
7528B44864m19424J62701k94370j76606P1401M05363Q8256l34724l2325J00869
7518a83995r6689L69111L76884R9998l1102J02436o56076k39554M876m09468J78239
$$ plain form
7507 -485340 -170844 78596 -75753 -16413 92830 438015 130157 -312774 -170160 307157
7497 307157 -155533 -369367 165194 -356581 -332043 -315867 5237 -280515 -211515 -378710
7487 -378710 -278933 -10605 182059 337943 248930 -27344 -84498 167353 -61746 -114657
7477 -114657 -153271 -158638 -291964 -167734 1891 -247271 -362749 143818 411145 526132
7467 526132 321113 290344 386661 398055 -12550 -103155 -422843 -446048 -18624 -115224 22539
7456 22539 48551 -198843 -322867 -165841 -31328 123063 39290 -79118 -170412 1073
7446 1073 188708 -430975 -544351 -550985 -352544 -414511 -738594 -679198 -247355 -438163 -856386
7435 -856386 -465995 -188012 -291376 -215973 -668358 -368651 -51039 -146658 -574932 -269661
$$ packed form
7507d85340L14496K49440j54349N9340J09243L45185l07858m42931J42614M77317
7497C07157m62690k13834N34561n21775K4538J6176L21104k85752O9000j67195
7487c78710R9777K68328J92664J55884q9013k76274n7154K51851k29099n2911
7477a14657l8614n367j33326J24230J69625k49162j15478N06567K67327J14987
7467E26132k05019l0769R6317J1394m10605r0605l19688k3205M27424r6600J37763
7456B2539K6012k47394j24024J57026J34513J54391q3773j18408r1294J71485
7446A073J87635o19683j13376o634J98441o1967l24083N9396M31843j90808m18223
7435h56386L90391K77983j03364P5403m52385K99707L17612r5619m28274L05271
$$ plain form
7425 -269661 -142839 -20733 592598 19565 -223075 -632785 -592547 -414659 -294332 -546482
7415 -546482 -768591 -343516 -247524 -393399 24334 275136 -14774 -214720 -469886 -243975
7405 -243975 -54349 -38621 -256835 -244536 -37977 156863 -446140 -274874 -63833 54965
7395 54965 186127 257019 -88007 -121 -176778 -252797 -419493 -643574 64377 -95223
7385 -95223 -548947 -521720 -127017 -178252 -313178 -67612 -233200 -529881 -188844 -158080
7375 -158080 -124659 -32451 188145 -13591 -170029 -97195 -29812 -207838 -170363 -88372 159018
7364 159018 177533 92398 91393 103761 -193825 143926 258035 -386293 -454354 -309270 -582587
7353 -582587 -380116 -51151 -12777 229985 123991 -12696 -562718 -491980 -277152 -380107
$$ packed form
7425b69661J26822J22106O13331n73033k42640m09710M0238J77888J20327k52150
7415e46482k22109M25075R5992j45875M17733K50802k89910j99946k55166K25911
7405b43975J89626J5728k18214J2299K06559J94840o03003J71266K11041J18798
7395E4965J31162P0892l45026Q7886j76657p6019j66696k24081P07951j59600
7385i5223m53724K7227L94703n1235j34926K45566j65588k96681L41037L0764
7375a58080L3421R2208K20596k01736j56438P2834O7383j78026L7475Q1991K47390
7364A59018J8515q5135j005J2368k97586L37751J14109o44328o8061J45084k73317
7353e82587K02471L28965L8374K42762j05994j36687n50022P0738K14828j02955
$$ plain form
7343 -380107 195286 30078 -430132 -310372 -93023 -152711 -96460 -127255 -50844 -167329
7333 -167329 -11570 81550 -323379 -16090 -202593 -222955 -353336 -140443 178370 -64099
7323 -64099 -45356 -220104 226159 169020 82993 251338 106530 -104506 -30413 28844 -11203
7312 -11203 -198586 -542453 -280946 -359857 9339 -142741 -422751 -225184 -281429 -153487
7302 -153487 -165722 -94585 -150441 -296610 -354427 -5415 167137 -73511 113524 512992
7292 512992 200795 -44154 -351462 -254447 -367643 106001 256502 -61337 77104 -64225
7282 -64225 -508032 -497034 -282356 -228038 25134 -373358 -328561 -75996 51269 -435612
7272 -435612 -269620 61321 229510 219865 -155464 -198701 -373906 -701201 -439761 41315
$$ packed form
7343c80107N75393j65208m60210J19760K17349n9688N6251l0795P6411j16485
7333a67329J55759R3120m04929L07289j86503k0362j30381K12893L18813k42469
7323f4099J8743j74748M46263n7139q6027J68345j44808k11036P4093N9257m0047
7312a1203j87383l43867K61507p8911L69196j52080k80010J97567n6245J27942
7302a53487j2235P1137n5856j46169n7817L49012J72552k40648J87035L99468
7292E12992l12197k44949l07308R7015j13196M73644J50501l17839J38441j41329
7282f4225m43807J0998K14678N4318K53172l98492M4797K52565J27265m86881
7272d35612J65992L30941J68189r645l75329m3237j75205l27295K61440M81076
$$ plain form
7262 41315 -165418 128141 6220 -223073 -349192 -149847 -161276 -324034 -309300 -183773
7252 -183773 18890 -265969 -63039 90985 -257500 90111 227098 77166 -192969 -756374
7242 -756374 -517823 -100453 -229109 -368686 -435759 -504357 -467295 -557453 -405867 -530109
7232 -530109 -234605 187641 141868 -100955 -211211 -173835 -142006 -286204 -52508 112912
7222 112912 205354 -67597 -317691 -201303 -65227 -298512 -459472 -30377 51736 37719
7212 37719 78533 70681 -204135 75600 213484 183675 494639 28829 -138324 -204548 15208
7201 15208 -298929 -583760 -491418 -287309 -406822 -354067 -245372 -6583 321515 -313794
7191 -313794 -611482 -514631 -605782 -670181 -352745 -646266 -232941 372448 36904 -385719
$$ packed form
7262D1315k06733K93559j21921k29293j26119J99345j1429j62758J4734J25527
7252a83773K02663k84859K02930J54024l48485L47611J36987j49932k70135n63405
7242g56374K38551M17370j28656j39577o7073o8598L7062r0158J51586j24242
7232e30109K95504M22246m5773k42823j10256L7376L1829j44198K33696J65420
7222A12912R2442k72951k50094J16388J36076k33285j60960M29095Q2113j4017
7212C7719M0814p852k74816K79735J37884k9809L10964m65810j67153o6224K19756
7201A5208l14137k84831R2342K04109j19513N2755J08695K38789L28098o35309
7191c13794k97688R6851r1151o4399L17436k93521M13325O05389l35544m22623
$$ plain form
7181 -385719 -460108 -190422 -535736 -21353 261310 197329 -27613 45150 -242576 -607600
7171 -607600 -48547 50773 -20945 -430552 -389360 -217620 -374962 -283728 297086 270976 141196
7160 141196 -851 193550 397610 -306769 -533658 -392478 143180 460693 120975 3018
7150 3018 -340389 -154039 -271730 -17220 -48969 -111025 63889 218398 104742 -232992
7140 -232992 -258335 168612 -19594 115666 459 -84570 203830 -60553 249526 419719
7130 419719 377885 -309946 -472651 -728104 -264243 -213589 -169302 -91667 -128476 -362714 -44559
7119 -44559 118361 -370684 -144088 -91334 -122810 89179 -465985 -376970 -362204 -437841 106474
7108 106474 -2892 -134573 -268573 -184835 153865 -146954 -240381 112838 -25294 123817
$$ packed form
7181c85719p4389K69686l45314N14383K82663o3981k24942P2763k87726l65024
7171f07600N59053R9320p1718m09607M1192J71740j57342R1234N80814k6110j29780
7160A41196j42047J94401K04060p04379k26889J41180N35658L17513l39718j17957
7150C018l43407J86350j17691K54510l1749o2056J74914J54509j13656l37734
7140b32992k5343M26947j88206J35260j15207q5029K88400k64383L10079J70193
7130D19719m1834o87831j62705k55453M63861N0654M4287P7635l6809k34238L18155
7119d4559J62920m89045K26596N2754l1476K11989n55164Q9015J4766p5637N44315
7108A06474j09366j31681j34000Q3738L38700l00819r3427L53219j38132J49111
$$ plain form
7098 123817 -25209 -513823 -469998 37373 -46433 146014 -110412 -419799 -417248 202970
7088 202970 -155216 -285347 -7695 -152281 73611 410899 256388 -144839 -69417 120125
7078 120125 -249972 -232876 152755 -174885 194464 189634 -135056 158819 71617 110471 -105034
7067 -105034 -283978 -314171 -337450 -581233 -660790 45635 293566 -196820 -64443 -46558
7057 -46558 51110 443521 432308 359283 -205064 62266 388094 136841 -185792 -314750
7047 -314750 -869168 -791548 -449908 -206755 -260806 -155161 329498 -122688 -286548 -573063
7037 -573063 -585937 -281598 64595 -18789 152723 -257253 -464608 -616363 -464385 -222064
7027 -222064 -128475 -209897 -287467 305725 546003 303223 98868 286616 34829 181751
$$ packed form
7098A23817j49026m88614M3825N07371q3806J92447k56426l09387K551O20218
7088B02970l58186j30131K77652j44586K25892L37288j54511m01227P5422J89542
7078A20125l70097J7096L85631l27640L69349m830l24690K93875q7202L8854k15505
7067a05034j78944l0193k3279k43783p9557P06425K47931m90386J32377J7885
7057d6558R7668L92411j1213p3025n64347K67330L25828k51253l22633j28958
7047c14750n54418P7620L41640K43153n4051J05645M84659m52186j63860k86515
7037e73063j2874L04339L46193q3384J71512m09976k07355j51755J51978K42321
7027b22064R3589q1422p7570N93192K40278k42780k04355J87748k51787J46922
$$ plain form
7017 181751 -74070 226101 379335 556744 -386 -248512 -137971 -202647 74876 -536
7007 -536 -271807 -247281 32167 61347 -101750 -39390 -23395 -712511 -395965 21622 -74626
6996 -74626 -97173 -23116 39143 -292588 -514893 -541089 -395137 -70028 197828 366030 192695
6985 192695 17822 556097 187421 -95199 -352174 -666387 -457008 -54001 -7511 -340793
6975 -340793 -313075 -2097 280436 613989 608954 313798 -33591 66096 181891 50329
6965 50329 36721 -162102 -245441 -109989 -271508 -324017 -361012 -262891 -264616 -8754 -456002
6954 -456002 -374909 -223622 -519901 -478507 -550925 -267234 127330 134095 17086 -49445 -501136
6943 -501136 -393680 -601463 -311410 -517802 -902249 -670502 -432374 -273911 165623 397705
$$ packed form
7017A81751k55821L00171J53234J77409n57130k48126J10541o4676K77523p5412
7007e36k71271K4526K79448K9180j63097O2360J5995o89116L16546M17587r6248
6996g4626k2547P4057O2259l31731k22305k6196J45952L25109K67856J68202j73335
6985A92695j74873N38275l68676k82620k56975l14213K09379M03007M6490l33282
6975c40793K7718L10978K82533L33553n035k95156l47389R9687J15795j31562
6965E0329j3608j98823q3339J35452j61519n2509l6995R8121j725K55862m47248
6954d56002Q1093J51287k96279M1394p2418K83691L94564O765j17009o6531m51691
6943e01136J07456k07783K90053k06392l84447K31747K38128J58463M39534K32082
$$ plain form
6933 397705 604066 692611 382365 -320455 -180508 -49573 17715 84239 -34660 -318046
6923 -318046 -498697 -368383 -334565 -42597 56904 -424616 -286769 -193112 -493779 -736928
6913 -736928 -392931 141450 -40585 -351245 -114220 -127396 -488269 -468561 -355679 -444927
6903 -444927 -194370 -408047 -246810 179452 155689 -24641 -43591 61719 -60455 -224981
6893 -224981 363724 623936 127847 199098 -59116 -164946 -215043 -21583 -203742 -197273
6883 -197273 -256572 -424111 -368394 -85622 165420 116575 -360432 -177717 65439 -37587
6873 -37587 -287878 245793 68061 -211376 -66972 -214502 -170906 -124277 -65708 -293667
6863 -293667 -228665 -211488 -42430 -219668 -380152 -290926 -348254 -422827 -689957 -533319 -468062
$$ packed form
6933C97705K06361Q8545l10246p02820J39947J30935O7288O6524j18899k83386
6923c18046j80651J30314L3818K91968R9501m81520J37847R3657l00667k43149
6913g36928L43997N34381j82035l10660K37025j3176l60873J9708J12882q9248
6903d44927K50557k13677J61237M26262k3763j80330j8950J05310j22174j64526
6893b24981N88705K60212m96089P1251k58214j05830n0097J93460j82159O469
6883a97273n9299j67539N5717K82772K51042m8845m77007J82715K43156j03026
6873c7587k50291N33671j77732k79437J44404j47530M3596M6629N8569k27959
6863b93667O5002J7177J69058j77238j60484Q9226n7328p4573k67130J56638O5257
$$ plain form
6852 -468062 -516080 -78156 -399993 -157683 -129846 72256 77631 -172909 151766 65274 -152700
6841 -152700 -42967 291844 -266634 -154763 -286173 -298139 -333088 -526959 -126523 -22509
6831 -22509 132838 172849 308224 174813 66234 -45403 -117213 150149 50277 -321889
6821 -321889 -94084 -373260 -346748 42821 -121449 -419585 -623696 -232521 -336227 -629693
6811 -629693 -350535 -416024 -77251 66334 -133449 69078 -556609 -537027 -319392 135840
6801 135840 26517 -379906 -456273 -447058 -366443 -114183 -5631 -161170 -20801 67097 -304074
6790 -304074 -548984 -205510 -276895 -235427 -44866 -385005 -382166 -229802 -56098 -198112
6780 -198112 -467243 -266514 -186315 -44624 499792 449054 -145945 -299187 60431 390446
$$ packed form
6852d68062m8018M37924l21837K42310K7837K02102N375k50540L24675q6492k17974
6841a52700J09733L34811n58478J11871j31410j1966l4949j93871M00436J04014
6831b2509J55347M0011J35375j33411j08579j11637p1810K67362r9872l72166
6821c21889K27805k79176K6512L89569j64270k98136k04111L91175j03706k93466
6811f29693K79158o5489L38773J43585j99783K02527o25687J9582K17635M55232
6801A35840j09323m06423p6367R215Q0615K52260J08552j55539J40369Q7898l71171
6790c04074k44910L43474p1385M1468J90561l40139K839J52364J73704j42014
6780a98112k69131K00729Q0199J41691N44416n0738n94999j53242L59618L30015
$$ plain form
6770 390446 -2965 -74525 -194323 240770 1921 -207826 -37346 -362898 -593587 -23193
6760 -23193 279555 111676 107231 134685 -75938 261682 26466 -272894 23435 -7642 -14440
6749 -14440 231405 308636 368213 -121118 -224446 176907 -328580 -185055 116022 73237
6739 73237 -20340 65932 -263628 -508403 -379748 -133865 -907 63529 -186527 -220409 76980
6728 76980 -78204 -429401 -294196 -220482 26349 30856 -87769 -15448 -259780 -340332 -116715
6717 -116715 -217744 -357180 -266737 -370786 -533994 -438568 -99145 -510959 -373251 167532
6707 167532 -39521 -392767 -61275 -225264 -616546 -305485 -277733 13911 167482 -496476
6697 -496476 -736592 -536792 -693170 -379389 -384929 -544796 57404 347094 -12159 -239071
$$ packed form
6770C90446l93411p1560j19798M35093k38849k09747J70480l25552k30689N70394
6760b3193L02748j67879m445K7454k10623L37620k35216k99360K96329l1077o798
6749a4440K45845P7231N9577m89331j03328M01353n05487J43525L01077m2785
6739G3237r3577Q6272l29560k44775J28655K45883J32958O4436k50056l3882K97389
6728G6980j55184l51197J35205P3714K46831M507j18625P2321k44332q0552K23617
6717a16715j01029j39436R0443j04049j63208R5426L39423m11814J37708N40783
6707A67532k07053l53246L31492j63989l91282L11061K7752K91644J53571o63958
6697d96476k40116J99800j56378L13781n540j59867O02200K89690l59253k26912
$$ plain form
6687 -239071 -87843 -292218 -412411 -144398 -442967 -474676 -408480 -341422 -210985 -335234
6677 -335234 -337871 335017 438101 177737 -3546 -169241 -81948 80298 -298484 -214400
6667 -214400 -377139 -23861 156217 -233288 -260521 -278332 -448097 -353202 -292791 -278828 107671
6656 107671 28051 58171 132391 -23193 -231596 -33015 -13505 106428 150422 248994 105203
6645 105203 -215822 -370418 -27389 -19638 47743 -199833 -217885 39473 165994 -151400
6635 -151400 -454538 -550192 -246512 -37526 -92271 -229658 -425859 109354 155901 -44163
6625 -44163 119602 86343 -170717 -532908 -485892 -263602 193170 338322 51412 -224101
6615 -224101 -88087 37426 -293592 -266335 -82493 -72413 161038 227078 -250290 -141277
$$ packed form
6687b39071J51228k04375j20193K68013k98569l1709O6196O7058J30437j24249
6677c35234k637O72888J03084k60364j81283j65695Q7293J62246l78782Q4084
6667b14400j62739L53278J80078l89505k7233j7811j69765R4895O0411J3963L86499
6656A07671p9620L0120P4220j55584k08403J98581J9510J19933M3994R8572j43791
6645A05203l21025j54596L43029P751O7381k47576j8052K57358J26521l17394
6635a51400l03138r5654L03680K08986n4745j37387j96201N35213M6547k00064
6625d4163J63765l3259k57060l62191M7016K22290M56772J45152k86910k75513
6615b24101J36014J25513l31018K7257J83842J0080K33451O6040m77368J09013
$$ plain form
6605 -141277 377272 385133 -226499 -53871 375366 184774 -183542 -365729 -285403 219796
6595 219796 -255879 140410 272274 93947 -191077 -443813 -190165 -226974 58630 3421
6585 3421 531812 364978 78714 -169907 -247192 -326585 -159445 -113353 8971 -135354 -141513
6574 -141513 -57047 -123718 -180295 -247800 -313846 -112594 -356743 -779457 -511650 -153194 -148668
6563 -148668 -356795 -500845 -429469 -198028 -121670 239108 -105921 -140883 -226238 -411372
6553 -411372 -346616 -380033 26273 -500740 -641310 -158817 26951 36863 -307251 -415872
6543 -415872 -625344 -152428 7526 -99440 -178681 29016 -206588 121169 85239 -343106
6533 -343106 -541395 -392705 -302109 -160747 225519 193406 -158980 -286307 -81149 -21871
$$ packed form
6605a41277N18549P861o11632J72628M29237j90592l68316j82187Q0326N05199
6595B19796m75675L96289J31864j78327k85024k52736K53648l6809K85604n5209
6585C421N28391j66834k86264k48621p7285p9393J67140M6092J22324j44325o159
6574a41513Q4466o6671n6577o7505o6046K01252k44149m22714K67807L58456M526
6563a48668k08127j44050P1376K31441P6358L60778l45029l4962q5355j85134
6553d11372O4756l3417M06306n27013j40570M82493J85768R912l44114j08621
6543d15872k09472M72916J59954j06966p9241K07697k35604L27757l5930m28345
6533c43106j98289J48690R0596J41362L86266l2113l52386j27327K05158N9278
$$ plain form
6523 -21871 -397078 -412739 -194239 46212 432570 441990 594487 262510 -266752 -298142 -171345
6512 -171345 -281053 -296435 -145816 -148988 -93090 34218 -247384 -389952 291071 546357
6502 546357 32889 123935 78748 237031 -140104 -426201 -270210 225590 179352 34302
6492 34302 -119375 -245092 -178466 -320570 -479596 -147750 257608 207402 -42683 -190099
6482 -190099 85537 375182 278178 -13290 51548 -79310 -252976 -244157 -304519 -387230 -360813
6471 -360813 -357757 -175953 -180154 -396911 -122297 147197 -131696 -191219 -204335 -278082 -244418
6460 -244418 -105133 -227005 154628 -16372 -740027 -421435 -100064 -102379 -93037 131512
6450 131512 190075 20860 256069 441064 243543 58401 -25775 410164 208684 -12096
$$ packed form
6523b1871l75207j5661K18500K40451L86358R420J52497l31977n29262l1390J26797
6512a71345j09708j5382J50619l172N5898J27308k81602j42568O81023K55286
6502E46357n13468R1046m5187J58283l77135k86097J55991M95800m6238j45050
6492C4302j53677j25717O6626j42104j59026L31846M05358n0206k50085j47416
6482a90099K75636K89645r7004k91468O4838j30858j73666Q819o0362q2711K6417
6471c60813L056J81804m201k16757K74614K69494k78893n9523j3116p3747L3664
6460b44418J39285j21872L81633j71000p23655L18592L21371k315R342K24549
6450A31512N8563j69215K35209J84995j97521j85142q4176M35939k01480k20780
$$ plain form
6440 -12096 -233751 -343655 -152469 35526 87574 -373963 -280447 25948 231585 397396
6430 397396 516507 87134 -164821 -97167 138759 -116007 -211115 49482 187325 415172
6420 415172 -50129 -99888 -547025 -487475 -238684 -496532 -107421 -298724 -213121 -361791
6410 -361791 -622134 -479380 -455037 1557 -64111 -229363 -145039 -541037 -233896 169996
6400 169996 -47138 -145722 -316464 -158456 230012 377255 178063 -169749 -243123 -69956
6390 -69956 -98707 -17106 -134939 -137968 -134670 -219171 -101337 -80485 -110075 -298296 -175749
6379 -175749 -288121 -339604 -347797 -456262 -339982 -364297 -178155 -502073 -568339 -513171 -266430
6368 -266430 -19729 -232338 179695 -35806 -207317 -245408 121368 275656 82605 270901
$$ packed form
6440a2096k21655j09904J91186J87995N2048m61537R3516L06395K05637J65811
6430C97396J19111m29373k51955O7654K35926k54766r5108K60597J37843K27847
6420D15172m65301m9759m47137N9550K48791k57848L89111j91303Q5603j48670
6410c61791k60343J42754K4343M56594o5668j65252Q4324l95998L07141M03892
6400A69996k17134r8584j70742J58008L88468J47243j99192l47812p3374J73167
6390f9956k8751Q1601j17833l029L298q4501J17834K0852k9590j88221J22547
6379a75749j12372n1483q193j08465J16280k4315J86142l23918o6266N5168K46741
6368b66430K46701k12609M12033k15501j71511l8091L66776J54288j93051J88296
$$ plain form
6358 270901 183860 169740 -59019 30792 3932 -268366 304729 -138735 -429751 -625991
6348 -625991 -606013 -349208 -93218 -211083 -285679 -3165 -108491 251546 92343 -218783
6338 -218783 -162965 -252309 -327765 -366230 -150013 -546366 -464076 365665 73320 -552786 -332810
6327 -332810 -44639 -33675 106277 401942 474168 360325 229887 -102133 -343427 -613500
6317 -613500 -303044 -398523 -155787 116710 107639 193096 17122 -165244 139452 376991
6307 376991 94522 40468 -447710 -286184 16429 32460 51375 -288519 -102451 70906
6297 70906 231052 101223 128656 294812 82909 -222154 -185835 -286302 -192186 52449
6287 52449 118920 -401879 -29452 -271615 -334061 -353357 -127676 -72171 -325794 256728 473458
$$ packed form
6358B70901q7041j4120k28759Q9811k6860k72298N73095m43464k91016j96240
6348f25991J9978K56805K55990j17865p4596K82514j05326L60037j59203l11126
6338b18783N5818q9344p5456l8465K16217l96353Q2290Q29741k92345o26106K19976
6327c32810K88171J0964J39952K95665P2226j13843j30438l32020k41294k70073
6317f13500L10456r5479K42736K72497r071Q5457j75974j82366L04696K37539
6307C76991k82469n4054m88178J61526L02613J6031J8915l39894J86068J73357
6297G0906J60146j29829K7433J66156k11903l05063L6319j00467R4116K44635
6287E2449O6471n20799L72427k42163o2446j9296K25681N5505k53623N82522K16730
$$ plain form
6276 473458 124907 -45585 -46050 -235784 -79504 68992 124680 -150103 216059 471772
6266 471772 139062 297872 316570 59416 -139917 63311 359353 638656 599755 474890
6256 474890 532589 135995 32207 110469 174902 -124096 57865 -176541 -305081 107852
6246 107852 282858 245098 394842 -152680 -229975 115711 56278 88136 15483 147465 156596
6235 156596 -36762 16078 -147154 -177216 -80120 467723 372069 -198010 -66131 404312
6225 404312 131782 -81185 -51538 -288233 -454907 -229268 15836 91506 388832 325
6215 325 -228334 -235146 -83950 208525 51421 10638 130251 -423424 -154370 78858 96768
6204 96768 -241116 -820149 -317948 -36526 -282951 -211888 -41975 249810 -92025 -541852
$$ packed form
6276D73458l48551j70492m65j89734J56280J48496N5688k74783L66162K55713
6266D71772l32710J58810J8698k57154j99333K03228K96042K79303l8901j24865
6256D74890N7699l96594j03788P8262O4433k98998J81961k34406j28540M12933
6246A07852J75006l7760J49744n47522p7295L45686n9433L1858p2653J31982R131
6235A56596j93358N2840j63232l0062R7096N47843r5654n70079J31879M70443
6225D04312k72530k12967K9647k36695j66674K25639K45104P5670K97326l88507
6215C25k28659o812J51196K92475j57104m0783J19613n53675K69054K33228J7910
6204I6768l37884n79033N02201K81422k46425P1063J69913K91785l41835m49827
$$ plain form
6194 -541852 -456372 -418308 -196006 -96422 -62580 -73940 -72994 -180433 182882 53445 -139749
6183 -139749 56251 62256 -236423 -98673 246623 449397 178346 -203710 -372727 -476321
6173 -476321 257061 451279 138986 -242975 -253002 -249377 -386955 -455663 47772 452426
6163 452426 262607 167251 -150103 -278335 -147448 -56235 -282738 -124926 -380901 -488543
6153 -488543 -199598 -347734 -48893 385164 263408 37339 -143169 343392 210517 162935
6143 162935 174119 2504 -96818 -375500 -133923 -268707 -377946 -186715 4931 -330006
6133 -330006 -447580 56677 -202067 -475655 -288284 -250529 9530 198105 -245908 -494711
6123 -494711 -342322 49576 -456479 -557198 41134 -181435 48917 -283225 -368378 -635637
$$ packed form
6194e41852Q5480L8064K22302R9584L3842j1360R46j07439L63315j29437j93194
6183a39749J96000O005k98679J37750L45296K02774k71051l82056j69017j03594
6173d76321P33382J94218l12293l81961j0027L625j37578o8708N03435M04654
6163D52426j89819r5356l17354j28232J30887R1213k26503J57812k55975j07642
6153d88543K88945j48136K98841M34057j21756k26069j80508M86561j32875m7582
6143A62935J1184j71615r9322k78682K41577j34784j09239J91231J91646l34937
6133c30006j17574N04257k58744k73588J87371L7755K60059J88575m44013k48803
6123d94711J52389L91898n06055j00719N98332k22569K30352l32142q5153k67259
$$ plain form
6113 -635637 -566007 -400779 -606596 -604316 44434 160062 241993 561534 158899 1622
6103 1622 99931 -187831 -36122 158610 -119158 -106961 332356 589402 436289 234102
6093 234102 -160315 81748 88836 253829 298652 51706 -15612 148442 454717 58220
6083 58220 34616 38018 572016 448979 360613 426039 34428 -129721 144359 90924 -85588
6072 -85588 63030 295346 701631 457530 -146512 133549 179922 51514 79659 280700
6062 280700 538409 217477 226746 387857 -79317 -192946 163315 142882 315099 72269
6052 72269 207048 620256 146029 -12683 71923 89353 497580 372766 489900 426673
6042 426673 227050 50999 -110864 -259740 -435023 -332127 93277 -49933 169996 -60243
$$ packed form
6113f35637O9630J65228k05817K280O48750J15628Q1931L19541m02635j57277
6103A622R8309k87762J51709J94732k77768J2197M39317K57046j53113k02187
6093B34102l94417K42063P088J64993M4823k46946o7318J64054L06275l96497
6083E8220k3604L402N33998j23037q8366O5426l91611j64149K74080n3435j76512
6072h5588J48618K32316M06285k44101o04042K80061M6373j28408K8145K01041
6062B80700K57709l20932R269J61111m67174j13629L56261k0433J72217k42830
6052G2269J34779M13208m74227j58712Q4606J7430M08227j24814J17134o3227
6042D26673j99623j76051j61863j48876j75283J02896M25404j43210K19929k30239
$$ plain form
6032 -60243 -47319 291395 83439 433076 27965 378370 478382 162043 614146 411723
6022 411723 325102 138682 78751 -184908 -256385 -85625 -572817 -26539 108798 -50141
6012 -50141 -235328 -172778 95490 -38318 148490 146080 -118556 135347 305946 -13663
6002 -13663 -15673 -431740 -281885 89412 411067 197491 394531 401491 326793 404048 478881
5991 478881 243843 56447 261993 207767 358440 433910 -121974 -262381 250901 63364
5981 63364 -231371 -394343 -9126 178739 233085 360512 108000 313711 -78694 -187193
5971 -187193 13975 493399 436775 89669 -146375 -4178 -47545 -250711 98649 42473
$$ packed form
6032f0243J2924L38714k07956L49637m05111L50405J00012l16339M52103k02423
6022D11723q6621j86420n9931k63659p1477J70760m87192N46278J35337j58939
6012e0141j85187O2550K68268j33808J86808k410k64636K53903J70599l19609
6002a3663k010m16067J49855L71297L21655k13576J97040O960p4698P7255P4833
5991D78881k35038j87396K05546n4226J50673P5470n55884j40407N13282j87537
5981F3364k94735j62972L85217J87865N4346J27427k52512K05711l92405j08499
5971a87193K01168M79424n6624l47106k36044J42197m3367k03166L49360n6176
$$ [...]
##END NTUPLES=NMR SPECTRUM
##END=
