##TITLE=1H_CA-9108
 CDCl3
 8 sc, 
 27.1.2023
##JCAMPDX= 6.0         $$ Bruker NMR JCAMP-DX V2.0
##DATA TYPE= NMR SPECTRUM
##DATA CLASS= NTUPLES
##ORIGIN= UXNMR, Bruker Analytische Messtechnik GmbH
##OWNER= root
$$ XWIN-NMR		Version 3.5
$$ Fri Jan 27 13:58:56 2023 Russian Standard Time (UT+4h)  she@DPX200
##.OBSERVE FREQUENCY= 200.13135
##.OBSERVE NUCLEUS= ^1H
##.ACQUISITION MODE= SIMULTANEOUS
##.ACQUISITION SCHEME= undefined
##.AVERAGES= 8
##.DIGITISER RES= 18
##SPECTROMETER/DATA SYSTEM= spect
##.PULSE SEQUENCE= zg30
##.SOLVENT NAME= CDCl3
##.SHIFT REFERENCE= (INTERNAL, CDCl3, 0, 15.7337)
##AUDIT TRAIL= $$ (NUMBER, WHEN, WHO, WHERE, WHAT)
$$ ##TITLE= Audit trail, XWIN-NMR		Version 3.5
$$ ##JCAMPDX= 5.01
$$ ##ORIGIN= Bruker BioSpin GmbH
$$ ##OWNER= she
$$ F:/spectra/data/she/nmr/H-F/1/pdata/1/auditp.txt
$$ ##AUDIT TRAIL=  $$ (NUMBER, WHEN, WHO, WHERE, WHAT)
(   1,<2023-01-27 13:57:16.79 +0400>,<she>,<DPX200>,
      <created by zg, POWCHK disabled, PULCHK disabled
       configuration hash MD5:
       00 E9 B6 7A A2 85 ED C7 34 08 36 98 17 FE 4E 26
       data hash MD5: 16K
       76 04 27 96 83 6A AD 5F B0 E5 A7 D2 93 06 20 D1>)
(   2,<2023-01-27 13:57:20.92 +0400>,<she>,<DPX200>,
      <Start of raw data processing
       efp BC_mod = 2 LB = 0.24 FT_mod = 6 PKNL = 1 PHC0 = -19107.5 PHC1 = 7.400789 SI = 16K 
       data hash MD5: 16K
       84 25 BA D1 58 ED 06 F3 5E 69 E7 8D 96 85 4A 56>)
(   3,<2023-01-27 13:57:43.46 +0400>,<she>,<DPX200>,
      <pk PHC0 = 0.4446183 PHC1 = 0 
       data hash MD5: 16K
       C8 09 F4 50 06 2F 31 D0 B7 62 3A D8 4E B0 02 B4>)
(   4,<2023-01-27 13:57:46.81 +0400>,<she>,<DPX200>,
      <abs ABSG = 5 
       data hash MD5: 16K
       71 2E 11 F4 85 98 E0 F1 88 59 91 CF 04 6B B2 28>)
(   5,<2023-01-27 13:58:11.67 +0400>,<she>,<DPX200>,
      <pk PHC0 = 0.7695474 PHC1 = -3.2 
       data hash MD5: 16K
       19 35 94 F3 4A 02 DC 22 9D A1 3B 61 AD 9F 41 88>)
(   6,<2023-01-27 13:58:14.98 +0400>,<she>,<DPX200>,
      <abs ABSG = 5 
       data hash MD5: 16K
       A9 90 CD 75 ED C3 CD 9F F3 3F 8C B8 7F 95 52 1D>)
$$ ##END=
$$ 
$$ hash MD5
$$ 24 B8 D5 E2 10 60 D3 81 F4 19 6A EB D2 09 A2 43
##$RELAX= 
##$RELAX= 
##$RELAX= 
##$RELAX= 
##$RELAX= 
##$RELAX= 
$$ Bruker specific parameters
$$ --------------------------
##$DU= <F:/spectra>
##$EXPNO= 1
##$NAME= <H-F>
##$PROCNO= 1
##$TYPE= <nmr>
##$USER= <she>
##$AMP= (0..31)
100 100 100 100 100 100 100 100 100 100 100 100 100 100 100 100 100 100 
100 100 100 100 100 100 100 100 100 100 100 100 100 100 
##$AQSEQ= 0
##$AQ_mod= 1
##$AUNM= <au_zg>
##$AUTOPOS= <>
##$BF1= 200.13
##$BF2= 200.13
##$BF3= 200.13
##$BF4= 200.13
##$BF5= 200.13
##$BF6= 200.13
##$BF7= 200.13
##$BF8= 200.13
##$BYTORDA= 1
##$CFDGTYP= 0
##$CFRGTYP= 5
##$CHEMSTR= <none>
##$CNST= (0..31)
1 1 145 1 1 1 1 1 1 1 1 1 1 1 1 1 1 1 1 1 1 1 1 1 1 1 1 1 1 1 1 1 
##$CPDPRG= <>
##$CPDPRG1= <>
##$CPDPRG2= <>
##$CPDPRG3= <>
##$CPDPRG4= <mlev>
##$CPDPRG5= <mlev>
##$CPDPRG6= <mlev>
##$CPDPRG7= <mlev>
##$CPDPRG8= <mlev>
$$ [...]
##$SUBNAM3= <"">
##$SUBNAM4= <"">
##$SUBNAM5= <"">
##$SUBNAM6= <"">
##$SUBNAM7= <"">
##$SUBNAM8= <"">
##$SUBNAM9= <"">
##$SW= 18.05172834244
##$SWIBOX= (0..15)
0 0 2 0 0 0 0 0 0 0 0 0 0 0 0 0 
##$SW_h= 3612.71676300578
##$TD= 16384
##$TD0= 1
##$TE= 0
##$TE2= 300
##$TE3= 300
##$TEG= 300
##$TL= (0..7)
0 120 120 120 120 120 120 120 
##$TP= (0..7)
150 150 150 150 150 150 150 150 
##$TP07= 0
##$TPNAME0= <>
##$TPNAME1= <>
##$TPNAME2= <>
##$TPNAME3= <>
##$TPNAME4= <>
##$TPNAME5= <>
##$TPNAME6= <>
##$TPNAME7= <>
##$TPOAL= (0..7)
0.5 0.5 0.5 0.5 0.5 0.5 0.5 0.5 
##$TPOFFS= (0..7)
0 0 0 0 0 0 0 0 
##$TUNHIN= 0
##$TUNHOUT= 0
##$TUNXOUT= 0
##$USERA1= <user>
##$USERA2= <user>
##$USERA3= <user>
##$USERA4= <user>
##$USERA5= <user>
##$V9= 5
##$VALIST= <valist>
##$VCLIST= <CCCCCCCCCCCCCCC>
##$VD= 0
##$VDLIST= <DDDDDDDDDDDDDDD>
##$VPLIST= <PPPPPPPPPPPPPPP>
##$VTLIST= <TTTTTTTTTTTTTTT>
##$WBST= 1024
##$WBSW= 4
##$XGAIN= (0..3)
0 0 0 0 
##$XL= 0
##$YL= 0
##$YMAX_a= 200471
##$YMIN_a= -140444
##$ZGOPTNS= <>
##$ZL1= 120
##$ZL2= 120
##$ZL3= 120
##$ZL4= 120
##$ABSF1= 15.73587
##$ABSF2= -2.315979
##$ABSG= 5
##$ABSL= 3
##$ALPHA= 0
##$AQORDER= 0
##$ASSFAC= 0
##$ASSFACI= 0
##$ASSFACX= 0
##$ASSWID= 0
##$AUNMP= <proc_1d>
##$AZFE= 0.1
##$AZFW= 0.1
##$BCFW= 0
##$BC_mod= 2
##$BYTORDP= 0
##$COROFFS= 0
##$CY= -3
##$DATMOD= 1
##$DC= 0
##$DFILT= <>
##$DTYPP= 0
##$F1P= 0
##$F2P= 0
##$FCOR= 1
##$FTSIZE= 16384
##$FT_mod= 6
##$GAMMA= 0
##$GB= 0
##$INTBC= 1
##$INTSCL= 3.70164e-10
##$ISEN= 128
##$LB= 0.24
##$LEV0= 0
##$LPBIN= 0
##$MAXI= 10000
##$MC2= 0
##$MEAN= 0
##$ME_mod= 0
##$MI= 1.114404
##$NCOEF= 0
##$NC_proc= -7
##$NLEV= 6
##$NOISF1= 3.799351
##$NOISF2= 2.8
##$NSP= 0
##$NTH_PI= 0
##$NZP= 0
##$OFFSET= 15.73367
##$PC= 1
##$PHC0= -19106.28
##$PHC1= 4.200788
##$PH_mod= 1
##$PKNL= yes
##$PPARMOD= 0
##$PSCAL= 0
##$PSIGN= 0
##$REVERSE= no
##$SF= 200.130007579999
##$SI= 16384
##$SIGF1= 3
##$SIGF2= 2
##$SINO= 5.538805
##$SIOLD= 16384
##$SREGLST= <1H.CDCl3>
##$SSB= 0
##$STSI= 16384
##$STSR= 0
##$SW_p= 3612.71676300578
##$SYMM= 0
##$S_DEV= 0
##$TDeff= 16384
##$TDoff= 0
##$TI= <>
##$TILT= no
##$TM1= 0
##$TM2= 0
##$TOPLEV= 0
##$USERP1= <user>
##$USERP2= <user>
##$USERP3= <user>
##$USERP4= <user>
##$USERP5= <user>
##$WDW= 1
##$XDIM= 16384
##$YMAX_p= 274558265
##$YMIN_p= -812587
$$ End of Bruker specific parameters
$$ ---------------------------------
##NTUPLES= NMR SPECTRUM
##VAR_NAME=  FREQUENCY,     SPECTRUM/REAL,   SPECTRUM/IMAG
##SYMBOL=    X,             R,               I
##VAR_TYPE=  INDEPENDENT,   DEPENDENT,       DEPENDENT
##VAR_FORM=  AFFN,          ASDF,            ASDF
##VAR_DIM=   16384,         16384,           16384
##UNITS=     HZ,            ARBITRARY UNITS, ARBITRARY UNITS
##FACTOR=    0.220516191357247, 1,           1
##FIRST=     3148.77954332775, 0,            0
##LAST=      -463.937219678032, 0,           0
##MIN=       -463.937219678032, -812587,     0
##MAX=       3148.77954332775, 274558265,    0
$$ Real data points
##PAGE= N=1
##DATA TABLE= (X++(R..R)), XYDATA
$$ [...]
$$ plain form
7284 1056568 1065741 902458 1067007 1242991 1211123 951827 986454 1029530 1069271 924255 802868
7273 802868 886175 965462 863748 1007617 882783 883311 996867 1037614 989094 1112709 1183362
7262 1183362 1034145 984847 940114 1025946 1124438 1158455 1149445 1114892 849809 914644 915718
7251 915718 871147 817184 826991 883554 1025708 994242 910810 826521 1035857 1089949 876283
7240 876283 994039 953652 881545 926308 895720 883936 744622 652400 700987 897244 1036228
7229 1036228 1023169 827493 775612 924832 785143 803851 891690 928595 885139 895071 950699
7218 950699 782524 876759 1041993 740494 635858 791570 833544 881010 919779 772627
7208 772627 590549 600629 765559 931381 925602 796450 882593 772928 728181 797763 855003
$$ packed form
7284A056568R173j63283J64549J75984l1868k59296L4627M3076L9741j45016j21387
7273H02868Q3307P9287j01714J43869j24834N28J13556M0747m8520J23615P0653
7262A183362j49217m9298m4733Q5832R8492L4017r010l4553k65083O4835J074
7251I15718m4571n3963R807N6563J42154l1466q3432q4289K09336N4092k13666
7240H76283J17756m0387p2107M4763l0588j1784j39314r2222M8587J96257J38984
7229A036228j3059j95676n1881J49220j39689J8708Q7839L6905m3456R932N5628
7218I50699j68175R4235J65234l01499j04636J55712M1974M7466L8769j47152
7208G72627j82078J0080J64930J65822n779j29152Q6143j09665m4747O9582N7240
$$ plain form
7197 855003 808133 866788 653684 522191 652541 529532 539168 651349 770596 401454
7187 401454 340384 457185 429798 726034 605351 656792 738859 748564 614795 489602 475701
7176 475701 610998 479514 304322 270892 320573 541106 581714 612266 675477 634077 807357
7165 807357 751413 627311 608555 294576 354001 489558 371299 441416 480993 273265 227269
7154 227269 255803 271561 502854 642255 667312 489967 430063 448510 240510 226920 301275
7143 301275 353215 343511 432452 307735 291443 222124 172459 143740 180117 217085 280585 206421
7131 206421 31714 220768 276302 427102 312543 395437 412031 427125 455461 429998 296855
7120 296855 182330 341245 308385 225340 155333 249312 165244 217020 303972 240573 237501
$$ packed form
7197H55003m6870N8655k13104j31493J30350j23009R636J12181J19247l69142
7187D01454o1070J16801k7387K96236j20683N1441Q2067R705j33769j25193j3901
7176D75701J35297j31484j75192l3430M9681K20533M0608L0552O3211m1400J73280
7165H07357n5944j24102j8756l13979N9425J35557j18259P0117L9577k07728m5996
7154B27269K8534J5758K31293J39401K5057j77345n9904J8447k08000j3590P4355
7143C01275N1940r704Q8941j24717j6292o9319m9665k8719L6377L6968O3500p4164
7131B06421j74707J89054N5534J50800j14559Q2894J6594J5094K8336k5463j33143
7120B96855j14525J58915l2860q3045p0007R3979q4068N1776Q6952o3399l072
$$ plain form
7109 237501 294591 317789 405676 343824 273684 333168 112969 23644 349550 361592 349959
7098 349959 203540 424049 376183 234847 182791 313687 283800 252463 202620 369648 457844
7087 457844 514280 218912 -177 218666 332377 291425 248598 241837 252818 413478 242755
7076 242755 36379 -9673 214107 283959 163682 162905 182301 322468 411889 445088 370006
7065 370006 385215 440031 287133 228315 188077 172251 61431 45650 -76874 -85478 2164
7054 2164 75879 -20940 208948 163494 350914 116205 77314 120195 8945 84084 54086
7043 54086 16934 101073 232222 139057 78478 206174 184725 32844 -87650 -54376 -5111
7032 -5111 -34986 -3609 132284 96033 50920 247872 225568 109670 -151032 -53943 -115841
$$ packed form
7109B37501N7090K3198Q7887o1852p0140N9484k20199q9325L25906J2042j1633
7098C49959j46419K20509m7866j41336n2056J30896k9887l1337m9843J67028Q8196
7087D57844N6436k95368k19089K18843J13711m0952m2827o761J0981J60660j70723
7076B42755k06376m6052K23780O9852j20277p77J9396J40167Q9421L3199p5082
7065C70006J5209N4816j52898n8818m0238j5826j10820j5781j22524q604Q7642
7054B164P3715r6819K29888m5454J87420k34709l8891M2881j11250P5139k9998
7043E4086l7152Q4139J31149r3165o0579J27696k1449j51881j20494L3274M9265
7032e111k9875L1377J35893l6251m5113J96952k2304j15898k60702R7089o1898
$$ plain form
7021 -115841 -63069 52879 -85583 -19676 64304 -15773 -106547 -99183 -67049 -17896 64146
7010 64146 104696 36029 -56163 -152199 -220200 -117598 -54125 -182478 -205736 -207664 48971
6999 48971 146170 6007 -133196 -38781 -125919 -140114 -213976 -133389 21749 73860 183528
6988 183528 286234 225701 254137 254976 59418 -66675 -163692 -116822 -132838 88378 42517
6977 42517 40589 -12262 -78066 -138512 -57090 35674 85750 92558 -23484 -105412 -158431 -152597
6965 -152597 247517 96306 78219 33548 85550 234708 57656 -26534 92651 -23490
6955 -23490 142233 177902 198843 158204 83300 98749 12645 109483 53520 741 -129574
6944 -129574 11777 -52423 59681 -75136 -133631 -136129 19270 121812 40654 125865 265548
$$ packed form
7021a15841N2772J15948j38462O5907Q3980q0077r0774P364L2134M9153Q2042
7010F4146M0550o8667r2192r6036o8001J02602O3473j28353k3258j928K56635
6999D8971R7199j40163j39203R4415q7138j4195p3862Q0587J55138N2111J09668
6988A83528J02706o0533K8436Q39j95558j26093r7017M6870j6016K21216m5861
6977D2517j928n2851o5804o0446Q1422R2764N0076O808j16042q1928n3019N834
6965a52597M00114j51211j8087m4671N2002J49158j77052q4190J19185j16141
6955b3490J65723L5669K0941m0639p4904J5449q6104R6838n5963n2779j30315
6944a29574J41351o4200J12104j34817n8495k498J55399J02542q1158Q5211J39683
$$ plain form
6933 265548 185814 94753 271758 336507 353893 275525 340608 476933 457801 264466 402061
6922 402061 616253 586994 524735 466805 512025 726698 1160709 1373463 1692925 1886527
6912 1886527 2243291 2579031 3179871 3433502 3269060 2754593 2246361 1574842 1177980 1022568
6902 1022568 1034338 719155 738528 735433 584116 658666 656374 627535 292440 424269 254783
6891 254783 342407 402311 207416 12152 135936 147015 56497 118797 43617 -96289 160462
6880 160462 293109 197143 230410 129622 4067 -75124 -183915 18061 -95844 -55624
6870 -55624 103719 108645 -28042 -8989 62214 28156 -92063 -288130 -119942 64244 -74069
6859 -74069 -304287 -107462 59061 -229434 -59843 94323 -10298 -147349 -205519 -198032
$$ packed form
6933B65548p9734r1061J77005O4749J7386p8368O5083J36325j9132j93335J37595
6922D02061K14192k9259o2259n7930M5220K14673M34011K12754L19462J93602
6912A886527L56764L35740O00840K53631j64442n14467n08232o71519l96862j55412
6902A022568J1770l15183J9373l095j51317P4550k292k8839l35095J31829j69486
6891B54783Q7624N9904j94895j95264J23784J1079r0518O2300p5180j39906K56751
6880A60462J32647r5966L3267j00788j25555p9191j08791K01976j13905M0220
6870e5624J59343M926j36687J9053P1203l4058j20219j96067J68188J84186j38313
6859g4069k30218J96825J66523k88495J69591J54166j04621j37051n8170P487
$$ plain form
6849 -198032 -99125 -65944 -111620 -305717 -318808 -279952 -293824 -170642 -142260 -165025 -140654
6838 -140654 -24590 -41064 -256014 -268633 -236961 -238319 -261518 -329473 -264333 -418080 -416716
6827 -416716 -229695 -335617 -381039 -184805 -56220 -7809 93546 -87827 -53188 47654
6817 47654 -205747 -355238 -220786 -215947 -298404 -208683 -287098 -166962 -99498 -64151 22263
6806 22263 45907 23312 -126478 -98748 -1538 45085 -56021 -199436 -27414 -1194 -119339
6795 -119339 -38520 98036 -12463 7980 44505 60681 57081 85402 44625 -45639 -259026
6784 -259026 -229719 -297881 -79445 -136795 -186160 -29990 -132892 -70646 50818 57973 -5161
6773 -5161 -48224 -125804 -195686 -199332 -255759 -276360 -143969 -120339 -45959 42055 -83094 1835
$$ packed form
6849a98032R8907L3181m5676j94097j3091L8856j3872J23182K8382k2765K4371
6838a40654J16064j6474k14950j2619L1672j358k3199o7955O5140j53747J364
6827d16716J87021j05922m5422J96234J28585M8411J01355j81373L4639J00842
6817D7654k53401j49491J34452M839q2457Q9721p8415J20136O7464L5347Q6414
6806B2263K3644k2595j49790K7730R7210M6623j01106j43415J72022K6220j18145
6795a19339Q0819J36556j10499K0443L6525J6176l600K8321m0777r0264k13387
6784b59026K9307o8162K18436n7350m9365J56170j02902O2246J21464P155o3134
6773e161m3063p7580o9882l646n6427k0601J32391K3630P4380Q8014j25149Q4929
$$ plain form
6761 1835 60405 183183 181535 140594 215286 41771 -108568 -218587 -318532 -307978 -240275
6750 -240275 -131955 -156159 -162719 -147071 -175330 -70986 6590 -21033 -156901 -125934 -54902
6739 -54902 -126894 -174171 -145993 -103614 -100204 -192357 -256288 -320309 -382475 -188482 -90024 131158
6727 131158 141395 103451 12272 -113794 -128269 -196126 -170364 -133659 -248918 -265912 -31000
6716 -31000 224580 146617 87474 229457 -142079 -177824 143297 109755 -134738 -145967 -98892
6705 -98892 -261963 -258373 -79420 -175669 -35432 -83576 -243835 -73143 31360 66002 76265
6694 76265 -34002 -24190 -87729 16010 974 -121138 -124746 32478 -256994 -244837 -103132
6683 -103132 -107744 -173527 189 -103229 -269467 16701 40047 50433 -3793 -206815 -3846
$$ packed form
6761A835N8570J22778j648m0941P4692j73515j50339j10019r9945J0554O7703
6750b40275J08320k4204o560J5648k8259J04344P7576k7623j35868L0967P1032
6739e4902p1992m7277K8178M2379L410r2153o3931o4021o2166J93993R8458K21182
6727A31158J0237l7944r1179j26066j4475o7857K5762L6705j15259j6994K34912
6716c1000K55580p7963n9143J41983l71536l5745L21121l3542k44493j1229M7075
6705i8892j63071L590J78953r6249J40237m8144j60259J70692J04503L4642J0263
6694G6265j10267R812o3539J03739j5036j22112l608J57224k89472J2157J41705
6683a03132m612o5783J73716j03418j66238K86168K3346J0386n4226k03022K02969
$$ plain form
6672 -3846 13780 67114 323071 223896 -1364 139534 138984 -64084 -4077 82324 163115 83132
6660 83132 28101 29744 192737 172764 192377 202151 75066 9709 81485 82620 251237 288703
6648 288703 234780 183754 248531 213800 198689 260029 148278 55110 187852 339988 392307
6637 392307 470159 207378 -20368 17587 94455 140275 92973 66331 306362 476081 430175
6626 430175 331786 438016 365723 270268 312413 222965 488429 600258 434275 315734 379097
6615 379097 338470 261877 304805 302105 515589 407620 190146 185103 340238 329246 257307
6604 257307 123924 171407 284650 129462 216836 -28494 91931 375451 471992 563680
6594 563680 399181 531236 614297 418657 302846 235956 355449 392683 478607 560661 564065
$$ packed form
6672c846J7626N3334K55957r9175k25260J40898n50k03068O0007Q6401Q0791p9983
6660H3132n5031J643J62993j9973J9613R774j27085o5357P1776J135J68617L7466
6648B88703n3923n1026O4777l4731j5111O1340j11751r3168J32742J52136N2319
6637C92307P7852k62781k27746L7955P6868M5820m7302k6642K40031J69719m5906
6626D30175r8389J06230p2293r5455M2145q9448K65464J11829j65983j18541O3363
6615C79097m0627p6593M2928k700K13484j07969k17474n043J55135j0992p1939
6604B57307j33383M7483J13243j55188Q7374k45330J20425K83520R6541R1688
6594E63680j64499J32055Q3061j95640j15811o6890J19493L7234Q5924Q2054L404
$$ plain form
6583 564065 695668 617611 501979 330826 293560 420539 444676 524965 617974 499624 530869
6572 530869 438255 501762 512025 422932 443538 605754 494773 355299 404712 563834 844972
6561 844972 628968 732175 535520 367328 412657 482678 482263 625619 760252 843450 644430
6550 644430 519802 660085 924582 666813 705687 836750 953334 990417 733532 708943
6540 708943 856968 970044 861620 841999 985318 980830 899772 551192 593542 758686 712635
6529 712635 852882 987142 766908 599628 668708 857607 857625 784343 996074 979062 971833
6518 971833 1034969 1109991 941896 918284 887157 961191 898103 867939 978644 1007042 1010821
6507 1010821 1080820 1095339 1118866 900591 758760 910998 971123 1037430 949605 926921 932574
$$ packed form
6583E64065J31603p8057j15632j71153l7266J26979K4137Q0289R3009j18350L1245
6572E30869r2614O3507J0263q9093K0606J62216j10981j39474M9413J59122K81138
6561H44972k16004J03207j96655j68192M5329P0021m15J43356J34633Q3198j99020
6550F44430j24628J40283K64497k57769L8874J31063J16584L7083k56885k4589
6540G08943J48025J13076j08424j9621J43319m488q1058l48580M2350J65144m6051
6529G12635J40247J34260k20234j67280O9080J88899J8p3282K11731j7012p229
6518I71833O3136P5022j68095k3612l1127P4034o3088l0164J10705K8398L779
6507A010821O9999J4519K3527k18275j41831J52238O0125O6307q7825k2684N653
$$ plain form
6496 932574 863961 924599 938377 1069258 983984 1164148 1085518 1188610 1087871 943084 1002086
6485 1002086 972055 1045617 1155947 1154549 1085118 1090697 1068410 816809 772962 1087466 1026340
6474 1026340 1023190 1147479 1150200 1143196 1092578 1172336 1079002 1141091 1169691 1280511 1055355
6463 1055355 1051479 1093372 1231121 1259181 1272082 1356104 1303726 1372026 1483983 1617832 1386203
6452 1386203 1300626 1187369 1429553 1545818 1566378 1545911 1402688 1393659 1458223 1399202 1442674
6441 1442674 1401839 1253559 1163932 1048643 1210644 1359947 1191662 1279959 1368772 1353473
6431 1353473 1358972 1361639 1453436 1420124 1332053 1355250 1323279 1141258 1316156 1314516 1342048 1428482
6419 1428482 1319585 1275864 1195506 1078712 1295030 1466033 1317111 1364761 1363269 1355578 1269784
$$ packed form
6496I32574o8613O0638J3778J30881q5274J80164p8630J03092j00739j44787N9002
6485A002086l0031P3562J10330j398o9431N579k2287k51601m3847L14504o1126
6474A026340l150J24289K721p004n0618P9758r3334O2089K8600J10820k25156
6463A055355l876M1893J37749K8060J2901Q4022n2378O8300J11957J33849k31629
6452A386203q5577j13257K42184J16265K0560k0467j43223r029O4564n9021M3472
6441A442674m0835j48280q9627j15289J62001J49303j68285Q8297Q8813j5299
6431A353473N499K667R1797l3312q8071K3197l1971j82021J74898j640K7532Q6434
6419A428482j08897m3721q0358j16794K16318J71003j48922M7650j492p691q5794
$$ plain form
6408 1269784 1327789 1310560 1317248 1386598 1544310 1274050 1247959 1517662 1668340 1353639 1332885
6397 1332885 1178637 1191898 1323643 1253525 1432037 1342848 1280642 1177698 1313456 1236803
6387 1236803 1330343 1546131 1551974 1498660 1375868 1412774 1372539 1234396 1367868 1529634 1295341
6376 1295341 1214554 1439714 1469768 1524422 1450858 1374539 1347190 1317994 1445091 1423279 1405271
6365 1405271 1248890 1303423 1539519 1514740 1441408 1492305 1577689 1442846 1499007 1500336 1469368
6354 1469368 1588328 1539178 1392158 1344620 1324654 1500930 1538400 1491436 1366452 1169729
6344 1169729 1277101 1284359 1398039 1481965 1598786 1557049 1395843 1468414 1347095 1388774 1560230
6333 1560230 1377636 1257678 1342323 1279980 1191989 1335111 1436712 1449340 1470433 1491111 1308148
$$ packed form
6408A269784N8005j7229O688O9350J57712k70260k6091K69703J50678l14701k0754
6397A332885j54248J3261J31745p0118J78512q9189o2206j02944J35758p6653
6387A236803R3540K15788N843n3314j22792L6906m0235j38143J33472J61766k34293
6376A295341q0787K25160L0054N4654p3564p6319k7349k9196J27097k1812j8008
6365A405271j56381N4533K36096k4779p3332N0897Q5384j34843N6161J329l0968
6354A469368J18960m9150j47020m7538j9966J76276L7470m6964j24984j96723
6344A169729J07372P258J13680Q3926J16821m1737j61206P2571j21319M1679J71456
6333A560230j82594j19958Q4645o2343q7991J43122J01601J2628K1093K0678j82963
$$ plain form
6322 1308148 1337264 1420206 1349148 1258370 1340282 1150062 1147872 1372613 1416738 1239614 1115566
6311 1115566 1244761 1338726 1489067 1176793 1027575 1210841 1161686 1404796 1482613 1430559
6301 1430559 1482707 1501911 1534272 1338660 1294674 1357172 1336211 1304794 1314093 1311318 1525215
6290 1525215 1416960 1392646 1393017 1435643 1321879 1338986 1322249 1390875 1231888 1350653 1360317
6279 1360317 1191123 1241163 1245353 1377245 1375032 1535291 1566107 1421440 1192341 1286693 1366130
6268 1366130 1299294 1163021 1310351 1267615 1067201 1020728 1202529 1259071 1036038 1026154 939172
6257 939172 1013539 1229050 1328740 1112858 1140154 1034368 1174333 1225921 1304051 1375179 1021082
6246 1021082 1031969 973274 1100290 1122741 986969 909867 957905 910842 1024823 1038951 897455
$$ packed form
6322A308148K9116Q2942p1058r0778Q1912j90220k190K24741M4125j77124j24048
6311A115566J29195R3965J50341l12274j49218J83266m9155K43110P7817n2054
6301A430559N2148J9204L2361j95612m3986O2498k0961l1417R299k775K13897
6290A525215j08255k4314L71M2626j13764J7107j6737O8626j58987J18765R664
6279A360317j69194N0040M190J31892k213J60259L0816j44667k29099R4352P9437
6268A366130o6836j36273J47330m2736k00414m6473J81801N6542k23033r884q6982
6257I39172P4367K15511R9690k15882K7296j05786J39965N1588P8130P1128l54097
6246A021082J0887n8695J27016K2451j35772p7102M8038m7063J13981J4128j41496
$$ plain form
6235 897455 873664 1106319 1234783 881075 795927 844334 928752 949804 1062802 1072409 1024172
6224 1024172 1014629 828470 874730 959473 1054009 865271 854428 908750 1088251 1049193 1015022
6213 1015022 1082186 1087787 1157772 1033827 1017633 1206801 1121331 984489 1151910 1107301 994828
6202 994828 853506 677170 659940 776434 863886 1149504 1154305 997890 1011914 966320 870199
6191 870199 978233 818097 813924 891755 854242 934301 1067071 1203774 1150572 1017900 911112
6180 911112 806469 984466 955920 989566 1014796 1081429 1134908 931515 999424 977620 990046
6169 990046 951088 651498 543617 698870 765621 844711 839457 686050 719869 862930 803758
6158 803758 822439 797013 909254 798693 899657 803510 611629 548150 733707 808091 735665
$$ packed form
6235H97455k3791K32655J28464l53708q5148M8407Q4418K1052J12998R607m8237
6224A024172r543j86159M6260Q4743R4536j88738j0843N4322J79501l9058l4171
6213A015022O7164N601O9985j23945j6194J89168q5470j36842J67421m4609j12473
6202I94828j41322j76336j7230J16494Q7452K85618M801j56415J4024m5594r6121
6191H70199J08034j60136m173P7831l7513Q0059J32770J36703n3202j32672j06788
6180I11112j04643J77997k8546L3646K5230O6633N3479k03393O7909k1804J2426
6169I90046l8958k99590j07881J55253O6751P9090n254j53407L3819J43061n9172
6158H03758J8681k5426J12241j10561J00964r6147j91881o3479J85557P4384p2426
$$ plain form
6147 735665 833518 817308 903371 758719 905151 930764 817545 901253 1074466 910511 899166
6136 899166 853097 748439 699192 845281 710946 741857 843346 783868 915649 800281
6126 800281 810629 720556 612118 670554 744439 868247 944992 873029 851525 983084 890839
6115 890839 780855 851037 568533 628503 830683 819214 600783 607974 590200 708905 632180
6104 632180 659449 606578 833862 781847 759734 696291 557337 557940 575159 691336 764036
6093 764036 784483 642493 699109 701123 803777 719312 744692 909302 963949 780174 728741
6082 728741 752633 717327 826206 771949 670723 546361 669431 702343 567674 678392
6072 678392 701563 523173 444098 403317 425073 618620 615828 729400 737277 663596 714668
$$ packed form
6147G35665R7853j6210Q6063j44652J46432K5613j13219Q3708J73213j63955j1345
6136H99166m6069j04658m9247J46089j34335L0911J01489n9478J31781j15368
6126H00281J0348r0073j08438N8436P3885J23808P6745p1963k1504J31559r2245
6115H90839j09984P0182k82504N9970K02180j1469k18431P191j7774J18705p6725
6104F32180K7269n2871K27284n2015k2113o3443j38954O03J7219J16177P2700
6093G64036K0447j41990N6616K014J02654q4465K5380J64610N4647j83775n1433
6082G28741K3892l5306J08879n4257j01226j24362J23070L2912j34669J10718
6072F78392K3171j78390p9075m0781K1756J93547k792J13572P877p3681N1072
$$ plain form
6061 714668 703796 713137 663752 601854 653527 634910 704020 644442 712398 544742 828301
6050 828301 686453 628292 707348 415220 762327 632123 433551 702340 742549 674009
6040 674009 611068 507535 492043 623917 686155 627018 604513 485428 442215 546078 551310
6029 551310 754431 618808 549373 571130 540507 503267 589504 393865 371002 550347 480646
6018 480646 435335 498417 526076 591745 655697 630191 684872 533077 246251 292246 399849
6007 399849 394501 348627 383136 481437 467394 462893 260672 238772 271652 217633 260000 433574
5995 433574 358230 259740 265581 534941 576826 478939 247935 218763 109741 106041 280164
5984 280164 334745 217264 257745 276513 300435 323649 286351 427281 392156 379745 390361
$$ packed form
6061G14668j0872R341m9385o1898N1673j8617O9110n9578O7956j67656K83559
6050H28301j41848n8161P9056k92128L47107j30204j98572K68789M0209o8540
6040F74009o2941j03533j5492J31874O2238n9137k2505j19085m3213J03863N232
6029E51310K03121j35623o9435K1757l0623l7240Q6237j95639k2863J79345o9701
6018D80646m5311O3082K7659O5669O3952k5506N4681j51795k86826M5995J07603
6007C99849n348m5874L4509R8301j4043m501k02221k1900L2880n4019M2367J73574
5995D33574p5344r8490N841K69360M1885r7887k31004k9172j09022l700J74123
5984B80164N4581j17481M0481J8768K3922K3214l7298J40930l5125j2411J0616
$$ plain form
5973 390361 375622 254307 329540 467534 344695 286510 250946 525412 464509 201122 -68523
5962 -68523 5856 108616 93885 177897 306912 198588 118933 199034 201253 250642 179651
5951 179651 190502 175660 270320 290316 290427 187516 97874 -124020 17262 -82929 8912
5940 8912 205530 197559 -24754 9079 213574 172598 67495 138900 47160 35059 75721
5929 75721 77539 100536 -50912 19413 -2106 -34070 10621 126755 158210 175815 104949 144443
5917 144443 -21862 -30446 195057 277107 -37941 -50746 -21970 -249564 -96812 -104073 105495
5906 105495 129292 -17636 231501 304131 207481 -6068 -4784 181955 369137 309271 71769
5895 71769 14122 34048 -116896 -190081 -61803 -36865 -11842 -215724 -271303 -161495 -38316
$$ packed form
5973C90361j4739j21315P5233J37994j22839n8185l5564K74466o0903k63387k69645
5962f8523P4379J02760j4731Q4012J29015j08324p9655Q0101K219M9389p0991
5951A79651J0851j4842R4660J9996J11j02911q9642k21894J41282j00191R1841
5940H912J96618p971k22313L3833K04495m0976j05103P1405r1740j2101M0662
5929G5721J818K2997j51448P0325k1519l1964M4691J16134L1455J7605p0866L9494
5917A44443j66305q584K25503Q2050l15048j2805K8776k27594J52752p261K09568
5906A05495K3797j46928K49137P2630r6650k13549J284J86739J87182n9866k37502
5895G1769n7647J9926j50944p3185J28278K4938K5023k03882n5579J09808J23179
$$ plain form
5884 -38316 38131 -95745 28261 120663 -121668 -155260 -117375 -307910 -284438 -191356 -214285
5873 -214285 -91469 -211857 -217344 86941 70228 44253 -10951 69785 -87199 -213557 -350674
5862 -350674 -264009 -173177 -235714 -314004 -253024 -89748 -120288 -138011 -225865 -111004 -82574
5851 -82574 -224411 -478893 -541562 -440787 -167284 -294483 -327164 -249096 -217090 -263372 -340363
5840 -340363 -250544 -190981 -132141 -218650 -167219 -43186 -121865 -106774 -211307 -112242 -170483
5829 -170483 -188130 35080 49867 102122 -195549 -191072 -387863 -378269 -12101 -3553 73128
5818 73128 -268228 -346936 -305512 -352464 -240237 -177286 -98175 29001 92110 -50442 -91382
5807 -91382 -244998 -324881 -186666 -53157 -196292 -316318 -419391 -381530 -476754 -198516
$$ packed form
5884c8316P6447j33876J24006R2402k42331l3592L7885j90535K3472R3082k2929
5873b14285J22816j20388n487L04285j6713k5975n5204Q0736j56984j26358j37117
5862c50674Q6665R0832o2537p8290O0980J63276l0540j7723q7854J14861K8430
5851h2574j41837k54482o2669J00775K73503j27199l2681P8068L2006m6282p6991
5840c40363Q9819N9563N8840q6509N1431J24033p8679J5091j04533R9065n8241
5829a70483j7647K23210J4787N2255k97671M477j96791R594L66168Q548P6681
5818G3128l41356p8708M1424m6952J12227O2951P9111J27176O3109j42552m0940
5807i1382j53616p9883J38215J33509j43135j20026j03073L7861r5224K78238
$$ plain form
5797 -198516 -149280 -207721 -162972 -204519 -223338 -100143 -5260 -163279 -178187 -426853 -401351
5786 -401351 -374528 -415595 -365119 -343762 -413224 -316760 -247797 -401346 -298540 -352314 -631435
5775 -631435 -575187 -436263 -458963 -552787 -365046 -149521 -198421 -313470 -415443 -287629
5765 -287629 -262439 -339858 -360078 -231356 -237546 -368132 -356796 -280818 -197115 -149737 -57212
5754 -57212 -142257 -91810 -144349 -160805 -301569 -214115 -266237 -421342 -506649 -429788 -328464
5743 -328464 -55895 -231075 -384564 -326408 -484797 -437766 -318760 -168648 -261663 -359715
5733 -359715 -334284 -439017 -368537 -351704 -250947 -309403 -309595 -176155 -367729 -452688 -465379
5722 -465379 -393165 -276915 -263222 -348442 -481075 -500392 -311958 -415161 -483777 -433383 -406241
$$ packed form
5797a98516M9236n8441M4749m1547j8819J23195R4883j58019j4908k48666K5502
5786d01351K6823m1067N0476K1357o9462R6464O8963j53549J02806n3774k79121
5775f31435N6248J38924k2700r3824J87741K15525m8900j15049j01973J27814
5765b87629K5190p7419k0220J28722o190j30586J1336P5978Q3703M7378R2525
5754e7212q5045N0447n2539j6456j40764Q7454n2122j55105q5307P6861J01324
5743c28464K72569j75180j53489N8156j58389M7031J19006J50112r3015r8052
5733c59715K5431j04733P0480J6833J00757n8456j92J33440j91574q4959j2691
5722d65379P2214J16250J3693q5220j32633j9317J88434j03203o8616N0394K7142
$$ plain form
5711 -406241 -428650 -452256 -296415 -216549 -271394 -203325 -223697 -301107 -348501 -202043 -540768
5700 -540768 -382835 -141233 -357423 -377979 -412943 -306476 -220780 -201193 -208085 -354339 -233657
5689 -233657 -262814 -258611 -279817 -308004 -144314 -284257 -479507 -434288 -485854 -440134 -417871
5678 -417871 -285434 -357122 -355371 -604628 -545433 -369907 -461900 -483715 -218822 -224905 -478388
5667 -478388 -438493 -544429 -416866 -272712 -260894 -320220 -491806 -522708 -414103 -389522 -61113
5656 -61113 -18451 -125266 -231476 -293930 -536931 -310530 -195932 -199044 -66176 -236130 -322574
5645 -322574 -222576 -60806 -191548 -456911 -368120 -389975 -233886 -179535 -148394 -344956 -530492
5634 -530492 -334461 -168621 -57298 -158673 -259283 -213755 -167622 -207894 -158297 -8367
$$ packed form
5711d06241k2409k3606J55841P9866n4845O8069k0372p7410m7394J46458l38725
5700e40768J57933K41602k16190k0556l4964J06467Q5696J9587o892j46254J20682
5689b33657k9157M203k1206k8187J63690j39943j95250M5219n1566M5720K2263
5678d17871J32437p1688J751k49257N9195J75526r1993k1815K64893o083k53483
5667d78388L9895j05936J27563J44154J1818n9326j71586l0902J08605K4581L28409
5656f1113M2662j06815j06210o2454k43001K26401J14598l112J32868j69954q6444
5645c22574R9998J61770j30742k65363Q8791k1855J56089N4351L1141j96562j85536
5634e30492J96031J65840J11323j01375j00610M5528M6133m0272M9597J49930
$$ plain form
5624 -8367 -89376 -318984 -177278 -198192 -249562 -328437 -298595 -184744 -6557 -40966 -296396
5613 -296396 -364976 -208595 -70856 30506 -161337 -45486 -62551 -392064 -277060 -42265
5603 -42265 -52342 -119935 -95932 -68205 -89194 -77919 -162339 -58873 -247963 -315829 -187755
5592 -187755 -223746 -330762 -277336 -79932 -145774 -241918 -254319 -292302 -394093 -245718 -251113
5581 -251113 -247386 -446434 -408631 -347371 -123431 -201706 -163453 24934 -167634 -204636 -153003
5570 -153003 -195332 -233573 -286647 -82781 -40938 -102694 -239626 -277291 -293197 -219816 -254746
5559 -254746 -69884 -45268 24095 -73937 -192827 -321601 -323019 -247530 -152117 -16438 -250297
5548 -250297 -253655 -213702 -125882 -114543 -19237 -152622 -202656 -86243 -125393 -304905 -245114
$$ packed form
5624h367q1009k29608J41706k0914n1370p8875K9842J13851J78187l4409k55430
5613b96396o8580J56381J37739J01362j91843J15851j7065l29513J15004K34795
5603d2265j0077o7593K4003K7727k0989J1275q4420J03466j89090o7866J28074
5592a87755l5991j07016N3426J97404o5842r6144j2401l7983j01791J48375n395
5581b51113L727j99048L7803O1260K23940p8275L8253J88387j92568l7002N1633
5570a53003m2329l8241n3074K03866M1843o1756j36932l7665j5906P3381l4930
5559b54746J84862K4616O9363r8032j18890j28774j418P5489R5413J35679k33859
5548b50297l358L9953Q7820J1339R5306j33385n0034J16413l9150j79512N9791
$$ plain form
5537 -245114 -240387 -113818 -46703 -90036 -2090 -205792 -220713 -391241 -369931 -162200 -54343
5526 -54343 -101899 -406474 -413031 -205611 -138871 -183187 -34801 -38755 -144814 -130636 -129571 -208995
5514 -208995 -197833 43690 155524 106688 69858 49424 169681 149070 4291 75780 181367
5503 181367 155130 241836 90795 290813 78201 196090 64551 86584 117446 82085 -85404
5492 -85404 -59010 8159 133728 86850 29776 6814 -3709 252193 -153317 -103284 88693
5481 88693 134213 -130520 -215997 -203687 8660 162894 167612 90520 18048 -14118 20685
5470 20685 51411 -91273 -9972 55420 185788 209378 205540 225423 163390 57646 36250
5459 36250 31552 111897 177272 91645 211298 154306 98036 193241 -28085 70959 37930 21449
$$ packed form
5537b45114M727J26569O7115m3333Q7946k03702j4921j70528K1310K07731J07857
5526e4343m7556l04575o557K07420O6740m4316J48386l954j06059J4178J065p9424
5514b08995J1162K41523J11834m8836l6830k0434J20257k0611j44779P1489J05587
5503A81367k6237Q6706j51041K00018k12612J17889j31539K2033L0862l5361j67489
5492h5404K6394O7169J25569m6878n7074k2962j0523K55902m05510N0033J91977
5481H8693M5520k64733q5477J2310K12347J54234M718p7092p2472l2166L4803
5470B0685L0726j42684Q1301O5392J30368K3590l838J9883o2033j05744k1396
5459C6250m698Q0345O5375q5627J19653n6992n6270R5205k21326R9044l3029j6481
$$ plain form
5447 21449 100384 -60459 28672 -7188 139252 183523 87906 175988 234128 151682 114315
5436 114315 25276 230273 359321 219355 220211 352254 376559 203065 344017 386146 269073
5425 269073 176190 105417 115226 16073 46142 56837 97226 1538 172100 236034 87958
5414 87958 189868 127671 11362 155859 173912 -53435 -3945 271290 135644 302031
5404 302031 247407 110506 97821 165376 68934 21835 81575 196194 125598 165463 310559
5393 310559 368831 285796 293661 155977 154156 252169 47176 -22163 -82903 -29987 15456 102212
5381 102212 132594 210215 287792 303845 262165 215408 66860 -38735 -135857 12240 79574
5370 79574 151240 122894 76613 82061 284677 126085 1010 214172 139272 112699 190459
$$ packed form
5447B1449P8935j60843Q9131l5860J46440M4271r5617Q8082N8140q2446l7367
5436A14315q9039K04997J29048j39966Q56J32043K4305j73494J40952M2129j17073
5425B69073r2883p0773R809r9153L0069J0695M0389r5688J70562O3934j48076
5414H7958J01910o2197j16309J44497J8053k27347M9490K75235j35646J66387
5404C02031n4624j36901j2685O7555r6442m7099N9740J14619p0596L9865J45096
5393C10559N8272q3035P865j37684j821R8013k04993o9339o0740N2916M5443Q6756
5381A02212L0382P7621P7577J6053m1680m6757j48548j05595r7122J48097O7334
5370G9574P1666k8346m6281N448K02616j58592j25075K13162p4900k6573P7760
$$ plain form
5359 190459 182521 58682 254533 354072 190342 204381 162531 276391 136585 35256 66236
5348 66236 31673 24641 6633 33511 15319 -3254 161295 -31410 -60117 -48972 -74218 -18466
5336 -18466 21542 167719 154780 105329 56929 182679 198324 -11604 118393 179533 189743
5325 189743 135025 -97320 78298 250983 224015 318716 107027 157638 234321 125847 46330
5314 46330 -90009 59063 44887 186061 267501 80270 124297 125988 -11920 91754 178523
5303 178523 160995 140477 112964 -12857 -86701 -28694 225944 155167 75248 118411 161105
5292 161105 186645 124664 141075 139984 145953 222705 150226 249972 309326 118654 105190 -22691
5280 -22691 122320 201253 247147 322112 274791 314095 244579 13532 -37483 -17313 -68165
$$ packed form
5359A90459p938j23839J95851R9539j63730J4039m1850J13860j39806j01329L0980
5348F6236l4563p032j8008K6878j8192j8573J64549j92705k8707J1145k5246N5752
5336a8466M0008J46177j2939m9451m8400J25750J5645k09928J29997O1140J0210
5325A89743n4718k32345J75618J72685k6968R4701k11689N0611P6683j08474p9517
5314D6330j36339J49072j4176J41174Q1440j87231M4027J691j37908J03674Q6769
5303A78523j7528k0518k7513j25821p3844N8007K54638p0777p9919M3163M2694
5292A61105K5540o1981J6411j091N969P6752p2479R9746N9354j90672j3464j27881
5280b2691J45011P8933M5894P4965m7321L9304o9516k31047n1015K0170n0852
$$ plain form
5269 -68165 -230047 23436 169478 191434 230620 83833 -8439 -86736 35474 157606 -8740
5258 -8740 -17742 216360 389189 160697 63590 31402 81730 133846 149157 36422 -189389
5247 -189389 111055 -55994 72715 -661 8070 99534 -4088 -178154 106144 130330 300864
5236 300864 363021 211390 43296 -74926 -15049 56806 -81683 31071 86035 -11358 -28888
5225 -28888 -93495 -48076 -100615 160956 104436 40366 -19874 13881 -143256 -92206 2760
5214 2760 -77515 -49245 15063 -83082 -226913 -106359 -17998 55628 47357 144290 285023 98354
5202 98354 94205 92057 76028 33034 -27573 41298 81996 131752 115235 -67684 -108955 -38340
5190 -38340 -32662 -107350 -43184 -53860 44454 178929 157952 111680 -144826 -161258 -139412 -203948
$$ packed form
5269f8165j61882K53483J46042K1956L9186j46787r2272p8297J22210J22132j66346
5258h740r002K34102J72829k28492r7107l2188N0328N2116J5311j12735k25811
5247a89389L00444j67049J28709p3376Q731R1464j03622j74066K84298K4186J70534
5236C00864O2157j51631j68094j18222N9877P1855j38489J12754N4964r7393j7530
5225b8888o4607M5419n2539K61571n6520o4070o0240L3755j57137N1050R4966
5214B760q0275K8270O4308r8145j43831J20554Q8361P3626q271R6933J40733j86669
5202I8354m149k148j6029m2994o0607O8871M0698M9756j6517j82919m1271P0615
5190c8340N678p4688O4166j0676R8314J34475k0977m6272k56506j6432K1846o4536
$$ plain form
5178 -203948 -154641 -64903 -122810 -76777 37942 -56520 -16803 -60167 41382 47722 304538
5167 304538 237332 108656 24978 -4510 41101 -275014 -137211 -69154 -133975 -65916 2553
5156 2553 66725 -4847 41348 -1962 -11840 8008 2508 -29614 -45730 -51567 -80797 -163924 -49730
5143 -49730 38704 -16157 -104235 -186585 -22810 35478 -257955 -297943 -191152 -211229 -100321
5132 -100321 -152892 -58397 -204223 -154847 -124485 -87321 68744 -32044 -101907 117535 114110
5121 114110 -167788 -199782 -50735 -204484 -101509 78279 9976 86715 -36270 -99698
5111 -99698 -75849 -253284 -282473 -85457 -92666 -184284 -171038 -241582 -242096 -263199 -177574 -346076
5099 -346076 -273812 -141934 -165379 -124142 -179625 -188768 -275326 -27760 91298 38936 -95847
$$ packed form
5178b03948M9307Q9738n7907M6033J14719r4462L9717m3364J01549O340K56816
5167C04538o7206j28676q3678k9488M5611l16115J37803O8057o4821O8059O8469
5156B553O4172p1572M6195m3310r878J9848n500l2122j6116n837k9230q3127J14194
5143d9730Q8434n4861q8078q2350J63775N8288k93433l9988J06791k0077J10908
5132a00321n2571R4495j45826M9376L0362L7164J56065j00788o9863K19442l425
5121A14110k81898l1994J49047j53749J02975J79788o8303P6739j22985o3428
5111i9698K3849j77435k9189J97016p209r1618J3246p0544n14k1103Q5625j68502
5099c46076P2264J31878k3445M1237n5483r143q6558K47566J19058n2362j34783
$$ plain form
5088 -95847 -204515 -204651 -172942 -393166 -317883 -295940 -108644 -70800 -204916 -184327 -411605
5077 -411605 -155392 -195069 -142667 -290642 -219850 -64636 -181023 -151321 -114320 -14347 91895
5066 91895 -43110 -166381 -262224 -395512 -145475 -210826 -180885 -129826 -110591 -215719 -243747
5055 -243747 -178677 -294371 -289314 -159910 -275698 -483891 -320783 -131693 -111935 -212489
5045 -212489 -301969 -83169 -83707 -14658 -127207 -105857 -22979 -15811 3294 -257381 -145568
5034 -145568 13555 9517 -124658 -334132 -301071 -131567 80371 37461 -78849 52476
5024 52476 -73507 -135832 -146784 -246599 -266640 -224054 -186837 -110439 -124369 -153254 -169435 -280458
5012 -280458 -393498 -203320 -177939 -314908 -288286 -245729 -232570 -39785 20220 30969 19809
$$ packed form
5088i5847j08668j36L1709k20224P5283K1943J87296L7844j34116K0589k27278
5077d11605K56213l9677N2402j47975P0792J55214j16387K9702L7001R9973J06242
5066I1895j35005j23271r5843j33288K50037o5351K9941N1059J9235j05128k8028
5055b43747O5070j15694N057J29404j15788k08193J63108J89090J9758j00554
5045b12489q9480K18800n38O9049j12549K1350Q2878P168J9105k60675J11813
5034a45568J59123m038j34175k09474L3061J69504K11938m2910j16310J31325
5024E2476j25983o2325j0952r9815k0041M2586L7217P6398j3930k8885j6181j11023
5012b80458j13040J90178K5381j36969K6622M2557J3159J92785O0005J0749j1160
$$ plain form
5001 19809 -166540 -251111 -231215 12335 -109118 -310110 -220952 -281909 -241785 -245748 -223458
4990 -223458 -332044 -348068 -176809 -36985 -16297 -93382 -190676 -278325 -195703 -105456 -119959
4979 -119959 -235286 12271 -12720 -121328 -102599 -161819 -172431 -238892 -137766 -124264 -42563
4968 -42563 -53254 -64133 -243467 -259126 -110723 117299 -41820 -281747 -177970 -246737 -252772
4957 -252772 -207432 -63312 -164448 -216005 -296623 -207944 -116546 -15476 -86161 -1610 31010
4946 31010 -88274 -42219 -52936 -111669 -29843 -79408 -194895 -66816 24430 65186 42425
4935 42425 -88702 -60825 -107924 -366446 -147638 18573 -71336 -196370 -163492 -72646 -9371
4924 -9371 -214374 -148183 -44531 -193266 -88239 76643 -80185 -112265 -157682 -231842 -107165
$$ packed form
5001A9809j86349q4571J9896K43550j21453k00992Q9158o0957M0124l963K2290
4990b23458j08586j6024J71259J39824K0688p7085r7294q7649Q2622R0247j4503
4979a19959j15327K47557k4991j08608J8729n9220j0612o6461J01126J3502Q1701
4968d2563j0691j0879j79334j5659J48403K28022j59119k39927J03777o8767o035
4957b52772M5340J44120j01136n1557q0618Q8679R1398J01070p0685Q4551L2620
4946C1010j19284M6055j0717n8733Q1826m9565j15487J28079R1246M0756k2761
4935D2425j31127K7877m7099k58522K18808J66211q9909j25034L2878R0846O3275
4924i371k05003O6191J03652j48735J05027J64882j56828l2080m5417p4160J24677
$$ plain form
4913 -107165 -241854 -217580 -101359 -126217 -89016 -123611 -333439 -187582 -128413 -245753 -290241
4902 -290241 -139345 -145604 -263426 -23540 -155205 -113023 35521 -136294 -118284 -252307
4892 -252307 -226684 -146805 -275641 -309354 -142917 -94349 -79479 91792 -45839 -191743 -156453
4881 -156453 -258722 -217621 -194844 -193375 -271862 -110837 3451 -140025 -215849 9760 -84029
4870 -84029 -187014 19036 -209140 -179196 -245277 -284808 -100666 -120525 -130692 -109485 -195
4859 -195 -82488 -210827 -182078 -139974 -245743 29057 65018 -37737 -93030 36248 -72780
4848 -72780 2147 131537 15038 21727 44951 -211496 -355306 -108653 -125105 -147555 -105734
4837 -105734 131480 4122 118263 66555 -3227 68658 88355 -116256 -66995 -18409 12207
$$ packed form
4913a07165j34689K4274J16221k4858L7201l4595k09828J45857N9169j17340m4488
4902b90241J50896o259j17822K39886j31665M2182J48544j71815J8010j34023
4892b52307K5623P9879j28836l3713J66437M8568J4870J71271j37631j45904L5290
4881a56453j02269M1101K2777J469p8487J61025J14288j43476p5824K25609r3789
4870h4029j02985K06050k28176K9944o6081l9531J84142j9859j0167K1207J09290
4859a95q2293j28339K8749M2104j05769K74800L5961j02755n5293J29278j09028
4848g2780P4927J29390j16499O689K3224k56447j43810K46653j6452k2450M1821
4837a05734K37214j27358J14141n1708o9782P1885J9697k04611M9261M8586L0616
$$ plain form
4826 12207 199973 144373 -171752 -13296 -98988 -89718 -99414 -209659 106605 68067 -18460
4815 -18460 -48076 -214264 -104481 58068 84399 38061 73646 134899 72806 35647 52851
4804 52851 -149197 -159636 51580 21495 22663 91749 -51698 -73556 -64878 68962 -11690
4793 -11690 53108 44519 6666 155598 -49274 109815 132819 200946 -51700 117248 254705
4782 254705 -205567 -120923 92436 62592 198116 215876 -8895 53188 103755 -25124 -138849
4771 -138849 -36177 111022 102681 55245 -126070 -89136 -193743 104629 298277 195844
4761 195844 195271 224046 245223 192959 169216 259420 197666 46919 128072 159167 73345 309611
4749 309611 92279 49548 145540 125290 317511 255533 26683 -25471 104482 143735 199604
$$ packed form
4826A2207J87766n5600l16125J58456q5692R270r696j10245L16264l8538q6527
4815a8460k9616j66188J09783J62549K6331m6338L5585O1253o2093l7159J7204
4804E2851k02048j0439K11216l0085J168O9086j43447k1858Q678J33840q0652
4793a1690O4798q589l7853J48932k04872J59089K3004O8127k52646J68948J37457
4782B54705m60272Q4644K13359k9844J35524J7760k24771O2083N0567j28879j13725
4771a38849J02672J47199q341m7436j81315L6934j04607K98372J93648j02433
4761A95844n73K8775K1177n2264k3743R0204o1754j50747Q1153L1095q5822K36266
4749C09611k17332m2731R5992k0250J92221o1978k28850n2154J29953L9253N5869
$$ plain form
4738 199604 140101 308915 286366 214783 169693 316686 258720 152689 76178 134243 210888
4727 210888 154263 101066 93682 83199 299053 465003 340791 401592 153514 251460 324338
4716 324338 372562 247152 180084 297631 333843 325916 174972 321846 449930 473694 321678
4705 321678 503703 417397 385373 453597 398140 465628 419810 360335 146577 230431 99580
4694 99580 72707 321050 338545 500602 637643 552351 547165 413756 509321 596391 509549
4683 509549 474837 204362 173359 238982 417184 440385 180344 178022 -60022 41555 241911
4672 241911 382290 415889 405780 430432 389379 378696 364838 359880 399540 441789 385082 469403
4660 469403 365799 375932 405343 448489 489985 527529 464335 488660 549003 754371 494269
$$ packed form
4738A99604n9503J68814k2549p1583m5090J46993n7966j06031p6511N8065P6645
4727B10888n6625n3197p384j0483K15854J65950j24212O0801k48078R7946P2878
4716C24338M8224j25410o7068J17547L6212p927j50944J46874J28084K3764j52016
4705C21678J82025q6306l2024O8224n5457O7488m5818n9475k13758Q3854j30851
4694I9580k6873K48343J7495J62057J37041q5292n186j33409R5565Q7070q6842
4683E09549l4712k70475l1003O5623J78202K3201k60041k322k38044J01577K00356
4672B41911J40379L3599j0109K4652m1053j0683j3858m958L9660M2249n6707Q4321
4660D69403j03604J0133K9411M3146M1496L7544o3194K4325O0343K05368k60102
$$ plain form
4649 494269 635890 669781 382227 486455 504978 601396 529445 623861 769989 798762 581757
4638 581757 501897 607831 606028 710617 756677 683938 651585 539630 628256 659400 613621
4627 613621 700899 744846 663638 551718 420669 624609 804804 742687 718728 753334 818297
4616 818297 712796 971233 972309 798713 683829 677861 763395 585038 650955 591248 611899
4605 611899 489491 509020 715713 703218 586814 502397 787117 927521 767087 771164 922415
4594 922415 865883 898052 698572 701512 922392 849620 930792 951466 980546 1161054 1038449
4583 1038449 899758 809686 678229 942964 864453 748712 983486 1172590 1001480 905686
4573 905686 986771 867964 884107 978114 936827 971302 876025 910748 962333 1025953 1179192
$$ packed form
4649D94269J41621L3891k87554J04228J8523R6418p1951R4416J46128K8773k17005
4638E81757p9860J05934j803J04589M6060p2739l2353j11955Q8626L1144m5779
4627F13621Q7278M3947q1208j11920j31049K03940J80195o2117k3959L4606O4963
4616H18297j05501K58437J076j73596j14884n968Q5534j78357O5917n9707K0651
4605F11899j22408J9529K06693j2495j16404q4417K84720J40404j60434M077J51251
4594I22415n6532L2169j99480K940K20880p2772Q1172K0674K9080J80508j22605
4583A038449j38691r0072j31457K64735p8511j15741K34774J89104j71110r5794
4573I05686Q1085j18807J6143R4007m1287L4475r5277L4723N1585O3620J53239
$$ plain form
4562 1179192 1178291 1205695 1234376 1198954 1120909 1160036 1103200 1143539 1314114 1536830 1337896
4551 1337896 1356551 1326748 1408214 1289843 1186724 1369074 1327508 1537905 1522182 1525802 1413978
4540 1413978 1384634 1389239 1186376 1446633 1576261 1644790 1547576 1568241 1688575 1724211 1737747
4529 1737747 1620439 1737857 1723857 1594945 1609420 1543672 1674298 1661869 1555623 1625864
4519 1625864 1778256 1844749 1794804 1719536 1798707 1898801 1826532 1966448 2127909 2031899 2179916
4508 2179916 2146593 2082812 2267768 2132831 2020142 2190239 2254351 2321235 2497373 2609077
4498 2609077 2505832 2576334 2770065 2869531 2844193 2810014 2880365 3094136 3326340 3207593
4488 3207593 3279933 3457540 3632249 3471401 3537525 3397216 3447309 3514066 3447885 3288109
$$ packed form
4562A179192r01K7404K8681l5422p8045L9127n6836M0339J70575K22716j98934
4551A337896J8655k9803Q1466j18371j03119J82350m1566K10397j5723L620j11824
4540A413978k9344M605k02863K60257J29628O8529r7214K0665J20334L5636J3536
4529A737747j17308J17418j4000j28912J4475o5748J30626j2429j06246P0241
4519A625864J52392O6493m9945p5268P9171J00094p2269J39916J61461r6010J48017
4508B179916l3323o3781J84956j34937j12689J70097O4112O6884J76138J11704
4498B609077j03245P0502J93731R9466k5338l4179P0351K13771K32204j18747
4488C207593P2340J77607J74709j60848O6124j40309N0093O6757o6181j59776
$$ plain form
4478 3288109 3309544 3185382 3209294 3035078 3057447 3111049 3145291 3144779 3044365 3000092 3181772
4467 3181772 3201364 3056026 2980373 2938681 3084008 3094125 3176734 2990419 2921608 2936612 3054339
4456 3054339 3204178 2986320 2987076 2854845 2855942 2869926 2929505 3030284 3041561 3298490 3403631
4445 3403631 3415229 3226741 3046648 3234732 3466400 3307862 2994654 2880058 3183868 3280759
4435 3280759 3298997 3299183 3306817 3453823 3416754 3173836 3207275 3375071 3336418 3385115 3669782
4424 3669782 3441216 3418233 3583859 3733338 3626352 3570375 3643885 3700430 3495105 3549659
4414 3549659 3535806 3641805 3681125 3787778 3839869 3830670 3887867 3862447 3768830 3836037 4049864
4403 4049864 4083169 3983144 4025701 4140257 4122965 4354746 4437096 4424977 4274510 4350251 4501396
$$ packed form
4478C288109K1435j24162K3912j74216K2369N3602L4242n12j00414m4273J81680
4467C181772J9592j45338p5653m1692J45327J0117Q2609j86315o8811J5004J17727
4456C054339J49839k17858P56j32231J097J3984N9579J00779J1277K56929J05141
4445C403631J1598j88488j80093J88084K31668j58538l13208j14596L03810R6891
4435C280759J8238J86P634J47006l7069k42918L3439J67796l8653M8697K84667
4424C669782k28566k2983J65626J49479j06986n5977P3510N6545k05325N4554
4414C549659j3853J05999L9320J06653N2091r199N7197k5420r3617O7207K13827
4403D049864L3305j00025M2557J14556j7292K31781Q2350j2119j50467P5741J51145
$$ plain form
4392 4501396 4482364 4523227 4656247 4554479 4646020 4740322 4921259 4915125 4855901 4836427 4945702
4381 4945702 4998550 4860907 5020004 4869091 4850695 5014862 5216046 5298435 5252418 5273949
4371 5273949 5288288 5340847 5461455 5608186 5634741 5658402 5904367 6203405 6322959 6341372
4361 6341372 6187457 6354260 6212546 6183632 6398155 6227039 6294928 6559391 6504628 6573140
4351 6573140 6888397 6789368 6827501 6813049 6863013 6846625 6876818 6958180 6952011 7090743 7128720
4340 7128720 7035319 7091316 7254388 7345286 7294357 7403147 7457134 7620333 7708745 7858493 7985063
4329 7985063 7982606 8072034 8198316 8356796 8270745 8446415 8459106 8729141 8893087 9074866
4319 9074866 9126351 9137185 9220177 9286484 9546473 9762291 9639892 9955078 10266895 10372709
$$ packed form
4392D501396j9032M0863J33020j01768R1541R4302J80937o134n9224j9474J09275
4381D945702N2848j37643J59097j50913j8396J64167K01184Q2389m6017K1531
4371E273949J4339N2559J20608J46731K6555K3661K45965K99038J19554J8413
4361F341372j53915J66803j41714k8914K14523j71116O7889K64463n4763O8512
4351F573140L15257r9029L8133j4452M9964j6388L0193Q1362o169J38732L7977
4340G128720r3401N5997J63072R0898n0929J08790N3987J63199Q8412J49748J26570
4329G985063k457Q9428J26282J58480q6051J75670J2691K70035J63946J81779
4319I074866N1485J0834Q2992O6307K59989K15818j22399L15186L11817J05814
$$ plain form
4309 10372709 10578370 10706470 10735053 10843319 11088435 11308247 11231908 11367948 11589910 11766471
4299 11766471 11947846 12234700 12266312 12343448 12846871 12940687 13236353 13085979 13295788 13875668
4289 13875668 14087628 14353007 14638053 14863533 15236624 15713775 15928141 16065284 16336688
4280 16336688 16647261 17135335 17367338 17727946 18158369 18545693 18803607 19249732 19643633
4271 19643633 20128202 20275043 20456703 21008995 21400451 21954521 22261806 22778730 23061174
4262 23061174 23287748 23934627 24318854 24850575 25735955 26314946 26979141 27495333 27966712
4253 27966712 28537988 29134325 29884276 30603759 31262619 32001026 32936347 33662073 34435339
4244 34435339 35320894 36356396 37422920 38222891 39092223 40107239 41052576 42262172 43615547
$$ packed form
4309A0372709K05661J28100K8583J08266K45116K19812p6339J36040K21962J76561
4299A1766471J81375K86854L1612P7136N03423R3816K95666j50374K09809N79880
4289A3875668K11960K65379K85046K25480L73091M77151K14366J37143K71404
4280A6336688L10573M88074K32003L60608M30423L87324K57914M46125L93901
4271A9643633M84569J46841J81660N52292L91456N54070L07285N16924K82444
4262B3061174K26574O46879L84227N31721Q85380N78991O64195N16192M71379
4253B7966712N71276N96337P49951P19483O58860P38407R35321P25726P73266
4244C4435339Q85555J035502J066524P99971Q69332J015016R45337J209596J353375
$$ plain form
4235 43615547 44902646 46109700 47379766 48786850 50277248 51925108 53601691 55439118
4227 55439118 57382451 59495798 61620255 63850980 65978046 68421974 71308183 74478863
4219 74478863 77240255 80346319 83774482 87337503 91036903 94986183 99419218 103985604
4211 103985604 108990201 114265849 120104648 126343817 133069745 140392547 147941983 156270794
4203 156270794 165351511 175063444 185129412 195555601 206706090 217920442 229216200
4196 229216200 240427955 250702918 259587870 266919137 271938244 274558265 274255259 271027997
4188 271027997 265256797 256973701 247178602 236444149 224895136 212953475 201141980
4181 201141980 190061276 179348291 169264449 159934712 151194587 143019674 135404123 128542223
$$ packed form
4235D3615547J287099J207054J270066J407084J490398J647860J676583J837427
4227E5439118J943333K113347K124457K230725K127066K443928K886209L170680
4219G4478863K761392L106064L428163L563021L699400L949280M433035M566386
4211A03985604N004597N275648N838799O239169O725928P322802P549436Q328811
4203A56270794R080717R711933J0065968J0426189J1150489J1214352J1295758
4196B29216200J1211755J0274963Q884952P331267N019107K620021l03006l227262
4188B71027997n771200q283096r795099j0734453j1549013j1941661j1811495
4181B01141980j1080704j0712985j0083842r329737q740125q174913p615551o861900
$$ plain form
4173 128542223 122119460 116353041 110913347 105961012 101308261 96990476 92975469 89264840
4165 89264840 85947070 82865073 79705287 76819883 74097393 71641026 69460176 67158414
4157 67158414 65187828 63327484 61596952 59977847 58380517 56966786 55693315 54155276
4149 54155276 52977195 51894357 50924271 50049455 49131132 48218684 47519556 46696503 45859403
4140 45859403 45318022 44859905 44157842 43773782 43074868 42442764 41921264 41530525 41181392
4131 41181392 40647907 40153500 40056277 39780350 39286382 39127260 38733391 38236719 37912507 37694981
4121 37694981 37237312 37039304 36866821 36558480 36103024 35758155 35530536 35231082 34983062
4112 34983062 34398266 34021851 33809085 33548641 33021026 32472065 32134869 31661690 31372988
$$ packed form
4173A28542223o422763n766419n439694m952335m652751m317785m015007l710629
4165H9264840l317770l081997l159786k885404k722490k456367k180850k301762
4157F7158414j970586j860344j730532j619105j597330j413731j273471j538039
4149E4155276j178081j082838r70086q74816r18323r12448o99128q23053q37100
4140D5859403n41381m58117p02063l84060o98914o32104n21500l90739l49133
4131D1181392n33485m94407r7223k75927m93968j59122l93869m96672l24212k17526
4121C7694981m57669j98008j72483l08341m55456l44869k27619k99454k48020
4112C4983062n84796l76415k12766k60444n27615n48961l37196m73179k88702
$$ plain form
4103 31372988 31141754 30798882 30291317 29676491 29301136 28870082 28423151 28218483 27790213
4094 27790213 27374122 27055928 26502974 26278448 25984110 25688193 25437290 24862764 24677837
4085 24677837 24456385 24206532 23772997 23761046 23447198 23244027 22940113 22675772 22315170 22154045
4075 22154045 22320751 22315266 21995154 21746512 21521399 21292099 20664757 20411296 20197625 19942214
4065 19942214 19656831 19263014 19127872 19131117 19021243 18925378 18852868 18670473 18475090 18180874
4055 18180874 18101353 18167445 18089601 17819775 17776057 17541270 17317191 17371536 17431402 17040822
4045 17040822 16813814 16667054 16734393 16613167 16440517 16462310 16501769 16252003 16384017 16334230
4035 16334230 16269118 16211662 16227862 16336273 16073887 15881352 15826875 15537475 15570391 15604214
$$ packed form
4103C1372988k31234l42872n07565o14826l75355m31054m46931k04668m28270
4094B7790213m16091l18194n52954k24526k94338k95917k50903n74526j84927
4085B4677837k21452k49853m33535j1951l13848k03171l03914k64341l60602j61125
4075B2154045J66706n485l20112k48642k25113k29300o27342k53461k13671k55411
4065A9942214k85383l93817j35142L245j09874r5865p2510j82395j95383k94216
4055A8180874p9521O6092p7844k69826m3718k34787k24079N4345N9866l90580
4045A7040822k27008j46760O7339j21226j72650K1793L9459k49766J32014m9787
4035A6334230o5112n7456J6200J08411k62386j92535n4477k89400L2916L3823
$$ plain form
4025 15604214 15683948 15852115 15570166 15483264 15328013 15369338 15375436 15286182 15223716 15338322 15328338
4014 15328338 15365950 15504114 15435242 15633745 15729960 15629353 15328132 15258433 15484585 15444733
4004 15444733 15277272 15239822 15383133 15304609 15127819 15180884 15340012 15270505 15056912 15217932
3994 15217932 15399015 15358602 15353385 15536429 15500388 15447344 15517612 15536831 15498041 15472696 15630124
3983 15630124 15742488 15749028 15629832 15403868 15679095 15857798 15846007 15627469 15504199 15612228
3973 15612228 15658124 15632999 15609198 15622770 15631685 15805533 15938798 15900603 15988107 15985874 15885976
3962 15885976 16003009 16019278 16110498 16116138 16379846 16179858 16255665 16160631 16084143 16155189 16168042
3951 16168042 16217831 16237758 16282421 16024064 16252167 16249895 16174330 16184751 16151249 16074951 16028848
$$ packed form
4025A5604214P9734J68167k81949q6902j55251M1325O098q9254o2466J14606r984
4014A5328338L7612J38164o8872J98503R6215j00607l01221o9699K26152l9852
4004A5444733j67461l7450J43311p8524j76790N3065J59128o9507k13593J61020
3994A5217932J81083m0413n217J83044l6041n3044P0268J9219l8790k5345J57428
3983A5630124J12364O540j19196k25964K75227J78703j1791k18538j23270J08029
3973A5612228M5896k5125k3801J3572Q915J73848J33265l8195Q7504k233r9898
3962A5885976J17033J6269R1220N640K63708j99988P5807r5034p6488P1046J2853
3951A6168042M9789J9927M4663k58357K28103k272p5565J0421l3502p6298m6103
$$ plain form
3940 16028848 16085498 16124014 16265555 16274892 16342439 16214979 16350426 16455684 16179607 16414179
3930 16414179 16623083 16728812 16772708 16515822 16372679 16577786 16770677 16756551 16650822 16669141
3920 16669141 16670958 16814195 16993215 17051326 17047479 17055529 17054165 16889911 16830996 16973568 17037515
3909 17037515 17085768 17061745 17175406 17350274 17114889 17304669 17403857 17325092 17508774 17402405
3899 17402405 17355276 17377430 17623593 17689405 17629955 17761297 17833696 17830914 17651238 17672075 17717844
3888 17717844 17618368 17633691 17624442 17505332 17292511 17308778 17502017 17255955 17074555 16981564
3878 16981564 17014141 17108118 16855784 16837478 16822599 16709479 16609021 16587218 16458764 16206655
3868 16206655 16287391 16452667 16321466 16056411 16120874 15919453 15820150 15711511 15840639 15937621
$$ packed form
3940A6028848N6650L8516J41541R337O7547j27460J35447J05258k76077K34572
3930A6414179K08904J05729M3896k56886j43143K05107J92891j4126j05729J8319
3920A6669141J817J43237J79020N8111l847Q050j364j64254n8915J42572O3947
3909A7037515M8253k4023J13661J74868k35385J89780R9188p8765J83682j06369
3899A7402405m7129K2154K46163O5812n9450J31342P2399k782j79676K0837M5769
3888A7717844r9476J5323r249j19110k12821J6267J93239k46062j81400r2991
3878A6981564L2577R3977k52334j8306j4879j13120j00458k1803j28454k52109
3868A6206655Q0736J65276j31201k65055O4463k01421r9303j08639J29128R6982
$$ plain form
3858 15937621 15928788 16008555 16139182 16014922 16029827 16053281 15896147 15883125 15820834 15745790 15595850
3847 15595850 15653388 15654160 15665763 15555184 15533082 15617509 15615898 15676460 15562266 15305721 15177639
3836 15177639 15112698 15246229 15250646 15069769 15018717 15062758 15244657 15310591 15050861 14949293
3826 14949293 14634194 14649082 14902577 14883492 14730079 14791973 14651264 14703660 14727114 14672636
3816 14672636 14583639 14518552 14396882 14377413 14412752 14588207 14519058 14401307 14470500 14438501 14429448
3805 14429448 14459196 14239679 14126001 14141287 14231235 14273421 14069392 14142636 14008346 14074750
3795 14074750 14006862 14097913 14173864 14030929 13972082 13920431 13956403 13854581 13964711 14054328 13813254
3784 13813254 14020443 14149180 14143316 14044907 13784207 13643798 13915784 13771173 13647928 13622143
$$ packed form
3858A5937621q833P9767J30627j24260J4905K3454j57134j3022o2291p5044j49940
3847A5595850N7538P72J1603j10579k2102Q4427j611O0562j14194k56545j28082
3836A5177639o4941J33531M417j80877n1052M4041J81899O5934k59730j01568
3826A4949293l15099J4888K53495j9085j53413O1894j40709N2396K3454n4478
3816A4672636q8997o5087j21670j9469L5339J75455o9149j17751O9193l1999r053
3805A4429448K9748k19517j13678J5286Q9948M2186k04029P3244j34290O6404
3795A4074750o7888R1051P5951j42935n8847n1651L5972j01822J10130Q9617k41074
3784A3813254K07189J28737n864r8409k60700j40409K71986j44611j23245k5785
$$ plain form
3774 13622143 13688448 13639600 13603729 13721893 13657253 13562125 13687314 13926264 13831903 13467444
3764 13467444 13353975 13426194 13598020 13664309 13527812 13605387 13689483 13522451 13345254 13485165
3754 13485165 13498138 13346293 13479046 13337290 13129639 13282557 13280242 13359633 13280837 13162240
3744 13162240 13389019 13178416 13101949 13105532 13326781 13390095 13255268 13116216 12995349 13005435
3734 13005435 13089191 13003388 12946495 12854301 12924147 12946421 12855891 13186084 13248347 13223428 12984848
3723 12984848 13103954 13049368 13005935 12883094 12845079 12753805 12758811 12748389 12803984 12884529 12943262
3712 12943262 12824442 12693621 12625694 12669609 12639068 12422894 12398016 12439139 12487871 12672227
3702 12672227 12626385 12647367 12477090 12378925 12415514 12312036 12276235 12288422 12189487 12139043 12392120
$$ packed form
3774A3622143O6305m8848l5871J18164o4640r5128J25189K38950r4361l64459
3764A3467444j13469P2219J71826O6289j36497P7575Q4096j67032j77197J39911
3754A3485165J2973j51845J32753j41756k07651J52918k315P9391p8796j18597
3744A3162240K26779k10603p6467L583K21249O3314j34827j39052j20867J0086
3734A3005435Q3756q5803n6893r2194O9846K2274r0530L30193O2263k4919k38580
3723A2984848J19106n4586m3433j22841l8015r1274N006j0422N5595Q0545N8733
3712A2943262j18820j30821o7927M3915l0541k16174k4878M1123M8732J84356
3702A2672227m5842K0982j70277r8165L6589j03478l5801J2187r8935n0444K53077
$$ plain form
3691 12392120 12356907 12267618 12230259 12131039 12120828 12201027 12235650 11859674 11761750 11885251 11841456
3680 11841456 12028269 11921879 11909281 12021809 11951124 11875178 11924982 12059597 12022531 11876194
3670 11876194 11976687 11975387 12046729 11810180 11709676 11600708 11480732 11594442 11511423 11471991
3660 11471991 11519039 11547843 11545292 11303072 11295272 11152464 11158798 11227383 11369879 11175208 11132250
3649 11132250 11175522 11282940 11186452 10971113 11297275 11361123 11400540 11249722 11062369 11066241
3639 11066241 11033485 10911516 11035491 10897161 10815636 10915607 10916435 10864573 10938015 10770513 11005267
3628 11005267 11084431 11056727 10957068 10866542 10710926 10574949 10660063 10865463 10731860 10639115
3618 10639115 10721465 10798974 10696258 10538789 10512688 10552573 10630939 10707596 10636124 10450233 10459422
$$ packed form
3691A2392120l5213q9289l7359r9220j0211Q0199L4623l75976r7924J23501m3795
3680A1841456J86813j06390j2598J12528p0685p5946M9804J34615l7066j46337
3670A1876194J00493j300P1342k36549j00504j08968j19976J13710q3019l9432
3660A1471991M7048K8804k551k42220p800j42808O334O8585J42496j94671m2958
3649A1132250M3272J07418r6488k15339L26162O3848L9417j50818j87353L872
3639A1066241l2756j21969J23975j38330q1525R9971Q28n1862P3442j67502K34754
3628A1005267P9164k7704r9659r0526j55616j35977Q5114K05400j33603r2745
3618A0639115Q2350P7509j02716j57469k6101L9885P8366P6657p1472j85891R189
$$ plain form
3607 10459422 10424651 10428302 10394245 10393531 10280365 10209581 10319516 10291555 10133105 10217416 9891977
3596 9891977 9895957 10076455 9903976 9665786 9641691 9907063 9921809 9846928 9748862 9671252 9600988
3585 9600988 9501408 9698508 9779717 9590810 9286099 9189448 9227364 9256291 9327737 9289575 9183269
3574 9183269 9179655 8966640 8997151 9039157 8994172 8984180 9104727 9067171 9097475 9048969 8961171
3563 8961171 8986917 9164952 9131636 8793844 8744610 8890291 8881330 8730021 8600999 8535230 8570046
3552 8570046 8611466 8518445 8619480 8566703 8326391 8317993 8423913 8366439 8360130 8474249 8388806
3541 8388806 8226352 8142466 8251106 8244502 8239715 7822582 7964652 8144158 7911421 7864419 7727513
3530 7727513 7759856 7862917 7990429 7970571 7921304 7839632 7673467 7721770 7632422 7696896 7902074
$$ packed form
3607A0459422l4771L651l4057p14j13166p0784J09935k7961j58450Q4311l25439
3596I891977L980J80498j72479k38190k4095K65372J4746p4881r8066p7610p0264
3585I600988r9580J97100Q1209j88907l04711r6651L7916K8927P1446l8162j06306
3574I183269l614k13015L0511M2006m4985r992J20547l7556L0304m8506q7798
3563H961171K5746J78035l3316l37792m9234J45681q961j51309j29022o5769L4816
3552H570046M1420r3021J01035n2777k40312q398J05920n7474o309J14119q5443
3541H388806j62454q3886J08640o604m787m17133J42070J79506k32737m7002j36906
3530G727513L2343J03061J27512j9858m9267q1672j66165M8303q9348O4474K05178
$$ plain form
3519 7902074 7819855 7499241 7434921 7418901 7544057 7647768 7558296 7643200 7628229 7502808 7745469
3508 7745469 7694418 7539360 7364245 7372374 7456305 7487483 7686876 7500070 7476132 7465263 7436756
3497 7436756 7477842 7530072 7572726 7492964 7365713 7314860 7429617 7329730 7247886 7282103 7257430
3486 7257430 7392367 7595545 7618307 7564383 7275438 7301914 7470829 7610617 7429108 7549258
3476 7549258 7738256 7609465 7612556 7596140 7530798 7538754 7620444 7547380 7344140 7142574 7098662
3465 7098662 6976985 7025568 7201064 7240247 7249243 7169542 7218372 7214082 6946694 6875575 6882610
3454 6882610 7042104 7183790 7179500 7257581 7526655 7350611 7543183 7545224 7410438 7424912 7723221
3443 7723221 7753455 7625598 7416322 7342349 7426628 7278840 7151561 6976130 6946744 6820955
$$ packed form
3519G902074q2219l20614o4320j6020J25156J03711q9472Q4904j4971j25421K42661
3508G745469n1051j55058j75115Q129Q3931L1178J99393j86806k3938j0869k8507
3497G436756M1086N2230M2654p9762j27251n0853J14757r9887q1844L4217k4673
3486G257430J34937K03178K2762n3924k88945K6476J68915J39788j81509J20150
3476G549258J88998j28791L091j6416o5342P956Q1690p3064k03240k01566m3912
3465G098662j21677M8583J75496L9183Q996p9701M8830m290k67388p1119P035
3454F882610J59494J41686m290P8081K69074j76044J92572K041j34786J4474K98309
3443G723221L0234j27857k09276p3973Q4279j47788j27279j75431k9386j25789
$$ plain form
3433 6820955 6790913 6805016 6809807 6892502 6862441 6813777 7010253 6965232 7085423 7067949 7016823
3422 7016823 6933088 6914189 6927836 6820507 6770375 6761407 6691128 6602462 6629440 6652284 6636578
3411 6636578 6666230 6595875 6538036 6383914 6202998 6259648 6162862 6070709 6183051 6183960 6234303
3400 6234303 6226539 6151625 6236058 6196297 5993560 5773632 6023364 5786198 5826921 6028712 6001018
3389 6001018 5949819 5768240 5693032 5854876 5960981 5883764 5927311 5846884 5891750 5837178 5796111
3378 5796111 5934171 5976923 5908708 5911763 5907285 5851706 6058433 6301066 6134323 6213671 6264171
3367 6264171 6159016 6141503 6346732 6395675 6232473 6088609 6106178 6189369 6233670 6265457 6263484
3356 6263484 6486669 6561127 6422576 6351484 6275055 6251567 6301682 6339085 6217769 6299428 6276569
$$ packed form
3433F820955l0042J4103M791Q2695l0061m8664J96476m5021J20191j7474n1126
3422G016823q3735j8899J3647j07329n0132q968p0279q8666K6978K2844j5706
3411F636578K9652p0355n7839j54122j80916N6650r6786r2153J12342R09N0343
3400F234303p764p4914Q4433l9761k02737k19928K49732k37166M0723K01791k7694
3389F001018n1199j81579p5208J61844J06105p7217M3547q0427M4866n4572m1067
3378E796111J38060M2752o8215L055m478n5579K06727K42633j66743P9348N0500
3367F264171j05155j7513K05229M8943j63202j43864J7569Q3191M4301L1787j973
3356F263484K23185P4458j38551p1092p6429k3488N0115L7403j21316Q1659k2859
$$ plain form
3345 6276569 6360281 6308484 6349755 6321672 6088587 5946086 5958342 6086886 5977962 5935064 6054738
3334 6054738 6191375 6071517 6095079 6063768 6009061 5991879 6015948 6188757 6298782 6127438
3324 6127438 6195344 6430834 6415954 6196275 6359607 6503412 6505298 6601159 6642855 6645670 6492347
3313 6492347 6601746 6898993 6950623 7000325 7061063 7044630 7049890 6984960 7001998 7064310 7268621
3302 7268621 7172737 7106976 7235413 7309248 7437057 7384344 7500282 7621264 7353751 7215991
3292 7215991 7164908 7248864 7279632 7311547 7471672 7412476 7456293 7557199 7583154 7415576 7413857
3281 7413857 7537297 7645640 7801218 7771764 7803465 7909679 7942569 8219678 8391284 8497287
3271 8497287 8496355 8672601 8837080 8817393 8890241 8971554 8936677 9031108 9017900 9140397 9298795
$$ packed form
3345F276569Q3712n1797M1271k8083k33085j42501J2256J28544j08924m2898J19674
3334F054738J36637j19858K3562l1311n4707j7182K4069J72809J10025j71344
3324F127438O7906K35490j4880k19679J63332J43805J886R5861M1696K815j53323
3313F492347J09399K97247N1630M9702O0738j6433N260o4930J7038O2312K04311
3302G268621r5884o5761J28437P3835J27809n2713J15938J20982k67513j37760
3292G215991n1083Q3956L0768L1915J60125n9196M3817J00906K5955j67578j719
3281G413857J23440J08343J55578k9454L1701J06214L2890K77109J71606J06003
3271H497287r32J76246J64479j9687P2848Q1313l4877R4431j3208J22497J58398
$$ plain form
3260 9298795 9475438 9658678 9728690 9889325 10151950 10530609 10796827 11287254 11661715 11805734
3250 11805734 11860637 12084398 12206338 12510599 13120200 13584615 14366424 15068079 15899886 16493519
3240 16493519 16058357 15117218 13798153 12549905 11541681 10818782 10435000 10041314 9654219
3231 9654219 9403049 9234668 8939801 8814096 8720946 8407566 8321672 8248631 7831848 7654780
3221 7654780 7597813 7410690 7128842 7076142 7148614 6942782 6983997 6841058 6823611 6784971 6808475
3210 6808475 6803525 6674494 6679287 6767205 6778486 6722749 6691537 6504652 6233972 6322893 6144427
3199 6144427 6098818 6045658 5814617 5827327 5754942 5630785 5681323 5799855 5599282 5573340 5362649
3188 5362649 5262892 5214796 5090505 4850779 4723031 4808861 4865585 4906614 4828286 4792098 4719828
$$ packed form
3260I298795J76643J83240P0012J60635K62625L78659K66218M90427L74461J44019
3250A1805734N4903K23761J21940L04261O09601M64415P81809P01655Q31807N93633
3240A6493519m35162r41139j319065j248248j008224p22899l83782l93686l87095
3231I654219k51170j68381k94867j25705r3150l13380q5894p3041m16783j77068
3221G654780n6967j87123k81848n2700P2472k05832M1215j42939j7447l8640K3504
3210F808475m950j29031M793Q7918J1281n5737l1212j86885k70680Q8921j78466
3199F144427m5609n3160k31041J2710p2385j24157N0538J18532k00573k5942k10691
3188E362649r9757m8096j24291k39726j27748Q5830N6724M1029p8328l6188p2270
$$ plain form
3177 4719828 4629535 4664877 4612097 4467308 4445867 4561079 4327423 4093130 4036168 3958311 3737541
3166 3737541 3504734 3642167 3619243 3714686 3642139 3690863 3706725 3576647 3631416 3582652 3579327
3155 3579327 3628502 3346392 3250353 3334312 3304489 3429197 3367834 3152123 3307670 3367535 3348032
3144 3348032 3373181 3274734 3115103 3093423 3097671 2856246 2869494 2850044 2823140 2761183 2783915
3133 2783915 2675750 2633420 2607400 2627667 2596644 2621063 2609081 2825199 2708649 2600187 2717075
3122 2717075 2636187 2638100 2605310 2657938 2504674 2477115 2483455 2482060 2487683 2502980 2281249 2344377
3110 2344377 2212623 2151963 2349121 2465328 2360430 2389666 2318701 2328730 2279072 2341090 2139592
3099 2139592 2135183 2294455 2196564 2140510 2042930 2195244 2229988 2100486 2204089 2147712 1930407
$$ packed form
3177D719828r0293L5342n2780j44789k1441J15212k33656k34293n6962p7857k20770
3166C737541k32807J37433k2924R5443p2547M8724J5862j30078N4769m8764l325
3155C579327M9175k82110r6039Q3959k9823J24708o1363k15711J55547N9865j9503
3144C348032K5149r8447j59631k1680M248k41425J3248j9450k6904o1957K2732
3133B783915j08165m2330k6020K0267l1023K4419j1982K16118j16550j08462J16888
3122B717075q0888J913l2790N2628j53264k7559O340j395N623J5297k21731O3128
3110B344377j31754o0660J97158J16207j04898K9236p0965J0029m9658O2018k01498
3099B139592m409J59272r7891n6054r7580J52314L4744j29502J03603n6377k17305
$$ plain form
3088 1930407 1906630 2064128 2048804 1914838 1955091 1805141 1975445 1796640 1789996 1685059
3078 1685059 1701587 1733651 1938604 1752059 1829487 1930150 1836072 1728111 1717833 1633492 1769668
3067 1769668 1646624 1543657 1654088 1661594 1726007 1731492 1637211 1530069 1549247 1668161 1695282
3056 1695282 1734440 1670434 1715944 1697453 1421663 1453771 1536871 1591514 1355922 1253371 1157550
3045 1157550 1596299 1601430 1465269 1604730 1691813 1545532 1712086 1706422 1773071 1723477 1721863
3034 1721863 1637131 1590949 1522964 1566865 1736934 1695247 1595427 1280243 1168367 1431321 1597495
3023 1597495 1416527 1546526 1481417 1516076 1435525 1328247 1327167 1297857 1253566 1502450 1427753
3012 1427753 1301311 1273516 1140919 1152233 1408269 1301234 1007620 1149183 1283148 1221878
$$ packed form
3088A930407k3777J57498j5324j33966M0253j49950J70304j78805o644j04937
3078A685059J6528L2064K04953j86545P7428J00663r4078j07961j0278q4341J36176
3067A769668j23044j02967J10431P506O4413N485r4281j07142J9178J18914K7121
3056A695282L9158o4006M5510j8491k75790L2108Q3100N4643k35592j02551r5821
3045A157550M38749N131j36161J39461Q7083j46281J66554n664O6649m9594j614
3034A721863q4732m6182o7985M3901J70069m1687r9820l15184j11876K62954J66174
3023A597495j80968J29999o5109L4659q0551j07278j080k9310m4291K48884p4697
3012A427753j26442k7795j32597J1314K56036j07035k93614J41563J33965o1270
$$ plain form
3002 1221878 1290670 1340996 1289112 1387901 1439934 1359277 1098606 1168787 1239151 1053022 1109586
2991 1109586 1172464 1254360 1382522 1329729 1126669 1250984 1232457 1122031 1104257 1084716 1262567
2980 1262567 1278776 1363529 1276303 1185783 1294040 1359928 1309981 1160333 1114730 1206997 1109484
2969 1109484 1170925 1124870 994688 1074958 970916 844216 960221 944075 1077200 1330595
2959 1330595 1258366 1150753 1109232 857527 1034309 1140909 1352353 1282723 1264344 1050260
2949 1050260 1059841 1086431 1127985 1235412 1326472 1286025 1242997 1506506 1378314 1089855 1146658
2938 1146658 1243154 1343331 1463677 1296007 1374044 1455204 1647694 1649339 1754499 1938258
2928 1938258 1782347 1910512 2071106 2094372 2135285 2365834 2831306 3099392 2906877 2638023
$$ packed form
3002A221878O8792N0326n1884R8789N2033q0657k60671P0181P0364j86129N6564
2991A109586O2878Q1896J28162n2793k03060J24315j8527j10426j7774j9541J77851
2980A262567J6209Q4753q7226r0520J08257O5888m9947j49648m5603R2267r7513
2969A109484O1441m6055j30182Q0270j04042j26700J16005j6146J33125K53395
2959A330595p2229j07613m1521k51705J76782J06600K11444o9630j8379k14084
2949A050260R581K6590M1554J07427R1060m0447m3028K63509j28192k88459N6803
2938A146658R6496J00177J20346j67670P8037Q1160J92490J645J05160J83759
2928A938258j55911J28165J60594K3266M0913K30549M65472K68086j92515k68854
$$ plain form
2918 2638023 2425181 2017005 1894743 1738291 1692226 1629392 1529961 1546765 1349114 1483250
2908 1483250 1707324 1479170 1281086 1163732 1131161 1130983 1382308 1498050 1316338 1177825
2898 1177825 1087802 906716 950373 882083 1013719 1110491 961002 1067980 1073203 842367 983253
2887 983253 1114393 1208443 1161565 1110565 945589 794909 1037861 1028692 908468 1016569 887542
2876 887542 901629 926918 836386 775330 820894 749750 800208 934483 781250 766520 850529
2865 850529 822376 954623 764069 614382 541933 728993 709535 868670 997717 832618
2855 832618 827984 626900 594501 629174 734935 948839 867809 605594 550935 422201 559132
2844 559132 413634 379653 401293 558666 479901 586978 508072 316994 382225 505780 561012
$$ packed form
2918B638023k12842m08176j22262j56452m6065o2834r9431J6804j97651J34136
2908A483250K24074k28154j98084j17354l2571j78K51325J15742j81712j38513
2898A177825r0023j81086M3657o8290J31636R6772j49489J06978N223k30836J40886
2887I83253J31140R4050m6878n1000j64976j50680K42952r169j20224J08101j29027
2876H87542J4087K5289r0532o1056M5564p1144N0458J34275j53233j4730Q4009
2865H50529k8153J32247j90554j49687p2449J87060j9458J59135J29047j65099
2855H32618m634k01084l2399L4673J05761K13904q1030k62215n4659j28734J36931
2844E59132j45498l3981K1640J57373p8765J07077p8906j91078O5231J23555N5232
$$ plain form
2833 561012 711748 588918 416247 342083 174919 136293 182631 314606 340195 261333 336455
2822 336455 569202 405098 354975 246790 198523 364328 426958 283085 407350 349279
2812 349279 151366 363536 550228 496541 693312 527126 259732 163077 303840 336621
2802 336621 368840 456970 323822 438429 523072 532115 509156 480957 502070 525404 528317 344771
2790 344771 164775 257144 212667 276234 124809 304617 315270 310220 288365 233947 372812
2779 372812 225973 226233 334632 372163 418681 289745 361833 352448 309647 434159 371678
2768 371678 446519 393095 260849 218123 290459 421669 412174 515031 374501 360737 216865
2757 216865 124588 204363 315028 300351 330170 338245 187537 279979 379151 247913 158304
$$ packed form
2833E61012J50736j22830j72671p4164j67164l8626M6338J31975K5589p8862P5122
2822C36455K32747j64104n0123j08185m8267J65805O2630j43873J24265n8071
2812C49279j97913K12170J86692n3687J96771j66186k67394r6655J40763L2781
2802C36621L2219Q8130j33148J14607Q4643R043k2959k8199K1113K3334K913j83546
2790C44771j79996R2369m4477O3567j51425J79808J0653n050k1855n4418J38865
2779C72812j46839K60J08399L7531M6518j28936P2088r385m2801J24512o2481
2768C71678P4841n3424j32246m2726P2336J31210r495J02857j40530j3764j43872
2757B16865r2277P9775J10665j4677K9819Q075j50708R2442R9172j31238q9609
$$ plain form
2746 158304 374467 471247 498684 530628 483513 584806 547472 392891 410827 510537 337029
2735 337029 483974 427477 296032 279912 73013 123116 181047 377910 209926 240718 156505
2724 156505 115140 218594 188097 311641 503394 327307 287099 267421 180106 101722 28248
2713 28248 2306 90284 224839 270855 171464 124931 207611 215494 153834 262755 470434
2702 470434 177859 51304 -87239 -40301 156323 277715 241791 237616 101952 69797 347045
2691 347045 273011 130157 152406 369269 226573 184735 25167 -32978 245394 56499
2681 56499 -79601 -153224 21437 178857 156799 -86629 -183138 -57657 -34737 19475 51183
2670 51183 161942 107456 138533 187993 18939 18124 -73310 -249505 -59657 -33948 -33155 -115833
$$ packed form
2746A58304K16163R6780K7437L1944m7115J01293l7334j54581J7936R9710j73508
2735C37029J46945n6497j31445j6120k06899N0103N7931J96863j67984L0792q4213
2724A56505m1365J03454l0497J23544J91753j76087m0208j9678q7315p8384p3474
2713B8248k5942Q7978J34555M6016r9391m6533Q2680P883o1660J08921K07679
2702D70434k92575j26555j38543M6938J96624J21392l5924m175j35664l2155K77248
2691C47045p4034j42854K2249K16863j42696m1838j59568n8145K78372j88895
2681E6499j36100p3623J74661J57420k2058k43428r6509J25481K2920N4212L1708
2670E1183J10759n4486L1077M9460j69054q15r1434j76195J89848K5709P93q2678
$$ plain form
2658 -115833 47209 131052 4195 132200 92855 187444 229941 183612 9305 -70354 25404
2647 25404 73574 68057 -42473 -53666 -180343 -178986 11832 147475 47249 -96819 -365955
2636 -365955 -324917 -172724 -44657 228455 117315 -132504 -17704 -30476 120519 98104
2626 98104 -152811 -71062 -115863 -320516 -261656 -185471 -62332 -76462 -59550 28853 35908
2615 35908 -49453 -49417 -14597 -76219 151285 51766 -16193 -30432 -143202 -56506 -113385 -142990
2603 -142990 -120724 42915 -20638 -134794 -130412 -224863 -92716 -40129 -16313 115189 94451
2592 94451 -8158 -6131 -45333 -171191 -352440 -367443 -199264 -57478 -95404 -165182 -128313
2581 -128313 -197619 -244405 -320330 -304186 -193186 76618 -44831 -63146 -142922 -218968 48200
$$ packed form
2658a15833J63042Q3843j26857J28005l9345R4589M2497m6329j74307p9659R5758
2647B5404M8170n517j10530j1193j26677J357J90818J35643j00226j44068k69136
2636c65955M1038J52193J28067K73112j11140k49819J14800j2772J50995k2415
2626I8104k50915Q1749m4801k04653N8860P6185J23139j4130J6912Q8403P055
2615C5908q5361L6L4820o1622K27504r9519o7959j4239j12770Q6696n6879k9605
2603a42990K2266J63639o3553j14156M382r4451J32147N2587K3816J31502k0738
2592I4451j02609K027l9202j25858j81249j5003J68179J41786l7926o9778L6869
2581a28313o9306m6786p5925J6144J11000K69804j21449j8315p9776p6046K67168
$$ plain form
2570 48200 149250 127467 -246234 -358757 -164433 -14282 -59507 -110259 -126539 54533 -52470
2559 -52470 -91445 -282009 -230492 -63844 -269214 -69330 66363 -53835 -54070 -117913 -212274
2548 -212274 -255099 -150913 -181085 -278697 -318389 -304622 -386659 -161663 -195363 -259838 -242644
2537 -242644 -186934 -135646 -342271 -267639 -176123 -189217 -113022 -102490 -157737 -153154 -171706 -218527
2525 -218527 72617 -103163 -161713 -263746 -247053 -194828 -138001 -102569 -255441 -177885 -70976
2514 -70976 -55508 -240913 -195076 -94899 -216792 -120245 8138 -44709 -57325 -27828 -18250
2503 -18250 -59045 175055 252398 90470 46815 -16973 289330 255360 22229 28213 -12460
2492 -12460 -207292 -138492 -111796 -57676 29471 -30955 9091 -70021 -92960 -219796 -134633
$$ packed form
2570D8200J01050k1783l73701j12523J94324J50151m5225n0752j6280J81072j07003
2559e2470l8975j90564N1517J66648k05370J99884J35693j20198k35o3843r4361
2548b12274m2825J04186l0172r7612l9692J3767q2037K24996l3700o4475J7194
2537b42644N5710N1288k06625P4632R1516j3094P6195J0532n5247M583j8552m6821
2525b18527K91144j75780n8550j02033J6693N2225N6827L5432j52872P7556J06909
2514g0976J5468j85405M5837J00177j21893R6547J28383n2847j2616K9497R578
2503a8250m0795K34100P7343j61928m3655o3788L06303l3970k33131N984m0673
2492a2460j94832O8800K6696N4120Q7147o0426M0046p9112k2939j26836Q5163
$$ plain form
2481 -134633 -102335 -38126 26414 14960 -184298 16808 -91105 -52035 -68929 -134671 -31871
2470 -31871 -65057 -400 23707 32411 159871 71173 64960 74236 -42533 -69890 82745 -100270
2458 -100270 -23264 -119598 -97764 -47993 -45099 82229 116782 197368 254865 267788 203360 262645
2446 262645 12096 8929 51670 109324 228081 25979 150303 167548 111902 69350 162665
2435 162665 312163 363504 110379 74026 121150 307635 338280 262566 261185 73830 -113500
2424 -113500 35560 171203 43083 207026 197367 -226981 -194014 70841 46831 -37737 -75569
2413 -75569 -47854 -37890 131507 104802 183497 268586 46395 94224 118825 47853 220697
2402 220697 328129 295674 423492 624392 449439 260719 352531 431828 248434 372844
$$ packed form
2481a34633L2298O4209O4540j1454j99258K01106j07913L9070j6894o5742J02800
2470c1871l3186O4657K4107Q704J27460q8698o213R276j16769k7357J52635j83015
2458a00270P7006r6334K1834M9771K894J27328L4553Q0586N7497J2923o4428N9285
2446B62645k50549l167M2741N7654J18757k02102J24324J7245n5646m2552R3315
2435A62665J49498N1341k53125l6353M7124J86485L0645p5714j381j87355j87330
2424a13500J49060J35643j28120J63943r659m24348L2967K64855k4010q4568l7832
2413g5569K7715R964J69397k6705P8695Q5089k22191M7829K4601p0972J72844
2402B20697J07432l2455J27818K00900j74953j88720R1812P9297j83394J24410
$$ plain form
2392 372844 296912 439840 230832 295189 348838 547775 451449 342447 371622 522640 464568
2381 464568 476483 556324 398390 465549 481401 437150 637940 810409 929049 1176876 981597
2370 981597 1041642 997636 823192 818429 844211 820436 852081 837612 718343 969663 933620
2359 933620 768009 744159 767356 1002574 930980 774097 804100 829750 914347 713370 787378
2348 787378 1024554 1007282 1224132 1200092 1047117 1045601 1312968 1675129 1735239 1641674 1699312
2337 1699312 1940009 2313664 2541010 3048939 3178473 2927505 2659231 2510054 2592960 2487270
2327 2487270 2429112 2365351 2450980 2670760 3041242 3608649 3982680 3975223 3872425 3657140
2317 3657140 3022908 2548899 2264130 2019326 1854043 1891493 1866632 1817481 1868128 1961869
$$ packed form
2392C72844p5932J42928k09008O4357N3649J98937r6326j09002K9175J51018n8072
2381D64568J1915P9841j57934O7159J5852m4251K00790J72469J18640K47827j95279
2370I81597O0045m4006j74444m763K5782k3775L1645j4469j19269K51320l6043
2359I33620j65611k3850K3197K35218p1594j56883L0003K5650Q4597k00977P4008
2348G87378K37176j7272K16850k4040j52975j516K67367L62161O0110r3565N7638
2337A699312K40697L73655K27346N07929J29534k50968k68274j49177Q2906j05690
2327B487270n8158o3761Q5629K19780L70482N67407L74031p457j02798k15285
2317C657140o34232m74009k84769k44804j65283L7450k4861m9151N0647R3741
$$ plain form
2307 1961869 1894000 2108873 2252517 2146704 2455428 2721988 2928241 3121064 3206989 2931748
2297 2931748 2420553 2101055 1965912 1590000 1532452 1661315 1696758 1462642 1410971 1450792
2287 1450792 1479886 1492245 1388025 1461496 1236439 1203889 1163122 1185173 1250023 1271713 1315826
2276 1315826 1444640 1513353 1502293 1572846 1555792 1343280 1430602 1493225 1408430 1333843 1542112
2265 1542112 1696886 1498368 1570358 1726724 1818207 1932669 1922029 1776587 1965694 1995450
2255 1995450 1989820 2115373 2067548 1980296 1892742 2014471 2007278 2270928 2372618 2304068 2190618
2244 2190618 2369531 2639638 2557623 2533576 2476308 2696865 2988270 2958199 3039874 3308561
2234 3308561 3246244 3409413 3345643 3259176 3357723 3275625 3304270 3653901 3797616 3921656 4016103
$$ packed form
2307A961869o7869K14873J43644j05813L08724K66560K06253J92823Q5925k75241
2297B931748n11195l19498j35143l75912n7548J28863L5443k34116n1671L9821
2287A450792K9094J2359j04220P3471k25057l2550m0767K2051O4850K1690M4113
2276A315826J28814O8713j1060P0553j7054k12512Q7322O2623q4795p4587K08269
2265A542112J54774j98518P1990J56366R1483J14462j0640j45442J89107K9756
2255A995450n630J25553m7825q7252q7554J21729p193K63650J01690o8550j13450
2244B190618J78913K70107q2015k4047n7268K20557K91405l0071Q1675K68687
2234C308561o2317J63169o3770q6467R8547q2098K8645L49631J43715J24040R4447
$$ plain form
2223 4016103 4101887 4221180 4371272 4547590 4638627 5010683 5265198 5483640 5988862 6620367
2213 6620367 7292311 7889737 8782542 9608891 10078572 9536932 8578437 7509213 6707079
2204 6707079 6423476 5984350 6005137 5938662 5977466 5963175 6077829 6268587 6478858 6736559
2194 6736559 6789766 6832445 6977893 6966056 7132072 7448861 7836590 8048368 8411453 8771484
2184 8771484 9177908 9767360 10365855 11089198 11369056 11898311 12659670 13431654 14435456
2175 14435456 15582309 17099332 18998072 21215969 24090241 28014569 32695178 38024715
2167 38024715 43674984 47208307 44886829 37910693 30716240 25057881 21194939 18550550
2159 18550550 16557825 14893157 13692404 12748884 12265154 11666432 11280371 11226235 11127712
$$ packed form
2223D016103Q5784J19293J50092J76318R1037L72056K54515K18442N05222O31505
2213F620367O71944N97426Q92805Q26349M69681n41640r58495j069224q02134
2204F707079k83603m39126K0787o6475L8804j4291J14654J90758K10271K57701
2194F736559N3207M2679J45448j1837J66016L16789L87729K11778L63085L60031
2184H771484M06424N89452N98495P23343K79858N29255P61359P71984J003802
2175A4435456J146853J517023J898740K217897K874272L924328M680609N329537
2167C8024715N650269L533323k321478o976136p194453n658359l862942k644389
2159A8550550j992725j664668j200753r43520m83730n98722l86061n4136r8523
$$ plain form
2150 11127712 10790760 10545435 10083897 9799875 9768842 9506102 9305664 9335850 9577691 9687435
2140 9687435 9746929 10152157 10384621 10294665 10725859 10842358 11179283 11718580 12242383 12661264
2130 12661264 13165840 13631243 13946029 14323462 14969222 15452673 16398671 17338605 18210038
2121 18210038 19401690 21104506 22610703 24026479 25318208 26812841 29042044 31561877
2113 31561877 34755071 38483157 43385455 49266996 56205109 65273203 76995029 91017653
2105 91017653 106325807 117679295 115596590 98374978 77899035 61778239 50001552
2098 50001552 41166710 34794035 30021305 26506088 23769914 21557042 19822038 18451563
2090 18451563 17547385 16677493 15656880 14554762 13074828 11849652 10933197 10235877 9683828
$$ packed form
2150A1127712l36952k45325m61538k84022l1033k62740k00438L0186K41841J09744
2140I687435N9494M05228K32464q9956M31194J16499L36925N39297N23803M18881
2130A2661264N04576M65403L14786L77433O45760M83451R45998R39934Q71433
2121A8210038J191652J702816J506197J415776J291729J494633K229203K519833
2113C1561877L193194L728086M902298N881541O938113R068094J1721826J4022624
2105I1017653J5308154J1353488k082705j7221612k0475943j6120796j1776687
2098E0001552q834842o372675m772730l515217k736174k212872j735004j370475
2090A8451563r04178q69892j020613j102118j479934j225176r16455o97320n52049
$$ plain form
2081 9683828 9136588 8567151 8092647 7673800 6983769 6580048 6202182 5803496 5576971 5289426
2071 5289426 4972263 4785643 4695663 4538887 4249452 4249191 3941234 3762893 3631042 3348318
2061 3348318 3088828 2891620 2803502 2736684 2575720 2439592 2469870 2495909 2475880 2273479
2051 2273479 2147576 2258500 2442514 2274781 1987293 1940303 1947002 1789446 1592154 1593251
2041 1593251 1777918 1789476 1686604 1565157 1570587 1353866 1192654 1133688 898091 900343 1030212
2030 1030212 1013531 968206 920023 795458 835429 771772 803922 787825 683423 688328 799886
2019 799886 674671 597765 539701 473506 378825 484880 373472 338792 266928 185728 353959
2008 353959 310325 119850 38068 28458 133610 253134 224103 151093 286548 420590 268622
$$ packed form
2081I683828n47240n69437m74504m18847o90031m03721l77866l98686k26525k87545
2071E289426l17163j86620q9980j56776k89435k61l07957j78341j31851k82724
2061C348318k59490j97208q8118o6818j60964j36128L0278K6039k0029k02401
2051B273479j25903J10924J84014j67733k87488m6990O699j57556j97292J097
2041A593251J84667J1558j02872j21447N430k16721j61212n8966k35597K252J29869
2030A030212j6681m5325m8183j24565L9971o3657L2150j6097j04402M905J11558
2019G99886j25215p6906n8064o6195r4681J06055j11408l4680p1864q1200J68231
2008C53959m3634j90475q1782r610J05152J19524k9031p3010J35455J34042j51968
$$ plain form
1997 268622 306788 302411 256464 263095 129673 247029 246782 237167 299420 211607 182519 259060
1985 259060 315207 292025 197768 145248 80335 160695 70316 32147 19524 52495 51113 113919
1973 113919 238130 109982 -81835 -67407 174966 78742 -52494 -21978 26817 533 14437
1962 14437 -175234 16390 -137936 -99306 -23533 -153724 -95042 16445 -10785 -249346 -115884
1951 -115884 56632 -162619 -59195 61226 201586 31387 -168975 -225329 -210959 -293636
1941 -293636 -138391 -85265 -278627 -125852 -11267 -65785 -403632 -438703 -495531 -455056 -258532
1930 -258532 -217090 -246197 -130579 -104573 -229717 -231713 -122043 -116136 -150880 -232699 -317674
1919 -317674 -301488 -217924 -211604 -472795 -454254 -130077 -261034 -268543 -149320 -170527 -261166
$$ packed form
1997B68622L8166m377m5947O631j33422J17356k47r615O2253q7813k9088P6541
1985B59060N6147k3182r4257n2520o4913Q0360r0379l8169j2623L2971j382O2806
1973A13919J24211j28148j91817J4428K42373r6224j31236L0516M8795k6284J3904
1962A4437j89671J91624j54326L8630P5773j30191N8682J11487k7230k38561J33462
1951a15884J72516k19251J03424J20421J40360j70199k00362n6354J4370q2677
1941b93636J55245N3126j93362J52775J14585n4518l37847l5071n6828M0475J96524
1930b58532M1442k9107J15618K6006j25144j996J09670N907l4744q1819q4975
1919c17674J6186Q3564O320k61191J8541L24177j30957p509J19223k1207r0639
$$ plain form
1908 -261166 -148916 -99547 -147555 -126286 -282592 -85438 -11273 -95307 45225 147083 32703
1897 32703 -176094 -193899 -97768 -72093 -170878 -274236 -229966 -133117 -137349 -295253 -345234
1886 -345234 -366213 -309499 -184551 -61867 -180717 -325151 -268222 -202489 -261344 -285137 -166779
1875 -166779 -211885 -176052 -459517 -414936 -360082 -193202 -328729 -289328 -231347 -457748 -256503
1864 -256503 518 -155159 -314854 -253493 -315197 -304121 -145089 -66864 -386230 -307764 -193508
1853 -193508 -124971 -289086 -362301 -288844 -386080 -271513 -360041 -360523 -333850 -428014 -293461
1842 -293461 -403292 -263153 -52032 -201680 -227112 63503 148759 120121 253058 131584
1832 131584 -169402 -382454 -284340 -130840 -85658 -186795 -184404 20806 -115982 -310477
$$ packed form
1908b61166J12250M9369m8008K1269j56306J97154P4165q4034J40532J01858j14380
1897C2703k08797j7805R6131K5675r8785j03358M4270R6849m232j57904m9981
1886c45234k0979N6714J24948J22684j18850j44434N6929O5733n8855k3793J18358
1875a66779m5106L5833k83465M4581N4854J66880j35527L9401N7981k26401K01245
1864b56503K57021j55677j59695O1361o1704J1076J59032P8225l19366P8466J14256
1853a93508O8537j64115p3215P3457r7236J14567q8528m82K6673r4164J34553
1842b93461j09831J40139K11121j49648k5432K90615Q5256k8638J32937j21474
1832A31584l00986k13052R8114J53500M5182j01137K391K05210j36788j94495
$$ plain form
1822 -310477 -273325 -85256 -99597 -240038 -94175 -294992 -260294 -120628 -268352 -454598
1812 -454598 -341961 -398566 -531281 -436300 -407850 -233428 -297226 -156184 -291841 -348201 -309461
1801 -309461 -233270 -151750 -299117 -294419 -309048 -581007 -290989 -155253 -268811 -261373 -234963
1790 -234963 -207701 -169775 -191758 -196974 -93760 -274980 -323818 -290492 -252209 -226593 -443073
1779 -443073 -601327 -475823 -543642 -361982 -267165 -375671 -143816 -69469 -269746 -369429
1769 -369429 -237369 -365823 -265907 -118631 -159883 -220978 -422971 -287173 -313258 -365972 -243464
1758 -243464 -188671 -181296 -337092 -472600 -552777 -449082 -339938 -194731 -266786 -367313 -563022
1747 -563022 -483856 -297273 -326055 -58550 -132655 -371569 -420708 -283275 -239034 -132101 -321049
$$ packed form
1822c10477L7152J88069j4341j40441J45863k00817L4698J39666j47724j86246
1812d54598J12637n6605j32715R4981K8450J74422o3798J41042j35657n6360L8740
1801c09461P6191Q1520j47367M698j4629k71959K90018J35736j13558P438K6410
1790b34963K7262L7926k1983n216J03214j81220m8838L3326L8283K5616k16480
1779d43073j58254J25504o7819J81660R4817j08506K31855P4347k00277r9683
1769c69429J32060j28454R9916J47276m1252o1095k01993J35798k6085n2714J22508
1758b43464N4793P375j55796j35508q0177J03695J09144J45207p2055j00527j95709
1747e63022P9166J86583k8782K67505p4105k38914m9139J37433M4241J06933j88948
$$ plain form
1736 -321049 -267338 -278883 -330643 -280330 -350886 -326751 -215071 -141121 -200794 -337491 -340327
1725 -340327 -562681 -621850 -530619 -379394 -371016 -426160 -386646 -316078 -314154 -444192 -385642
1714 -385642 -443945 -516118 -461721 -399791 -483161 -544459 -387243 -313589 -268666 -304366 -450930
1703 -450930 -465866 -384425 -387296 -431217 -412948 -128952 -265897 -509360 -282969 -109985 -169668
1692 -169668 -175170 -242616 -321623 -292328 -155390 -267580 -342685 -299719 -328404 -222874 -244170
1681 -244170 -256084 -264608 -181220 -339994 -176556 -263697 -434856 -442388 -351910 -319192 -232269
1670 -232269 -256805 -353645 -271208 -243558 -510555 -315997 -361052 -231802 -314004 -434661 -184640
1659 -184640 -249387 -136295 -476594 -392622 -291989 -236042 -292654 -300072 -221548 -424632 -343785
$$ packed form
1736c21049N3711j1545n1760N0313p0556K4135J11680P3950n9673j36697k836
1725c40327k22354n9169R1231J51225Q378n5144L9514P0568J924j30038N8550
1714c85642n8303p2173N4397O1930q3370o1298J57216P3654M4923l5700j46564
1703d50930j4936Q1441k871m3921J8269K83996j36945k43463K26391J72984n9683
1692a69668n502o7446p9007K9295J36938j12190p5105M2966k8685J05530k1296
1681b44170j1914q524Q3388j58774J63438q7141j71159p532R0478L2718Q6923
1670b32269k4536r6840Q2437K7650k66997J94558m5055J29250q2202j20657K50021
1659a84640o4747J13092l40299Q3972J00633N5947n6612p418P8524k03084Q0847
$$ plain form
1648 -343785 -175803 -103110 11159 -44831 -87020 -262296 -240234 -315917 -462727 -588479 -812587
1637 -812587 -594844 -207676 -220294 -163432 -54710 -256374 -160070 -194448 -240548 -274815 -223145
1626 -223145 -396500 -472665 -217729 -365033 -379455 -218020 -190684 -217159 -322295 -256849 -73112
1615 -73112 -256414 -357753 -245402 -67898 12899 -111115 13150 -83665 -148338 -157634 -293715
1604 -293715 -391640 -328463 -162767 -272343 -423325 -154966 -191498 -212039 -229560 -365587 -396455
1593 -396455 -390806 -296012 -314761 -218786 94891 -30643 -116407 -194328 -239989 -155614 -28174
1582 -28174 -226093 -395506 -545296 -403267 -211504 -245221 -243722 -371395 -224655 -200507 -275745
1571 -275745 -384259 -382301 -284096 -187968 -72564 -156611 -200591 -256092 -313848 -153204 -101506
$$ packed form
1648c43785J67982P2693J14269n5990m2189j75276K2062p5683j46810j25752k24108
1637h12587K17743L87168j2618N6862J08722k01664R6304l4378m6100l4267N1670
1626b23145j73355p6165K54936j47304j4422J61435K7336k6475j05136O5446J83737
1615g3112j83302j01339J12351J77504Q0797j24014J24265r6815o4673r296j36081
1604b93715r7925O3177J65696j09576j50982K68359l6532k0541j7521j36027l0868
1593c96455N649R4794j8749R5975L13677j25534q5764p7921m5661Q4375J27440
1582b8174j97919j69413j49790J42029J91763l3717J499j27673J46740K4148p5238
1571b75745j08514J958R8205R6128J15404q4047m3980n5501n7756J60644N1698
$$ plain form
1560 -101506 -91856 -195771 -168645 -111311 -51401 -129655 -173865 -355820 -510336 -349505 -128656
1549 -128656 -242416 -149254 -67509 -162431 -254619 -52740 -98649 -289166 -344572 -412824 -427126
1538 -427126 -348213 -467915 -466796 -516674 -392428 -283222 -396597 -326574 -196139 -205998 -110521
1527 -110521 -259948 -291918 -143463 -136901 -27884 92154 100239 -14295 -213807 -248617 -270458
1516 -270458 -294847 -178757 -171395 -156193 -237068 -300241 -197666 -239193 -167954 -102169 -290359
1505 -290359 -278791 -109615 -253144 -301512 -198722 -272791 -140656 -107631 -315189 -249837 -133904
1494 -133904 -72152 -138509 -140852 -97755 -233544 -89390 -162453 -172795 -167830 -242481 -308871 -120054
1482 -120054 -41369 -29294 -143983 -259409 -294586 -185967 -196118 -355976 -290316 -205168 -155500
$$ packed form
1560a01506R650j03915K7126N7334N9910p8254m4210j81955j54516J60831K20849
1549a28656j13760R3162Q1745r4922r2188K01879m5909j90517n5406o8252j4302
1538d27126P8913j19702J119m9878J24246J09206j13375P0023J30435r859R5477
1527a10521j49427l1970J48455O562J09017J20038Q085j14534j99512l4810k1841
1516b70458k4389J16090P362J5202q0875o3173J02575m1527P1239O5785j88190
1505b90359J1568J69176j43529m8368J02790p4069J32135L3025k07558O5352J15933
1494a33904O1752o6357k343M3097j35789J44154p3063j0342M965p4651o6390J88817
1482a20054P8685J2075j14689j15426l5177J08619j0151j59858O5660Q5148M9668
$$ plain form
1471 -155500 45440 -144128 -72045 -127387 -150808 -135364 -219617 -258178 -247501 -132536 -69811
1460 -69811 -171157 -350147 -142024 -136969 -200018 -266044 -373031 -434795 -304676 -105285 -148775
1449 -148775 -101378 -61318 -88732 -148058 -178799 -231238 -155414 -299573 -479280 -234719 -51123
1438 -51123 -58779 -161499 -135882 -261682 -172044 -246757 -324904 -242195 -274120 -225384 -172256 -27614
1426 -27614 -165886 -162802 -134208 -238250 -321597 -177300 -300536 -240373 -105755 -161759 -117286
1415 -117286 -156360 -102956 -15315 110613 -21847 -28330 115424 -35560 -234793 -121445 -31942
1404 -31942 -33080 -144853 -131384 -196507 -171205 -150882 -187064 -110304 -149790 -46053 -38806 -276983
1392 -276983 -192847 -32747 -4262 -281646 -30954 42592 13823 89355 -134576 26431 -135232
$$ packed form
1471a55500K00940j89568P2083n5342k3421J5444q4253l8561J0677J14965O2725
1460f9811j01346j78990K08123N055o3049o6026j06987o1764J30119J99391m3490
1449a48775M7397M0060k7414n9326l0741n2439P5824j44159j79707K44561J83596
1438e1123p656j02720K5617j25800Q9638p4713p8147Q2709l1925M8736N3128J44642
1426b7614j38272L084K8594j04042q3347J44297j23236O0163J34618n6004M4473
1415a17286l9074N3404Q7641J25928j32460o483J43754j50984j99233J13348Q9503
1404c1942j138j11773J3469o5123K5302K0323l6182P6760l9486J03737P247k38177
1392b76983Q4136J60100K8485k77384K50692P3546k8769P5532k23931J61007j61663
$$ plain form
1381 -135232 -208028 -14420 -73679 23271 -76377 -71898 -82728 21882 2868 -150109 -117092
1370 -117092 -160484 -123260 -4371 76560 -100094 -56674 -90762 32825 65007 23679 173851
1359 173851 10525 -109470 -196506 -182087 -144937 -156743 -143378 -14326 -76209 -67183 50013
1348 50013 45615 -101799 -172850 -95921 -262322 -206575 -217801 -94399 -102632 -23636 -99978 -163864
1336 -163864 -127372 -153283 -221902 -69197 -111550 -25919 -22349 -52722 67462 -99066 -137094
1325 -137094 -240899 -140512 -151444 -75487 17065 -189161 -219629 -42714 -109054 -42708 -176160
1314 -176160 -189594 -190106 -388150 -122722 36077 -27919 -105712 -182232 -279356 -332753 -219168
1303 -219168 -242476 -326152 -265113 -77023 -175507 -89544 -4495 -58327 27909 -10887 -30623
$$ packed form
1381a35232p2796J93608n9259R6950r9648M479j0830J04610j9014j52977L3017
1370a17092m3392L7224J18889Q0931j76654M3420l4088J23587L2182m1328J50172
1359A73851j63326j19995q7036J4419L7150j1806J3365J29052o1883R026J17196
1348E0013m398j47414p1051P6929j66401N5747j1226J23402q233P8996p6342o3886
1336a63864L6492k5911o8619J52705m2353Q5631L570l0373J20184j66528l8028
1325a37094j03805J00387j0932P5957R2552k06226l0468J76915o6340O6346j33452
1314a76160j3434n12j98044K65428J58799o3996p7793p6520r7124n3397J13585
1303b19168k3308q3676O1039J88090r8484Q5963Q5049n3832Q6236l8796j9736
$$ plain form
1292 -30623 -208155 -89630 -45539 -14922 91528 -32580 131962 44607 -106333 16924
1282 16924 -31219 -45140 -185840 -229028 -273720 -302068 -66369 -223483 -141104 -171236 123472
1271 123472 78269 -191483 -130556 -221320 -189646 -127375 -101901 -144795 -217003 -62283 8704
1260 8704 54969 102651 -17542 -105291 -182297 -106775 -186846 -160057 -38769 151349 -27174
1249 -27174 -115848 -164764 -115132 -100315 -14581 -275039 -256310 46452 184758 65765 104926
1238 104926 62262 34101 -54984 -206653 -183248 -144183 -144266 51193 194271 -27618 -125150
1227 -125150 -104136 -211172 -258864 -26153 -38010 -90530 -66306 -88869 -216855 -134606 -112724
1216 -112724 -169762 -259803 -20365 118224 -22160 -71958 -233806 -390392 -117964 -130556
$$ packed form
1292c0623j77532J18525M4091L0617J06450j24108J64542q7355j50940J23257
1282A6924m8143j3921j40700m3188m4692k8348K35699j57114Q2379l0132K94708
1271A23472m5203k69752O0927r0764L1674O2271K5474m2894p2208J54720P0987
1260H704M6265M7682j20193q7749p7006P5522q0071K6789J21288J90118j78523
1249b7174q8674m8916M9632J4817Q5734k60458J8729L02762J38306j18993L9161
1238A04926m2664k8161q9085j51669K3405L9065q3J95459J43078k21889r7532
1227a25150K1014j07036m7692K32711j1857n2520K4224k2563j27986Q2249K1882
1216a12724n7038r0041K39438J38589j40384m9798j61848j56586K72428j2592
$$ plain form
1206 -130556 87783 41392 -129607 -157741 -101989 -226824 -109456 -302494 -291644 -7172
1196 -7172 38114 -25823 -226875 -209621 -192987 -185604 -255705 -213918 -86759 11391 -39633 -8273
1184 -8273 135912 97989 -85818 29286 214591 -54234 -219746 102084 215159 256873
1174 256873 81402 23144 136278 56900 -133452 -203807 -216152 -139307 -23532 167022 169261
1163 169261 -4925 -172585 -217153 -144674 -176412 -57464 87187 32845 -141071 -196652 -187842
1152 -187842 -97720 -139332 -278797 -154313 -153592 -49028 -36578 54179 75588 -9468 45291
$$ packed form
1206a30556K18339m6391j70999k8134N5752j24835J17368j93038J0850K84472
1196g172M5286o3937k01052J7254J6634P383p0101M1787J27159R8150n1024L1360
1184h273J44185l7923j83807J15104J85305k68825j65512L21830J13075M1714
1174B56873j75471n8258J13134p9378j90352p0355j2345P6845J15775J90554K239
1163A69261j74186j67660m4568P2479l1738J18948J44651n4342j73916n5581Q810
1152a87842R0122m1612j39465J24484P21J04564J2450R0757K1409q5056N4759
$$ [...]
##END NTUPLES=NMR SPECTRUM
##END=
