##TITLE=1H_CA-9107
 CDCl3
 8 sc, 
 27.1.2023
##JCAMPDX= 6.0         $$ Bruker NMR JCAMP-DX V2.0
##DATA TYPE= NMR SPECTRUM
##DATA CLASS= NTUPLES
##ORIGIN= UXNMR, Bruker Analytische Messtechnik GmbH
##OWNER= root
$$ XWIN-NMR		Version 3.5
$$ Fri Jan 27 13:53:26 2023 Russian Standard Time (UT+4h)  she@DPX200
##.OBSERVE FREQUENCY= 200.13135
##.OBSERVE NUCLEUS= ^1H
##.ACQUISITION MODE= SIMULTANEOUS
##.ACQUISITION SCHEME= undefined
##.AVERAGES= 8
##.DIGITISER RES= 18
##SPECTROMETER/DATA SYSTEM= spect
##.PULSE SEQUENCE= zg30
##.SOLVENT NAME= CDCl3
##.SHIFT REFERENCE= (INTERNAL, CDCl3, 0, 15.7359)
##AUDIT TRAIL= $$ (NUMBER, WHEN, WHO, WHERE, WHAT)
$$ ##TITLE= Audit trail, XWIN-NMR		Version 3.5
$$ ##JCAMPDX= 5.01
$$ ##ORIGIN= Bruker BioSpin GmbH
$$ ##OWNER= she
$$ F:/spectra/data/she/nmr/H-F/1/pdata/1/auditp.txt
$$ ##AUDIT TRAIL=  $$ (NUMBER, WHEN, WHO, WHERE, WHAT)
(   1,<2023-01-27 13:52:11.25 +0400>,<she>,<DPX200>,
      <created by zg, POWCHK disabled, PULCHK disabled
       configuration hash MD5:
       00 E9 B6 7A A2 85 ED C7 34 08 36 98 17 FE 4E 26
       data hash MD5: 16K
       3B 27 0E 51 64 44 D0 78 36 B0 98 5A 47 6B 13 58>)
(   2,<2023-01-27 13:52:13.26 +0400>,<she>,<DPX200>,
      <Start of raw data processing
       efp BC_mod = 2 LB = 0.24 FT_mod = 6 PKNL = 1 PHC0 = -19113.96 PHC1 = 8.400789 SI = 16K 
       data hash MD5: 16K
       AB 6D 0F 98 61 87 7C FB 3F 70 09 3C E5 EC 97 1F>)
(   3,<2023-01-27 13:52:32.25 +0400>,<she>,<DPX200>,
      <pk PHC0 = 6.464908 PHC1 = -1 
       data hash MD5: 16K
       B2 B0 CB 7C 30 8F 0C D0 17 66 2E A7 B5 59 21 F2>)
(   4,<2023-01-27 13:52:34.82 +0400>,<she>,<DPX200>,
      <abs ABSG = 5 
       data hash MD5: 16K
       F1 41 78 78 0E 39 D7 65 83 0D B4 A1 26 E1 A7 02>)
$$ ##END=
$$ 
$$ hash MD5
$$ BA AA B1 AB 7F 66 3A 5D 3E 9D C6 C5 02 FF E5 A4
##$RELAX= 
##$RELAX= 
##$RELAX= 
##$RELAX= 
##$RELAX= 
##$RELAX= 
$$ Bruker specific parameters
$$ --------------------------
##$DU= <F:/spectra>
##$EXPNO= 1
##$NAME= <H-F>
##$PROCNO= 1
##$TYPE= <nmr>
##$USER= <she>
##$AMP= (0..31)
100 100 100 100 100 100 100 100 100 100 100 100 100 100 100 100 100 100 
100 100 100 100 100 100 100 100 100 100 100 100 100 100 
##$AQSEQ= 0
##$AQ_mod= 1
##$AUNM= <au_zg>
##$AUTOPOS= <>
##$BF1= 200.13
##$BF2= 200.13
##$BF3= 200.13
##$BF4= 200.13
##$BF5= 200.13
##$BF6= 200.13
##$BF7= 200.13
##$BF8= 200.13
##$BYTORDA= 1
##$CFDGTYP= 0
##$CFRGTYP= 5
##$CHEMSTR= <none>
##$CNST= (0..31)
1 1 145 1 1 1 1 1 1 1 1 1 1 1 1 1 1 1 1 1 1 1 1 1 1 1 1 1 1 1 1 1 
##$CPDPRG= <>
##$CPDPRG1= <>
##$CPDPRG2= <>
##$CPDPRG3= <>
##$CPDPRG4= <mlev>
##$CPDPRG5= <mlev>
##$CPDPRG6= <mlev>
##$CPDPRG7= <mlev>
##$CPDPRG8= <mlev>
##$CPDPRGB= <>
##$CPDPRGT= <>
##$D= (0..31)
0 1.2 0 0 0 0 0 0 0 0.06 0 0.03 0 0 0 0 0.0002 0 0 0 0 0 0 0 0 0 0 0 0 
0 0 0 
##$DATE= 1674813130
##$DBL= (0..7)
120 120 120 120 120 120 120 120 
##$DBP= (0..7)
150 150 150 150 150 150 150 150 
##$DBP07= 0
##$DBPNAM0= <>
##$DBPNAM1= <>
##$DBPNAM2= <>
##$DBPNAM3= <>
##$DBPNAM4= <>
##$DBPNAM5= <>
$$ [...]
##$SUBNAM3= <"">
##$SUBNAM4= <"">
##$SUBNAM5= <"">
##$SUBNAM6= <"">
##$SUBNAM7= <"">
##$SUBNAM8= <"">
##$SUBNAM9= <"">
##$SW= 18.05172834244
##$SWIBOX= (0..15)
0 0 2 0 0 0 0 0 0 0 0 0 0 0 0 0 
##$SW_h= 3612.71676300578
##$TD= 16384
##$TD0= 1
##$TE= 0
##$TE2= 300
##$TE3= 300
##$TEG= 300
##$TL= (0..7)
0 120 120 120 120 120 120 120 
##$TP= (0..7)
150 150 150 150 150 150 150 150 
##$TP07= 0
##$TPNAME0= <>
##$TPNAME1= <>
##$TPNAME2= <>
##$TPNAME3= <>
##$TPNAME4= <>
##$TPNAME5= <>
##$TPNAME6= <>
##$TPNAME7= <>
##$TPOAL= (0..7)
0.5 0.5 0.5 0.5 0.5 0.5 0.5 0.5 
##$TPOFFS= (0..7)
0 0 0 0 0 0 0 0 
##$TUNHIN= 0
##$TUNHOUT= 0
##$TUNXOUT= 0
##$USERA1= <user>
##$USERA2= <user>
##$USERA3= <user>
##$USERA4= <user>
##$USERA5= <user>
##$V9= 5
##$VALIST= <valist>
##$VCLIST= <CCCCCCCCCCCCCCC>
##$VD= 0
##$VDLIST= <DDDDDDDDDDDDDDD>
##$VPLIST= <PPPPPPPPPPPPPPP>
##$VTLIST= <TTTTTTTTTTTTTTT>
##$WBST= 1024
##$WBSW= 4
##$XGAIN= (0..3)
0 0 0 0 
##$XL= 0
##$YL= 0
##$YMAX_a= 121993
##$YMIN_a= -104757
##$ZGOPTNS= <>
##$ZL1= 120
##$ZL2= 120
##$ZL3= 120
##$ZL4= 120
##$ABSF1= 15.74579
##$ABSF2= -2.30606
##$ABSG= 5
##$ABSL= 3
##$ALPHA= 0
##$AQORDER= 0
##$ASSFAC= 0
##$ASSFACI= 0
##$ASSFACX= 0
##$ASSWID= 0
##$AUNMP= <proc_1d>
##$AZFE= 0.1
##$AZFW= 0.1
##$BCFW= 0
##$BC_mod= 2
##$BYTORDP= 0
##$COROFFS= 0
##$CY= -3
##$DATMOD= 1
##$DC= 0
##$DFILT= <>
##$DTYPP= 0
##$F1P= 0
##$F2P= 0
##$FCOR= 1
##$FTSIZE= 16384
##$FT_mod= 6
##$GAMMA= 0
##$GB= 0
##$INTBC= 1
##$INTSCL= 3.70164e-10
##$ISEN= 128
##$LB= 0.24
##$LEV0= 0
##$LPBIN= 0
##$MAXI= 10000
##$MC2= 0
##$MEAN= 0
##$ME_mod= 0
##$MI= 1.114404
##$NCOEF= 0
##$NC_proc= -7
##$NLEV= 6
##$NOISF1= 3.799351
##$NOISF2= 2.8
##$NSP= 0
##$NTH_PI= 0
##$NZP= 0
##$OFFSET= 15.73587
##$PC= 1
##$PHC0= -19107.5
##$PHC1= 7.400789
##$PH_mod= 1
##$PKNL= yes
##$PPARMOD= 0
##$PSCAL= 0
##$PSIGN= 0
##$REVERSE= no
##$SF= 200.130007139166
##$SI= 16384
##$SIGF1= 3
##$SIGF2= 2
##$SINO= 5.538805
##$SIOLD= 16384
##$SREGLST= <1H.CDCl3>
##$SSB= 0
##$STSI= 16384
##$STSR= 0
##$SW_p= 3612.71676300578
##$SYMM= 0
##$S_DEV= 0
##$TDeff= 16384
##$TDoff= 0
##$TI= <>
##$TILT= no
##$TM1= 0
##$TM2= 0
##$TOPLEV= 0
##$USERP1= <user>
##$USERP2= <user>
##$USERP3= <user>
##$USERP4= <user>
##$USERP5= <user>
##$WDW= 1
##$XDIM= 16384
##$YMAX_p= 524609273
##$YMIN_p= -1666511
$$ End of Bruker specific parameters
$$ ---------------------------------
##NTUPLES= NMR SPECTRUM
##VAR_NAME=  FREQUENCY,     SPECTRUM/REAL,   SPECTRUM/IMAG
##SYMBOL=    X,             R,               I
##VAR_TYPE=  INDEPENDENT,   DEPENDENT,       DEPENDENT
##VAR_FORM=  AFFN,          ASDF,            ASDF
##VAR_DIM=   16384,         16384,           16384
##UNITS=     HZ,            ARBITRARY UNITS, ARBITRARY UNITS
##FACTOR=    0.220516191357247, 1,           1
##FIRST=     3149.21984775359, 0,            0
##LAST=      -463.496915252192, 0,           0
##MIN=       -463.496915252192, -1666511,    0
##MAX=       3149.21984775359, 524609273,    0
$$ Real data points
##PAGE= N=1
##DATA TABLE= (X++(R..R)), XYDATA
$$ [...]
7385h3245J11644j46938o0753N7086K0411o3303M884L3080m6672k10942L21504
$$ -83245 28399 -118539 -179292 -122206 -101795 -165098 -160214 -127134 -173806 -384748 -63244
7374f3244O4454M0584l08491O2004K59807j76475J04732k7518l02358M7180J10344
$$ -63244 1210 41794 -266697 -204693 55114 -121361 -16629 -44147 -346505 -299325 -188981
7363a88981K8337J17199k20053J24067M6887j40019R9104j4266K22236j24059
$$ -188981 -160644 -43445 -263498 -139431 -92544 -232563 -133459 -147725 74511 -49548
7353d9548j90354l6632J12992J49197j52622K6324O2801r6128M8612R7027r8650
$$ -49548 -239902 -276534 -163542 -14345 -166967 -140643 -77842 -173970 -125358 -28331 -126981
7342a26981j18467M8823k8055J82766j23114r7169R2917M7838J40600K64789j48704
$$ -126981 -245448 -196625 -224680 -41914 -165028 -262197 -169280 -121442 19158 283947 135243
7331A35243q4943j3208J00773q2637j80886J7455o5398P8031q2861R0243M0337
$$ 135243 50300 37092 137865 55228 -125658 -108203 -173601 -95570 -178431 -88188 -47851
7320d7851J01947R1059l92587N9256K17675j70137m8940L5599L10215j31644l49526
$$ -47851 54096 145155 -247432 -188176 29499 -140638 -189578 -153979 156236 24592 -324934
7309c24934k048J42489j4644O9321k08560O959M8534L0123N0042k62554m2497
$$ -324934 -326982 -184493 -199137 -129816 -338376 -331417 -282883 -252760 -202718 -465272 -507769
7298e07769J95931J56363j10527P3585R456N6515J15293K04081q1662l10466j55038
$$ -507769 -311838 -155475 -266002 -192417 -182961 -126446 -11153 192928 111266 -199200 -354238
7287c54238R7726K02239K19422j29409j45817j88194o8242R2288K5181L29282
$$ -354238 -256512 -54273 165149 35740 -110077 -298271 -366513 -274225 -249044 80238
7277H0238L4470k56957k44355L34945o0617j44165j68225K01855J20337K7709
$$ 80238 114708 -142249 -386604 -51659 -112276 -256441 -424666 -222811 -102474 -74765
7267g4765M3920J01597j18821j21988j06313j17133O5513Q1657R5116J92592l473
$$ -74765 -30845 70752 -48069 -170057 -276370 -393503 -327990 -246333 -151217 41375 37902
7256C7902j63450j2717l910O3361k1614m3660M245m7176R2075j97696K44207M7930
$$ 37902 -125548 -138265 -142175 -78814 -100428 -144088 -139843 -187019 -94944 -292640 -48433 -503
7244e03j43077q7719M7263J2737J2926m371J86537J50611j10046k17639K7990
$$ -503 -143580 -231299 -184036 -171299 -158373 -162744 23793 174404 64358 -153281 -125291
7233a25291K8790P7629k02385J19001K79093L1164M3515j73200R1830o0933j70842
$$ -125291 -96501 -18872 -221257 -102256 176837 208001 251516 78316 170146 109213 -61629
7222f1629j4540M8416J1374Q2262O2586R6992j78842m1895l7639J60702M0405
$$ -61629 -76169 -27753 -16379 65883 128469 225461 46619 4724 -32915 127787 168192
7211A68192j7304l9516K250l15076o1043M5263P0046J24177K8258k40482J66173
$$ 168192 150888 111372 113622 -201454 -262497 -217234 -147188 -23011 5247 -235235 -69062
7200f9062j03362k5867O1919q008R3466j09126R9403l1907j06975p0707j10675
$$ -69062 -172424 -198291 -136372 -144380 -50914 -160040 -60637 -92544 -199519 -270226 -380901
7189c80901K54588J67619k3533q4720j35742J49730q0431j2300J29136M9249p451
$$ -380901 -126313 41306 17773 -66947 -202689 -52959 -133390 -145690 -16554 32695 25244
7178B5244k23062m1889J73884N7446q0997K587R7075M7067N9575n9934Q084j66455
$$ 25244 -197818 -239707 -65823 -8377 -89374 -86787 10288 57355 116930 56996 65080 -101375
7166a01375j04470o2885o1181J26958J44605p7099N5005j58622l72q4029m0567
$$ -101375 -205845 -268730 -329911 -202953 -58348 -135447 -80442 -239064 -239436 -323465 -364032
7155c64032L03529M675J30258j33548L2559n3028K00185j81815l5051J71540j75795
$$ -364032 -60503 -55828 74430 -59118 -26559 -79587 120598 -61217 -96268 75272 -100523
7144a00523q728l7661p0059r378n0900K88616J18056k00651j25574l5479Q9298
$$ -100523 -109251 -146912 -216971 -226349 -277249 11367 129423 -71228 -196802 -232281 -142983
7133a42983J19395o9008p613J69345q0503k59320J84820K42500n1436j55122k21890
$$ -142983 -23588 -92596 -100209 69136 -11367 -270687 -85867 156633 105197 -49925 -271815
7122b71815p69J00825J55408j1135k39393M0386j7278k0184J2315J44184J52900
$$ -271815 -272584 -171759 -16351 -27486 -266879 -226493 -243771 -263955 -251640 -107456 45444
7111D5444o0513j78100R9201J4599j30959O0697J1557J5505J0555J03089j20162
$$ 45444 -15069 -193169 -93968 -79369 -210328 -149631 -138074 -122569 -112014 -8925 -129087
7100a29087m4883o858Q8505m3900p967K39663K5913m2948J50519l2802j4129j9189
$$ -129087 -173970 -180828 -92323 -136223 -144190 95473 121386 78438 228957 196155 182026 162837
7088A62837j62436j41063n8618m2709J60324n3072Q8404n8917J57546j18504q7361
$$ 162837 401 -140662 -199280 -241989 -81665 -134737 -46333 -105250 52296 -66208 -153569
7077a53569j2148J66389J0599L4107K586p7515j6988Q821j5491J25815J24318
$$ -153569 -165717 672 11271 45378 47964 -29551 -46539 -37718 -53209 72606 196924
7066A96924k69146r6076J37031L1902j52533j561R0379j41598q458J87330O2975
$$ 196924 -72222 -168298 -31267 635 -151898 -153459 -63080 -204678 -213136 -25806 37169
7055C7169j47019o8030M793K1529J18428j65051Q0895L9930R8194j73352K20483
$$ 37169 -109850 -177880 -173087 -151558 -33130 -198181 -117286 -77356 20838 -152514 67969
7044F7969n4960j60303R704m8609m3815q4698J43676r0819m5168J77450k1228
$$ 67969 13009 -147294 -137590 -186199 -230014 -314712 -171036 -261855 -307023 -129573 -150801
7033a50801L2277L2664M1924l335N254P767q373J80951m6382k36134J48778k8181
$$ -150801 -118524 -85860 -43936 -47271 -42017 -34250 -42623 138328 91946 -144188 4590 -23591
7021b3591j14737l2200M8561Q6217J51925J19409l64347R0390p359k51547k3109
$$ -23591 -138328 -170528 -121967 -35750 116175 235584 -128763 -38373 -45732 -297279 -320388
7010c20388J61849K73564r3094L0738p8852k32820J4283L9728J23341K20066k63827
$$ -320388 -158539 115025 21931 52669 -26183 -259003 -244720 -204992 -81651 138415 -125412
6999a25412j43272P9930l9630J23925J29710J19175k28510Q4222j1289J69262
$$ -125412 -268684 -188754 -228384 -104459 25251 144426 -84084 138 -11151 158111
6989A58111q0325P1213j79616r8727L46353j13483j62732j24426J00138r2816
$$ 158111 77786 148999 -30617 -129344 217009 103526 -59206 -183632 -83494 -176310
6979a76310j78045O9816J56869j8073k113M6200L1934o5244j66080J48560j7634
$$ -176310 -354355 -284539 -127670 -145743 -147856 -101656 -69722 -134966 -301046 -152486 -170120
6968a70120l8615j50744j08148J77206L19233l4420n1061N2026r0610m7004k8153
$$ -170120 -208735 -359479 -467627 -290421 28812 -5608 -56669 -4643 -95253 -142257 -170410
6957a70410j11509J54850J32825K5160J13523j28442r26j77086o9108Q9978J11911
$$ -170410 -281919 -127069 5756 30916 144439 15997 15071 -162015 -231123 -141145 -29234
6946b9234j25496k10150l3644M00723P7164o4421N2715J8074k39045Q7689j40737
$$ -29234 -154730 -364880 -398524 2199 79363 14942 67657 85731 -153314 -65625 -206362
6935b06362j33466m4452K2470L42279O657R422r3217n0386j30981J92193J67526
$$ -206362 -339828 -384280 -361810 -19531 -12874 -3452 -96669 -147055 -278036 -85843 81683
6924H1683Q72L1012j04303l9781K22040q2667N4014O1770j92615j19549Q4381
$$ 81683 82555 113567 9264 -30517 191523 108856 162870 224640 32025 -87524 -3143
6913c143j74994o3613K71037O9661l2807k41510K71656L6414j29244L8605J74940
$$ -3143 -178137 -241750 29287 98948 66141 -175369 96287 132701 3457 42062 217002
6902B17002k94065R4439N4332m5480J6075j51278J08678p3327j4630J06694j13270
$$ 217002 -77063 17376 71708 26228 42303 -108975 -297 -73624 -88254 18440 -94830
6891i4830J46873p7045J70106l6093j22594j76555N2888K33322k21279n0038R1205
$$ -94830 52043 -25002 145104 109011 -13583 -190138 -137250 96072 -125207 -175245 -84040
6880h4040M9871m1131k0273J02739R2298k5124n8753j7374O4556R2949K40104
$$ -84040 -34169 -75300 -95573 7166 99464 74340 15587 -1787 62769 155718 395822
6869C95822k10791j31207Q8319k1168j49072o327J17673p6310m3517m8984J09445
$$ 395822 185031 53824 142143 120975 -28097 -34424 83249 6939 -36578 -85562 23883
6858B3883k05189j31782L26948p4639m097N7536o588j19661n0345p4892O3024
$$ 23883 -181306 -313088 13860 -60779 -64876 -7340 -13928 -133589 -183934 -258826 -195802
6847a95802L4513K2979p3964J44400J487O1537q2882J04668j48896N6893K62579
$$ -195802 -161289 -138310 -212274 -67874 -66387 -4850 -87732 16936 -131960 -75067 187512
6836A87512p435j67951r2020P3698k8874q5937R9721P8981j58894P5808L5922
$$ 187512 180077 12126 -79894 -6196 -35070 -121007 -21286 57695 -101199 -25391 10531
6825A0531O4462K5110j3855j02445j36015Q410P3156K40058j03233j51531R7281
$$ 10531 74993 100103 86248 -16197 -152212 -143802 -70646 169412 66179 -85352 11929
6814A1929J26158o1764j12058o5412j26257N9604k14J07570J56913l2337k00360
$$ 11929 138087 76323 -35735 -101147 -227404 -167800 -168014 -60444 96469 64132 -136228
6803a36228j2935K12j4061L2558M5518P457M4168Q2725n8894k6098J20043j89573
$$ -136228 -149163 -148951 -163012 -130454 -84936 -77479 -33311 49414 -9480 -35578 84465 -105108
6791a05108R2632N6569j53618J14408j35588J9315J69039j02504p7883L7880q5814
$$ -105108 -12476 44093 -109525 4883 -130705 -111390 57649 -44855 -122738 -84858 -170672
6780a70672K580r7208J44992l0905n9814m335J40173J76629n5238j09003r9743
$$ -170672 -168092 -265300 -120308 -151213 -211027 -215362 -75189 101440 46202 -62801 -162544
6769a62544Q2710L31770j8741o3062m599r6583n3461j57288j19095n3152L40340
$$ -162544 -79834 251936 233195 170133 165534 68951 15490 -141798 -260893 -314045 26295
6758B6295J33508p267O2303k0243r3467j49739p5833m4571l2805K5519q9227M07424
$$ 26295 159803 152536 214839 194596 101129 -48610 -124443 -169014 -201819 -176300 -265527 141897
6746A41897p190p3602J1104J53844m8244j24812j67294j4691K83155r5011K3749
$$ 141897 134707 61105 72209 226053 177809 52997 -114297 -128988 154167 59156 82905
6735H2905L0397P4011k8666j72224L6987q084k9079m7648l0647O231N9109P4359
$$ 82905 113302 187313 158647 -13577 23410 15326 -13753 -61401 -92048 -85817 -26708 47651
6723D7651k681j19963N717K93798k1128n7221k43711j34577J28361Q1230j46543
$$ 47651 44970 -74993 -69276 224522 203394 146173 -97538 -232115 -103754 -22524 -169067
6712a69067j8467J13347l1860K57725j41915j94282K7549L5941k2125R4783j82276
$$ -169067 -187534 -74187 -106047 151678 9763 -184519 -156970 -121029 -143154 -48371 -230647
6701b30647m2989K32490J3213r8084j68412J76159k00897R733K13093r738K40575
$$ -230647 -273636 -41146 -27933 -126017 -294429 -118270 -319167 -309434 -96341 -106079 134496
6690A34496k06273j19802J45213L2781l9717j63683M4163O699J26456K68042n2517
$$ 134496 -71777 -191579 -46366 -13585 -53302 -216985 -172822 -166123 -39667 228375 175858
6679A75858j18394q4983m916r0858j46499J68992K48333j74427l7734j03231o0775
$$ 175858 57464 -27519 -32435 -123293 -269792 -100800 147533 -26894 -64628 -167859 -228634
6668b28634p9535m5466j1334O2598j03756L6116R2302R8421R2671q5846J50923
$$ -228634 -308169 -353635 -364969 -302371 -406127 -370011 -277709 -179288 -86617 -172463 -21540
6657b1540o0223k3385M334J20631o5953n4420q8831K53455P9059j80144j57275
$$ -21540 -81763 -105148 -100814 19817 -46136 -100556 -189387 64068 143127 -37017 -194292
6646a94292n4359N7720l8112n2263K23788M7384j45430K8232M2291j02048q4026
$$ -194292 -248651 -190931 -229043 -281306 -57518 -10134 -155564 -127332 -85041 -187089 -271115
6635b71115J68617N0367j0715k143J10172K6286k33634j51022J45727k42388R5093
$$ -271115 -102498 -52131 -62846 -64989 45183 71469 -162165 -313187 -167460 -409848 -314755
6624c14755J78500n5349j6834N2423K77834j36567j797J26975j39732M6144J07993
$$ -314755 -136255 -191604 -208438 -156015 121819 -14748 -16545 110430 -29302 16842 124835
6613A24835r6298J9765m1366J08729k17300P6453n8640m2051J7075j9962J56340
$$ 124835 28537 48302 6936 115665 -101635 -25182 -83822 -125873 -108798 -128760 27580
6602B7580J12777j20210J7354L10205j2409j02177l5056j83077l2874J68953q5505
$$ 27580 140357 20147 37501 347706 335297 233120 198064 14987 -17887 151066 65561
6591F5561l7387p24J66056r8243q1594J10655P4159O5431L3539k14588L4346O3802
$$ 65561 28174 27450 193506 95263 13669 124324 198483 263914 297453 82865 117211 181013
6579A81013L0843J89625k28898j67281O0703J82378P8437J13861q8333k94036
$$ 181013 211856 401481 172583 5302 66005 248383 326820 440681 352348 58312
6569E8312j08841L32667p6621k82241O8553J83796R7848q5302j44028J76874M3358
$$ 58312 -50529 282138 205517 -76724 -8171 175625 273473 188171 44143 221017 264375
6558B64375P0355J12215m6885M7581j64739j11444p8230K7538O5014M4164Q5024
$$ 264375 334730 446945 400060 447641 282902 171458 93228 120766 185780 229944 314968
6547C14968l3514m2320Q9759J15912j28926L8619Q0886m1381J19711O6995j24242
$$ 314968 281454 239134 328893 444805 315879 354498 435384 394003 513714 580709 456467
6536D56467k81922O9456q7120m4569K52813N4415q2620R2338j02927K60541m3384
$$ 456467 174545 244001 156881 112312 365125 419540 336920 429258 326331 586872 543488
6525E43488N0330P2626K4608j15197o0851j19115j21572K24116J12355N0998N0713
$$ 543488 593818 666444 691052 575855 515004 395889 274317 498433 610788 661786 712499
6514G12499J11556j17840N088n7439j4417O2635J04821L3375J4813j28407Q5057
$$ 712499 824055 706215 711303 653864 639447 702082 806903 840278 855091 726684 811741
6503H11741L03451k25395K8836j0175j6024K149J73053K33051j72921P1860M1364
$$ 811741 1115192 889797 918633 908458 892434 894583 1067636 1300687 1127766 1199626 1240990
6492A240990J24068J32532J23745q7637N1668j38250O4455J59936O6847L14600
$$ 1240990 1365058 1497590 1621335 1533698 1585366 1447116 1511571 1671507 1738354 2052954
6482B052954j38324K6336J59475J09218j50485M5683O7373J64470K07608J49226
$$ 2052954 1914630 1940966 2100441 2209659 2059174 2104857 2172230 2336700 2544308 2693534
6472B693534J01673K17670J48286J26408M44198J57774J75282L56050M34337L26159
$$ 2693534 2795207 3012877 3161163 3287571 3731769 3889543 4064825 4420875 4855212 5181371
6462E181371L96698O24709P82958N12022Q45423J024875J128968J619292K080131
$$ 5181371 5578069 6202778 6985736 7497758 8343181 9368056 10497024 12116316 14196447
6453A4196447K525353K726582K959763K138281P10679n68055j793499k877714
$$ 14196447 16721800 19448382 22408145 24546426 25257105 24689050 22895551 20017837
6445B0017837k999157k854409k391004j761138j471734j113202p86041q73895
$$ 20017837 17018680 14164271 11773267 10012129 8540395 7427193 6641152 5767257
6437E767257p89472n92439m46052l06784j58099l09843j47439k72087k09532j22561
$$ 5767257 4977785 4385346 3939294 3632510 3474411 3164568 3017129 2745042 2535510 2412949
6427B412949K3433r0003l01115j05613n483j29940j50468K63496k25609j36205
$$ 2412949 2436382 2346379 2045264 1939651 1934168 1804228 1653760 1917256 1691647 1555442
6417A555442j74252l3331m8404r6956j43068j9182m1903R8663M896n3276j48114
$$ 1555442 1381190 1347859 1299455 1202499 1059431 1040249 998346 1097009 1101905 1048629 900515
6406I00515m9700Q1076j02556p9376P9124J20839O7510j94361o6202q34o5143
$$ 900515 850815 931891 829335 749959 829083 949922 1017432 823071 756869 756035 690892
6395F90892J472j9268k4368k1895k13002j01826J62890L803l0482J04452o5333
$$ 690892 692364 673096 648728 626833 413831 312005 474895 478698 448216 552668 487335
6384D87335n5240o6934J72005N0924j8069J69090M3480o4965j41735m5383n4677
$$ 487335 432095 365161 537166 588090 570021 739111 782591 717626 575891 530508 475831
6373D75831p3600m0605r719n9796k8010K50240K8609k2848J03262j16889r9853
$$ 475831 402231 361626 351907 292111 264101 514341 542950 520102 623364 506475 406622
6362D06622j02643K98861J13237P1215K45070k83102O4408J32637K20801K87175
$$ 406622 303979 602840 716077 787292 1032362 749260 813668 946305 1167106 1454281
6352A454281L3580L52143J61512r6915K536k47477j59656r7241k40400j14088
$$ 1454281 1487861 1840004 2001516 1904601 1907137 1659660 1500004 1402763 1162363 1048275
6342A048275m19463m4716r531j41352q0638M2634l3843K44880k23203P6930n1973
$$ 1048275 628812 584096 574565 433213 352575 395209 361366 606246 383043 459973 408000
6331D08000N3647q5120k79670J42251J32693K2092k097J3173q2950l0491r0320
$$ 408000 461647 376527 96857 239108 371801 393893 391796 404969 322019 291528 201208
6320B01208j00369O2989j6339K0188Q6681n9535j82749q678r328J32962l1216
$$ 201208 100839 163828 147489 167677 254358 194823 12074 3396 -5932 127030 95814
6309I5814p55L9097J1690R9512N3660o9737k05180j178J33080r0143k7259K03330
$$ 95814 95059 134156 145846 245358 299018 229281 24101 22923 156003 65860 38601 241931
6297B41931j03540J01556n8846n2260k3298J51921j30319j36866K04353M2523
$$ 241931 138391 239947 181101 128841 105543 257464 127145 -9721 194632 237155
6287B37155l90741j76834L19830J89160l2143j00292j09766k7278k45019j4405
$$ 237155 -153586 -330420 -10590 178570 146427 46135 -63631 -90909 -335928 -350333
6277c50333J14860M1172P9226L0474N4070J40753j06548P7711J1432q4621o2846
$$ -350333 -235473 -194301 -115075 -84601 -30531 110222 3674 81385 92817 8196 -54650
6266e4650R7982k9292j01557k4793P5155J34126j0719J2573n0662p1102J29978
$$ -54650 43332 14040 -87517 -112310 -37155 96971 86252 98825 48163 -22939 107039
6255A07039L1334j36098p9870j68000R8206M4814K880l2533P6800J28682l5917
$$ 107039 138373 2275 -77595 -245595 -147389 -102575 -99695 -132228 -55428 73254 37337
6244C7337j52185l8810K78882p1742J0643n725j27753P1478J50488j42961q3607
$$ 37337 -114848 -153658 125224 53482 64125 58400 -69353 2125 152613 9652 -73955
6233g3955J31314j55738j13079m3159j86312J98851L24767j4666j85565q6652
$$ -73955 57359 -98379 -211458 -254617 -440929 -242078 82689 68023 -117542 -204194
6223b04194j44172L53808J49780m316R5496j46652J8189j34689n1471J10914j70465
$$ -204194 -348366 5442 155222 150906 246402 99750 117939 -16750 -68221 42693 -127772
6212a27772j63103N8288j02870L7845J82843J21220K5968M7526Q189J33611j04547
$$ -127772 -290875 -232587 -335457 -297612 -114769 6451 32419 79945 88134 221745 117198
6201A17198j01287k71214J64427L0186M7986k8001P6149K00837M1392R734k29214
$$ 117198 15911 -255303 -90876 -60690 -12704 -40705 35444 236281 277673 287407 58193
6190E8193k8990R9151r2687r4780j5811R8095N1719m1361R6991j2965n9597P4663
$$ 58193 29203 128354 35667 -59113 -74924 23171 74890 33529 130520 117555 57958 132621
6178A32621k8969o8651j6528R4946k9638j12137J9994n0877j51403J28755J29776
$$ 132621 103652 35001 18473 113419 83781 -28356 -8362 -59239 -210642 -81887 47889
6167D7889R4239k65750q315R6245m6423j1774n1469Q0578l767J6081q118L1657
$$ 47889 142128 -123622 -131937 -35692 -82115 -93889 -145358 -64780 -68547 -52466 -60584 -28927
6155b8927N2773J10762O837r1645j25804j71262P7582J20592M3174J6127n8608
$$ -28927 23846 134608 141445 49800 -76004 -247266 -169684 -49092 -5918 10209 -48399
6144d8399M4382J07612N8612K2716k23795k25460j6457k7767K54087J32459p0148
$$ -48399 -4017 103595 162207 184923 -38872 -264332 -280789 -308556 -54469 77990 7842
6133G842q2562J01799j00240K1683L1425O9608N452k7216n6433M3361m1085j92885
$$ 7842 -74720 27079 -73161 -51478 -20053 49555 55007 27791 -28642 14719 -26366 -219251
6121b19251K84833r9975k324J01923k75720M5312J25198N7580j8192J57139j56819
$$ -219251 65582 -34393 -36717 65206 -210514 -165202 -40004 17576 -616 156523 -296
6110b96M9325j1813j07613j6584O0732N2925k1042o0714J19457M3765j81828J25391
$$ -296 49029 37216 -70397 -86981 -26249 26676 5634 -55080 64377 108142 -73686 51705
6098E1705J40396j33800j00056k7083Q138M9668J17057J48422k3129j08519Q2112
$$ 51705 192101 58301 -41755 -68838 -60700 -11032 106025 254447 231318 122799 204911
6087B04911L3596r5340k02150J48607n4513j4343n8841J53041R877N7687j26973
$$ 204911 238507 143167 -58983 89624 35111 20768 -38073 114968 124845 182532 55559
6076E5559j75374J22965j64077J90825M1093N7513O260K2208j66872J35829p5971
$$ 55559 -119815 3150 -160927 29898 70991 128504 134764 156972 -9900 125929 49958
6065D9958o1428m652k10714j4686J70509K22885q8784J07588K8539j11518k0643
$$ 49958 -11470 -16122 -226836 -241522 -71013 151872 63088 170676 199215 87697 67054
6054F7054j01010j21967M7749J16735K7869J40102j428O076K0253R50k27424M2796
$$ 67054 -33956 -155923 -108174 8561 36430 176532 175104 181180 201433 202383 -25041 17755
6042A7755l2384J67305Q8040j48291k78703l7549L22089Q0061j51170P2554P7510
$$ 17755 -14629 152676 240716 92425 -186278 -223827 98262 178323 27153 99707 177217
6031A77217O8236m0993j8065j02108R7727n8580r292P7223o8057k08060o096M0969
$$ 177217 245453 204460 186395 84287 182014 123434 114142 191365 123308 -84752 -90848 -49879
6019d9879Q9869J68223m7881m9j36472P8575r515j3939O1656J03318r8229O3217
$$ -49879 39990 208213 160332 160283 23811 102386 92871 78932 140588 243906 145677 208894
6007B08894k03265J41677l3461j42710O5589R6082m6948j78380J9439k136K27823
$$ 208894 5629 147306 113845 -28865 36724 132806 85858 -92522 -73083 -75219 152604
5996A52604J11904j66696j06273K4818k7297j44519n1570L20661Q7429k14204
$$ 152604 264508 97812 -8461 16357 -10940 -155459 -207029 113632 201061 -13143
5986a3143J64579l8051r1162N079K0886k2840p9207Q2616K16826J03550q6556
$$ -13143 151436 113385 22223 27302 48188 25348 -53859 28757 245583 349133 262577
5975B62577J53760o8476j85072k31903j5978k1516L37762p5577j19712J86687
$$ 262577 416337 347861 162789 -69114 -85092 -106608 231154 155577 35865 222552
5965B22552j8214k21755n5219J41107P4424j27552r5051j76857Q1960K5092K7549
$$ 222552 204338 -17417 -72636 68471 142895 15343 -79708 -256565 -174605 -149513 -121964
5954a21964L1498Q8265J21814J18427k6987r0503N7330k16484J658R0405K2264
$$ -121964 -90466 -2201 119613 238040 211053 120550 177880 -38604 -36946 53459 75723
5943G5723j20529J47166r2123n9460p3338J73747q7585m8260J3225Q9009P6072
$$ 75723 -44806 102360 10237 -49223 -122561 51186 -36399 -84659 -71434 17575 93647
5932I3647j60105k4835P1361Q5272P4772j33332K5782J21j1539J11555O403q1516
$$ 93647 -66458 -91293 -19932 65340 140112 6780 32562 32683 21144 132699 139102 57586
5920E7586j63688q692J2357n827l8101r5890K68213J82129Q4630l560l01851p9916
$$ 57586 -106102 -114794 -102437 -108264 -146365 -242255 25958 208087 292717 289157 -12694 -92610
5908i2610M918Q8098K74607M2949N317k50227M2617j3233k3064r0422j32389j1805
$$ -92610 -87692 406 275013 317962 323279 73052 115669 102436 79372 -11050 -143439 -155244
5896a55244k1093J46062k3745N6799l4421n9339j17354K15331J09975k47385J11563
$$ -155244 -176337 -30275 -54020 2779 -31642 -90981 -208335 6996 116971 -130414 -18851
5885a8851K00346n8571j01527J05574N4597P3429r1938j14340j1167K0984k485
$$ -18851 181495 122924 21397 126971 181568 254997 163059 48719 37552 58536 56051
5874E6051L6269k23549K9356K45441j56118j46119M5146Q8042J04737J68446q6813
$$ 56051 92320 -131229 -101873 143568 -12550 -158669 -113523 -25481 79256 247702 160889
5863A60889k1078Q9566n4803j81539l3583J84347j51731r0598P1435j04555p150
$$ 160889 139811 229377 174574 -6965 -40548 143799 -7932 -98530 -27095 -131650 -138800
5852a38800R0997Q4550o7230N4841p2921O0357R6519j60599k3463L05688j21423
$$ -138800 -47803 36747 -30483 24358 -48563 11794 108313 -52286 -75749 229939 108516
5841A08516K7394j26065p5559K87711R441k46446Q2999K2364J8294L2528k28189
$$ 108516 135910 9845 -65714 221997 231438 -15008 67991 90355 108649 141177 -87012
5830h7012N5435J92219j60182o0931q1800O3768J15324n0126j3377O9718n7327
$$ -87012 -31577 160642 460 -60471 -142271 -78503 36821 -13305 -26682 43036 -14291
5819a4291N8448J4656p6097J55342K7762j13781k8391J70607j73973m9657N6477
$$ -14291 44157 58813 -17284 138058 165820 52039 23648 194255 20282 -29375 27102
5808B7102J61535N9292k23952j1383q860o1324L49725J02779j16215o7363k60105
$$ 27102 188637 247929 23977 12594 3734 -57590 292135 394914 278699 211336 -48769
5797d8769j7051q9358J01442p7386p1678J4582j219J13825r1162O2439J87933
$$ -48769 -65820 -155178 -53736 -131122 -202800 -188218 -189437 -75612 -166774 -104335 83598
5786H3598K6225Q5604J0470j82280r0841J62434O8744j56322M7972k3653L3596
$$ 83598 109823 195427 205897 23617 -67224 95210 163954 7632 55604 31951 65547
5775F5547R0121Q9721m0299j42186r6814o9379q2059J19671l2978j5057Q6281
$$ 65547 155668 245389 205090 62904 -33910 -103289 -185348 -65677 -98655 -113712 -27431
5764b7431p3740j62986J30488J60552j9513K454j49754n5711N213J85476j06163
$$ -27431 -101171 -264157 -133669 26883 7370 9824 -139930 -195641 -190428 -4952 -111115
5753a11115J13589j44766n093K8241j246p041R0791K76077j29344j10064j35828
$$ -111115 2474 -142292 -147385 -119144 -120390 -127431 -36640 239437 110093 29 -135799
5742a35799Q3224o2761M5528j166K53744j57458R7993n0592m3060l3668j3044
$$ -135799 -52575 -115336 -69808 -70974 182770 25312 123305 72713 29653 -4015 -17059
5731a7059K15062k20708J8801J4876K1037J44064K00513j74772j96355m7692m5755
$$ -17059 198003 -22705 -3904 10972 32009 176073 376586 201814 5459 -42233 -87988
5720h7988J71488r7174j09403R7462M1774n361R6307P4730l7459k51422J56863
$$ -87988 83500 -13674 -123077 -25615 16159 10798 107105 181835 144376 -107046 49817
5709D9817J93895m1344n3820k47437K66401K54349j60608Q2649k44880j02202
$$ 49817 243712 202368 148548 -98889 167512 421861 261253 343902 99022 -3180
5699c180o3903q4704K03007N8785j6434k00395J2773j08543J04348n4224N8964
$$ -3180 -67083 -151787 51220 110005 93571 -106824 -94051 -202594 -98246 -152470 -93506
5688i3506M2280N7294l6090o2338J28212n3317p8333n6330J62227M2799j42943
$$ -93506 -51226 6068 -30022 -92360 35852 -17465 -95798 -152128 10099 52898 -90045
5677i0045L4492O3480k10625K13430k33223r590O2579J78159J90508j24115m2962
$$ -90045 -55553 7927 -202698 10732 -222491 -232081 -169502 8657 199165 75050 32088
5666C2088O4875J01174j13485j51847R1574K4759n3754O2126p0254R1583q6389
$$ 32088 96963 198137 84652 -67195 24379 49138 -4616 57510 -12744 78839 -7550
5655g550J04576N3665J4316k8845j26909k1704J39385q8983J83395Q3962j31549
$$ -7550 97026 150691 165007 136162 9253 -12451 126934 37951 221346 305308 173759
5644A73759k41120Q1917Q9607L9867k1889m0932J10127q7259j8668l0551k3477
$$ 173759 -67361 14556 104163 144030 122141 81209 191336 104077 85409 54858 31381
5633C1381j43250j01554j7760J59134p7210N058J63648J9891J47499J54557Q732
$$ 31381 -111869 -213423 -231183 -72049 -149259 -144201 19447 39338 186837 341394 350126
5622C50126j94754j04192J4125J39089j97653L7253j7044Q515K4774R8278L7824
$$ 350126 155372 51180 65305 204394 6741 43994 26950 35465 60239 158517 196341
5611A96341J13927k67059r0416K34799j00943Q5926N721J47785o2621p8223j62934
$$ 196341 310268 43209 -47207 187592 86649 172575 178296 326081 263460 185237 22303
5600B2303K9058K9498k2963l4456J5237M6635j06949j11625J7775M2447J70411
$$ 22303 51361 80859 57896 23440 38677 85312 -21637 -133262 -115487 -73040 97371
5589I7371m1840J8817j52530k04764Q3007J71232q0957K01820Q3257j99286J60159
$$ 97371 55531 74348 -78182 -282946 -199939 -28707 -109664 92156 175413 -23873 136286
5578A36286L6264k06066K3864o3419K28974J43816j39508M7417J22041j20983
$$ 136286 172550 -33516 -9652 -73071 155903 299719 160211 207628 329669 208686
5568B08686Q5720k6619j18981R102j10249R5803j47588O5685R9796P2608o4385
$$ 208686 294406 267787 148806 157908 47659 143462 -4126 61559 161355 233963 169578
5557A69578p0570j1251M1794j6306j79006j45108J94725J40188n6847j16242M9529
$$ 169578 99008 87757 129551 113245 -65761 -210869 -16144 124044 67197 -49045 484
5546D84Q6919l1755J37794j90194O4744P2891M8121J81439p7382o531J699J9614
$$ 484 87403 55648 193442 3248 67992 140883 189004 370443 293061 286530 288229 307843
5534C07843j45100l43103p6657K44657Q322J52394N0717p5869N582n1876L9846
$$ 307843 162743 -180360 -257017 -12360 -4038 148356 199073 123204 128786 76910 116756
5523A16756J24401j22378o5122n8415J49097K6967J58473j10232q1440O9043K0130
$$ 116756 241157 118779 53657 -4758 144339 171306 329779 219547 138107 207150 227280
5512B27280j0104N7658m0240j05325n0228L7410L2162l2434O2858M8212M4310
$$ 227280 217176 274834 234594 129269 79041 116451 148613 116179 179037 227249 271559
5501B71559Q1065k8136m7920j07716k07850K78449j1354j0423K7360q6230Q6416
$$ 271559 352624 324488 276568 168852 -38998 239451 228097 217674 245034 158804 245220
5490B45220L83Q9393J23866j38098r9706J27232J04863j48266J37266J12133k7870
$$ 245220 245603 334996 458862 320764 221058 348290 453153 304887 442153 554286 526416
5479E26416O4015Q5203P3458l9468j16326L1928K54891O0334J16254L96218J25632
$$ 526416 590431 675634 749092 709624 593298 625226 880117 940451 1056705 1452923 1578555
5468A578555K23574J52024N20225K29286K69384j32066m87040l60240k65156j99056
$$ 1578555 1802129 1954153 2474378 2703664 2973048 2840982 2353942 1993702 1728546 1529490
5458A529490m06584k16399p2375k20799J8406k3024o3409J08991r1370j27013
$$ 1529490 1122906 906507 834132 613333 631739 608715 545306 654297 562927 435914
5448D35914p7420j23447n5981O6879L9826m7281P8919q0348p1872O6387p325N1998
$$ 435914 358494 235047 179066 245945 285771 238490 317409 237061 165189 231576 224251 276249
5436B76249k9767K88K75786n1042k44400N6900P8051L74l7947j30909P26Q4096
$$ 276249 246482 246770 522556 471514 227114 284014 362065 362439 324492 193583 194309 278405
5424B78405M9222N9828j09181j33936r8820J23507L3331Q3641J7669j29197K11309
$$ 278405 327627 387455 278274 144338 45518 169025 202356 285997 303666 174469 385778
5413C85778O1059j34087q1877l9619k7086R2238N2563j14234j0339q0014L30641
$$ 385778 446837 312750 230873 191254 164168 256406 308969 194735 184396 104382 435023
5402D35023p6936j44520m9216J14269O4155q0625r1787J51255j17481k6598J47292
$$ 435023 358087 213567 164351 278620 342775 262150 170363 321618 204137 177539 324831
5391C24831j18009j04384j40736k0503K29139N0603M0054K2374o6464j61215J48445
$$ 324831 206822 102438 -38298 -58801 170338 220941 260995 283369 216905 55690 204135
5380B04135N2935n408m6074R9827o4249k15129N8367J91293j04709o0335R4708
$$ 204135 257070 251662 205588 305415 241166 26037 84404 275697 170988 110653 205361
5369B05361P8075p0821J21959K3071j78375j9542m8310J43412k88190R2738k6596
$$ 205361 283436 212615 334574 357645 179270 159728 111418 254830 -33360 59378 32782
5358C2782J97569K8829l0815J24456o5415J48484j98731j56712K17856L4006L8498
$$ 32782 230351 259180 228365 352821 287406 435890 237159 80447 298303 332309 370807
5347C70807n3898j84028M7618q3892k4850J44654k6858J053m8129L2783j71879
$$ 370807 316909 132881 180499 96607 71757 216411 189553 190606 142477 175260 3381
5336C381P2486j38919j9667L9779K8457O3112l766J1679K14178j01859k5257r3467
$$ 3381 75867 -63052 -82719 -42940 -14483 48629 44863 56542 270720 168861 143604 50137
5324E0137O315J24691q990J034l2669l4228Q5549N1921r551R9563n1572J8965
$$ 50137 56452 181143 172153 173187 140518 106290 191839 243760 234209 333772 282200 301165
5312C01165r8357M1390l5921P3469j6803L91q1116K5184j67828M2812J41565L8102
$$ 301165 202808 244198 208277 281746 264943 265334 184218 209402 41574 84386 225951 264053
5300B64053J9352L56J3992j24751k3119j75761P3337J2005j04248J43390Q7620
$$ 264053 283405 283761 297753 173002 149883 -25878 47459 59464 -44784 98606 186226
5289A86226M9604l0903n7545J848J6077j66247J4218K11958n3638l05530K30660
$$ 186226 235830 204927 147382 149230 165307 -940 13278 225236 171598 -133932 96728
5278I6728J89344m4008O3106L3530k86429J6867o4383j37822K35343J59589m5790
$$ 96728 286072 242064 305170 338700 52271 69138 4755 -133067 102276 261865 216075
5267B16075k18850R2765J28000Q6171l3551j05284J38996n197j63413l7033J33402
$$ 216075 -2775 89990 217990 304161 270610 165326 304322 299125 135712 98679 232081
5256B32081r713o743J43922j81426m6058m5331J53228P132j43166n7358N2758
$$ 232081 222368 215625 359547 178121 132063 86732 239960 247092 103926 46568 99326
5245I9326J12446o8628K9096Q2400j42851J31925j4402M8202j84811k6251P5712
$$ 99326 211772 143144 172240 254640 111789 243714 229312 277514 92703 66452 142164
5234A42164q8160j49760j44396J52238J72595P5990j13875Q7606N6851l5160o3444
$$ 142164 54004 -95756 -240152 -87914 84681 160671 46796 134402 191253 156093 92649
5223I2649N4765K5240k30909q1273L30162N5243k03345R0919Q3640J36760k2692
$$ 92649 147414 172654 -58255 -139528 190634 245877 42532 133451 217091 353851 331159
5212C31159j89951l8446L4394R76l8881M6748j51791r8174J285J26192L9146J677
$$ 331159 141208 102762 137156 138132 99251 145999 -5792 -103966 -102681 23511 62657 64334
5200F4334n0951J539O4302q1843k5020J5597J23099J67206J14739q9045j62232
$$ 64334 13383 14922 79224 -2619 -27639 -12042 111057 278263 393002 303957 141725
5189A41725K4344L9311k0373Q5957p2813k41584J24432R388l81566J3501L48715
$$ 141725 166069 205380 185007 270964 198151 -43433 80999 90387 -291179 -277678 71037
5178G1037J23935K15984j65842l0177m4733K5047p9225J2366q0j0049j11382j24552
$$ 71037 194972 410956 245114 214937 170204 195251 116026 128392 128312 118263 6881 -117671
5166a17671R6756P239J38497J34928L3884p7781R896j37373M3280L3849m0088
$$ -117671 -20915 -13676 124821 259749 293633 215852 225748 88375 131655 165504 125416
5155A25416Q4304Q7385j32075j43467K8431J13379j52537R6501J56336N3021j1994
$$ 125416 209720 297105 165030 21563 49994 163373 10836 107337 263673 316694 304700
5144C04700j06448n9414J64811L5946P7478j53214k80568Q845R348j11253J89258
$$ 304700 198252 138838 303649 339595 417073 263859 -16709 -7864 1484 -109769 79489
5133G9489M5058K9741M9136P0391m3036j0779Q6315o1758j96920J6021P3598k66875
$$ 79489 124547 154288 203424 273815 230779 220000 306315 244557 47637 63658 137256 -129619
5121a29619o8618K65514J03681j8801j3838l833j4855J3545o4647Q29M7892j22995
$$ -129619 -198237 67277 170958 152157 138319 134486 119631 133176 68529 69358 117250 -5745
5109e745L5581P7183m9012L4104k1904o6009M39400k46761l7523N2156j28662
$$ -5745 29836 107019 58007 92111 70207 4198 443598 196837 159314 211470 82808
5098H2808M8637J49618k48652J08312J83173q3161j84477j3706N6726l5453j1747
$$ 82808 131445 281063 32411 140723 323896 240735 56258 42552 99278 63825 52078
5087E2078J71588j8632q6785m6544l8213L9235J18845P0162n1554j23660J6591
$$ 52078 223666 205034 118249 71705 33492 72727 191572 261734 210180 86520 103111
5076A03111j73550Q1694n1204j05133J98546M3125k3441J4301L081o6657R7125
$$ 103111 -70439 11255 -39949 -145082 53464 96589 73148 87449 90530 23873 120998
5065A20998M5048J55750J1140n4740l3311J16795p3685j27306P859Q2307j07729
$$ 120998 166046 321796 332936 278196 244885 361680 287995 160689 168548 250855 143126
5054A43126j0999p6449Q1895j1823M9342K4025j93393l5632J48490m2450P858
$$ 143126 132127 55678 137573 125750 175092 199117 5724 -29908 118582 76132 83990
5043H3990J14311N5712p4663j93397r2641J83418l1844P0053k06901K71043q0595
$$ 83990 198301 254013 179350 -14047 -106688 76730 44886 114939 -91962 179081 98486
5032I8486q1346J02785p5122K15429j42350j06239Q1771K8453j32254k8790K10987
$$ 98486 17140 119925 44803 260232 117882 11643 93414 121867 -10387 -39177 171810
5021A71810j33943j32333J54571J26888J0572r7014J23818j54630j98284q717
$$ 171810 37867 -94466 60105 186993 197565 100551 224369 69739 -128545 -137262
5011a37262K02565j22208m7020o8913J49844Q3447J73786R5953l4149q1644k03406
$$ -137262 65303 -56905 -103925 -172838 -22994 60453 234239 330192 296043 214399 10993
5000A0993k20931K49359K94953L4400q4954j00114M1464j22164J97223O9779l4547
$$ 10993 -209938 39421 334374 368774 283820 183706 225170 103006 300229 370008 335461
4989C35461l8323r3508K5511J45608j28823o2574l0615r681P6156K0523p6809
$$ 335461 297138 203630 229141 374749 245926 183352 152737 143056 219212 239735 162926
4978A62926J01486r5673j12366r6634J48090j07744J7466J44726M0008m6185n9693
$$ 162926 264412 168739 56373 -40261 107829 85 17551 162277 202285 156100 96407
4967I6407J09297j19131j34599p6374k7384O5191J66332k4400j8846k7966j7412
$$ 96407 205704 86573 -48026 -124400 -151784 -86593 79739 55339 36493 8527 -8885
4956h885N920J46221p2684M3146R4467m8745r2348J00376q8682P5083J66095J10255
$$ -8885 -2965 143256 70572 113718 208185 159440 67092 167468 78786 153869 319964 430219
4944D30219M4709k13302j42180k10794P7246J3025J00740L4683j59147l5541J14548
$$ 430219 474928 261626 119446 -91348 -14102 -1077 99663 134346 -24801 -60342 54206
4933E4206m3311l5149L2838j23874K06008p2185j41846N2280O4749J54155L4079
$$ 54206 10895 -24254 8584 -115290 90718 18533 -123313 -71033 -6284 147871 181950
4922A81950k51058J56624k11306p7529K31494P9318M1581Q2975j43296k4115p6794
$$ 181950 -69108 87516 -123790 -201319 30175 109493 151074 234049 90753 66638 -10156
4911a0156J0495J14097l1971j20484J03166J9913j8572K2253j54620R9782m5103
$$ -10156 339 114436 82465 -38019 65147 85060 66488 88741 -65879 33903 -11200
4900a1200j00207J45627K966j45410Q1375l8471r164j2175P3487p3209J74817
$$ -11200 -111407 34220 37186 -108224 -26849 -65320 -74484 -86659 -13172 -86381 88436
4889H8436J82123j62501m5210j41507J7371k728M0636J83284j15768j9861J621
$$ 88436 270559 108058 62848 -78659 -61288 -64016 -23380 159904 44136 24275 25896
4878B5896k11929J44490K24495j00126O1413j6598R305m5723j0711L4968r8899
$$ 25896 -186033 -41543 182952 82826 144239 127641 136946 91223 80512 115480 16581
4867A6581J18961M5032M3798n4780p4103k5040P891k608k74821J70197n0588j37983
$$ 16581 135542 180574 224372 169592 95489 70449 78340 75732 -199089 -28892 -79480 -217463
4855b17463R4985J80388J88361m0418P9255q7196p5731p1805j09190K02821J78340
$$ -217463 -122478 57910 246271 205853 285108 197912 122181 50376 -58814 144007 322347
4844C22347R8844j92019r5418m715j32227J56549j11446j65640J81658j9586P4511
$$ 322347 421191 229172 133754 129039 -3188 153361 41915 -123725 57933 38347 112858
4833A12858J06864J01955m7228k17878m4414K931J36973m7238j78315J18051o4461
$$ 112858 219722 321677 274449 56571 12157 15088 152061 104823 -73492 44559 -19902
4822a9902j9525J81902K00676k04328j02516M1829J10712j32952m0572m3224J60257
$$ -19902 -39427 142475 343151 138823 36307 78136 188848 55896 15324 -27900 132357
4811A32357j123n2841o5555l6444j24605P7975L18898Q943j67209j7000J04567
$$ 132357 131234 78393 12838 -23606 -148211 -70236 248662 257605 90396 73396 177963
4800A77963l8276l7318J9446o5942o0863M7798L2797J51524M7293j29833j62957
$$ 177963 139687 102369 121815 55873 -4990 42808 75605 227129 274422 144589 -18368
4789a8368L9279j2417J34353k8512Q8966m3539k38133R3426J28278p4304R4001
$$ -18368 20911 8494 142847 114335 203301 159762 -78371 15055 143333 69029 163030
4778A63030P0088j48602j10539k8745p7192J91659k8820j49741M875J76267R0929
$$ 163030 233118 84516 -26023 -54768 -131960 59699 30879 -118862 -113987 62280 153209
4767A53209o543K5438K9603J55464k0662j60349l3606M56r4326r5402J5047n4767
$$ 153209 146666 172104 201707 357171 336509 176160 142554 143010 48684 -46718 -31671 -86438
4755h6438Q1270p7849J35025J37716k04187j36084J74022P0593m4740K1487J15851
$$ -86438 -5168 -83017 52008 189724 -14463 -150547 23475 94068 49328 70815 186666
4744A86666Q2836j23493J84087o7430l92372K09051K9341k49519J15270K23486
$$ 186666 269502 146009 330096 262666 -129706 79345 108686 -140833 -25563 197923
4734A97923J7409o3385M6713l2081j64480J99831k8978n7782K19726j04088o5836
$$ 197923 215332 151947 198660 166579 2099 201930 172952 115170 334896 230808 164972
4723A64972J02533K0777Q6697K6046j94707j29506K10833o1778j05995j13058
$$ 164972 267505 288282 374979 401025 206318 76812 287645 225867 119872 6814
4713F814K0361M3650J43470N8932j73770k91779M8467K75106R7037q3560j55308
$$ 6814 27175 70825 214295 273227 99457 -192322 -143855 131251 228288 144728 -10580
4702a0580j31213Q8401K36736j8519J8425J15323j14628N3480K2749j25604J91120
$$ -10580 -141793 -53392 183344 164825 183250 298573 183945 237425 260174 134570 325690
4691C25690Q9681j08046j55447O6039L695j64575J88070p139q3033J78968r4484
$$ 325690 415371 307325 151878 217917 221612 57037 245107 237968 154935 333903 239419
4680B39419K2309k2791N318n5418l6901j35532p2201o5740L1672j4660J70952
$$ 239419 261728 238937 244255 188837 151936 16404 -55797 -121537 -89865 -104525 66427
4669F6427K2198O3679L2030M2316J5706j58394L7212p2771p9410J79131O7173
$$ 66427 88625 152304 184334 226650 242356 83962 121174 48403 -31007 148124 215297
4658B15297K11894J2478j70267J94495Q2513k78902J15912l01923R0905K00738
$$ 215297 427191 439669 269402 463897 546410 267508 383420 81497 172402 373140
4648C73140j2483j05529o8261J76145R4661j14338Q270j54247j14825J9706J45534
$$ 373140 360657 255128 186867 363012 457673 343335 351605 197358 82533 102239 247773
4637B47773O2769P6631O8234j67542j34090j618q8009j91579K29815P075P6979
$$ 247773 310542 387173 455407 287865 153775 152157 64148 -127431 102384 109459 186438
4626A86438O0907j83426j45518J5756K46005K17173j78563j42858o907J43084
$$ 186438 247345 63919 -81599 -65843 180162 397335 218772 75914 69007 212091
4616B12091K32125o7089m0946J6429j3361j5974p4r4461l1508R7158q5261m0791
$$ 212091 444216 377127 336181 352610 339249 323275 323201 228740 197232 294390 209129 168338
4604A68338l247J49585K1067K8127L3893j86849j5549m244o8960N8137P4455Q4422
$$ 168338 165091 314676 335743 363870 397763 210914 195365 191121 122161 180298 254753 339175
4592C39175j06623J06113M951N928K9503j46100m7269J04814k10587J90473J07626
$$ 339175 232552 338665 343616 349544 379047 232947 185678 290492 79905 270378 378004
4581C78004K42707N1896j01848j84083K7065l273j48403p3688J01260J72585j54314
$$ 378004 620711 672607 570759 386676 413741 410468 262065 188377 289637 462222 307908
4570C07908q8454P4024J67524j28716K36369k0950r7706N3161j43662k39554k6204
$$ 307908 219454 293478 461002 332286 568655 547705 449999 503160 359498 119944 93740
4559I3740J93648P941j3113r2053M9911l2633J967R2678J53962j28348J11459
$$ 93740 287388 295329 282216 190163 240074 207441 209408 302086 456048 327700 439159
4548D39159L0410j89255J02358J20079J04270J29251j35945p974R6308J84732
$$ 439159 469569 280314 382672 502751 607021 736272 600327 592353 688661 873393
4538H73393j08237k04644j62599N492J40112K05520p1780j11371J31272o4234
$$ 873393 765156 560512 397913 403405 543517 749037 677257 565886 697158 632924
4528F32924P9479j13800l1055M4641J64694K6693O5490k52604p6942J62625K25529
$$ 632924 712403 598603 567548 612189 776883 803576 869066 616462 539520 702145 927674
4517I27674J9036N8102q2802l7410K1556M7748J28474q8932m6535o7268m2376
$$ 927674 946710 1004812 922010 884600 906156 953904 1082378 993446 946911 879643 837267
4506H37267L4844L02587J54671P7271J64374J99842J24534J42420K63784K59553
$$ 837267 872111 1174698 1329369 1406640 1571014 1770856 1895390 2037810 2301594 2561147
4496B561147M93700K71785J82152j2752m59147k76771k71326k84274k98360j98413
$$ 2561147 3054847 3326632 3508784 3496032 3036885 2760114 2488788 2204514 1906154 1707741
4486A707741l67644k20329J89098n6716j07331n2874J7767p4008L2183O715k7668
$$ 1707741 1340097 1119768 1308866 1252150 1144819 1091945 1109712 1035704 1067887 1074602 1046934
4475A046934L6088k88616J19216P2018l6215M2625j09196J60354J9214j66831
$$ 1046934 1083022 794406 913622 985640 949425 992050 882854 1043208 1062422 895591
4465H95591R8333k24930J56006L88148j15219m9565m7871o5119m15351J70540
$$ 895591 993924 768994 925000 1313148 1197929 1148364 1100493 1035374 620023 790563
4455G90563j00165j35189j0421K85936K04632K2493N8311l7588j23774j38831
$$ 790563 690398 555209 544788 830724 1035356 1057849 1116160 1078572 954798 815967
4445H15967p9533J46194K80894j91723j34114J44827j46620O0289j35110l8662
$$ 815967 736434 882628 1163522 971799 837685 982512 835892 896181 761071 722409
4435G22409M31002R3821j47424K7270M2l13508m9610M43184n6575q0543J4235
$$ 722409 1153411 1247232 1099808 1127078 1127120 813612 764002 1207186 1150611 1070068 1084303
4424A084303k7464K03378J1180k27698m455K83238K08040l6678K01725J14832
$$ 1084303 1056839 1260217 1271397 1043699 1039244 1322482 1530522 1493844 1695569 1810401
4414A810401J41332k12532k11400l5127l2513K17656j37591o1442l00000K5387
$$ 1810401 1951733 1739201 1527801 1492674 1460161 1677817 1540226 1478784 1178784 1204171
4404A204171M1036J80908K1424J23414O1576j1268q1407K54240j53161j86858
$$ 1204171 1245207 1426115 1447539 1570953 1632529 1621261 1539854 1794094 1640933 1454075
4394A454075P1779J50551n9080L943J56089o131N2064J47483o27k10794j21174
$$ 1454075 1525854 1676405 1617325 1621268 1777357 1771226 1823290 1970773 1970146 1759352 1638178
4383A638178P8554J57945O1082j57178J23260J12989p9452M0834R0045j10656
$$ 1638178 1716732 1874677 1935759 1778581 1901841 2014830 1935378 1976212 2066257 1955601
4373A955601K7490J28214o745J20566J21005l3292J33833n5482n6250K4710J1612
$$ 1955601 1983091 2111305 2104560 2225126 2346131 2312839 2446672 2391190 2334940 2359650 2371262
4362B371262M903P3158J38732K8214k09844O3722O3859K7213O6233K43233M9541
$$ 2371262 2376165 2449323 2588055 2616269 2406425 2470147 2534006 2561219 2627452 2870685 2920226
4351B920226k2725M9543k01679J62400p8692k0879m5217J08901J12537m834p1324
$$ 2920226 2897501 2947044 2745365 2907765 2829073 2808194 2762977 2871878 2984415 2979581 2908257
4340B908257p1531J55990P8141l8584L53297j08537J09315l3342J48053J2414
$$ 2908257 2836726 2992716 3070857 3032273 3385570 3277033 3386348 3353006 3501059 3513473
4330C513473o4347r4328J73667L9024L16868Q27J03581l2157M5479J81370p6612
$$ 3513473 3449126 3354798 3528465 3567489 3884357 3885184 3988765 3956608 4002087 4183457 4106845
4319D106845L68065K8225o0643J11692K12281L2025K2583J38727J26505N4775
$$ 4106845 4474910 4503135 4442492 4554184 4766465 4798490 4821073 4959800 5086305 5141080
4309E141080L12414J41263l4149J94163J42373r0851j17820J76033K56093J27
$$ 5141080 5453494 5594757 5560608 5754771 5897144 5806293 5688473 5864506 6120599 6120726
4299F120726J63237K1326L30970K96597J19714J54348L05120K58369K63611K39119
$$ 6120726 6283963 6305289 6636259 6932856 7052570 7206918 7512038 7770407 8034018 8273137
4289H273137K64771l057K88021L01051J76095k8803L68785K58225J61738K73212
$$ 8273137 8537908 8534851 8822872 9123923 9300018 9271215 9640000 9898225 10059963 10333175
4279A0333175L60360K16754N75806K86929J4129M99559L83733L9649L69436M96239
$$ 10333175 10693535 10910289 11486095 11773024 11787153 12286712 12670445 12710094 13079530 13575769
4269A3575769N16084J55674J85655J95551J98418K07804J28638K72549M12001
$$ 13575769 14091853 14247527 14433182 14628733 14827151 15034955 15163593 15436142 15848143
4260A5848143N69122M78031L33397K95384M92402M02031K74408L43917N42060
$$ 15848143 16417265 16895296 17228693 17524077 18016479 18418510 18692918 19036835 19578895
4251A9578895M73476L82253L91324N89156P18406R01639P99513J035434J220734
$$ 19578895 20052371 20434624 20825948 21415104 22133510 23035149 23834662 24870096 26090830
4242B6090830P67517Q17249J438906J039806J123206J140111J206642J447587
$$ 26090830 26858347 27675596 29114502 30154308 31277514 32417625 33624267 35071854
4234C5071854J323878J333906J578476J579222J962418J907893K057335K295863
$$ 35071854 36395732 37729638 39308114 40887336 42849754 44757647 46814982 49110845
4226D9110845K409072K484038L108859K772887K993549L486993M064416M554126
$$ 49110845 51519917 54003955 57112814 59885701 62879250 66366243 70430659 74984785
4218G4984785N301905N530701O042110O548863P227999Q012123J0052319J1990042
$$ 74984785 80286690 85817391 91859501 98408364 105636363 113648486 123700805 135690847
4210A35690847J4386235J6423001J9238849K3174168L1144947M1727714N5361248
$$ 135690847 150077082 166500083 185738932 208913100 240058047 281785761 337147009
4203C37147009O1843323N7239572M3204602K5174767k2745677p4637074p8945370
$$ 337147009 398990332 456229904 499434506 524609273 501863596 427226522 348281152
4196C48281152o5365591m8738281l6854129k8453094k2730142j8262517j5154472
$$ 348281152 282915561 234177280 197323151 168870057 146139915 127877398 112722926
4189A12722926j2275146r877936q073091o676765n591404m772867l906348l817262
$$ 112722926 100447780 90569844 82496753 75819988 70228584 65455717 61549369 57732107
4181E7732107l608437l451154k913515k617635k122594j926768j749990j752574
$$ 57732107 54123670 50672516 47759001 45141366 43018772 41092004 39342014 37589440
4173C7589440j811541j923397j661798j809670j361354r45908j095543j070237
$$ 37589440 35777899 33854502 32192704 30383034 29021680 28075772 26980229 25909992
4165B5909992j019806r01378q96115n30703n83110n78773n32887l15597k97657
$$ 25909992 24890186 23988808 23092693 22561990 21978880 21400107 20867220 20551623 20253966
4156B0253966m71441k57032k9018j4947j85347k06761l12671j52755j35121k58469
$$ 20253966 19782525 19525493 19496475 19481528 19296181 19089420 18776749 18623994 18488873 18230404
4146A8230404k83246j93558k85439k19423J88976o1619k764l6860J31464J35177
$$ 18230404 17947158 17753600 17468161 17248738 17437714 17376095 17373331 17336471 17467935 17603112
4136A7603112J86692K06768N23237N13738K50777O42564O86514J097311J316661
$$ 17603112 17789804 17996572 18519809 19033547 19284324 19926888 20613402 21710713 23027374
4127B3027374J206533J889661K369567K933589M232910N078409N677669M904463
$$ 23027374 24233907 26123568 28493135 31426724 35659634 40738043 46415712 51320175
4119E1320175L554745O01323l476768o583185p317258n914643m675016l639552
$$ 51320175 54874920 55476243 51999475 45416290 38099032 32184389 27509373 23869821
4111B3869821k865595k125452j876106j446726j182093j060470q10032o20538
$$ 23869821 21004226 18878774 17002668 15555942 14373849 13313379 12503347 11882809
4103A1882809o07161m55011o96888n10824n13343n5369j99025m92491k51202j66512
$$ 11882809 11275648 10820637 10123749 9612925 9099582 9044213 8845188 8352697 8101495 7934983
4093G934983j81029k60706k80297l29947j48639J47014k34245l26366k31738m9042
$$ 7934983 7753954 7493248 7212951 6883004 6734365 6881379 6647134 6320768 6089030 6039988
4083F039988k9729Q8474K12357J272J39429K53413J3576M41883N21386O17515
$$ 6039988 6010259 6098733 6311090 6312362 6451791 6705204 6718780 7160663 7682049 8299564
4073H299564Q52176O80785J92270K06041l26489r93984j154162q99360o55953
$$ 8299564 9151740 9832525 10024795 10230836 9904347 8910363 7756201 6856841 6200888
4064F200888m59067k83557l92659k47564k00456j52653l48897n1328j71518l3669
$$ 6200888 5741821 5458264 5065605 4818041 4617585 4464932 4116035 4064707 3893189 3859520
4054C859520l26130k54042J56643Q9163p1095M3305j32311l30070q4697o0850
$$ 3859520 3533390 3279348 3435991 3525154 3454059 3497364 3365053 3034983 2950286 2889436
4044B889436J3373k01488k23486N0444k5302p8474o5103m9353n6667m1401J13673
$$ 2889436 2902809 2701321 2477835 2528279 2502977 2424503 2359400 2310047 2253380 2211979 2325652
4033B325652j46445p1849J44471L4827r7445L1713j70799n2192k7354m9597j45249
$$ 2325652 2179207 2107358 2251829 2286656 2189211 2220924 2050125 1997933 1970579 1920982 1775733
4022A775733J00777k33555j04649K31650o3499j31443M83l4390K05131j09191
$$ 1775733 1876510 1642955 1538306 1769956 1706457 1575014 1575497 1541107 1746238 1637047
4012A637047p2743r214k01708m5005J15219k2921m4951O2650l96460J47856J96890
$$ 1637047 1564304 1555090 1353382 1308377 1423596 1400675 1355724 1418374 1021914 1169770 1366660
4001A366660J40226m2162r6690R0551j75439J1139P1756m3745K02513l4202J03268
$$ 1366660 1506886 1464724 1368034 1458585 1283146 1294285 1366041 1322296 1524809 1490607 1593875
3990A593875j7598J8313M0387O9139j72331k17320j11682J5350K1664M1799j47896
$$ 1593875 1576277 1594590 1634977 1704116 1531785 1314465 1202783 1218133 1239797 1281596 1133700
3979A133700j32525J64659m993J14226K7313j16877K3133o8282P1238j88434K3548
$$ 1133700 1001175 1165834 1160841 1275067 1302380 1185503 1208636 1140354 1211592 1023158 1046706
3968A046706K20866J32526J13329n6489p2246k89624r658J22582L0299M3832j50435
$$ 1046706 1267572 1400098 1513427 1456938 1384692 1095068 1085410 1207992 1238291 1282123 1131688
3957A131688j67233o5775Q7627Q8568k0675n2447j49790j22454K62006j38758
$$ 1131688 964455 898680 986307 1074875 1054200 1001753 851963 729509 991515 852757
3947H52757J67866J26629L3762j30232k42977p6377j54Q8518l362K6418j47214
$$ 852757 1020623 1147252 1181014 1050782 807805 731428 731274 819792 816430 842848 695634
3936F95634l08083L4677K00784J66761L3021P1193J13815k1744J76300j14100
$$ 695634 387551 422228 623012 789773 822794 893987 1007802 986058 1162358 1048258
3926A048258P2656k686j60010J02793m5666o8453Q8735j7676p7481M1640m448
$$ 1048258 1120914 1118228 958218 1061011 1015345 946892 1035627 1017951 940470 982110 977662
3915I77662N9154J75467P0162P0111R6798J48757L53340L47108J18192L24155
$$ 977662 1036816 1212283 1282445 1352556 1449354 1598111 1951451 2298559 2416751 2740906
3905B740906L61565Q7846K8701l1928m72590m06949l73543k19401l29441r5065
$$ 2740906 3102471 3190317 3219018 3187090 2714500 2307551 1934008 1714607 1385166 1290101
3895A290101J29723j86608j94037k6144l9284q3147r9509r8001Q200J10916J9373
$$ 1290101 1419824 1233216 1039179 1013035 973751 890604 791095 693094 701294 812210 831583
3884H31583q9835k48950l3030J48220j76960j26846K24601R5377o8400j5708K19017
$$ 831583 741748 492798 459768 607988 431028 304182 528783 624160 555760 540052 759069
3873G59069o1703l50149Q9497K22488n1263n2176R016k22014J25749J07989K1586
$$ 759069 697366 347217 436714 659202 607939 555763 564779 342765 468514 576503 598089
3862E98089q1589q2270J58912j8643P179M892j80472j79029J66030Q0283M0003
$$ 598089 516500 434230 593142 574499 581678 586570 406098 227069 393099 473382 513385
3851E13385L8758l2950j1020M8941K12531j78883j91213Q919R3092O7447k73170
$$ 513385 552143 519193 508173 557114 769645 590762 399549 408468 501560 569007 295837
3840B95837j05858j482J25279J55521J73972j97711j64476m0184J49759p6037
$$ 295837 189979 188497 313776 469297 643269 445558 281082 240898 390657 314620
3830C14620L9292J9377J09655m3965Q2832m0090j3517q3328Q6597j15968J3418
$$ 314620 353912 373289 482944 438979 521811 481721 468204 384876 471473 355505 368923
3819C68923J04675J15418J12802r8333N9492O2958n5069j71173j03j42036N2867
$$ 368923 473598 589016 701818 603485 662977 725935 670866 499693 499590 357554 410421
3808D10421j35141p658R0749j4581k0265R9517j30683L28036j21493j9031J16795
$$ 410421 275280 267622 358371 343790 323525 423042 292359 620395 498902 479871 596666
3797E96666p0400q3757J70608M3734l2666k57117k54653J09648R0743k6846r993
$$ 596666 526266 442509 613117 656851 624185 367068 112415 222063 312806 285960 275967
3786B75967J15172J20216l00347J28693m2995J7859j15102K9570J82129J24379
$$ 275967 391139 511355 211008 339701 296706 314565 199463 229033 411162 535541
3776E35541R4141K6564k21443o1320O0342n4103K20391j60745O7751L7479j87466
$$ 535541 629682 656246 434803 373483 433825 379722 600113 439368 507119 544598 357132
3765C57132r3320J42436J25133R4256N0381q3438L7590M44l978M7200k7524N0133
$$ 357132 263812 406248 531381 625637 676018 592580 630170 630614 626636 673836 646312 696445
3753F96445Q8136M8600N8680l9466p4328L6248j6903K65043j10101J13632j46831
$$ 696445 784581 833181 891861 852395 778067 814315 797412 1062455 952354 1065986 919155
3742I19155k29603l0007J16650J07341k41133l3156K6160P0787N2709k36166N215
$$ 919155 689552 659545 776195 883536 642403 609247 635407 706194 758903 522737 527952
3731E27952J08336R609J28098j11579j32137P3624L8197J25549M4055Q7297j32627
$$ 527952 636288 645897 773995 662416 530279 603903 642100 767649 811704 899001 766374
3720G66374k04995l6523L672K9790k9584J66715j06864p0499N0276L7358K26602
$$ 766374 561379 524856 528528 558318 528734 695449 588585 518086 568362 605720 832322
3709H32322M4493r3946Q9959j48771M0164j097O4671M2089j43099P288M4492j15847
$$ 832322 876815 782869 872828 724057 764221 763124 827795 869884 726785 734073 778565 662718
3697F62718Q8924K13069o7093J51094o4919N9351N018L9258j83738l6493J28573
$$ 662718 751642 964711 897618 1048712 983793 1043144 1048162 1087420 903682 867189 995762
3686I95762O5009k3691k2860l2416J85321j22597n743K23848R0083P5547L3085
$$ 995762 1060771 1037080 1014220 981804 1167125 1044528 1038785 1262633 1352716 1428263 1461348
3675A461348J37604j0157j07810j20818J13362P8771J396L5231K39238j34059
$$ 1461348 1598952 1588795 1480985 1360167 1473529 1552300 1553696 1588927 1828165 1694106
3665A694106j12346J24875k6467j3603k1401K9101J97218J63203P8k7451O0721
$$ 1694106 1581760 1706635 1680168 1666565 1645164 1674265 1871483 2034686 2034764 2007313 2068034
3654B068034N8203J89025K759N9406R8667O166O0648K48364m2219j4842k8674
$$ 2068034 2126237 2315262 2318021 2377427 2476094 2482260 2542908 2791272 2749053 2734211 2705537
3643B705537P3396R8940J73906J09007J86578J12800J6993N3590o898K45132K12693
$$ 2705537 2778933 2877873 3051779 3160786 3347364 3460164 3477157 3530747 3523849 3768981 3981674
3632C981674J18110P7704R3858R5709j00616K13610L66937R7626k3447K51111
$$ 3981674 4099784 4177488 4271346 4367055 4266439 4480049 4846986 4944612 4921165 5172276
3622E172276K88919j04772Q1691J65866J34194m689L55700J02499J54738J87154
$$ 5172276 5461195 5356423 5438114 5603980 5738174 5733485 6089185 6191684 6346422 6533576
3612F533576q502J95637J54089J6921j21641l3986J89226j88791k79378m2424
$$ 6533576 6525074 6720711 6874800 6891721 6770080 6736094 6925320 6736529 6457151 6414727
3602F414727l02418O4691m9491k60384j76790N7607m8757j85452L2975k76495
$$ 6414727 6112309 6177000 6127509 5867125 5690335 5747942 5699185 5513733 5546708 5270213
3592E270213j29507j94637o4332j62715j82667j69570p1893j34993j99858j20021
$$ 5270213 5140706 4946069 4881737 4719022 4536355 4366785 4294892 4159899 3960041 3840020
3582C840020j23391p4338o0134j72037n7134j00190j95787m774j50199o7398J76733
$$ 3840020 3716629 3642291 3582157 3410120 3352986 3252796 3057009 3052235 2902036 2834638 3011371
3571C011371l16923o5336J72911n1108j0903n9213j24763m7267K2802K2757j53061
$$ 3011371 2694448 2629112 2802023 2750915 2740012 2680799 2556036 2508769 2531571 2554328 2401267
3560B401267k55939L784k929j90406R1702K12039J12260l32439J17632J37384
$$ 2401267 2145328 2149112 2146183 1955777 2047479 2259518 2371778 2039339 2156971 2294355
3550B294355k49018J92152J87300K5493k90034j66223J14698J52686o1841J02000
$$ 2294355 2045337 2237489 2424789 2450282 2160248 1994025 2108723 2261409 2199568 2301568
3540B301568o3102K5095n5522k3536n6061J35465r5859L573m7767M7813J81909
$$ 2301568 2238466 2263561 2208039 2184503 2128442 2263907 2168048 2171621 2123854 2171667 2353576
3529B353576o9582K0361K15223l6933N5490N2247J4J0551J50293j47371q7128
$$ 2353576 2283994 2304355 2519578 2482645 2538135 2590382 2590396 2600947 2751240 2603869 2516741
3518B516741J73351M1885J06086N7871O7935R3936K13048k08486L1121j07186
$$ 2516741 2690092 2731977 2838063 2895934 2963869 3057805 3270853 3062367 3093488 2986302
3508B986302j11988R8662J66251N6571M4953K7120P5408O9538J41490J10141J01171
$$ 2986302 2874314 2972976 3139227 3195798 3240751 3267871 3343279 3412817 3554307 3664448 3765619
3497C765619K32620k4009J58174J31472q3815J88703K83487k1788K61501J95987
$$ 3765619 3998239 3974230 4132404 4263876 4180061 4368764 4652251 4630463 4891964 5087951
3487E087951J40732J36911K11718K64418J53995K51976L11600K93969J72269M51179
$$ 5087951 5228683 5365594 5577312 5841730 5995725 6247701 6559301 6853270 7025539 7476718
3477G476718J93730K52064M15949L84012N89719L93787K75821N99419N61975N78889
$$ 7476718 7670448 7922512 8338461 8722473 9312192 9705979 9981800 10581219 11143194 11722083
3467A1722083O57821Q25819R21631J151208J086556J005466J415625J562836J691173
$$ 11722083 12379904 13205723 14127354 15278562 16365118 17370584 18786209 20349045 22040218
3458B2040218K432050K650582L035143L816683M728286O342836Q778239J0208033
$$ 22040218 24472268 27122850 30157993 33974676 38702962 45045798 53824037 64032070
3450F4032070J0012042Q164083N168775p35679j0860642j4018375j1740162q818058
$$ 64032070 74044112 82208195 87376970 86641291 75780649 61762274 50022112 41204054
3442D1204054o574009n438448m122060l239852k540868k219884j823678j404337
$$ 41204054 34630045 29191597 25069537 21829685 19288817 17068933 15245255 13840918
3434A3840918j089837j029873p85903p63035n04701p22216n46738l53488n11762
$$ 13840918 12751081 11721208 10935305 10172270 9667569 8945353 8398615 8045127 7533365
3425G533365l73924l25456n60101l91830l31171l93019k54850m9823j07155l59420
$$ 7533365 7159441 6833985 6273884 5882054 5550883 5157864 4903014 4853191 4746036 4386616
3415D386616l16587k40541j98365l30222R5965J01258j97736j09913j64339L8246
$$ 4386616 4070029 3829488 3631123 3300901 3396866 3498124 3300388 3190475 3026136 3064382
3405C064382l20991k05451r419P7673J82392j71167p2450n9343j23811m4817o7876
$$ 3064382 2743391 2537940 2528521 2606194 2788586 2617419 2544969 2485626 2361815 2316998 2249122
3394B249122k71095j91597P3465J47273j99549j3734M779J54186j34537L9913
$$ 2249122 1978027 1786430 1859895 2007168 1807619 1793885 1798664 1952850 1818313 1858226
3384A858226j0904j81050M1456j61413j30487l3619K6108J80532M304l29365r9033
$$ 1858226 1847322 1666272 1707728 1546315 1415828 1382209 1408317 1588849 1593153 1263788 1164755
3373A164755p7069K53107j04694r0108R725j55335r2671J58272k6566O6283J883
$$ 1164755 1087686 1340793 1236099 1145991 1155716 1000381 907710 1065982 1039416 1105699 1107582
3362A107582p4752k85427K06050J3992j69253J3475l9478q6531R1999j6913m9138
$$ 1107582 1032830 747403 953453 967445 798192 811667 772189 685658 777657 760744 711606
3351G11606J61694p5249m3462j07960J38466j41258K66918j16837j11734Q5395
$$ 711606 873300 798051 754589 646629 785095 643837 910755 793918 682184 767579
3341G67579j01672k8513o9976l4369m09j55460j70285J97316K11475r1150P0408
$$ 767579 665907 637394 567418 533049 532640 377180 206895 404211 615686 524536 594944
3330E94944M7894j0187j89856J10971O7555J7012L3099j47196M7153o0722N0476
$$ 594944 642838 632651 442795 553766 621321 638333 671432 524236 571389 510667 561143
3319E61143O3571O3594k09010L8665J86857j98950J5528q3965r2131l6129l993
$$ 561143 624714 688308 479298 517963 704820 505870 521398 437433 345302 309173 305180
3308C05180M8291j03622Q8816J50753r5162j03189P9861Q9513P4122q3019j8397
$$ 305180 353471 249849 338665 489418 394256 291067 370928 460441 534563 451544 433147
3297D33147K7702K7660k55582k5224J06076J05316J12249L5505q6609J661J11128
$$ 433147 460849 488509 232927 207703 313779 419095 531344 566849 480240 481901 593029
3286E93029p3823j86754k8727m480J49366M9687p7165P324P5980n806l5893j0452
$$ 593029 519206 332452 303725 299245 448611 498298 421133 428457 504437 498631 462738 452286
3274D52286j54982K18704m7084J33816K8539j09063o8230K3843P2779o7046K0274
$$ 452286 297304 516008 468924 602740 631279 522216 453986 477829 550608 483562 503836
3263E03836K7798o0992J1184K00688l5042j24593j05347j63586j2659J90234J3485
$$ 503836 531634 470642 481826 682514 647472 522879 417532 253946 241287 431521 445006
3252D45006J6291K36320k44765M6805M4154J10998J5052J17653K12032k15524
$$ 445006 461297 697617 452852 499657 543811 654809 669861 787514 999546 784022
3242G84022o3958j11346J01204K19883j36439j80073k6559m6241Q1908o7806k41744
$$ 784022 720064 608718 709922 929805 793366 613293 586734 540493 622401 554595 312851
3231C12851l5740P1115J79940p7536k31346p1730n558J31915K5921M2862L4183
$$ 312851 277111 348226 528166 450630 219284 147554 141996 273911 299832 342694 376877
3220C76877j84020n2691J41656m8912n934r593l9151m0907J2332J80546k906q8437
$$ 376877 192857 140166 281822 232910 226976 217383 178232 137325 149657 330203 327297 238860
3208B38860J79638j443j11058J9528r4980r7236k21519J73866L7115j15500L7545
$$ 238860 418498 417055 305997 325525 230545 133309 -88210 85656 122771 7271 44816
3197D4816o8446K69520P5113k3263j08498m9330j00966P0294M181J17215Q6743
$$ 44816 -23630 245890 321003 297740 189242 139912 38946 109240 113421 230636 317379
3186C17379k19951l2500j3330j6326m2161o1623Q7054J37426J7799Q1186q6042
$$ 317379 97428 64928 51598 35272 -6889 -68512 18542 155968 173767 254953 168911
3175A68911j38145J13129p3763j14657K11643J55426o9209j48100n2296P7391
$$ 168911 30766 143895 70132 -44525 167118 322544 253335 105235 52939 130330
3165A30330k8087j53631K24651m6219R35L7230j12931J01149K9563j2765k1679
$$ 130330 102243 -51388 173263 127044 127979 165209 52278 153427 182990 170225 148546
3154A48546J4302m5430J36610L9104R1728o0131N8742K00652J04483n0714k96673
$$ 148546 162848 117418 254028 293132 384860 324729 383471 584123 688606 637892 341219
3143C41219j08615L5361Q9298p8829O9340J56748k73846j30837j13010l6277O7180
$$ 341219 232604 267965 357263 278434 347774 504522 230676 99839 -13171 -49448 17732
3132A7732R0247Q3277O7425O1307k29320p3238J8530k4214Q561M5784Q690j05994
$$ 17732 107979 191256 258681 319988 90668 17430 35960 11746 20307 66091 74781 -31213
3120c1213N2306r211P8949j09793j933K2037L4186j03233R6964j92336q6119k8891
$$ -31213 21093 11882 90831 -18962 -20895 1142 35328 -67905 29059 -163277 -249396 -278287
3108b78287m4041J29258j7251K5862N4175M7900M7786K68750j36670q4441N6434
$$ -278287 -322328 -193070 -210321 -184459 -130284 -82384 -34598 234152 97482 13041 69475
3097F9475j4989j9184r5540q0658N8197m0294O2237q5078J3897Q6115o9893N3143
$$ 69475 54486 35302 -60238 -140896 -82699 -122993 -60756 -145834 -131937 -45822 -115715 -62572
3085f2572J70134j95027M9650K4779o1973o0454L6302j63223j2387N1979n244
$$ -62572 107562 -87465 -37815 -13036 -75009 -135463 -99161 -262384 -274771 -222792 -228036
3074b28036L17746k4963j44238Q4390r540J8162P2913o554j21098O8144j60030
$$ -228036 89710 64747 -79491 4899 -4641 13521 86434 79880 -41218 26926 -133104
3063a33104J32353O7150O3998m6212j32104P4073j02190J05841m746j42242P0370
$$ -133104 -751 66399 130397 84185 -47919 26154 -76036 29805 25059 -117183 -46813
3052d6813m7751j50445O3102N9266j08172O7637N4859j16267J50609M15J91768
$$ -46813 -94564 -245009 -181907 -122641 -230813 -163176 -108317 -224584 -73975 -73560 118208
3041A18208j68354L0381L7513M0454K12803l02940k45694K19329j99430P7904
$$ 118208 -50146 -19765 17748 58202 271005 -31935 -277629 -58300 -257730 -179826
3031a79826K32937n5021n1292q3523q9755K0541R7229q830J78926k2828j53249
$$ -179826 53111 -1910 -53202 -136725 -226480 -205939 -108710 -117540 61386 38558 -114691
3020a14691j1399o5872L30215Q1263j61941q5471K6655J38399j27834j3333j27259
$$ -114691 -126090 -191962 138253 219516 57575 -27896 -1241 137158 9324 -4009 -131268
3009a31268J45052Q2646j5382R2342n2451k20918J2059l5645J12765L6697o0990
$$ -131268 13784 96430 81048 173390 120939 -99979 -87920 -123565 -10800 25897 -35093
2998c5093N746r5370N8871P4081n6916J95067j85850N9771J45504N113l1151j80472
$$ -35093 -29347 -124717 -65846 8235 -48681 146386 -39464 20307 165811 170924 139773 -40699
2986d0699j11710J0370J09796k43597M6197J28428m1054j05996K57329J42760
$$ -40699 -152409 -142039 -32243 -275840 -229643 -101215 -142269 -248265 9064 151824
2976A51824j75585r1849N4672P0329P1712k5002j41331M0113L20960l7415l01055
$$ 151824 -23761 -115610 -60938 9391 81103 56101 -85230 -45117 275843 238428 -62627
2965f2627J08232K0226j96434K7912P1205q9184j56008j9138J87961m0274m5778
$$ -62627 45605 65831 -130603 -102691 -31486 -120670 -276678 -295816 -107855 -148129 -193907
2954a93907K3712R9165k44308K0128K39850p1049p2441p3161J20239j28931L9299
$$ -193907 -170195 -71030 -315338 -295210 -55360 -126409 -198850 -272011 -151772 -280703 -241404
2943b41404L7693J54345K9199R2569n3235r5420K8370N8401P7661p0315J13784
$$ -241404 -203711 -49366 -20167 72402 19167 -76253 -47883 10518 88179 17864 131648
2932A31648j12990k32951J17920K8221q3334J7188J38086L4576K8974j24343Q0180
$$ 131648 18658 -214293 -96373 -68152 -151486 -134298 3788 38364 67338 -57005 23175
2921B3175o1733L6051p457j15735k9551J44793p1386Q3513Q1699j75665O9107
$$ 23175 -38558 -2507 -9964 -125699 -155250 -10457 -81843 1670 83369 -92296 -23189
2910b3189N4259o3551J9840M6028j29371J34266n3224k28504Q9916K21132j09800
$$ -23189 31070 -32481 -12641 33387 -95984 38282 -14942 -243446 -153530 67602 -42198
2899d2198n7527L9931j10147J59329o2405J86548n1541j52488J61044j60134J7119
$$ -42198 -99725 -59794 -169941 -10612 -73017 113531 61990 -90498 70546 -89588 -72469
2888g2469J15152J31189k25454p1069p1891J66980K26411j93725M768K9042N8671
$$ -72469 42683 173872 -51582 -122651 -194542 -27562 198849 5124 9892 38934 97605
2877I7605j27209O7982j12653j39865K33140K16203J00270j68610Q584k29597
$$ 97605 -29604 38378 -74275 -214140 19000 235203 335473 166863 175447 -54150
2867e4150M0979J8346J36246k6793n4069M337N3820N018k0556j41370K6450j91494
$$ -54150 -13171 5175 141421 114628 60559 64896 118716 123734 103178 -38192 -11742 -203236
2855b03236R1227J06558R2361J33632K4569k2838J26414j30974j78384j13411
$$ -203236 -112009 -5451 86910 220542 245111 222273 348687 217713 39329 -74082
2845g4082O283K55140j06693l0484J07949O7289n7073q7387j15029J3688L5715
$$ -74082 -67799 187341 80648 50164 158113 225402 168329 80942 -34087 -20399 15316
2834A5316M3586L7601j00670k20527r3975J85243O3467p2118J91680M9222M467
$$ 15316 58902 96503 -4167 -224694 -318669 -133426 -69959 -142077 49603 98825 103292
2823A03292l2917k4436o1963l4118k38600k37834K98460J97599O8237k4846l3729
$$ 103292 70375 45939 -16024 -50142 -288742 -526576 -228116 -30517 37720 12874 -20855
2812b0855q717r971n2397L927J01769j27127P1457j16629J33080K1139n966k5089
$$ -20855 -29572 -39543 -91940 -88013 13756 -113371 -41914 -158543 -25463 -4324 -10290 -35379
2800c5379r2610J5193J41670k19909J58937J04470k778l05595j43960K82131r9047
$$ -35379 -127989 -112796 28874 -191035 -32098 72372 69594 -236001 -379961 -97830 -196877
2789a96877Q8299Q420J53477o2064J50413j83652l30602M7385K92542J01918q8829
$$ -196877 -108578 -100158 53319 -8745 141668 -41984 -372586 -325201 -32659 69259 -19570
2778a9570q6865j03279K8811J98547r7902j78875J13606J2661r9275L2330K8573
$$ -19570 -106435 -209714 -180903 17644 -80258 -259133 -145527 -132866 -232141 -199811 -171238
2767a71238l3513m8104J66424J43125J3751p2714j25996J04605j77557J90645
$$ -171238 -204751 -252855 -86431 56694 70445 -2269 -128265 -23660 -201217 -10572
2757a0572K24570k98500q19q2561J45130o8678p2195Q7430J30190m4500k23826
$$ -10572 213998 -84502 -85321 -167882 -22752 -91430 -163625 -76195 53995 9495 -214331
2746b14331N3896j47161J32929j5010N7127K65700K1419o4563J99142k1979o7042
$$ -214331 -160435 -307596 -174667 -189677 -132550 133150 154569 90006 289148 267169 200127
2735B00127j06876J31208P6496o116k45197k7108l9066R420k6498p3110o8360
$$ 200127 93251 224459 300955 294839 49642 22534 -16532 -7112 -33610 -106720 -175080
2724a75080J31377K5518j47938K2375n1243J6203Q9339L4223j34044k5413j03996
$$ -175080 -43703 -18185 -166123 -143748 -194991 -178788 -89449 -55226 -189270 -214683 -318679
2713c18679R8854j28965j21211J33678K49965j81482m5922p836q7629K23497O7760
$$ -318679 -219825 -348790 -470001 -336323 -86358 -267840 -313762 -321598 -409227 -185730 -117970
2702a17970R7145o7050q2246J11798Q6565r5750j28618L7750K6510n7842K27368
$$ -117970 -20825 -87875 -170121 -58323 28242 -67508 -196126 -158376 -131866 -189708 37660
2691C7660q5697m8372J46061J7458r6545j32237n9617J0891J84299l7405k6024
$$ 37660 -48037 -96409 49652 67110 -29435 -161672 -221289 -210398 -26099 -63504 -89528
2680h9528q3409J27947Q1119K492p006k83713j3683n0571J67151R9921P9022j69750
$$ -89528 -172937 -44990 36129 38621 31615 -252098 -265781 -316352 -149201 -49280 29742 -140008
2668a40008m6338P9454m4814J03040m0461Q0267n5938j19290o8833K28428J33393
$$ -140008 -186346 -106892 -151706 -48666 -89127 -8860 -64798 -184088 -252921 -24493 108900
2657A08900m753j42680l1258J26699L6299q5583J13133r8284J7560l1493j7654
$$ 108900 104147 -38533 -69791 56908 93207 7624 120757 22473 40033 8540 -9114
2646i114j96979q8666J04885J19965J91925R5513j73978J28418n4878j69765j27445
$$ -9114 -206093 -294759 -189874 -69909 122016 217529 43551 171969 117091 -52674 -180119
2635a80119r0266N6097J94525J3557k05777r4806J17329n9637J03700K11256R7785
$$ -180119 -270385 -214288 -19763 -6206 -211983 -306789 -189460 -249097 -145397 65859 163644
2624A63644O0894k33147n4493p0587P0939j07587J57542J16040l83118L27016
$$ 163644 224538 -8609 -63102 -133689 -62750 -170337 -12795 103245 -279873 47143
2614D7143K08782j60978r2779p3763o6143m8519K81318j27477j43038K9828J928
$$ 47143 255925 94947 2168 -71595 -137738 -186257 95061 -32416 -175454 -145626 -143698
2603a43698p7924r7585J09445J24902j44695J24187n8339L7646l5031Q1480O1764
$$ -143698 -221622 -319207 -209762 -84860 -229555 -105368 -163707 -126061 -161092 -79612 -17848
2592a7848j0941O6573k1271k49117J50892l734m0108O6291k9824O0062n5754m2786
$$ -17848 -28789 37784 16513 -232604 -81712 -85446 -125554 -59263 -89087 -29025 -84779 -127565
2580a27565q6397j751Q8612J30404J44815o9804j75112j86862J46651R5065n8478
$$ -127565 -213962 -215713 -127101 3303 148118 78314 -96798 -283660 -137009 -41944 -100422
2569a00422O5725N4615L4224j39152K02892m9325p9437l683K71407k91422k45765
$$ -100422 -34697 19918 54142 -85010 117882 68557 -10880 -14563 256844 -34578 -280343
2558b80343K18960o4269l4704l3044J03585O8049P0572L2583P924j94767J8025
$$ -280343 -61383 -125652 -160356 -193400 -89815 -21766 48806 81389 89313 -105454 -87429
2547h7429O7008k07171L9768j06112j3749J49740J61932J72122K51825p0980j09182
$$ -87429 -20421 -227592 -187824 -293936 -307685 -157945 3987 176109 427934 356954 247772
2536B47772k60904j50777Q8344r0582Q4371R9237n6960J07885o2830j78274Q2362
$$ 247772 -13132 -163909 -75565 -166147 -81776 17461 -39499 68386 5556 -172718 -90356
2525i0356K2958O1182j15520K2127o5406j35591J09976R1275n8150R7160J87014
$$ -90356 -67398 -6216 -121736 -99609 -165015 -300606 -190630 -99355 -157505 -60345 126669
2514A26669K8645j89105k9050J04110k9100R3475L2414O6961j53237j26599R0623
$$ 126669 155314 -33791 -62841 41269 12169 105644 138058 205019 51782 -74817 15806
2503A5806q9859l9408J3595J1527q0986N9780K8180j31598j18659K05612N6063
$$ 15806 -74053 -113461 -99866 -88339 -169325 -109545 -81365 -212963 -331622 -126010 -69947
2492f9947j26162K46318k7315l791K6982n8025j3914l8360M9792q6262J9847k20253
$$ -69947 -196109 50209 22894 19103 46085 -11940 -25854 -64214 -14422 -100684 -80837 -301090
2480c01090O3435J67858m3831O8689J53516j49860J23044L3435l8251K337K2402
$$ -301090 -237655 -69797 -113628 -44939 108577 -41283 81761 115196 76945 79282 101684
2469A01684R1010k61j9169j05800j90631K08711Q8483n1150K3978j13268K3266
$$ 101684 192694 192433 173264 67464 -123167 85544 174027 122877 146855 33587 56853
2458E6853n536m0315j44898O0447j10648K14174q4342N8153J64836L5940O5392
$$ 56853 51317 11002 -133896 -73449 -184097 30077 -54265 3888 168724 204664 270056
2447B70056k0216L2139r4240j57263Q0456m0585J33025l8755m972K0767j22952
$$ 270056 249840 281979 187739 30476 110932 70347 203372 164617 159645 180412 57460
2436E7460j07577K93478q4837j64814J67813r9669l3037k5516J36003j37375P5884
$$ 57460 -50117 243361 158524 -6290 161523 61854 28817 3301 139304 1929 77813
2425G7813l5745j97439k5019J63818Q6027Q4283J56730q1296j32731J31947q1719
$$ 77813 42068 -155371 -180390 -16572 69455 153738 310468 229172 96441 228388 146669
2414A46669J4423j68392l6751J41274K8296n575o0961Q8007K43138p8679j95797
$$ 146669 161092 -7300 -44051 97223 125519 119944 58983 146990 390128 311449 115652
2403A15652O6163P2796j2061p8243r7822j06107J17545M2423J54182j06428J06196
$$ 115652 181815 254611 242550 164307 66485 -39622 77923 120346 274528 168100 274296
2392B74296J09420J14025l8453j01387j24157L8202n1176j16994R5333J24538
$$ 274296 383716 497741 459288 357901 233744 271946 220770 103776 199109 323647
2382C23647P6838P6667J84946N5115j61242O021M0663J81229N4973q473K82572
$$ 323647 400485 477152 662098 717213 555971 561992 602655 783884 838857 830384 1112956
2371A112956k5490N5112J18799j3959j06979N138m1744j4753K9381J7149r709
$$ 1112956 1087466 1142578 1261377 1247418 1140439 1145577 1103833 1089080 1118461 1135610 1125901
2360A125901O1478R8217J00406J61134L06097L85049L62575L65901K58155J79016
$$ 1125901 1187379 1285596 1386002 1547136 1853233 2238282 2600857 2966758 3224913 3403929
2350C403929j00959k55651m67616m93332m27698k45838k33013j45820k0014j09351
$$ 3403929 3302970 3047319 2579703 2086371 1658673 1412835 1179822 1034002 1013988 904637
2340I04637j6738j73353j51128j40376P2939L3788J41927m1275j99675m4127R604
$$ 904637 887899 714546 563418 423042 495981 529769 671696 630421 430746 386619 396223
2329C96223J75465o256k50499K6837k856P6031l21Q6661M5249j16069j2811j7287
$$ 396223 571688 565432 314933 341770 338914 414945 414624 501285 546534 430465 417654 400367
2317D00367m7961J30702N774l4415J35455q5865k8035j94563P2879J10088l0125
$$ 400367 352406 483108 488882 454467 589922 504057 476022 281459 354338 464426 434301
2306D34301N337n4224Q9974M2219j93508j96361m780J83246j07898o6745J62864
$$ 434301 439638 385414 475388 517607 324099 127738 122958 306204 198306 131561 294425
2295B94425K18288J81402j83037q8394j39707j41194K2495O5165m7057J43822
$$ 294425 512713 694115 511078 422684 282977 141783 164278 229443 182386 326208
2285C26208J49991j05542o0491L28310l4916k38391K62088K03184k55923M7389
$$ 326208 476199 370657 310166 638476 603560 365169 627257 830441 574518 621907
2275F21907n3073j08254j01529k568N9749l25636K63937K76526r1535p4499J37976
$$ 621907 568834 460580 359051 356483 416232 90596 354533 631059 539524 465025 603001
2264F03001o8964J8613Q7180p8807n0446J08370R3079j2912k36031q8778J57582
$$ 603001 534037 552650 639830 561023 510577 618947 712026 699114 463083 374305 531887
2253E31887k3441N3167L0235j330Q3902J21631m1505j01067r7928j40666j08343
$$ 531887 508446 561613 591848 590518 674420 796051 754546 653479 555551 414885 306542
2242C06542R9354J54809n5579L00316l1377j83559N3925J80029j89505N7670J61660
$$ 306542 405896 560705 505126 805442 774065 590506 644431 824460 634955 692625 854285
2231H54285N7918r1799k00980K14821M977m2106m508Q4687o8869k5122m6061P2891
$$ 854285 912203 820404 619424 834245 839222 797116 792608 877295 808426 783304 737243 810134
2219H10134P4162q4133j10639J81132J17009m4025K9310J28655k225Q514J34436
$$ 810134 884296 800163 689524 870656 987665 943640 972950 1101605 1099380 1107894 1242330
2208A242330k8785o6366j62809J0309K16872L8161J37873J32108m7190j76124
$$ 1242330 1213545 1147179 984370 994679 1211551 1249712 1387585 1519693 1472503 1296379
2198A296379L6513J01281Q6233M3376J03408J0674P1525Q9347p5217m2797M2638
$$ 1296379 1332892 1434173 1520406 1563782 1667190 1677864 1749389 1838736 1763519 1720722 1763360
2187A763360J15668M7114K66820q9735J46996K41225j40084O4392K04494J63657
$$ 1763360 1879028 1926142 2192962 2103227 2250223 2491448 2351364 2415756 2620250 2783907
2177B783907j3013j05091J21745M9902K0180K56114J61918k22267J04292L44273
$$ 2783907 2770894 2665803 2787548 2837450 2857630 3113744 3275662 3053395 3157687 3501960
2167C501960n5526j15270q3943M45638J84315j60621J41979n3497J48969N5594
$$ 3501960 3446434 3331164 3247221 3692859 3877174 3716553 3858532 3805035 3954004 4009598
2157D009598J78331K4493J3425L3998P6108K62833P9763J46555Q6495j721L03174
$$ 4009598 4187929 4212422 4225847 4259845 4335953 4598786 4678549 4825104 4911599 4909878 5213052
2146E213052L07731K26873J17840K38735J24915L77976M46302J82379K53607K69555
$$ 5213052 5520783 5747656 5865496 6104231 6229146 6607122 7053424 7235803 7489410 7758965
2136G758965L66822L85303K66862L56616L05721O23508N48087M26646M20325R84355
$$ 7758965 8125787 8511090 8777952 9134568 9440289 10063797 10611884 11038530 11458855 12443210
2126A2443210O97577N13980O20538J196902J288260J177204J409384J279786J545031
$$ 12443210 13140787 13654767 14275305 15472207 16760467 17937671 19347055 20626841 22171872
2117B2171872J649050J411681J506045J887964K540607L338097L720274M333575
$$ 22171872 23820922 25232603 26738648 28626612 31167219 34505316 38225590 42559165
2109D2559165N883298P918609J0725725J3713299J3739116J1296537Q171348K360620
$$ 42559165 48442463 56361072 67086797 80800096 94539212 105835749 114007097 116367717
2101A16367717j3390593j9511675j6421980j2615811q547777o917597n432869
$$ 116367717 102977124 83465449 67043469 54427658 45879881 38962284 33529415
2094C3529415m309599l440404k618105k162280j636927j278231j113133q76929
$$ 33529415 29219816 25779412 23161307 20999027 19362100 18083869 16970736 16093807
2086A6093807j507587j248490j069460p85608p27939p48179o71556l69276n63095
$$ 16093807 14586220 13337730 12268270 11482662 10754723 10006544 9334988 8965712 8402617
2077H402617k99734l86312m30404n28978l11790k70261k12783m15305k84392m39152
$$ 8402617 8102883 7716571 7286167 6757189 6445399 6175138 5962355 5547050 5262658 4823506
2067D823506k10945k9612k82029n5859k16516K3039r1138r9224j06384k38816
$$ 4823506 4612561 4582949 4300920 4245061 4028545 4051584 3960446 3861222 3754838 3516022
2057C516022j97720n7921J63513j35249j18402j81300j96989n2530j48951K00214
$$ 3516022 3318302 3260381 3423894 3288645 3170243 2988943 2791954 2739424 2590473 2790687
2047B790687j77298j23822m2017j13869k5643j9982j38950j32017j68379J03804
$$ 2790687 2613389 2489567 2447550 2333681 2308038 2288056 2149106 2017089 1848710 1952514
2037A952514n5491O9613j26494k16436l2048o1644n9090j37104J43075J1082k51178
$$ 1952514 1897023 1966636 1840142 1623706 1591658 1530014 1470924 1333820 1476895 1487977 1236799
2026A236799K0881J04809k72002J51490J35183j09049k2640q2408l071j08371
$$ 1236799 1257680 1362489 1090487 1241977 1377160 1268111 1245471 1163063 1159992 1051621
2016A051621L9526j11915M3749J03918j27731r8220k2987K7719k60036M8681R448
$$ 1051621 1091147 979232 1022981 1126899 999168 900948 877961 905680 645644 694325 703773
2005G03773J06640k2463n1133o3836J73398q7217k48046r4214M4183J05549J7778
$$ 703773 810413 787950 736817 672981 846379 759162 511116 416902 461085 566634 584412
1994E84412n4832K8340j55107j8140n0922J297L8324j2733L5279l8778p9973j04018
$$ 584412 529580 557920 402813 384673 333751 335048 373372 360639 395918 357140 277167 173149
1982A73149J95214N6819j24429L0630N878J16215q1335O7810R2970j87236K6862
$$ 173149 368363 425182 300753 331383 337261 453476 372141 439951 532921 345685 372547
1971C72547o6951k1051k214J42591j66963j8476Q5321r0204J75242O9457k51353
$$ 372547 305596 284545 282331 424922 257959 239483 324804 234600 409842 479299 227946
1960B27946n4225K59192L8689l09336k77851L17087l7894q4017J37711P90R8287
$$ 227946 173721 432913 471602 162266 -115585 201502 163608 79591 217302 218092 316379
1949C16379j03251K7370l0255M1850J0152j70687J9288J81672m4180k05343K56433
$$ 316379 213128 240498 210243 252093 262245 91558 110846 292518 248338 42995 299428
1938B99428j26677k29320M0282K52711j22509M4990J51266J83476j3048k33301
$$ 299428 172751 -56569 -16287 236424 113915 158905 310171 493647 480599 247298
1928B47298r4287j21298J02996L3574K9297P9701R4766k9584j17395j18582M1621
$$ 247298 153011 31713 134709 168283 197580 277281 372047 342463 225068 106486 148107
1917A48107q1881K489j53664J39297L3799n0417L1591L0856k96538m8844L3056
$$ 148107 66226 68715 -84949 54348 88147 37730 69321 100177 -196361 -245205 -212149
1906b12149L6116K6161L26448J71779j09053O4215q2388r3110P6554J19993J47400
$$ -212149 -176033 -149872 176576 348355 239302 303517 221129 128019 204573 324566 471966
1895D71966k85275j05029q6077R3980K60343k332j68638n3215J18202Q451J54503
$$ 471966 186691 81662 -4415 89565 349908 347576 178938 125723 243925 252376 406879
1884D06879j91169l46774J227R1242p1302l2839R3710J90812j03462J1919q5057
$$ 406879 215710 -131064 -129837 -38595 -109897 -142736 -49026 141786 38324 50243 -34814
1873c4814o983m0723O9842O0106J19817j66350j88701J36817M7269J06971J34752
$$ -34814 -41797 -82520 -12678 47428 167245 895 -187806 -50989 -3720 103251 238003
1862B38003l7300j66614j24187L8134k5625o4349N3965J27943J04078j9046J44996
$$ 238003 200703 34089 -90098 -51964 -77589 -141938 -87973 39970 144048 125002 269998
1851B69998j44968q635P6680j99723r685K34145J05443k29730n7175M6765J17174
$$ 269998 125030 116395 193075 -6648 -16333 217812 323255 93525 36350 83115 200289
1840B00289N6168j14654l0793K38988J71406q0125J65166J866j29134r3168j4624
$$ 200289 256457 141803 111010 349998 521404 441279 606445 608311 479177 386009 371385
1829C71385K6727Q919j36667k40926M7452R6527k06415j14992K31004R8958j6961
$$ 371385 398112 407031 270364 29438 76890 173417 -32998 -147990 83014 181972 165011
1818A65011k60450j40328Q0406k2644J87201J37477j58731j11925O0555N441n1728
$$ 165011 -95439 -235767 -155361 -178005 9196 146673 -12058 -123983 -63428 -57987 -109715
1807a09715P4491M5443j9002m9759j19252j28218n3310K35197J75333n2633k14049
$$ -109715 -35224 10219 -8783 -58542 -177794 -306012 -359322 -124125 51208 -1425 -215474
1796b15474m6772J74526J1500Q6703j94464O2815J20864n16j61811J40535O9656
$$ -215474 -262246 -87720 -76220 10483 -183981 -121166 -302 -818 -162629 -22094 47562
1785D7562j39379k6122j72703K03022M3154j29609k9374J36736j40982j8883K46410
$$ 47562 -91817 -117939 -290642 -87620 -44466 -174075 -203449 -66713 -207695 -226578 19832
1774A9832j0082N2197q3259k18332Q7641p5434L7317K00163J28716j09006r9964
$$ 19832 9750 61947 -21312 -239644 -152003 -227437 -190120 10043 138759 29753 -70211
1763g0211J28893J17161j86661k03132L8936J38647O6004j32367Q453l1413J1889
$$ -70211 58682 175843 -10818 -213950 -175014 -36367 29637 -102730 -94277 -125690 -113801
1752a13801P0143J0862j62803J34691n7663K4006k1124J10400J7746j7597O1474
$$ -113801 -43658 -32796 -195599 -60908 -118571 -94565 -115689 -5289 12457 -5140 56334
1741E6334r3275Q5081P7145k04744p6674J35152P7105j8896l06955Q5193J03018
$$ 56334 -36941 48140 125285 -79459 -156133 -20981 56124 37228 -269727 -184534 -81516
1730h1516O9905r2244J44886J7592l947K3549j87099m9951O1813O2348k3933j4284
$$ -81516 -11611 -103855 41031 58623 54676 78225 -108874 -158825 -97012 -34664 -58597 -72881
1718g2881j90975J45261N1576k43221j1547J23760J97000p2755k4378J14174K6706
$$ -72881 -263856 -118595 -67019 -310240 -321787 -198027 -1027 -73782 -98160 16014 42720
1707D2720p1157j93361K17308J1781m0486N2575J40968Q1394j28771l7783j36915
$$ 42720 -28437 -221798 -4490 7291 -33195 19380 160348 241742 112971 75188 -61727
1696f1727J24885J01842k3294j61974n9325q5774j6132R4982r978P232J47362
$$ -61727 63158 165000 141706 -20268 -79593 -165367 -181499 -86517 -96495 -89263 58099
1685E8099k07322k34682K02042J39047j330r3669J5780J07306j36618R2013N3860
$$ 58099 -149223 -383905 -181863 -42816 -44146 -137815 -122035 -14729 -151347 -59334 -5474
1674e474n6912J4156r0464j57603J41763L7198J21503J63890k00381j23350J5162
$$ -5474 -62386 -48230 -138694 -296297 -154534 -117336 4167 168057 -32324 -155674 -140512
1663a40512N9351p6758j20394J01984K3980R998P000o1812J18935N7937n0241
$$ -140512 -81161 -157919 -278313 -176329 -152349 -142351 -135351 -197163 -78228 -20291 -70532
1652g0532j71205P8950q6915J60729R016j2872M6000j11485J28048J89442J2595
$$ -70532 -241737 -162787 -249702 -88973 -79957 -92829 -46829 -158314 -30266 159176 171771
1641A71771k47309J7898P1356p8353J33945p8036o1092j66030l6737J85514K82889
$$ 171771 -75538 -57640 13716 -64637 69308 -8728 -69820 -235850 -272587 -87073 195816
1630A95816j46757j95034J50107J43679j98510J04756o5013j50823L7560n3674
$$ 195816 49059 -145975 4132 147811 -50699 54057 -10956 -161779 -124219 -177893
1620a77893N1729j86856P1517J5839K15074j19590O6607n3661N9881J52511j6154
$$ -177893 -126164 -313020 -241503 -225664 -10590 -130180 -63573 -117234 -57353 95158 79004
1609G9004J19048r44j32012j59241J47202L4936q0617l5094q5198L3561m3417
$$ 79004 198052 197108 65096 -94145 53057 87993 7376 -27718 -112916 -79355 -122772
1598a22772R874j36525o5867J13032K53950l7254N5304j7845k09823p708K02547
$$ -122772 -112898 -249423 -315290 -202258 51692 14438 69742 51897 -157926 -165634 36913
1587C6913K5878r5139k6488P666J61696r7385j40752M9605j94131k6072K29264
$$ 36913 62791 -32348 -58836 -51170 110526 13141 -127611 -78006 -272137 -298209 -68945
1576f8945J0167j05014j01864J58018j966J24098k6939j76728o7064K25668J87104
$$ -68945 -58778 -163792 -265656 -107638 -109604 14494 -12445 -189173 -256237 -30569 156535
1565A56535j99601J3295j27751j18809R0736j23601j59311R6626N2328L07661
$$ 156535 -43066 -29771 -157522 -276331 -185595 -309196 -468507 -371881 -319553 -11892
1555a1892o5302j86368N5031p3519J31111M22K16671r4650J30956n6443j89552
$$ -11892 -77194 -263562 -208531 -282050 -150939 -150517 66154 -28496 102460 46017 -143535
1544a43535J16116J49713L595q0961k31780J47804o115R9209j54778O3775K30845
$$ -143535 -27419 122294 125889 44928 -186852 -39048 -45163 54046 -100732 -36957 193888
1533A93888r2529k56586j90265K20418l8522l3564J28175K3546K10004J07580
$$ 193888 101359 -155227 -345492 -125074 -163596 -197160 -68985 -45439 164565 272145
1523B72145k09622j41627j43805J97863N0783n4670o6279P6123L6570O0126q3945
$$ 272145 62523 -79104 -222909 -25046 25737 -28933 -95212 -19089 17481 77607 -6338
1512f338O3852n0323j2602q215P6959j12923j18489O9819L364q1097Q4827P3620
$$ -6338 57514 7191 -5411 -13626 63333 -49590 -168079 -98260 -94896 -175993 -91166 -17546
1500a7546J76722j46492r9642R4744k2091k4062j74063J34391k0984K0714p0477
$$ -17546 159176 12684 -86958 7786 -14305 -38367 -212430 -78039 -99023 -78309 -148786
1489a48786J9434Q0276p7249J41045M8545r7017J8995M8612Q3274j29908J9340
$$ -148786 -129352 -49076 -126325 14720 63265 -33752 -14757 33855 117129 -12779 6561
1478F561N5645j274k57614K7490K15027j46546N3388P1448r0093J02036j0373
$$ 6561 62206 60932 -196682 -169192 45835 -100711 -47323 24125 -65968 36068 25695
1467B5695l7742j3122J0058J23568m5085n496j11778K6530j33431o9586J06626
$$ 25695 -12047 -25169 -15111 108457 63372 57876 -53902 -27372 -160803 -230389 -123763
1456a23763L3533j48428J58192J38827p8921q8633j19116J96727R5839P4100j30056
$$ -123763 -90230 -238658 -80466 58361 -20560 -109193 -228309 -31582 64257 138357 8301
1445H301j26289o8248r593J47811j05284m5699P1542J1681r9n0473K3382j046
$$ 8301 -117988 -186236 -195829 -48018 -153302 -199001 -127459 -115778 -115877 -166350 -142968 -144014
1433a44014P5139o2545P7127Q2386j30909R3403m3687J7530j00326q3724J32856
$$ -144014 -68875 -131420 -54293 28093 -102816 -9413 -53100 -35570 -135896 -219620 -86764
1422h6764j718k10921O8736P8162k6455J38936j5046K80116j83245r2382J9252
$$ -86764 -88482 -299403 -230667 -152505 -178960 -40024 -55070 225046 41801 -50581 -31329
1411c1329m8596P7199k922l8924n7278m8712l3853O477R8053N9380k3887P444
$$ -31329 -79925 -2726 -5648 -44572 -101850 -150562 -184415 -177938 -79885 -20505 -44392 -36948
1399c6948k518j12673j756J16286L6164J17527P0591j26880j43233l6487R6181
$$ -36948 -39466 -152139 -153895 -37609 -1445 116082 186673 59793 -83440 -119927 -23746
1388b3746O3809l2663n8641j94005J95190j78912p2351J25152Q3910J68662j15368
$$ -23746 40063 7400 -51241 -245246 -50056 -228968 -301319 -176167 -92257 76405 -38963
1377c8963j42551J13888J39309N8042K1598l0386k01461j0577J64382j16557j69324
$$ -38963 -181514 -67626 71683 129725 151323 120937 -80524 -91101 73281 -43276 -212600
1366b12600N2690j54022O9836L23420N2479k52802j2462J0740q9408M0387j45603
$$ -212600 -159910 -313932 -244096 79324 131803 -120999 -133461 -122721 -212129 -171742 -317345
1355c17345j41567K13742J03105r6723J33813k0406R56j51520q7827R1875J76348
$$ -317345 -458912 -245170 -142065 -238788 -104975 -125381 -124425 -275945 -363772 -271897 -95549
1344i5549J76611J23609q9865j01866l2080j14434o8541p2324J64668R9365J02082
$$ -95549 81062 204671 114806 12940 -19140 -133574 -202115 -274439 -109771 -10406 91676
1333I1676N9506j04951k54472J27880J11174J02498m5685k18912j6134r3847R6201
$$ 91676 151182 46231 -208241 -80361 30813 133311 87626 -131286 -147420 -241267 -145066
1322a45066P2004J47546j68007j47867K67819l2280J27071J3664N984j84119l3167
$$ -145066 -73062 74484 -93523 -241390 26429 -5851 121220 134884 140868 -43251 -76418
1311g6418J89213j49876K546j30127J20990n155j37051K47625L05044l04741r3435
$$ -76418 112795 -37081 -34535 -164662 -43672 -48827 -185878 61747 366791 62050 -31385
1300c1385N2208L6767q1873l8835j90587k482K6211p337K01964J14407J18445
$$ -31385 20823 57590 -24283 -63118 -253705 -256187 -229976 -237313 -35349 79058 197503
1289A97503m7001r4339J21299j07901J4945j00755j67111m8513J69894J4759r1718
$$ 197503 150502 56163 177462 69561 84506 -16249 -183360 -231873 -61979 -47220 -138938
1278a38938o053J04584j21282j18312r5974J13824J10365l7023p8798Q2034O2038
$$ -138938 -144991 -40407 -161689 -280001 -375975 -262151 -151786 -188809 -267607 -185573 -123535
1267a23535q0226K82235l491n1107o3207O4024j90463o2258r7519J18953n9530
$$ -123535 -203761 78474 74983 23876 -39331 24693 -165770 -228028 -325547 -206594 -266124
1256b66124K88443J66656j97019r8094J30962L260j70875K23997J77873k10500
$$ -266124 22319 188975 -8044 -106138 24824 28084 -142791 81206 259079 48579
1246D8579n6525L8570m9826q1157L1793N6681q1955R6132J27936o8435J769k46828
$$ 48579 -7946 30624 -19202 -100359 -68566 -11885 -93840 2292 130228 61793 63562 -183266
1234a83266j26102Q0360L5036K06190O8482L2610p5660n1169p0379j55275R6179
$$ -183266 -309368 -229008 -193972 12218 80700 113310 37650 -13519 -83898 -239173 -142994
1223a42994K11581j92306j9096J22306j1174j57960O4860o3109k997N4082p4650
$$ -142994 68587 -123719 -142815 -20509 -31683 -189643 -124783 -187892 -190889 -136807 -211457
1212b11457K04471M6706j86420j6406R0403M974Q4520q9997p3707M9384j09237
$$ -211457 -6986 39720 -146700 -163106 -72703 -67729 16791 -73206 -146913 -97529 -206766
1201b06766m1405J65981O8081P2105p3515j235J29408j18089j9226J5544J05076
$$ -206766 -248171 -82190 -14109 57996 -15519 -16754 112654 -5435 -24661 -9117 95959
1190I5959k5126j24948J86287q2980m613j02174J1189J46356q8316m259r2552
$$ 95959 70833 -54115 132172 49192 44579 -57595 -46406 99950 11634 7375 -85177
1179h5177r1982P6728p4428r7334m074O1025J48018R5708J55439P6067r472j50245
$$ -85177 -177159 -100431 -174859 -272193 -276267 -215242 -67224 28484 183923 259990 250518 100273
1167A00273k16825J32646O4112l80376J39070R4103M1252N3606j2421j31983K05055
$$ 100273 -116552 16094 80206 -300170 -161100 -66997 -25745 27861 15440 -116543 88512
1156H8512k5258l7447O5461j99588j51130J75361k8625k11179J91729L4508R3705
$$ 88512 63254 25807 91268 -108320 -259450 -84089 -112714 -323893 -132164 -97656 -3951
1145c951N5407J45909k55881J01979j0178J86583j36745r5842J14697k00645n3175
$$ -3951 51456 197365 -58516 43463 33285 219868 83123 -12719 101978 -98667 -151842
1134a51842J14621M7680L8003n7698J78658M2567j76900k606o3911j57281J16947
$$ -151842 -37221 10459 48462 -9236 169422 211989 35089 32483 -31428 -188709 -71762
1123g1762J73714j77021K7238m0541P3572n4341k9582K01197j33176j99005J22582
$$ -71762 101952 -75069 -47831 -88372 -14800 -69141 -98723 102474 -30702 -229707 -107125
1112a07125J31746p0048J50547p1217r0711j9534J50129q8239N739M2480j57218
$$ -107125 24621 -45427 105120 33903 -56808 -76342 73787 -14452 -8713 33767 -123451
1101a23451l090R4105P3981j02790n9017k08614q83O0480J43417P0060K940n2563
$$ -123451 -126541 -32436 41545 -61245 -120262 -328876 -329759 -269279 -125862 -55802 -52862 -105425
1089a05425R9700o1552l8247j34382P1309M8140R6962j96577k1969J85265J04198
$$ -105425 -5725 -67277 -105524 -239906 -168597 -120457 -23495 -220072 -242041 -56776 47422
1078D7422j05960O3002J05255p9624k0700N3329o1158j60481j40254J75874O8898
$$ 47422 -58538 4464 109719 30095 9395 62724 1566 -158915 -299169 -123295 -54397
1067e4397n2615m0017M6982J03802j47781k5952J99380p5580l3692J46177j12720
$$ -54397 -107012 -147029 -100047 3755 -144026 -169978 29402 -46178 -79870 66307 -46413
1056d6413j00417Q8715j4992N9824K6556P8262l09138N533K28167R8716j57099
$$ -46413 -146830 -58115 -73107 -13283 13273 91535 -217603 -212070 16097 114813 -42286
1045d2286j6924R2120k0011L4058M1182j52258k33004K48233O6102K0124k3956
$$ -42286 -59210 32910 12899 46957 88139 -64119 -297123 -48890 17212 37336 13380
$$ [...]
##END NTUPLES=NMR SPECTRUM
##END=
