##TITLE=1H_CA-9105
 CDCl3
 8 sc, 
 23.1.2023
##JCAMPDX= 6.0         $$ Bruker NMR JCAMP-DX V2.0
##DATA TYPE= NMR SPECTRUM
##DATA CLASS= NTUPLES
##ORIGIN= UXNMR, Bruker Analytische Messtechnik GmbH
##OWNER= root
$$ XWIN-NMR		Version 3.5
$$ Mon Jan 23 14:48:31 2023 Russian Standard Time (UT+4h)  she@DPX200
##.OBSERVE FREQUENCY= 200.13135
##.OBSERVE NUCLEUS= ^1H
##.ACQUISITION MODE= SIMULTANEOUS
##.ACQUISITION SCHEME= undefined
##.AVERAGES= 8
##.DIGITISER RES= 18
##SPECTROMETER/DATA SYSTEM= spect
##.PULSE SEQUENCE= zg30
##.SOLVENT NAME= CDCl3
##.SHIFT REFERENCE= (INTERNAL, CDCl3, 0, 15.7381)
##AUDIT TRAIL= $$ (NUMBER, WHEN, WHO, WHERE, WHAT)
$$ ##TITLE= Audit trail, XWIN-NMR		Version 3.5
$$ ##JCAMPDX= 5.01
$$ ##ORIGIN= Bruker BioSpin GmbH
$$ ##OWNER= she
$$ F:/spectra/data/she/nmr/H-F/1/pdata/1/auditp.txt
$$ ##AUDIT TRAIL=  $$ (NUMBER, WHEN, WHO, WHERE, WHAT)
(   1,<2023-01-23 14:47:20.25 +0400>,<she>,<DPX200>,
      <created by zg, POWCHK disabled, PULCHK disabled
       configuration hash MD5:
       00 E9 B6 7A A2 85 ED C7 34 08 36 98 17 FE 4E 26
       data hash MD5: 16K
       76 C4 C8 E2 D3 E8 B2 F2 BD 88 1F 1C AA B8 2C AE>)
(   2,<2023-01-23 14:47:22.65 +0400>,<she>,<DPX200>,
      <Start of raw data processing
       efp BC_mod = 2 LB = 0.24 FT_mod = 6 PKNL = 1 PHC0 = -19113.39 PHC1 = 14.60079 SI = 16K 
       data hash MD5: 16K
       20 A1 57 82 61 34 23 05 E3 CA 11 2A 33 E7 B6 1C>)
(   3,<2023-01-23 14:47:40.35 +0400>,<she>,<DPX200>,
      <pk PHC0 = 2.596926 PHC1 = -4.4 
       data hash MD5: 16K
       6C DC 55 6E 0E 57 09 BA D8 5C 5B A0 25 3F B0 2F>)
(   4,<2023-01-23 14:47:43.32 +0400>,<she>,<DPX200>,
      <abs ABSG = 5 
       data hash MD5: 16K
       85 44 CB 79 DB D2 A7 21 CE C7 59 F9 84 9D DF 91>)
$$ ##END=
$$ 
$$ hash MD5
$$ 36 3A 85 59 22 E9 21 6A 18 AE 01 E1 99 5D FF CF
##$RELAX= 
##$RELAX= 
##$RELAX= 
##$RELAX= 
##$RELAX= 
##$RELAX= 
$$ Bruker specific parameters
$$ --------------------------
##$DU= <F:/spectra>
##$EXPNO= 1
##$NAME= <H-F>
##$PROCNO= 1
##$TYPE= <nmr>
##$USER= <she>
##$AMP= (0..31)
100 100 100 100 100 100 100 100 100 100 100 100 100 100 100 100 100 100 
100 100 100 100 100 100 100 100 100 100 100 100 100 100 
##$AQSEQ= 0
##$AQ_mod= 1
##$AUNM= <au_zg>
##$AUTOPOS= <>
##$BF1= 200.13
##$BF2= 200.13
##$BF3= 200.13
##$BF4= 200.13
##$BF5= 200.13
##$BF6= 200.13
##$BF7= 200.13
##$BF8= 200.13
##$BYTORDA= 1
##$CFDGTYP= 0
##$CFRGTYP= 5
##$CHEMSTR= <none>
##$CNST= (0..31)
1 1 145 1 1 1 1 1 1 1 1 1 1 1 1 1 1 1 1 1 1 1 1 1 1 1 1 1 1 1 1 1 
##$CPDPRG= <>
##$CPDPRG1= <>
##$CPDPRG2= <>
##$CPDPRG3= <>
##$CPDPRG4= <mlev>
##$CPDPRG5= <mlev>
##$CPDPRG6= <mlev>
##$CPDPRG7= <mlev>
##$CPDPRG8= <mlev>
##$CPDPRGB= <>
##$CPDPRGT= <>
##$D= (0..31)
0 1.2 0 0 0 0 0 0 0 0.06 0 0.03 0 0 0 0 0.0002 0 0 0 0 0 0 0 0 0 0 0 0 
0 0 0 
##$DATE= 1674470839
##$DBL= (0..7)
120 120 120 120 120 120 120 120 
##$DBP= (0..7)
150 150 150 150 150 150 150 150 
##$DBP07= 0
##$DBPNAM0= <>
##$DBPNAM1= <>
##$DBPNAM2= <>
##$DBPNAM3= <>
##$DBPNAM4= <>
$$ [...]
##$SUBNAM3= <"">
##$SUBNAM4= <"">
##$SUBNAM5= <"">
##$SUBNAM6= <"">
##$SUBNAM7= <"">
##$SUBNAM8= <"">
##$SUBNAM9= <"">
##$SW= 18.05172834244
##$SWIBOX= (0..15)
0 0 2 0 0 0 0 0 0 0 0 0 0 0 0 0 
##$SW_h= 3612.71676300578
##$TD= 16384
##$TD0= 1
##$TE= 0
##$TE2= 300
##$TE3= 300
##$TEG= 300
##$TL= (0..7)
0 120 120 120 120 120 120 120 
##$TP= (0..7)
150 150 150 150 150 150 150 150 
##$TP07= 0
##$TPNAME0= <>
##$TPNAME1= <>
##$TPNAME2= <>
##$TPNAME3= <>
##$TPNAME4= <>
##$TPNAME5= <>
##$TPNAME6= <>
##$TPNAME7= <>
##$TPOAL= (0..7)
0.5 0.5 0.5 0.5 0.5 0.5 0.5 0.5 
##$TPOFFS= (0..7)
0 0 0 0 0 0 0 0 
##$TUNHIN= 0
##$TUNHOUT= 0
##$TUNXOUT= 0
##$USERA1= <user>
##$USERA2= <user>
##$USERA3= <user>
##$USERA4= <user>
##$USERA5= <user>
##$V9= 5
##$VALIST= <valist>
##$VCLIST= <CCCCCCCCCCCCCCC>
##$VD= 0
##$VDLIST= <DDDDDDDDDDDDDDD>
##$VPLIST= <PPPPPPPPPPPPPPP>
##$VTLIST= <TTTTTTTTTTTTTTT>
##$WBST= 1024
##$WBSW= 4
##$XGAIN= (0..3)
0 0 0 0 
##$XL= 0
##$YL= 0
##$YMAX_a= 225761
##$YMIN_a= -188163
##$ZGOPTNS= <>
##$ZL1= 120
##$ZL2= 120
##$ZL3= 120
##$ZL4= 120
##$ABSF1= 15.78215
##$ABSF2= -2.269699
##$ABSG= 5
##$ABSL= 3
##$ALPHA= 0
##$AQORDER= 0
##$ASSFAC= 0
##$ASSFACI= 0
##$ASSFACX= 0
##$ASSWID= 0
##$AUNMP= <proc_1d>
##$AZFE= 0.1
##$AZFW= 0.1
##$BCFW= 0
##$BC_mod= 2
##$BYTORDP= 0
##$COROFFS= 0
##$CY= -3
##$DATMOD= 1
##$DC= 0
##$DFILT= <>
##$DTYPP= 0
##$F1P= 0
##$F2P= 0
##$FCOR= 1
##$FTSIZE= 16384
##$FT_mod= 6
##$GAMMA= 0
##$GB= 0
##$INTBC= 1
##$INTSCL= 3.70164e-10
##$ISEN= 128
##$LB= 0.24
##$LEV0= 0
##$LPBIN= 0
##$MAXI= 10000
##$MC2= 0
##$MEAN= 0
##$ME_mod= 0
##$MI= 1.114404
##$NCOEF= 0
##$NC_proc= -6
##$NLEV= 6
##$NOISF1= 3.799351
##$NOISF2= 2.8
##$NSP= 0
##$NTH_PI= 0
##$NZP= 0
##$OFFSET= 15.73808
##$PC= 1
##$PHC0= -19110.79
##$PHC1= 10.20079
##$PH_mod= 1
##$PKNL= yes
##$PPARMOD= 0
##$PSCAL= 0
##$PSIGN= 0
##$REVERSE= no
##$SF= 200.130006697108
##$SI= 16384
##$SIGF1= 3
##$SIGF2= 2
##$SINO= 5.538805
##$SIOLD= 16384
##$SREGLST= <1H.CDCl3>
##$SSB= 0
##$STSI= 16384
##$STSR= 0
##$SW_p= 3612.71676300578
##$SYMM= 0
##$S_DEV= 0
##$TDeff= 16384
##$TDoff= 0
##$TI= <>
##$TILT= no
##$TM1= 0
##$TM2= 0
##$TOPLEV= 0
##$USERP1= <user>
##$USERP2= <user>
##$USERP3= <user>
##$USERP4= <user>
##$USERP5= <user>
##$WDW= 1
##$XDIM= 16384
##$YMAX_p= 504823231
##$YMIN_p= -1319479
$$ End of Bruker specific parameters
$$ ---------------------------------
##NTUPLES= NMR SPECTRUM
##VAR_NAME=  FREQUENCY,     SPECTRUM/REAL,   SPECTRUM/IMAG
##SYMBOL=    X,             R,               I
##VAR_TYPE=  INDEPENDENT,   DEPENDENT,       DEPENDENT
##VAR_FORM=  AFFN,          ASDF,            ASDF
##VAR_DIM=   16384,         16384,           16384
##UNITS=     HZ,            ARBITRARY UNITS, ARBITRARY UNITS
##FACTOR=    0.220516191357247, 1,           1
##FIRST=     3149.66206074668, 0,            0
##LAST=      -463.054702259097, 0,           0
##MIN=       -463.054702259097, -1319479,    0
##MAX=       3149.66206074668, 504823231,    0
$$ Real data points
##PAGE= N=1
##DATA TABLE= (X++(R..R)), XYDATA
$$ [...]
7509b49472r6004K22854l7270q2296M0973K251R1281L1588R4313o8168J07743
7498E7793j6428j49237J09989Q7046m7961n2692K3008l2879O5872Q185m3441o421
7486B834j22612j2488O3447J36026J5340j7300m8531p1372P9265p496K4844p5778
7474c3821p5436J14146j02872K6940O9043j0151L4291l7675K0273j27604L9973
7463h2893N0146q457L1034Q3827j31945j21358O6886O8027q227q8794O5078M7797
7451b8879M1582k2613o1842m0543o5207r59J68580Q2592N8265r3107j2948J9144
7439D4065j10051L4470J12009l3906r7845J2190p0475M9813P3487l6649r337M6974
7427A4745r4365m8104J1003K6359o4219j5535O0889k9332j51981n380M8734P7294
$$ y = [-249472, -345476, -122622, -159892, -242188, -201215, -198964, -107683, -76095, 18218, -49950, 57793, 41365, -107872, 2117, 89163, 41202, -11490, 11518, -21361, 44511, 52696, 9255, 2834, -119778, -132266, -68819, 67207, 82547, 65247, 16716, -54656, 24609, 17113, 41957, -33821, -109257, 4889, -97983, -71043, -2000, -12151, 22140, -15535, 4738, -122866, -82893, -32747, -41204, -10170, 73657, -58288, -179646, -112760, -44733, -52960, -141754, -76676, -28879, 12703, -9910, -71752, -112295, -177502, -178461, -9881, 72711, 130976, 37869, 24921, 44065, -65986, -31516, 80493, 46587, -51258, -39068, -109543, -59730, 13757, -22892, -32229, 14745, -79620, -127724, -116721, -90362, -154581, -170116, -109227, -138559, -290540, -295920, -247186, -169892]
7415a69892O6683Q9517l9989m6354n4713N3314O3126r5076P980o4403M7185M6822
7403i5800L1863Q0936J3429m4507j3873K1430Q0793p1721l8431o4430j06833Q9639
7391a17505n7948K2367N3508j06337J26126J3526K7180n6075j03670P6752j63488
7380b85564n2467Q8461Q8893P3201K9104M2227r840n1479j15173K8697J42351
7369b1589P7008q1727q4797j16000J46973m0213r0090K08996J7377j85882K7460
7358a42484M2281O3151K0804j02202K4098j4140j33397R7729J94033M795J6033
7347G0701J487J7131p7882m9323r3750m328J52542R4588j11047m1529Q4303l3131
7335I762m1348l485K0599n6050M7609j31306m0317P2694o4803J13035l6422j33528
$$ y = [-169892, -103209, -13692, -53681, -100035, -154748, -101434, -38308, -133384, -125404, -189807, -142622, -95800, -63937, 16999, 30428, -14079, -27952, -6522, 74271, 2550, -35881, -100311, -207144, -117505, -175453, -153086, -99578, -205915, -79789, -66263, -39083, -95158, -198828, -122076, -285564, -338031, -249570, -160677, -87476, -58372, -16145, -25985, -77464, -192637, -163940, -21589, 55419, -26308, -111105, -227105, -80132, -120345, -210435, -1439, 15938, -169944, -142484, -100203, -37052, -16248, -118450, -94352, -108492, -241889, -144160, 49873, 54668, 70701, 72188, 89319, 11437, -37886, -131636, -135964, 16578, 111166, 119, -41410, 42893, 9762, -31586, -35071, -14472, -70522, -22913, -154219, -194536, -121842, -186645, -73610, -110032, -243560]
7323b43560M7301J06941j88679O5096K3963P9550l4222J760L006P9789L9560l0550
7311e0045o8810n3600O8409j46616O7871N2219n000o885J9588j44116M9711R4553
7299a22721o8378N6727O7037N9530k0819o7307J00411Q3262k1802m6103k3029
7288c192p7359k1445J775m94L9354Q0343j28281L3043O7810j3311L9345J3711
7276C1299k5921k9060j19541P3999P5283o4114l4547N497l1460j5592Q2785L1617
7264a9755J9801j20824l7295Q863j5082J35311P1069n371j81251q5938N1066R3122
7252h6284K5788K1925p0426M0212m30J6134J0577K7766N4243q5059r1836n6032
7240a93422N7210q950L8566M629O7207l9302O467Q2688j48730r9381N1813L884
$$ y = [-243560, -196259, -89318, -277997, -212901, -188938, -109388, -143610, -141850, -138844, -59055, -19495, -50045, -118855, -172455, -104046, -250662, -182791, -130572, -135572, -142457, -122869, -266985, -217274, -122721, -191099, -134372, -67335, -7805, -28624, -95931, 4480, 87742, 65940, 19837, -3192, -80551, -101996, -100221, -100715, -61361, 18982, -109299, -76256, -8446, -21757, 17588, 31299, 5378, -23682, -143223, -69224, 6059, -58055, -92602, -87105, -118565, -134157, -51372, -19755, 46, -120778, -158073, -149210, -164292, -28981, 42088, 36717, -144534, -230472, -179406, -86284, -60496, -38571, -108997, -68785, -69215, -53081, -42504, -14738, 39505, -45554, -137390, -193422, -136212, -145162, -106596, -101967, -34760, -74062, -67595, 15093, -133637, -233018, -181205, -177321]
7228a77321Q9073j29462K1883J28792J9059m2877L6450Q8541O489k16227O4196
7217a11404L8750q0567k1301m394J07683P0531j2772j82677P8523P5265k8146
7206g0509N8402L4281q1747m9207M6681p0874J20888l1357l6012k5128K3636Q6844
7194E898k2155m775J73739j30105L8185k9470p6798j2333o3728k8773o8767J6095
7182b02987R8247N4500M2308M5480q7777j08348q1139K4011o602P4591J35664
7171a2052l9346L3938R2004p0258j10557M2884J01656r4202m2364N0925J47306
7160I9934j412k4531k13058m8208J55131q492m1568L4080l7132R4890K5939j34264
7148i8691J7834M5499P858p0233m7086N227R8361M9251j2480M4647m2361l3138
$$ y = [-177321, -88248, -217710, -195827, -67035, -47976, -90853, -54403, 34138, 40627, -175600, -111404, -72654, -153221, -174522, -178916, -71233, -702, -13474, -196151, -117628, -42363, -70509, -12107, 22174, -59573, -108780, -62099, -132973, -12085, -43442, -79454, -104582, -80946, 5898, -16257, -21032, 152707, 22602, 60787, 31317, -45481, -57814, -121542, -150315, -219082, -202987, -104740, -50240, -7932, 37548, -50229, -158577, -239716, -215705, -222307, -147716, -12052, -51398, -17460, 74544, 4286, -106271, -63387, 38269, -55933, -98297, -47372, 99934, 98522, 73991, -139067, -187275, -32144, -40636, -82204, -48124, -85256, 9634, 35573, -98691, -80857, -35358, -27500, -97733, -144819, -139592, -41231, 8020, -4460, 40187, -2174, -35312]
7136c5312k2790Q598r0164M8382k2421O8265J08409n8518j34618j0187Q8072M1651
7124a0633o5860Q2642P3274n0887m229J06506k8925j84054q1308q523l9565L3460
7112a78102l429O6345N1524j182k5353o1532Q0916L046N6328n0849j12113N1194
7100a23207R7349K6741n8208o9825Q1918p7355n6527J05708j127l6525j12968
7089b24026q1738J36231P5316J8486p1864J5157P9317N9882k1200J5027q4811
7078h4223j24395J07657J63239k20378M3171J79041j51221L7710j48491P1566
7068a26324J22590o9748Q0754q925m9434R6463o4948J6596r8903r1339m5570M3391
7056a95397K5559K04446M2322l1339k5944P1207k7910j51932N7740o261K7181
$$ y = [-35312, -58102, -49504, -139668, -91286, -113707, -45442, 62967, 4449, -130169, -140356, -52284, -10633, -76493, 6149, 79423, 28536, 24307, 130813, 101888, -82166, -163474, -171997, -211562, -178102, -181531, -115186, -63662, -64844, -90197, -151729, -70813, -67767, -11439, -62288, -174401, -123207, -25858, 883, -57325, -127150, -45232, -122587, -179114, -73406, -74533, -111058, -224026, -305764, -169533, -94217, -75731, -147595, -132438, -53121, 6761, -14439, 588, -84223, -208618, -100961, 62278, -158100, -114929, 64112, -87109, -49399, -197890, -126324, -3734, -73482, 7272, -1653, -51087, 45376, -19572, -2976, -101879, -193218, -238788, -195397, -169838, 34608, 76930, 45591, 19647, 90854, 62944, -88988, -31248, -37509, -10328]
7045a0328o2771R6006k4625j22182k7817N9259Q9541K5247m782j13675M6139J07412
7033E7424p6091n0179r2113P6738O8073o3917j9136Q0814j26753J6776J12250
7022a6114L2033M5384P088j6805o3464J03585q640j03863k2891n0252R1067o5949
7010f8821l0139J05076p6132m6276J40403O7810l8030O8713L7228j04091j20869
6999f5128p3746J5458P1220Q5775q3003p5222L9166J03143P686N269M3399O7175
6987A41192p3760r8029n3482M8916J97510P4603j48342l0510j54440j0796L6459
6976g0679l2197K7508J52493R0432j01281L2465m688q7517k9084p0780J91404
6965I8076k3827j24891J064J15128J37338q0159n9389n9037j4909j05034J32013
$$ y = [-10328, -73099, 22907, -1718, -123900, -151717, -92458, -2917, 22330, 17548, -96127, -49988, 57424, -18667, -68846, -160959, -84221, -16148, -80065, -99201, -18387, -145140, -128364, -16114, 15919, 61303, 68391, 51586, -11878, 91707, 83067, -20796, -43687, -93939, -2872, -68821, -98960, 6116, -70016, -116292, 24111, 91921, 53891, 122604, 159832, 55741, -65128, -138874, -123416, -52196, 33579, -49424, -124646, -85480, 17663, 25349, 30618, 74017, 141192, 67432, -30597, -84079, -35163, 162347, 236950, 88608, 58098, -96342, -107138, -70679, -102876, -75368, 77125, 167557, 66276, 98741, 94053, 6536, -22548, -93328, 98076, 74249, -50642, -49578, 65550, 202888, 122729, 63340, 4303, -10606, -115640, 16373]
6954A6373k6273k1798M3020J10802O9266j93788l2162M9922p9544R6710K5845
6943E8373Q0691N587l123L9027o0141q7864p194K4659n525Q1408J2800J5090j1844
6930A41944o374q2483J35475q4387M2757Q9034p4712m0486m9810K0374J26934
6919B18266J59643L5906J81118J29184Q6239J76505L22450J50115J20675J04090
6909A684191K4460k56933l41768j67507k05919j70951M5238m6422r7514j59613
6899C07262j81012j9738J20028n5584R7018l4292q9564j2952m2951J242P9494
6888A68951q7197l001j4480j38676J09040J15992j05703j9675K0317r3688R1740
6877D3620N518k0478P161r3582M7146O3810n4927L3443L2907K1010J0765m2706
$$ y = [16373, -9900, -31698, 11322, 122124, 191390, -2398, -34560, 15362, -64182, 32528, 58373, 139064, 144651, 141528, 180555, 120414, 32550, 25356, 50015, 44490, 125898, 138698, 153788, 141944, 135570, 53087, 188562, 104175, 146932, 235966, 161254, 120768, 70958, 91332, 218266, 377909, 413815, 594933, 724117, 810356, 986861, 1309311, 1459426, 1580101, 1684191, 1708651, 1451718, 1109950, 942443, 736524, 565573, 610811, 564389, 466875, 307262, 126250, 106512, 226540, 170956, 267974, 233682, 144118, 131166, 88215, 89457, 168951, 81754, 78753, 64273, -74403, 34637, 150629, 44926, 25251, 45568, -48120, 43620, 49138, 28660, 35821, -57761, -10615, 53195, -1732, 31711, 64618, 85628, 96393, 53687]
6865E3687j2023j88865P5040n09J17542r593j58266J2348M5684J79211j06573
6854G683K3791k0073j6765r3971M2210P2355j06129j8147j8355J17267m3932N8299
6842D233l8566P6998K8483n1236J486j8416J24657j57189o2460j8762P3488P1625
6830C4341M7709O6972j62299k26515J13072l7255J8185P6556m7342K4982R5223
6819C629n8064O7674k7337l3505j4515k3218J15930k3213p511j01760k7542Q4466
6807d4966L8824k3128L8408J70853j31821j04058K1758l0871j5457j0918k8415
6796a19791K40100N2495j47742m0656r6827M5766J60124j535k34435r43R0617
6785e2827O9885K1690k9822m730j11269J12697j01894m9723J68943P0074j03250
$$ y = [53687, 41664, -147201, -72161, -72670, 44872, 35279, -122987, -110639, -64955, 114256, 7683, 31474, 11401, -5364, -99335, -57125, 15230, -90899, -109046, -127401, -10134, -54066, 4233, -34333, 42665, 71148, 19912, 21398, 2982, 127639, -29550, -92010, -110772, -37284, 34341, 82050, 149022, -13277, -239792, -126720, -163975, -145790, -69234, -116576, -91594, 3629, -54435, 13239, -14098, -47603, -62118, -85336, 30594, 7381, -130, -101890, -129432, -44966, -6142, -29270, 9138, 179991, 48170, -55888, -34130, -65001, -80458, -91376, -119791, 120309, 172804, 25062, -15594, -112421, -66655, 93469, 91934, -142501, -143444, -52827, 17058, 38748, 8926, 4196, -107073, 5624, -96270, -145993, 22950, 93024, -10226]
6774a0226L8407l972j05948J231M3748M4719P346p172n1088J13360J40548m8072
6762A62881r1674j13677N3988R8857j41472J9274k1597o6342P729L6436L4669
6751b0928q1229K6108L0073K3053n1158J80320J923J1734J22576l9341q0794p622
6739A14715O5150M2127q1029l8758J06025j1248O476R6890o7151j74834J50657
6728B09020j00152n1442j9101P5632L6871K4409j06392m6125J0081M5078M5058
6717A22937n8235j34281j4010J23779p60j09199N5138P2335J144p5784K7507L3685
6705D4256j00887N0100M7012j95531Q6997J28235p7464q484N6950J44867j32108
6694D3943r8288J36991J2583p8779j11632L6152K856o53N4224l5465o015L8191
$$ y = [-10226, 28181, 24209, -81739, -80508, -36760, 7959, 15305, 8133, -42955, 70405, 210953, 162881, 71207, -42470, 11518, 110375, -31097, -11823, -33420, -99762, -92033, -55597, -20928, -102157, -76049, -45976, -22923, -74081, 106239, 108162, 119896, 242472, 203131, 122337, 114715, 179865, 221992, 140963, 102205, 208230, 196982, 203458, 300348, 233197, 58363, 209020, 108868, 57426, 38325, 113957, 150828, 175237, 68845, 22720, 32801, 77879, 122937, 64702, -69579, -83589, 40190, 39430, -69769, -14631, 57704, 58848, -16936, 10571, 44256, -56631, -6531, 40481, -155050, -68053, 60182, -17282, -25766, 31184, 176051, 43943, -54345, 82646, 95229, 16450, -95182, -59030, -56174, -56827, -2603, -38068, -44083, -5892]
6682e892n26j14947R405J49243r6816n4188J51575o4739R3955M1121j55352l9511
6670h6672K17763J6975L0262n7018j9647j32905r5147k0005J40339O4850k25249
6659a66454J06769J01817L5064j35189J15700O0765R593j16431O8810J4879j5013
6648H0310j35753j3345K0179j3384J4231j08588J18141Q3249p0721m9467K00353
6637A25205q3542j85291K5313N1941J9888k3298J16048J060O5967j61190p2520
6626a20419J50940M973p8696m7019K7901l2216m1264Q8347P2898r7767p7618J3509
6614a36431O1993L3636l1299M8571J09623r6483o2229L7853P619p7661o2709r808
6602a77325J11459j0949J0683k1861M8737K8537q9760q0341l415p0806J34870
$$ y = [-5892, -6418, -121365, -111960, 37283, -59533, -113721, 37854, -26885, 67070, 108191, -47161, -86672, 131091, 148066, 178328, 121310, 101663, -31242, -126389, -146394, -6055, 58795, -166454, -59685, 42132, 77196, -57993, 57707, 118472, 128065, 11634, 80444, 95323, 80310, -55443, -68788, -48609, -61993, -47762, -156350, -38209, 45040, -25681, -75148, 125205, 41663, -143628, -118315, -66374, -46486, -69784, 46264, 47324, 113291, -47899, -120419, 30521, 35494, -43202, -90221, -62320, -94536, -135800, -47453, 25445, -72322, -149940, -136431, -74438, -40802, -72101, -23530, 86093, -10390, -72619, -34766, -27147, -104808, -167517, -177325, -65866, -76815, -66132, -87993, -39256, -10719, -100479, -180820, -184235, -255041, -120171]
6591a20171m9439l3040M7649J85791J1201o1077j8090n8370J96495J136j22758
6580b0673J25207j40942k6677M3966o3226j67753K47201J06746j19500q293J5716
6569h228l0821M490j18586J9957O1752j3883j1768J13575l0607o5249R7934k1869
6557c303o2046o6272L1228O8368k2844j05551J01016K0345J6641j10597l7453
6546a70468p841J52356k2639N1665j42232Q7876O9462N6391J9014l0222J229j27117
6534f2526j8286P8230L4519n7224r1013M4475j1196R8623q0779j56735J2651J39159
6522g0102P8856j11290n1273m4782J00446R1895m1467l2974l1242R6878r7766
6511a12821o3213M4455L9500M8042j3542O0027j09180J9699r255O4927n6015M3094
$$ y = [-120171, -169610, -202650, -155001, 30790, 41991, -19086, -37176, -95546, 100949, 102085, -20673, 104534, -36408, -63085, -19119, -82345, -250098, -2897, 103849, -15651, -23944, -8228, -39049, -34559, -153145, -133188, -71436, -85319, -97087, 16488, -14119, -79368, 18566, -3303, -65349, -131621, -100393, -32025, -54869, -160420, -59404, -39059, -22418, -133015, -170468, -178309, -25953, -48592, 3073, -139159, -51283, 18179, 74570, 93584, 63362, 64591, -62526, -80812, -2582, 31937, -25287, -116300, -71825, -83021, 15602, -65177, -221912, -209261, -70102, 8754, -102536, -153809, -198591, -98145, -6250, -47717, -80691, -111933, -15055, -112821, -176034, -131579, -92079, -44037, -57579, 2448, -106732, -87033, -96288, -31361, -87376, -44282]
6499d4282K4227K78M3191P1161o5179r6475Q372o7588P7689q254j1886M096Q4759
6486B0109k2209k7840O0124l131m3912j87095j59000J31144n1250J18299O0877
6475a03884r1325J2320J72375j298k4277k1419J4427J2676k8041K7773N5297Q768
6463C3392j41387m3378R0875j307Q477q554j23811P4025J33035n1691j07240J35726
6451a838P7907n3500j77206J07030p675P4209M5650n0634j54708K7033J15290
6440A558L0249J8883j22435P5623j27550m1779R6876N37J8153l3934P0121k2090
6428c5788o7723j00769Q0679M4627L1443o2800J44059j2667n1442J14279p1633
6417A2265j04050n2527R7816r4062j6138M6467o9557l0150J4762O4777R4042O2143
$$ y = [-44282, -20055, -19777, 23414, 94575, 29396, -67079, -58707, -126295, -48606, -56860, -68746, -64650, 20109, -2100, -29940, 30184, 27053, -16859, -203954, -362954, -231810, -283060, -164761, -103884, -195209, -182889, -10514, -11812, -36089, -57508, -43081, -30405, -58446, -30673, 24624, 33392, -107995, -151373, -60498, -61805, -53328, -61882, -185693, -111668, 21367, -30324, -137564, -1838, 76069, 22569, -154637, -47607, -55282, 18927, 64577, 13943, -140765, -113732, 1558, 31807, 50690, -71745, 3878, -123672, -165451, -68575, -68038, -49885, -83819, -13698, -35788, -103511, -204280, -123601, -78974, -47531, -110331, 33728, 21061, -30381, 83898, 12265, -91785, -144312, -46496, -140558, -156696, -110229, -179786, -209936, -195174, -130397, -36355, 25788]
6405B5788J69841j29519N0627j58823j19418J49644o2267J4778M6335o0910j06706
6394a80630J12972J89196j54403o2496J9496O1595O4442q0320m859n2818j35713
6383b23538J53861N003m1271p4894J8399l4394m0311L08607p388k4765j8383m8758
6371b7832j3037J19694k7671j48125P1425O8844n6600o2257j46047J32337j2555
6360a01824K5067J49408l2097l9630l9689j34084R3843j8063n8380J16031p5972
6349a15390J5679J10921Q2926L7577l04962j2591J04284Q2350m9757q3045k2487
6338a54495N0284m7264K8277K00432r2863M0485l1543o4876q189N1859P556j50104
6326a70441j02426J11153Q2160N0922k0528K1385l194L709M9031L2807m4911p2894
$$ y = [25788, 195629, 66110, 116737, -42086, -161504, -11860, -74127, -59349, -13014, -73924, -180630, -67658, 121538, -32865, -95361, -75865, -14270, 50172, -30148, -35007, -87825, -223538, -69677, -64674, -105945, -180839, -162440, -196834, -237145, 71462, 64074, 39309, 20926, -27832, -40869, 78825, 51154, -96971, -25546, 43298, -13302, -75559, -221606, -89269, -101824, -76757, 72651, 40554, 924, -38765, -172849, -79006, -97069, -155449, -39418, -115390, -99711, 11210, 94136, 131713, -173249, -185840, -81556, 794, -48963, -132008, -154495, -104211, -151475, -123198, 77234, -15629, 24856, -6687, -71563, -79752, -27893, -20337, -170441, -272867, -161714, -79554, -28632, -49160, -27775, -30969, -27260, 21771, 54578, 9667, -63227]
6314f3227m1497r6136L6721p5588J4428J43951o0023L0522o2835r543L2869J00557
6302d9801K2943J03340j67049j35209J21340J9561o2877P7582o004r8266N7650
6291a16790N3981N1967M7939o3604J07641K7422j27565o2679J2639k5129J03223
6280I045O6771j65018N3584O1326o9569j4358n8016j4147Q2408M5487N8059j30792
6268g5220O0433m4403p8352j25700K2680J0203m3203J71747O2349O1070Q0289
6257A01893l6135M9823J3050j51931q1334m3845k4312k5541Q1916M4551r7177
6246a69042K3417O3817m0707N8233P8304L9170j2944p2599l770k977L691m1521
6234g6928M7647N5897k5039j12266n8565K109K5045P4816L1628L153l5965j20436
$$ y = [-63227, -104724, -200860, -164139, -239727, -225299, -81348, -141371, -110849, -173684, -183227, -150358, -49801, -26858, 76482, -90567, -225776, -104436, -84875, -147752, -70170, -76174, -174440, -116790, -62809, -10842, 37097, -26507, 81134, 108556, -19009, -81688, -69049, -94178, 9045, 75816, -89202, -35618, 25708, -43861, -58219, -116235, -130382, -47974, -2487, 55572, -75220, -14787, -59190, -137542, -263242, -240562, -230359, -273562, -101815, -39466, 21604, 101893, 65758, 115581, 128631, -23300, -104634, -148479, -172791, -198332, -116416, -71865, -169042, -145625, -81808, -122515, -64282, 14022, 53192, 40248, -32351, -36121, -39098, -35407, -76928, -29281, 26616, 1577, -110689, -169254, -167145, -142100, -67284, -35656, -32503, -68468, -188904]
6222a88904P6541n1752q2438L3146N3280K6144l3446q3662m2712J29645K14064
6211D9906o3050j8543Q9485O6920J01840k68052k4762k9756P8937J52314q1183
6200E4056m4957m1892j2492K3106m7216q540j8675J28714K110l0434q975k2445
6188b7640L8818n2897j11826J36649m1486O690p4219j22305J13011L8915J85025
6177H8735o5210m5886P6027N4839M5487n5199j11560L1431j3132n1041L0076J57600
6165A42167p0068j64196M3484j6545j61370Q2581J41871p4775M259K2322R1542
6154D1272r133n9720M107j82978P4152N5492j2332L6889Q5103o5840j24402L5258
6142a22132J22126p14j03710J02957K3348L1275j30939j81070M2975J41168l5914
$$ y = [-188904, -112363, -164115, -246553, -213407, -160127, -133983, -167429, -251091, -293803, -164158, 49906, -13144, -31687, 57798, 124718, 226558, -41494, -66256, -96012, -17075, 135239, 54056, 9099, -32793, -45285, -22179, -69395, -77935, -96610, 32104, 34214, 3780, -5195, -27640, 11178, -41719, -153545, -16896, -58382, -51692, -125911, -248216, -135205, -96290, 88735, 23525, -22361, 53666, 108505, 153992, 98793, -12767, 18664, 5532, -45509, -15433, 142167, 72099, -92097, -48613, -65158, -226528, -143947, -2076, -76851, -72592, -50270, 41272, 32139, -27581, -23474, -206452, -132300, -76808, -89140, -52251, 32852, -32988, -157390, -122132, -6, -720, -104430, -1473, 21875, 53150, -77789, -258859, -215884, -74716, -110630]
6131a10630J4140J73086J2282q5262K4467m0905j6065P8924m5773M2075J9824
6120F6163m2536P5752p1261O4367Q9894J910q629j80877J19983l9555j19659P7852
6108C3404O1278K5931j26210k9509j39569N9690l9996j1453N7605M8556o938N7153
6096a0058n8717J27010q8250j74793K2641J0496J8526J137K9698M3381J24308
6085D5379l8768M4139j24237p258P7607Q762M2524J12008l5408k5881P3898p0169
6073A02596j0929p5719j47628J06675l3846L9644P4505Q5160o8804L035j5871
6062E8818j66708k7763J35485j7958Q1182L3336N6361j26211o0871l7945q4322
6051a56596J96256J04344r4882P825o6725m3439N634M5105M13K6306j9843l7050
$$ y = [-110630, -96490, 76596, 88878, 3616, 28083, -12822, -28887, 50037, 4264, 46339, 66163, 23627, 99379, 28118, 92485, 182379, 184289, 175660, -5217, 114766, 75211, -44448, 33404, 94682, 120613, -5597, -35106, -174675, -114985, -154981, -166434, -108829, -60273, -67211, -10058, -68775, 58235, -30015, -204808, -182167, -171671, -153145, -152008, -122310, -78929, 45379, 6611, 50750, -73487, -80745, -3138, 5624, 48148, 160156, 124748, 98867, 172765, 102596, 91667, 15948, -131680, -25005, -58851, -19207, 55298, 140458, 71654, 74689, 58818, -107890, -135653, -168, -18126, 63056, 96392, 152753, 26542, -34329, -72274, -156596, 39660, 144004, 49122, 56947, -9778, -53217, -47583, -2478, -2065, 24241, 4398, -32652]
6039c2652p6578o5370M005J01239o371j1487J36539K0899J12482j75618p8363
6028g1275r2303K1786J01751l4011l574K1333m3349P0846J6390m7592J0073Q3972
6016C4047P516l5810p0556J3982L0095L6008r287o5801O6531j06315j11670J11830
6004i9430M4121R0676n9642m3912j63092N3924O2243L1394J7616J35895r5767
5993b5974j05572K2153J03119j8999L7195J3659j02795N0162P944m1931M401Q4102
5981B7464l0856O5044K8192J8411M783r1486j02305n5104J9648n4991R87J61301
5969h912m1352j6068P2727j25200K2724n6620N1919N3383k9224J13661k1654J8709
5957C4093J7586J7817l5904k27j32396J3769J4019J06500P7082m1719j26738Q6420
$$ y = [-32652, -109230, -174600, -170595, -69356, -75727, -87214, 49325, 70224, 182706, 7088, -71275, -163578, -141792, -40041, -74052, -77626, -56293, -99642, -28796, -12406, -59998, -49925, 34047, 41563, 5753, -64803, -50821, -20726, 15282, 5995, -59806, 6725, -99590, -211260, -99430, -55309, 35367, -24275, -68187, -231279, -177355, -115112, -83718, -66102, 69793, -25974, -131546, -109393, -6274, -25273, 11922, 25581, -77214, -27052, -19108, -61039, -56638, 27464, -3392, 61652, 89844, 108255, 113038, 21552, -80753, -135857, -116209, -171200, -170213, -8912, -50264, -66332, 6395, -118805, -96081, -152701, -100782, -47399, -76623, 37038, 15384, 34093, 51679, 69496, 33592, 33365, -99031, -85262, -71243, 35257, 112339, 70620, -56118, 30302]
5945C0302l8187O8334P4267K527r2649j01533Q8294K830j67771m5026J06709J9029
5933e2874K1051o3412k8445L5327N544N532N5006L5650o5312L0222N1042q2132
5921e2801L5135L4560l3513P0381R523k6021p014o3678q6097J27484l7834Q6366
5909E6491l0846j89770O5169L3972J18714k3262j5048n6816K575j2535j3612Q0003
5897A5035j4562r986l3271j3676N3367m065K8298j759J06132k3219j00564O114
5885G844O7925q8249j10002L7184N5770N6245q2307j52386L0387R6168P9694J06591
5873A04864k1207J2107m5097L5034l1565j8254k7256O8702r7083R820K2708k2224
5861i451K6202Q787K8555n3548m2660n0327P1612n7145o5875O0195M0081M3131
$$ y = [30302, -7885, 60449, 134716, 137243, 44594, -56939, 31355, 34185, -133586, -178612, -71903, -52874, -31823, -95235, -123680, -88353, -82809, -77277, -22271, 13379, -51933, -21711, 29331, -52801, -17666, 16894, -16619, 53762, 63285, 37264, 30250, -33428, -119525, 7959, -29875, 56491, 25645, -164125, -98956, -64984, 53730, 30468, 15420, -41396, -38821, -51356, -64968, 15035, 473, -9513, -42784, -56460, -3093, -7158, 21140, 19381, 125513, 102294, 1730, 7844, 75769, -12480, -122482, -85298, -29528, 26717, -55590, -207976, -177589, -81421, -1727, 104864, 83657, 95764, 50667, 85701, 54136, 35882, 8626, 77328, -19755, -9935, 12773, -9451, 16751, 25538, 54093, 545, -42115, -92442, -20830, -77975, -143850, -83655, -43574, -443]
5849d43m4034N7853N5234n3422J07670m4299k3832j04563R148J4091O9505r4568
5837e1660r2657O0893J05137R771J4578l1160q5868J82386R5578k13245j2236
5826a8483J72561O4586n2280o8044j22946J52294Q1077q2799m5503K0602J35760
5815B36825K0100j39517j92810N5000L8562j2365j00369n3924N3652K6118K8961
5804c9767p0086M258l1938m7311J28889M4323l979N1423m8170k2369j22700J70783
5792A3356R0872m1188j01144R2496J07247q1518J9637j49332R4759k1809J60469
5781A83845j46113J2185J06538p9502k9813L1091L9805m552N387j79076O6213
5770F008O4806o5072P9491M3430n4957m1637L5184P3049L7416j15417m6031m4020
$$ y = [-443, -44477, 13376, 68610, 15188, 122858, 78559, 54727, -49836, -40688, -26597, 42908, -51660, -144317, -83424, 21713, 31484, 46062, 14902, -70966, 111420, 206998, -6247, -18483, 154078, 218664, 166384, 98340, -24606, 127688, 208765, 125966, 80463, 101065, 236825, 256925, 117408, -75402, -20402, 18160, 5795, -94574, -148498, -94846, -68728, -39767, -109853, -105595, -137533, -184844, -55955, -11632, -15611, 35812, -12358, -34727, -157427, 13356, 104228, 63040, -38104, 54392, 161639, 80121, 99758, -49574, 45185, 23376, 183845, 37732, 49917, 156455, 76953, 47140, 78231, 118036, 113484, 118871, -60205, 6008, 70814, 5742, 85233, 128663, 73706, 32069, 67253, 140302, 177718, 62301, 16270, -27750]
5758b7750O4069m5730p1481J02352l5247P9890J9750n0882J22918j983l8954l940
5746A13012J8500J34602L9681j06673M8015j19979j20919j2610N1950Q5704J9341
5735A50624J11463L2368j33079r6866K2949M7319m8181P691P729l1310j4631M1339
5723I7415J5957O8344L9943n4854p2999j5878O4252L1191K2230p46R7015j51329
5711A40541L9825J04741P5198O112j08789j3931O1150J6198j02976K4371P0717
5700C13157Q3826R2973j3130j1161q1024P9551J09371K28J46013J33857q4284
5689G69377m6329R8664L3199K1831Q011P5640N6639q247M7096n7508j15924m6330
5677H36119J24788j81496n288M8381l2634R697N2711j12850j3551J47977K3544
$$ y = [-27750, 36319, -9411, -80892, 21460, -13787, 66103, 85853, 34971, 157889, 155906, 116952, 113012, 131512, 266114, 305795, 199122, 247137, 127158, 6239, -6371, 45579, 131283, 150624, 262087, 294455, 161376, 64510, 87459, 134778, 86597, 94288, 102017, 70707, 56076, 97415, 113372, 181716, 221659, 166805, 93806, 77928, 142180, 173371, 195601, 194855, 291870, 140541, 180366, 285107, 360305, 366417, 257628, 243697, 304847, 321045, 218069, 242440, 313157, 396983, 489956, 476826, 465665, 384641, 464192, 573563, 573791, 719804, 853661, 769377, 723048, 821712, 854911, 876742, 884753, 960393, 1017032, 1008785, 1055881, 998373, 882449, 836119, 960907, 779411, 774123, 822504, 789870, 799567, 852278, 739428, 725877, 873854, 897398]
5666H97398L317L9510J45751J18589J52792J89124M2106O5712K02452J46814J43191
5655B146756J05698J97000J6393k7216N0522q1753k39442r8711q1751j08972j98221
5644A680303k10023j02160j07298j26661j6663k1634J13603l4291j10329J27222
5634A192069O6012L0859Q8738Q7291j2801J26569J25688J2355L17994J78288J8446
5623B231508L8456J51776r825p0673o3428j33182j5775j98428k04594k09540M9429
5612A565724p6260k50287k59295O9752j11980j73198l2552j4230J68443n1683
5602H34434j7549n9665n5628J3726q4012j6745J56866L5490m692J48374K3228
5591I73827J7707l0309j81231J14597N1934j1827j26086j01617l7027r8720r8705
$$ y = [897398, 900715, 940225, 1085976, 1204565, 1357357, 1546481, 1588587, 1654299, 1856751, 2003565, 2146756, 2252454, 2449454, 2465847, 2438631, 2489153, 2407400, 2167958, 2069247, 1987496, 1878524, 1680303, 1470280, 1368120, 1260822, 1134161, 1117498, 1095864, 1209467, 1175176, 1064847, 1192069, 1258081, 1288940, 1377678, 1464969, 1452168, 1578737, 1704425, 1716780, 2034774, 2213062, 2231508, 2269964, 2421740, 2411915, 2341242, 2277814, 2144632, 2128857, 1930429, 1725835, 1516295, 1565724, 1489464, 1239177, 979882, 1049634, 937654, 764456, 731904, 717674, 886117, 834434, 816885, 757220, 701592, 715318, 631306, 614561, 771427, 806917, 802225, 950599, 973827, 991534, 961225, 779994, 894591, 946525, 934698, 808612, 706995, 669968, 571248, 472543]
5580D72543J08209K0487j25285p0018m0748L9785l4468r2999Q1740P7181j29596
5569C06831o2992j5334l5538O2153K5411q1510p8483k6090N2481q856L4815l6068
5557A36820m70P5180o039O3589n2343q2048J52841p4059l1004J04197Q4846j29876
5545B41634q8926m8989R990L0257j86813J34675N0766J5413p9682L0694L3240
5534A42259j78654Q7291L8008K3453O0243j68734K9827k4779J63529P2824p2557
5523A72710l0346p1579q581O7511J9519o8572K4403j65945J770p2658J21548K8442
5511A8222j68528P6313M9218J57286P6183k09908j2746l3162Q8777K9354k5987
5500D5022M8814r2531J0469O209J46855k2941j05634k5425q0135J3391J48486
$$ y = [472543, 580752, 601239, 475954, 405936, 365188, 404973, 370505, 277506, 359246, 436427, 306831, 243839, 228505, 192967, 255120, 280531, 199021, 120538, 94448, 146929, 138073, 172888, 136820, 136350, 211530, 205491, 269080, 216737, 134689, 287530, 213471, 182467, 286664, 371510, 241634, 152708, 103719, 113709, 143966, -42847, 91828, 142594, 158007, 78325, 109019, 142259, -36395, 50896, 88904, 112357, 172600, 3866, 33693, 8914, 172443, 245267, 172710, 142364, 70785, 62204, 129715, 149234, 80662, 105065, -60880, -59110, -131768, -10220, 18222, -150306, -73993, -24775, 132511, 208694, -1214, -13960, -47122, 41655, 71009, 45022, 93836, 1305, 11774, 17983, 164838, 141897, 36263, 10838, -69297, -55906, 92580]
5489I2580N464j75813Q1722l9428J42726M2626r0872L2113k9436j7017j8385O0620
5477H6900m7035K753K5350j0162K6864P5073o7765j33554j12166N2797R2837J15482
5465A07374N3402q5177l8405q8429N8485P2528p0483R6584L4519N5878J17991
5454C14267j51423k15141m8096Q5119o0100O9545Q1075k1072q394K9825r1095
5443a5490M5903Q9841P2117M0284p1722K7470j85459L2577N4209R048k06568M7152
5431f0638Q7216k3697N6092n0950J01719n3811R0841n0312j59910O3105P8699
5420G8354l992M9640j39030J9882r6911j958Q3920J6646N5444L6135l4117k6682
5408C7331J07011p0970Q1267M1584M0239k0275j52480J82q1512R4033K2621o9088
$$ y = [92580, 98044, -77769, 3953, -35475, 107251, 149877, 59005, 91118, 61682, 44665, 26280, 86900, 39865, 42618, 67968, 57806, 84670, 159743, 91978, -41576, -153742, -100945, -8108, 107374, 160776, 75599, 37194, -51235, 7250, 79778, 9295, 105879, 140398, 196276, 314267, 162844, -52297, -100393, -15274, -75374, -5829, 75246, 54174, 45780, 75605, -15490, 30413, 120254, 192371, 232655, 160933, 188403, 2944, 35521, 89730, 98778, -107790, -60638, 26578, 2881, 58973, 8023, 109742, 55931, 146772, 96460, -63450, -345, 78354, 74362, 124002, -15028, 4854, -92057, -94015, -10095, 6551, 61995, 98130, 64013, 37331, 144342, 73372, 154639, 196223, 236462, 216187, 63707, 63889, -17623, 76410, 99031, 29943]
5396B9943J47347K1020j89379n6982O1613J5439J6696j9986N0566L6823k0111
5385I2989j9189R4247j12767p8933n0828N7847J00500M1800J4344q6450m917l3512
5373A5131M133K69r9885J11078Q9118K3101r5833q3158J16424O0542J00251o5323
5361A75848j46326J36071k3819Q584l9809J2292k7966j17736P0192J48613N31
5350A96475q7325j92064O7715N7343j17082J4484m2717O8395K1436P2044Q317
5339F7021J1505j2514n3068J43635R0804j37025j43100J53485K725n4528L3284
5328A02224j2160M7775l8351k5899j8773J09690j7938r4279K4318J15P9412l8825
5316A17309n6166J8447m0795L9260P1980L6983m1032n0117q6430p9319O0983K3723
$$ y = [29943, 177290, 198310, 8931, -48051, 13562, 29001, 45697, 25711, 76277, 113100, 92989, 73800, 168047, 55280, -23653, -74481, -16634, 83866, 125666, 140010, 53560, 48643, 15131, 19264, 19533, -80352, 30726, 119844, 142945, 47112, -36046, 80378, 140920, 241171, 175848, 29522, 165593, 141774, 150358, 110549, 122841, 94875, -22861, 47331, 195944, 196475, 109150, -82914, -15199, 42144, -74938, -60454, -103171, -34776, -13340, 58704, 67021, 78526, 66012, 12944, 156579, 247383, 110358, -32742, 120743, 123468, 68940, 102224, 90064, 137839, 99488, 73589, 54816, 164506, 146568, 52289, 76607, 76722, 156134, 117309, 61143, 79590, 38795, 78055, 150035, 187018, 145986, 95869, 9439, -69880, -8897, 14826]
5304A4826P3762k2528r1817p6319J64962l025m2695k6582m3152P8494j7720N3973
5292F2179O141j2086q673j47225L051J59592k1336r7779P2737J44617j18331m1751
5280A136K311J10031N5824m5387r9896k0453r5060L9208N8481J11506j7511P519
5268A07709j61500k931P0210Q696k802L2340l9111o673J3713J05961l2937n5102
5256C7573k563R5853L7716K800M6215j22112j0254K706J9079n1849J27354j00409
5244H2109o1763O9368O7931p0600j3539m4076O3057Q2818j43922M024j09647J03634
5232B9394Q9126Q2849j3576j02169j614J5603J46180k1241p0061j12471l3373
5221H647n001n3407J01759k9616l0465K1536O209J07316j24702R2672o7462m7991
$$ y = [14826, 88588, 66060, -25757, -102076, 62886, 59861, 17166, -9416, -52568, 25926, 8206, 62179, 68320, 56234, 47561, -99664, -96613, 62979, 41643, -56136, 16601, 161218, 42887, 1136, 3447, 113478, 169302, 123915, 24019, 3566, -91494, -52286, 6195, 117701, 100190, 107709, -53791, -56722, 13488, 22184, 19382, 51722, 12611, 5938, 19651, 125612, 92675, 37573, 35010, 130863, 168579, 171379, 217594, 95482, 85228, 87934, 107013, 55164, 182518, 82109, 20346, 89714, 157645, 87045, 73506, 29430, 92487, 175305, 31383, 35407, -74240, 29394, 118520, 201369, 187793, 85624, 84010, 99613, 245793, 224552, 154491, 42020, 8647, 3646, -49761, 51998, 22382, -8083, 13453, 19662, 126978, 2276, 94948, 27486, -20505]
5209b0505K7135Q1529K9611P7377l6325r3135k6860m0961p0994L0703N453q0320
5197a17292J09860P0645p0771n2810Q385J3216P8776o0650N4015J21391J7031
5186A71796j32651p0048J19923M5678J5305p5610q410p4760Q4731L0202N3706
5175A59862j8168O8376R1225k02988r8965k0486J33984n8471p6376K6310J01220
5164A05523l0707j00432R268M3549O3592j21666k2242J17689k8376l3120J7289
5153B0367K3426M6030k564m0602o3498O0658q5320P0927K5404q780J6224P0278
5141A32550j16275L9562R9032k50725P8158J15280K2238o7554j2447q0157p5817
5130a16155L084Q4400M7974j0816q4087Q429k5543N6808P3212k0105n0193j34818
$$ y = [-20505, 6630, 88159, 117770, 195147, 158822, 65687, 38827, -2134, -73128, -42425, -36972, -117292, -7432, 63213, -7558, -60368, -51983, -38767, 40009, -20641, 33374, 154765, 171796, 39145, -30903, 89020, 134698, 150003, 74393, 65983, -8777, 75954, 106156, 159862, 141694, 210070, 301295, 98307, -658, -21144, 112840, 54369, -22007, 4303, 105523, 74816, -25616, -16348, 27201, 90793, -30873, -53115, 64574, 36198, 3078, 20367, 43793, 89823, 87259, 46657, -16841, 43817, -41503, 29424, 54828, 46048, 62272, 132550, 16275, 55837, 154869, -95856, -17698, 97582, 119820, 52266, 39819, -40338, -116155, -113071, -28671, 19303, 8487, -75600, -67171, -92714, -35906, 37306, 17201, -32992, -167810]
5118a67810K3413J67459L9814o7874k6658j3593J25860J3724j51817k5281O5821
5107a6942m190j04571K23874N2559j30587j1436o3976O6128R1400n0813n6959
5096e513o3993K05754K3237j2812k9350j11950L1839l6398j16061M8088P7511
5085A0352n8768L3470j68193J28968J00821J17281M3442k1309l3347k16590R1125
5074B7252Q5389J3928k9054o9438l5006R1837r7970k3790k6361J54089l6588j0617
5062D3671j9596j65757J29444M8165L2824J1821n7973r959n1375K3295K5328o6070
5050e6182L1980m1321M274L5697K5975J12048j9407q763k1898K818k1429j01072
5038e7280o5692O7914J08227j8506J14055q0125p9524O0205j9838K2640O0633
$$ y = [-167810, -144397, 23062, 62876, -4998, -31656, -45249, 80611, 94335, -57482, -82763, -16942, -21132, -125703, 98171, 150730, 20143, 8707, -55269, 10859, 102259, 51446, -5513, -69506, 136248, 159485, 146673, 117323, 5373, 37212, 814, -115247, -67159, 10352, -48416, -14946, -183139, -54171, 46650, 163931, 207373, 186064, 152717, -63873, 27252, 112641, 126569, 97515, 28077, -6929, 84908, -13062, -36852, -63213, 90876, 54288, 43671, 24075, -141682, -12238, 35927, 68751, 80572, 22599, 12640, -38735, -15440, 9888, -56182, -24202, -65523, -61249, -25552, 423, 112471, 93064, 84301, 62403, 65221, 43792, -57280, -122972, -55058, 53169, 34663, 148718, 68593, -10931, 49274, 29436, 52076, 112709]
5027A12709l2593q4892l2643O6372q5417P8322n5607l4838N4294R0181O406o8054
5015A4240P8097R8165m7695n3384l3998o9393l1560K5475N264L6712k9810M242
5003c645K6037o2996M9976J46540n1829L6921L9332j2678j27867L1690j17808
4992d6327o2133J11766J43375j18333p211O2124j50069j2786k6515j416l7192
4981a44717J76733L102L8334Q3801j9274p7528q0727l1968L9905Q5497o8577o1702
4969e7121J03865N1887L2304m2940O3198k2379L4221j70215L1592Q7793N612n8901
4957E8916j3469r1410J04810J41569q6346M5003q2023k26799M3133L1539j4272
4946h9349m7811Q5474J55856p4945K714o3471M4701P7124r3279J09635l8857j9927
$$ y = [112709, 80116, -4776, -37419, 28953, -56464, 21858, -33749, -68587, -14293, 75888, 82294, 14240, 92337, 190502, 142807, 89423, 55425, -13968, -45528, -20053, -14789, 21923, -7887, -3645, 22392, -40604, 9372, 155912, 104083, 141004, 180336, 167658, 39791, 71481, -46327, -108460, 3306, 146681, 28348, 21137, 83261, -66808, -79594, -106109, -107525, -144717, 32016, 35118, 73452, 157253, 137979, 60451, -20276, -52244, -12339, 73158, 4581, -57121, 46744, 98631, 130935, 87995, 151193, 128814, 163035, -7180, 24412, 112205, 117817, 58916, 45447, -45963, 58847, 200416, 114070, 159073, 77050, -149749, -106616, -75077, -89349, -137160, -51686, 104170, 29225, 31939, -31532, 13169, 90293, -2986, 106649, 67792, 47865]
4934D7865K3732n9854P0078m4201n869r757L3448k6236j0596k662J1058P395l0682
4921C719R1354L0492O0034m3166p9610M7649K1170r884l6343P2973j1784n7451
4909H9153o2223N2587N0101j22045Q4209o5931m0467K20189r7646m5818m8585
4898A3524N882N04J15457n6138m4667k9571P5991M5076j01889P4010P5493n3232
4886A20440r8937l2322k7631m5539J18692q6585j00025O5715J71313P2104q426
4875A48799j48085L7488J89200j12633Q7180j05610o0622j9803m7J74438M6576
4864B36881r1284R7970p0751j3320K89k8366K2089N8051M1946j8685Q18L8159
4852B73797j11246L1751o8886J2221m2972r5294R7497m3936J50730j20291j00606
$$ y = [47865, 71597, 11743, 81821, 37620, 31751, 21994, 55442, 29206, 18610, 15948, 27006, 34401, 3719, 95073, 125565, 185599, 142433, 62823, 110472, 131642, 121758, 85415, 158388, 146604, 89153, 26930, 79517, 129618, 7573, 91782, 25851, -14616, 205573, 107927, 62109, 13524, 19406, 19910, 135367, 79229, 34562, 4991, 80982, 126058, 24169, 98179, 173672, 120440, 21503, -10819, -38450, -83989, 34703, -51882, -151907, -86192, 85121, 157225, 148799, 714, 38202, 227402, 114769, 201949, 96339, 35717, 15914, 15867, 190305, 236881, 145597, 243567, 172816, 159496, 159785, 131419, 153508, 211559, 253505, 234820, 235638, 273797, 162551, 194302, 125416, 137637, 94665, -629, 96868, 52932, 203662, 83371, -17235]
4841a7235j09748P5796R3620L0587K7583K9749N0158n0085j15828j13372J98589
4830I9814M0729r676k8565q3331j3076Q4879q7126P3622k3340j30737O3343M2946
4818B9482N8120n2405J37398n5853O8994r6474r6906m4019J64822k5077r6624
4807h542n0732K6708K3240n1035K2692R0907J06694l8131r9269m5984J23062o0317
4795C9293N1080q2926o0133J24842M0411p1542m6165L4099M0938L9564j6891N6592
4783A49162l9404l2133O1932q5418P0415q857L1101J6224l4447j1670J6561P5216
4771B08682j6953l8912r6081q2262J30964M6782n6980M9282r1906m424P1920n6561
4759F3551j7446L855J03847j34975J54514K3947n6623l0560n7609j20126J04524
$$ y = [-17235, -126983, -51187, 42433, 73020, 100603, 130352, 180510, 130425, 14597, -98775, 99814, 140543, 130867, 102302, 18971, 5895, 90774, 3648, 77270, 53930, -76807, -13464, 29482, 87602, 35197, 172595, 116742, 185736, 89262, -7644, -51663, 113159, 88082, -8542, -59274, -32566, -9326, -60361, -37669, 53238, 159932, 121801, 22532, -23452, 99610, 39293, 90373, 7447, -52686, 72156, 112567, 41025, -5140, 28959, 69897, 109461, 92570, 149162, 109758, 77625, 139557, 54139, 124554, 115697, 146798, 163022, 128575, 116905, 133466, 208682, 191729, 152817, 56736, -25526, 105438, 152220, 95240, 144522, 52616, 48192, 120112, 63551, 46105, 49960, 153807, 18832, 173346, 197293, 140670, 110110, 52501, -67625, 36899]
4748C6899n1037J66390N2004j73649K2447K6639Q5243j47262q803J01820M3655
4737A54346q1707l7743Q1070N2148O5193j40393m6503J07742K9460l541j1733
4726A68339r8517l7614O9446N1413q4917o1732L7128n4640J8688K4370L341j7498
4714A7807J04558K6308l57202k5145R5009k607J04932R707K7140M6211O1407j23070
4702a4945K1382O3824q8560m4204J52243k3199j0886m4708p448j2149J9606j40257
4690a29301J32702p8291O3705Q6417k9466l0860q5151o0818J10674Q4770n0872
4679A3509l8449M6673M6079J11476J4227j22995p6067N1031L4940K2384p6093
4668B6715J7086J02097P1260n2143q1862l2720O5378O2141N409m7474L9916N2614
$$ y = [36899, -14138, 152252, 204256, 30607, 53054, 79693, 164936, 17674, 8871, 110691, 154346, 72639, 34896, 115966, 168114, 233307, 92914, 46411, 154153, 183613, 180072, 168339, 69822, 32208, 101654, 153067, 68150, 6418, 43546, -11094, 7594, 31964, 35305, 17807, 122365, 148673, -208529, -233674, -138665, -141272, -36340, -26633, 507, 46718, 108125, -14945, 6437, 70261, -18299, -62503, 89740, 66541, 55655, 10947, 3499, -8650, 10956, -129301, 3401, -74890, -11185, 75232, 45766, 14906, -70245, -131063, -20389, 64381, 13509, -24940, 21733, 67812, 179288, 193515, 70520, -5547, 45484, 80424, 102808, 26715, 43801, 145898, 217158, 165015, 83153, 50433, 115811, 177952, 183361, 135887, 175803, 228417]
4656B28417k08723R6470j24450O7414Q2061m9344Q5206j06986N3821O4131j65846
4645B2171n4764Q7438P2190K2738l7116r7465R219n4225j8289J04196N5561m04
4633A11250k4719R443j56637m7582J44760k0840j14769J5618J31172Q613Q035
4622F4344p5544N5686J1136r9972K4038J57189L5507q2403K917N877P31j5066
4610H4440N1137L5739p2473O6598J01758P2671Q4556o9525o7812R5179N5520K3561
4598D61349k55476j2653l1491Q82K9840N9131o2281r6229r168P2819o7496j7995
4586G1232k9678J8010K0042j5861L3999Q2295L0681q7063O104m1516J10780m1540
4574A57485R7007J35032p4318l5992j4590r3117J27042J8597j14378J45297O5239
$$ y = [228417, 19694, 116164, -8286, 59128, 141189, 91845, 177051, 70065, 123886, 188017, 22171, -32593, 54845, 127035, 149773, 112657, 15192, 24411, -29814, -48103, 56093, 111654, 111250, 86531, 95974, -60663, -108245, 36515, 15675, -99094, -83476, 47696, 56309, 64344, -11200, 44486, 55622, -44350, -20312, 136877, 172384, 89981, 92898, 98775, 99506, 84440, 135577, 171316, 98843, 165441, 267199, 339870, 424426, 354901, 287089, 382268, 437788, 461349, 205873, 193220, 161729, 162611, 192451, 251582, 189301, 93072, 83904, 156723, 89227, 71232, 41554, 59564, 79606, 63745, 97744, 180039, 210720, 123657, 129761, 88245, 199025, 157485, 254492, 389524, 315206, 279214, 264624, 171507, 298549, 317146, 202768, 348065, 413304]
4563D13304k7568k845m6908p6785J51160n1243j8228J2800n3288K9183q666K9430
4551C50346O328Q244L1042K4227J2124j58604J60633R9395m8316L445q7266J8595
4539D20193J2200j5103J2409J56387j41156l8454N9032J54225M3888j12421j48626
4528D02574O1956m255l9137L2879P5225q546K19606J83776j29563j45912m5816
4517F02787R3563N6274N0202m6965r1844L8381J6998j1586J5137J24611m7887
4506G99671J34736J08072K4758J318N1352O2155q0580K10603J2890M9045p038
4495A366982K616P0453J58907J69443K17711K51330L14921L61598J72290J92677
4485C278928j36428k35761k50281k17068j84601j58516l06663k37734M2555K693
$$ y = [413304, 385736, 382891, 335983, 259198, 410358, 359115, 340887, 353687, 300399, 329582, 320916, 350346, 356674, 364918, 395960, 420187, 432311, 273707, 434340, 533735, 485419, 488864, 401598, 420193, 432393, 417290, 429699, 586086, 444930, 406476, 465508, 619733, 663621, 551200, 402574, 464530, 460275, 421138, 454017, 529242, 520696, 740302, 924078, 794515, 648603, 602787, 696350, 752624, 802826, 755861, 664017, 702398, 719396, 707810, 722947, 847558, 799671, 934407, 1042479, 1067237, 1068555, 1119907, 1182062, 1101482, 1312085, 1324975, 1374020, 1366982, 1369598, 1440051, 1598958, 1768401, 1986112, 2237442, 2552363, 2913961, 3086251, 3278928, 3142500, 2906739, 2656458, 2439390, 2254789, 2096273, 1789610, 1551876, 1594431, 1597124]
4475A597124j10289r5730k7276j25904n1273O1641o9963j59489O0404j9310q7012
4464I72923K1128l428J26715r0293J3479p1147m4978r399N2475Q9278q8353j06678
4452H61722k0501J59326j05040m505O1660L4876O9070K4991j10898J6201J25223
4441A112125J74358j082p0060Q4098o7612K2184j16847j479L2810O5427J32829
4430A366751r7274M2240q2943n2184o2878n5055j8665J6006J69041o1489j02408
4419A061142K4487K8508r6244M5752K9239L9687J44206L3297J63354j9690L8263
4408A492001J34323K280j54269J2455J18483L85Q9669k6375l3064j514R013l4946
4396A608441j41061j03794R4910N5290P3733J53797O3617J5539m1781J8002q0521
$$ y = [1597124, 1486835, 1391105, 1363829, 1237925, 1186652, 1248293, 1178330, 1018841, 1079245, 1059935, 972923, 994051, 990623, 1117338, 1027045, 1040524, 969377, 924399, 915000, 967475, 1056753, 968400, 861722, 841221, 1000547, 895507, 891002, 952662, 987538, 1056608, 1081599, 970701, 986902, 1112125, 1286483, 1285401, 1215341, 1299439, 1231827, 1254011, 1137164, 1135685, 1168495, 1233922, 1366751, 1269477, 1311717, 1228774, 1176590, 1113712, 1058657, 1039992, 1055998, 1225039, 1163550, 1061142, 1085629, 1114137, 1017893, 1063645, 1092884, 1132571, 1276777, 1310074, 1473428, 1453738, 1492001, 1626324, 1628604, 1474335, 1486790, 1605273, 1605658, 1695327, 1668952, 1635888, 1634374, 1643387, 1608441, 1467380, 1363586, 1458496, 1513786, 1587519, 1741316, 1804933, 1820472, 1778691, 1796693, 1716172]
4385A716172l7153N4968P1648J86746o4372p6007N1341l9290J22453L5351m4865
4374A976992j6933J7481P7786j42556q4216J80485M7948K02719K08403M2383j49327
4363B361165J1355o1051M9192M7577J40452k09077j47189L7307O4364Q8942j1348
4352B371689J60450r94n417k538l8518O3676J07243J6116O7745M0883J05639J0942
4340B896916K0885Q4500j52887j456J44534J11220j0428p0377Q9186L8397K9675
4329C180165q5181O8615M3736J06537K44997N1614M5604J39085L0124O2930R1451
4318C979677J6165O8799J45143O0479J33709J5297q6734P9111N2106M0320J42590
4307D646662J48406J94411M7275J66628J00300K1928O7352P9468J08457M4090
$$ y = [1716172, 1679019, 1733987, 1805635, 1992381, 1928009, 1852002, 1903343, 1864053, 1986506, 2021857, 1976992, 1960059, 1977540, 2055326, 1912770, 1828554, 2009039, 2056987, 2259706, 2468109, 2510492, 2361165, 2372520, 2311469, 2360661, 2408238, 2548690, 2339613, 2192424, 2229731, 2294095, 2383037, 2371689, 2532139, 2531145, 2525728, 2523190, 2484672, 2548348, 2655591, 2671707, 2739452, 2780335, 2885974, 2896916, 2917801, 3002301, 2849414, 2847958, 2992492, 3103712, 3093284, 3022907, 3112093, 3150490, 3180165, 3094984, 3163599, 3207335, 3313872, 3558869, 3610483, 3656087, 3795172, 3825296, 3888226, 3979677, 3995842, 4064641, 4209784, 4270263, 4403972, 4419269, 4332535, 4411646, 4463752, 4504072, 4646662, 4795068, 4989479, 5036754, 5203382, 5303682, 5325610, 5392962, 5472430, 5580887, 5624977]
4297E624977J17406m3832J06724J09534M1343K05396J77763J2578l8794L02322
4287F615417J26446j8157K25968K53293J19712K80455L18547J51113K97937K58577
4277H629308M7548J51592J96931J39730r690J38804K45452K46294K44615M79061
4267A0509645J87184K05664M94375K98022J83445L09441M43580L81039K81297
4258A3293692L28181K68338N7422K73483L72693K56806M55559M53825K63416L85637
4248A6409052L80387N11413M63816L65398M68526M64274O79238P61481P55124
4239B1258709Q23940Q42085R37774P93642R28819R53685R55257J040257J256927
4230B9791095J342045J606048J585423J673325J848710J853635J636862J715155
$$ y = [5624977, 5742383, 5698551, 5805275, 5914809, 5956152, 6161548, 6339311, 6351889, 6313095, 6615417, 6741863, 6723706, 6949674, 7202967, 7322679, 7603134, 7921681, 8072794, 8370731, 8629308, 8676856, 8828448, 9025379, 9165109, 9155419, 9294223, 9539675, 9785969, 10030584, 10509645, 10696829, 10902493, 11396868, 11694890, 11878335, 12187776, 12631356, 13012395, 13293692, 13621873, 13890211, 13947633, 14221116, 14593809, 14850615, 15306174, 15759999, 16023415, 16409052, 16789439, 17300852, 17764668, 18130066, 18598592, 19062866, 19742104, 20503585, 21258709, 22082649, 22924734, 23862508, 24656150, 25584969, 26538654, 27493911, 28534168, 29791095, 31133140, 32739188, 34324611, 35997936, 37846646, 39700281, 41337143, 43052298]
4222D3052298J612101J549391J740037J812001K114368K299911K520035K718951
4214E9419093K980542L428248M008975M359876M891484N447438O250133O571088
4206I7356877P527349Q622038J0010257J1639942J3799121J6867390K0867653
4199A86690627K6619235L3786753M2523766N2686675O0137945N7102168L5802400
4192D95349569R473662k3991587o0223265o8454846n8147536m6068290l6999712
4185B10937995k9479238k3239248j8501764j5026324j2596977j0527634q919148
4178I2647662p394168o231843n327223m786627m546357m020320l565346l268532
4170E3507246k976242k787709k280191k413281k344312k287633k162294j912457
$$ y = [43052298, 44664399, 46213790, 47953827, 49765828, 51880196, 54180107, 56700142, 59419093, 62399635, 65827883, 69836858, 74196734, 79088218, 84535656, 90785789, 97356877, 104884226, 113506264, 123516521, 135156463, 148955584, 165822974, 186690627, 213309862, 247096615, 289620381, 342307056, 402445001, 459547169, 495349569, 504823231, 480831644, 420608379, 352153533, 294005997, 247937707, 210937995, 181458757, 158219509, 139717745, 124691421, 112094444, 101566810, 92647662, 85253494, 79021651, 73694428, 68907801, 64361444, 60341124, 56775778, 53507246, 50531004, 47743295, 45463104, 43049823, 40705511, 38417878, 36255584, 34343127]
4162C4343127j743789j561461j413444j067117j033593r83854p66859n96546p65504
4153B4410960p61878m17167n80314n27633l31297l23575k21691j82369k25452
4144B0839584r7524j48378j25608l36424k43496j15290k48741N316j20027j28071
4134A9281341l533j1483J10502K29619J62448J08344L47407M07760L24595K78396
4124B1235396N79339Q13822R64655J375942J847965K468480L088446M002229M917172
4115D1293446N386034M991632L403400P79314k748229n488626o614466n880020
4107C5122485m878534l940715l100968k404252j889424j647313j303856j151452
4099A4805971q94364p55861o60147p18963n01023n36159p35461m65512m15138
$$ y = [34343127, 32599338, 31037877, 29624433, 28557316, 27523723, 26539869, 25773010, 25176464, 24410960, 23649082, 23231915, 22651601, 22123968, 21792671, 21469096, 21247405, 21065036, 20839584, 20742060, 20593682, 20468074, 20131650, 19888154, 19772864, 19524123, 19529439, 19409412, 19281341, 19277808, 19266325, 19376827, 19606446, 19768894, 19877238, 20224645, 20632405, 20957000, 21235396, 21814735, 22628557, 23593212, 24969154, 26817119, 29285599, 32374045, 36376274, 41293446, 46679480, 51671112, 55074512, 55853826, 53105597, 47616971, 41002505, 35122485, 30243951, 26303236, 23202268, 20798016, 18908592, 17261279, 15957423, 14805971, 13911607, 13155746, 12495599, 11776636, 11275613, 10739454, 10003993, 9538481, 9123343]
4090I123343m18641l55778k74515l54589k62397j52145k54223l51504j87412j19612
4080F392527r0003N0553j05008j7475j47002j1323J34122m3961j4058j47639R2699
4069F093432j35983k04392k7318j85316j82989r9371j87838j29762j05607j45236
4059D689620J0758p9275p7589j97100j08236k7699j04382p5235j33444j43736
4049C753682j24222j23273Ok21910r2120M1066j94247k3524k9230m4202M9438
4038B991464n0595j74760o8087J9062j76436m6692j11110j81263l5844J31558
4028B297297n5046j25190j0329p2223j3289j74608n7277j44234N6725o6987r0329
4017A544510j2053O5058p276M3716J10558p9020J8070q9048n6933r5585P9019
$$ y = [9123343, 8704702, 8348924, 8074409, 7719820, 7457423, 7305278, 7051055, 6699551, 6512139, 6392527, 6302524, 6353077, 6248069, 6230594, 6083592, 6072269, 6206391, 6162430, 6148372, 6000733, 6093432, 5957449, 5753057, 5725739, 5540423, 5357434, 5258063, 5070225, 4940463, 4834856, 4689620, 4700378, 4621103, 4543514, 4346414, 4238178, 4210479, 4106097, 4030862, 3897418, 3753682, 3629460, 3506187, 3506193, 3284283, 3192163, 3233229, 3038982, 3015458, 2986228, 2942026, 2991464, 2940869, 2766109, 2698022, 2717084, 2540648, 2493956, 2382846, 2201583, 2165739, 2297297, 2242251, 2117061, 2106732, 2034509, 2021220, 1846612, 1789335, 1645101, 1701826, 1634839, 1544510, 1532457, 1597515, 1590239, 1633955, 1744513, 1665493, 1683563, 1594515, 1537582, 1441997, 1521016]
4006A521016M7932l3294m4902n7854j88094N4499M5152m6891n6511J6125J5473
3995A272651J82242l7295j81883N4807O5154N7011j47009k1205R5072j5699L6058
3984A359904m3623q7954K0420M5562K3240L022j36279l5360m2405r3604J04996
3973A117919O9397O2284n3061j43850J56921O3049K2879r3592j09152K06677p1766
3962A227705k02812L3825R1886m0232J08074r4952p712J76671r0114j10536l3152
3951A058651j05347q1254K9311J31197n4791o6433n5269P1044K3363M5899K1962
3940A018333M2720j08434L3527k439M1822J67383n3772r193L9906L0046j01213
3929A098686o1944M4074K4220L898k7187q623l7802j0392M7742Q8557l3191L3235
$$ y = [1521016, 1568948, 1535654, 1490752, 1432898, 1244804, 1299303, 1344455, 1297564, 1241053, 1257178, 1272651, 1454893, 1417598, 1235715, 1290522, 1355676, 1412687, 1265678, 1244473, 1339545, 1323846, 1359904, 1316281, 1228327, 1248747, 1294309, 1317549, 1320571, 1184292, 1148932, 1106527, 1012923, 1117919, 1187316, 1249600, 1196539, 1052689, 1209610, 1272659, 1295538, 1201946, 1092794, 1299471, 1227705, 1024893, 1058718, 1150604, 1110372, 1218446, 1123494, 1115782, 1292453, 1202339, 1091803, 1058651, 953304, 872050, 901361, 1032558, 977767, 911334, 856065, 927109, 950472, 996371, 1018333, 1061053, 952619, 986146, 983707, 1025529, 1192912, 1139140, 1129947, 1169853, 1199899, 1098686, 1036742, 1080816, 1105036, 1108934, 1081747, 1073124, 1035322, 1024930, 1072672, 1161229, 1128038, 1161273]
3917A161273K2387m3855J27018j6753K6589K9862N2657K9747o2858M3020J61816
3906A530903J29587J35792l8200J01468K13050R4868K04039L90618K51875K73569
3896C287569J15063J48976k15496k92032k90822l50455k85034l64447m0483j00868
3886A611971r9263k05068j9917m9277r3656j98004j30776J62007R4169n5953q8293
3875I27940j7493N3208P7180j05473m355J7312n7226j1356M3820q8051l3476P6227
3863H78257Q0648q1000K0744o574p2249O8257J0503p2389p1165J16014K3222N2937
3851I47205M5812k2940j8519j50330k0277n2075J2202Q3113o5441r1497J20284
3840G87537L1538j32233O1502o157J3323r252L2813J14004j29463q9437J74451
$$ y = [1161273, 1183660, 1139805, 1266823, 1250070, 1276659, 1306521, 1359178, 1388925, 1326067, 1369087, 1530903, 1660490, 1796282, 1758082, 1859550, 2072600, 2167468, 2371507, 2762125, 3014000, 3287569, 3402632, 3551608, 3336112, 3044080, 2753258, 2402803, 2117769, 1753322, 1712839, 1611971, 1512708, 1307640, 1287723, 1238446, 1144790, 946786, 816010, 978017, 1072186, 1016233, 927940, 910447, 963655, 1040835, 935362, 931007, 948319, 891093, 879737, 923557, 835506, 802030, 878257, 958905, 877905, 898649, 892075, 819826, 888083, 898586, 826197, 755032, 871046, 894268, 947205, 993017, 970077, 951558, 801228, 780951, 728876, 741078, 824191, 758750, 667253, 787537, 819075, 686842, 748344, 742187, 755510, 746258, 779071, 893075, 763612, 674175, 848626]
3829H48626k2739q1116P611N7052J6578q1064L2734O3136Q161R8232Q4563M0172
3817A071946R231o308J7686l8924k3991L7013K8756j286j22529j38375n353J79275
3805A007141q913j00500l7510J37450l3187j0410Q4138m8246J37028p22j26514
3794I99755J1555J50103j28717J38599o2271o3225J27309M0160O8214l7435p6572
3783A167475R0153P9726o1340O2795Q478o4054P0918l3861j41199M1044J04383
3772A324518J504K6661K8476N4151K551o7337m0349N155j9726K3041J23902J2503
3760A475050k7326O1394N9886l7629r225M3924q6340j999O5525o925k7432m684
3748A504219l4664J0601N8776j02305m5512J58028o5237n1928O0620q762q6994
$$ y = [848626, 825887, 744771, 752382, 809434, 826012, 744948, 777682, 840818, 848979, 947211, 1031774, 1071946, 1081177, 1074869, 1092555, 1053631, 1029640, 1066653, 1095409, 1094123, 971594, 833219, 827866, 1007141, 998228, 897728, 860218, 997668, 964481, 954071, 1038209, 989963, 1126991, 1126269, 999755, 1011310, 1161413, 1032696, 1171295, 1109024, 1045799, 1173108, 1213268, 1281482, 1244047, 1167475, 1257628, 1337354, 1276014, 1338809, 1347287, 1283233, 1354151, 1320290, 1179091, 1220135, 1324518, 1326022, 1352683, 1381159, 1435310, 1437861, 1370524, 1330175, 1335330, 1315604, 1338645, 1462547, 1475050, 1447724, 1509118, 1569004, 1531375, 1522150, 1566074, 1479734, 1477735, 1543260, 1536335, 1508903, 1504219, 1469555, 1480156, 1538932, 1436627, 1391115, 1549143, 1483906, 1431978, 1492598, 1483836, 1396842]
3737A396842n5938J55510o4572J14641P2499J11424j36953p9897Q0512m8030n4452
3726A491586P2778j59396l5757q0705R3102j29167J737J2229J02744n24j21217
3715A247410P128K4749O6773J3466j63685O8011K7940o7069q949j9016N8663J9984
3703A275405k0166m7097m7371p9891R6969k0642j8083j78012J63676J09889q5134
3692A149543j20212J6995K30050j33063j03719J86014j68310q7858j6514r334
3682I43592N3437J04664j39238N5492K3435k7515j39102p7848R3715J8486m3205
3671H65913K2224j35234n7517O5307J06855j21775N1946M3987P6097j9438n531
3660H92834k8453p3079K4871o8302m4846M0724n7550o529q8396J9665M1324k4052
$$ y = [1396842, 1340904, 1496414, 1431842, 1546483, 1618982, 1730406, 1593453, 1513556, 1594068, 1546038, 1491586, 1564364, 1404968, 1369211, 1288506, 1381608, 1252441, 1254178, 1266407, 1369151, 1368627, 1247410, 1254538, 1279287, 1346060, 1359526, 1195841, 1263852, 1291792, 1224723, 1215774, 1196758, 1255421, 1275405, 1255239, 1208142, 1160771, 1080880, 1177849, 1157207, 1139124, 961112, 1124788, 1234677, 1149543, 1029331, 1046326, 1276376, 1143313, 1039594, 1225608, 1057298, 969440, 952926, 943592, 997029, 1101693, 962455, 1017947, 1041382, 1013867, 874765, 796917, 890632, 909118, 865913, 888137, 752903, 695386, 760693, 867548, 745773, 797719, 841706, 917803, 898365, 892834, 864381, 791302, 816173, 747871, 703025, 743749, 686199, 679670, 591274, 610939, 652263, 628211]
3648F28211J33299j34541o7503J65262K3238L535n068p6781j8552l712L7206o3416
3636F21178m1552L7021J3605p2415j27245j0195L8020j03819J62855N3393o0194
3625E10652N9586M9134l2171j16882j7719n0830J39954R3197q9038j19301L4296
3614D60878o7543k4720R2952j0516l6612j07968O9738K3444N1663l8296l4324
3603C78696k5820q2641j9306M2301L5304J13148J13731p1846j03341m6455r2089
3592B41682P5391K2190O7668J9861m6607j19836N223J38039j2503j69153N1952
3581B73907o2118q8948J13727Q1490k8628P926k7375j8808m3766k708O9850m2952
3569B31597q2454P0440P5851k5427q2292O2212K1233k233j19226R8279P5578L6270
$$ y = [628211, 761510, 626969, 559466, 724728, 747966, 751501, 746433, 669652, 651100, 647388, 684594, 621178, 579626, 616647, 630252, 557837, 430592, 420397, 458417, 354598, 517453, 570846, 510652, 570238, 619372, 587201, 470319, 452600, 401770, 541724, 634921, 545883, 426582, 460878, 393335, 368615, 461567, 451051, 414439, 306471, 376209, 399653, 451316, 413020, 378696, 352876, 270235, 250929, 293230, 328534, 441682, 555413, 483567, 380226, 333771, 241682, 317073, 339263, 406931, 426792, 380185, 260349, 265572, 403611, 391108, 221955, 273907, 211789, 122841, 236568, 318058, 289430, 297356, 269981, 251173, 207407, 204699, 274549, 231597, 149143, 219583, 295434, 270007, 187715, 249927, 271160, 268927, 149701, 247980, 323558, 359828]
3557C59828o56j12503l4822J14610j56767j11151K64842O9165j31144j183Q5414
3546C45633m380n7598n9539L7442J07155p621q5104P6226k6083M6348r8005j5918
3534B58556r9784k6185k8693J1467J1973r555J6981p925J22460j28284M9822N3615
3522B24448k4675j40938M2832n1505Q3148J7479l2814K4164Q858j9969o5614n697
3510E9717R956K13847m0937n4402M1771k4757n2953K5787m1510j54207J21273
3499A03585J49082l5299K1300o1873q8712m3486R4334J03M7784m2884l764N7293
3487A97463m939p1489J50756m7004j2357j78755K6878J8290K6467L4583j1972
3476A27921l6509Q9316L7558j1638j5432k3790r911R219q9613P2801O0434j2473
$$ y = [359828, 359172, 246669, 211847, 326457, 169690, 58539, 323381, 392546, 261402, 260219, 345633, 341253, 283655, 224116, 261558, 368713, 361092, 275988, 352214, 326131, 372479, 274474, 258556, 158772, 132587, 103894, 115361, 127334, 117779, 134760, 126835, 249295, 121011, 170833, 224448, 199773, 58835, 101667, 50162, 133310, 150789, 117975, 142139, 150997, 131028, 65414, 59717, 69673, 283520, 242583, 188181, 229952, 205195, 152242, 178029, 136519, -17688, 103585, 252667, 217368, 238668, 176795, 88083, 44597, 138931, 139034, 186818, 143934, 140170, 197463, 192524, 121035, 271791, 224787, 212430, 33675, 60553, 78843, 105310, 139893, 127921, 91412, 180728, 218286, 206648, 191216, 167426, 157515, 166734, 77121, 149922, 210356, 197883]
3464A97883r1717L0241Q2769M436k0653l2418l0056k3550P8445l6507R3015n1068
3452B00820m6105r4874J20736j225q1299J41115J8892J8968m2710P885N2776p3149
3440B21830J8897p805J4525L2795j84227Q4780J45143j87947j5861K6431J53455
3429C02016j62666l7823Q5456M2784j5756k3606p8163K1819P8682n4788J17967
3418B75922J3713J5004m3211J62417r4106P8279p992j32842K240K6709j244N1163
3406C46052J26145L416o9510j32689k6006J8192J53343r649l0580n480J35274
3395E08508k65J2001k0998N6756q5249Q2208o1715K5293m0104L4536m2187l4287
3383D34497r1321K4533P4331j35417J11365O9000k2793R439L7207k7767O3162
$$ y = [197883, 106166, 136407, 219176, 223612, 202959, 170541, 140485, 116935, 195380, 158873, 251888, 200820, 154715, 59841, 180577, 179352, 98053, 239168, 258060, 277028, 234318, 242203, 294979, 221830, 240727, 232922, 247447, 280242, 96015, 180795, 325938, 137991, 122130, 148561, 302016, 139350, 101527, 186983, 229767, 214011, 190405, 112242, 134061, 212743, 157955, 275922, 289635, 304639, 261428, 423845, 329739, 408018, 400026, 267184, 269424, 296133, 294889, 346052, 472197, 475613, 406103, 273414, 247408, 265600, 418943, 409294, 378714, 373234, 508508, 508243, 520244, 499246, 556002, 470753, 552961, 491246, 516539, 476435, 510971, 468784, 434497, 343176, 367709, 442040, 306623, 417988, 486988, 464195, 473634, 510841, 483074, 546236]
3372E46236J35556M4301m8560r7010k0616J03389l7996P7645J05700m9998n6021
3361G02626P0741J41039J10696K155m5636O4663J17348N7982k7463O9712K23545
3350A487408J12626J96051J37912J99048K72130K01119L33195M30549K68872l3498
3340C605412j11415k55100l04505l19311j53936k26550j59895m8053o9069n266
3330A952312o4692n6291M7929O3808j06528J00982o8635K52858J70044O0116L9662
3319B391565J73565J86565K02814M36399K56147O81956O38836P03627N92164K12592
3309F476230o4298k25603o76014o69871o35877m99252m78219m44744j32024j27560
3299B522768r9845j87798K4010r1968j04855n5220Q8875O295r3960P9278Q1666
$$ y = [546236, 681792, 726093, 677533, 580523, 559907, 663296, 625300, 702945, 808645, 758647, 702626, 773367, 914406, 1025102, 1027257, 981621, 1046284, 1163632, 1221614, 1194151, 1263863, 1487408, 1600034, 1796085, 1933997, 2133045, 2405175, 2606294, 2939489, 3370038, 3638910, 3605412, 3493997, 3238897, 2934392, 2615081, 2461145, 2234595, 2074700, 2026647, 1957578, 1952312, 1887620, 1831329, 1879258, 1943066, 1836538, 1937520, 1868885, 2121743, 2291787, 2351903, 2391565, 2565130, 2751695, 2954509, 3390908, 3647055, 4329011, 4967847, 5671474, 6263638, 6476230, 6411932, 6186329, 5510315, 4840444, 4204567, 3705315, 3227096, 2782352, 2650328, 2522768, 2422923, 2235125, 2259135, 2167167, 2062312, 2007092, 2095967, 2102262, 2008302, 2087580, 2169246]
3288B169246j9569Q0959P5525J2570K46223L08537K13544K70307L34173L35247
3278D026762J05422j09624j67059k47265l71963r5396k24235l21818j85434n5040
3268B354350j38868l4101n598N5134m9486p5018J25016O9620n8298O2274K06543
3257B511568P9910J0344J5329L6469K60548J1519o1029J55111K36522R3698l6789
3246C313200l7433j94701j33466n08m1548L434p5525J9515j34817k05602l7317
3235B475232j59919k81190m2056m9233j11703m0684p9982j76097m3979N9253p8026
3224A471616j46162k09909j0644q3540L7140j14965L0028J7120j03235n6593p8296
3213G52560l9536r411j30850j34Q1622p9010N048l7769j60472M3963N8040N445
$$ y = [2169246, 2149677, 2230636, 2306161, 2318731, 2564954, 2873491, 3087035, 3357342, 3691515, 4026762, 4132184, 4022560, 3855501, 3608236, 3236273, 3140877, 2916642, 2594824, 2409390, 2354350, 2215482, 2181381, 2175783, 2230917, 2181431, 2106413, 2231429, 2301049, 2242751, 2305025, 2511568, 2591478, 2601822, 2617151, 2653620, 2914168, 2925687, 2864658, 3019769, 3256291, 3349989, 3313200, 3275767, 3081066, 2947600, 2947092, 2905544, 2908978, 2833453, 2852968, 2718151, 2512549, 2475232, 2315313, 2034123, 1992067, 1942834, 1831131, 1790447, 1710465, 1534368, 1490389, 1549642, 1471616, 1325454, 1115545, 1104901, 1021361, 1058501, 943536, 973564, 990684, 887449, 830856, 752560, 713024, 703613, 572763, 572629, 654251, 575241, 580289, 542520, 382048, 426011, 484051, 489496]
3201D89496j43466o5827k795J69060k7094n7037J23827N8715j17349n0941p6906
3190B99683L5884O16m2491J0973R2252j46086L0032Q1983M564L4690k8534n9469
3178C14097N8154k871r5927J19588j61959m1211J47265Q159J546r0937m3087N9308
3166B72125j43626K6100J24267j39847r3571M6377o5473P3456J52118q9664o0211
3155A02051m914j431n6101K0452J42361p7258n6696m5506j313L9832R5590j01847
3143E5220P4203m5484n7542O2361m3896j17675K8886L4155J05028N4639l5972
3132A13923q2262o0273j2293J19548Q120j25263K00480J1173j12494k0090O7995
3121A08564R9275n3544n4286N0704o179j28966L4240j8198k05780J78032R1671
$$ y = [489496, 346030, 280203, 277408, 446468, 419374, 362337, 486164, 544879, 427530, 376589, 299683, 335567, 336183, 293692, 304665, 396917, 250831, 280863, 362846, 367410, 402100, 373566, 314097, 372251, 369380, 273453, 393041, 231082, 189871, 337136, 345295, 346841, 255904, 212817, 272125, 128499, 154599, 278866, 139019, 45448, 91825, 26352, 99808, 251926, 162262, 102051, 97137, 95706, 39605, 60057, 202418, 125160, 68464, 22958, 21645, 61477, 157067, 55220, 129423, 83939, 26397, 88758, 44862, -72813, -43927, -9772, 95256, 149895, 113923, 31661, -28612, -40905, 78643, 86763, -38500, 161980, 173153, 60659, 40569, 108564, 207839, 154295, 100009, 150713, 144534, 15568, 49808, 31610, -174170, 3862, 95533]
3110I5533q7003n0530J07509n3318q5699q619n2316K22288M1274r8442j6510l0481
3098a6314K7508M9046L8735q2129R7557j6n4937K0317j38035K1218J23768q9198
3086b480K9620j2602o3694J06347M9212K4187j74674j8876J1043J06173N9094
3075A13350k960j7742m9093j6007J0741k5461M5756n9024m4210L8347n3205K4312
3063c5196n0793k7650J2625O2052P1628j49615J02876J07810l7570j12360P9855
3052B3662N3262l3005j61874J40080J19556j06077P0616k4304Q4520m978p7823
3041H3635j26917J09003M4985l2263N4063n4079n0220n019R9658r6255P5373M9277
3029A51241m3773o4339n4273O6731j1642O4682M5303J80487r1789j45512o643
$$ y = [95533, 8530, -42000, 65509, 12191, -73508, -82127, -134443, 87845, 129119, 30677, 14167, -16314, 11194, 60240, 98975, 16846, 114403, 114387, 59450, 79767, -58268, -37050, 86718, -2480, 27140, 14538, -49156, 57191, 106403, 130590, -44084, -62960, -51917, 54256, 113350, 110390, 92648, 43555, 27548, 38289, 12828, 58584, -440, -44650, -6303, -59508, -35196, -85989, -113639, -101014, -38962, 32666, -116949, -14073, 93737, 56167, -56193, 23662, 76924, 43919, -117955, 22125, 141681, 35604, 106220, 81916, 166436, 161458, 83635, -43282, 65721, 110706, 78443, 132506, 78427, 28207, 23188, 122846, 26591, 101964, 151241, 107468, 43129, -11144, 55587, 43945, 108627, 153930, 334417, 242628, 97116, 90473]
3018I0473J5797q8314j529K8435j4527n3013J20185M8174P5285J6290m7889m2679
3006A46688L7390K5589J3666l6335p0844m9910n7003Q5782J51622m2375k227l3186
2994A68857q9493J52512J1626j02948j1277K0702o8024M6439L4668o9578J47464
2983B40948l5255n5436l4623L0860J63522j06640o8606L8361k7166p3586J7641
2972I0020N1809L9884K3048p2389R0817q3940l765J29345r9417j4577N0442N2763
2960B54040R552L1086J23709n6662l5609N8144j07340N963n9450k3463J03279
2949C03249q3253j9018J45139k0347J6201P4023p8765p9650J34041J65186M9568
2938F06374J3878j3255o424N6894l4670j0342J12777Q4153K0467J70105l3464
$$ y = [90473, 106270, 17956, 16427, 44862, 30335, -22678, 97507, 145681, 220966, 237256, 189367, 146688, 184078, 209667, 223333, 186998, 116154, 66244, 9241, 95023, 246645, 204270, 202043, 168857, 79364, 231876, 243502, 140554, 129277, 149979, 81955, 128394, 163062, 93484, 240948, 205693, 150257, 115634, 146494, 310016, 203376, 134770, 173131, 145965, 72379, 90020, 141829, 181713, 204761, 132372, 223189, 139249, 135484, 264829, 165412, 150835, 201277, 254040, 263592, 294678, 418387, 361725, 326116, 384260, 276920, 282883, 223433, 199970, 303249, 219996, 200978, 346117, 325770, 341971, 415994, 337229, 257579, 391620, 556806, 606374, 620252, 606997, 600573, 657467, 622797, 612455, 725232, 809385, 829852, 999957, 966493]
2927I66493M1016q4066R672K8979n0200K5175k1750K2817K6605J7929j535r161
2915I71974N2042O537M9520p6971j2913P4067P1896L7016j02572P4278q53L2668
2903A176689L83010J31959k8835K35575R4238o4934l18407k02277n2012n0033
2893A304973k1132j53411j35613j5020j8340p7061n0390K9269r3464j3263l1787
2882G24761O3269n0156K852j8298R246l7286m6705K9784J07862l2239j51358K31129
2870H32861n9876j38410J92618J45607k47299l0000M2876j32570O660q7354j48034
2859C77079K3755P1774j01204o7174p5355K3142J61763K4186j20333j51050J16004
2848B82587l0034p8524K6122p0533J01291M6908r0607j23087j3491J75365M8989
$$ y = [966493, 1007509, 923443, 933115, 962094, 911894, 937069, 915319, 938136, 964741, 982670, 981135, 971974, 1024016, 1030553, 1080073, 1003102, 990189, 1064256, 1136152, 1173168, 1070596, 1144874, 1144021, 1176689, 1559699, 1691658, 1662823, 1898398, 1992636, 1927702, 1609295, 1407018, 1355006, 1304973, 1283841, 1130430, 994817, 979797, 961457, 884396, 834006, 863275, 769811, 756548, 724761, 788030, 737874, 740726, 722428, 731674, 694388, 647683, 677467, 785329, 753090, 601732, 832861, 772985, 634575, 827193, 972800, 725501, 695501, 738377, 605807, 612467, 525113, 377079, 400834, 472608, 371404, 304230, 228875, 252017, 413780, 437966, 317633, 166583, 282587, 252553, 174029, 200151, 129618, 230909, 277817, 187210, 64123, 50632, 225997, 274986]
2837B74986q7439j59262M2477N9745r2304N92L206O7847K6986j15021k1851N2260
2825E2222l078j2083q1458j8697r3293M4007J76400O6077J7526j75632j13388
2814a41397L5055J06159K4575j4348M6575L920L7788j15809k0161P5802K1187
2803E9346M3129p0343M0769K8932k8729j02864m5028J0337O977N306N7437P330
2791A2599m8121M776l8542j5928L4929J1847L4476K7397j05722J57384k4225j20083
2779f9213l5627n4925r096Q8826J52224P669n5824j723j27946p5030J9104Q5874
2767g5687K28122k7511j87370l7406L0863J4135J7722N7845m1003m4521j9313
2756h4124J32182O6045Q6736q7350m4157k6336l1877j3004j47906K1733J24446
$$ y = [274986, 187547, 28285, 70762, 130507, 38203, 38795, 42001, 109848, 136834, 21813, -38, 52222, 49144, 37061, -44397, -63094, -156387, -112380, 64020, 130097, 147623, -28009, -141397, -106342, -183, 24392, 10044, 56619, 60539, 98327, -17482, -37643, 38159, 59346, 102475, 32132, 72901, 101833, 73104, -29760, -74788, -64451, -57474, -52168, 5269, 12599, -35522, -30746, -69288, -85216, -50287, -38440, -3964, 23433, -82289, 75095, 50870, -69213, -104840, -159765, -168861, -80035, 72189, 79858, 24034, 22311, -105635, -180665, -161561, -75687, 152435, 124924, -62446, -99852, -68989, -54854, -37132, 20713, -20290, -64811, -84124, 48058, 114103, 200839, 113489, 69332, 42996, 11119, -1885, -149791, -128058, -3612]
2745c612O9019p1221M710N970n0425K3949j40298o4412O6158M4983K6017j03372
2733a92534l3524k3387J41663N3093m7543k9631k206L3146L7118p483K5839R1549
2721D6100l460j23145J9414n9331m0848J3595O3943O0379K069r6699Q605o6816
2709a76194K4281N6675o052J55730J25349j6831j62657M146O3484j10133j03020
2698a45222j2231J75315n6399l8776p5125j295k03N9365j00942Q066O7495o1764
2686a81716R736P4662K19466Q479r3106q999o6970K5130k1040j00233P1285K0012
2674d3294L4929j41566L7593n447o3728j4960K02035r1069j08484J67990J35573
2663A09572j2099j23361J933m3078R05k0075k2572P9288k5946O9624J07619o2854
$$ y = [-3612, 65407, -5814, -1104, 4866, -45559, -21610, -161908, -226320, -160162, -115179, -89162, -192534, -226058, -249445, -107782, -54689, -102232, -131863, -134069, -100923, -63805, -71288, -45449, 46100, 42640, -80505, -61091, -120422, -161270, -147675, -83732, -23353, -21284, -117983, -109378, -176194, -151913, -95238, -101290, 54440, 179789, 162958, 301, 4447, 67931, -42202, -145222, -157453, 17862, -38537, -77313, -152438, -153733, -153936, -94571, -195513, -187447, -119952, -181716, -171980, -97318, 122148, 130627, 37521, 28522, -38448, -13318, -34358, -134591, -63306, -43294, -8365, -149931, -112338, -117785, -181513, -196473, 5562, -85507, -193991, -26001, 109572, 97473, -25888, -23955, -67033, -66128, -86203, -108775, -29487, -55433, 14191, 121810, 58956]
2651E8956n1797l9308n9077L4454l704k2497p0760L9961K9806L8785l0643K909
2639g2915m3279o2694R4701j32212L5979J79571j85975n078J47890p501M6385
2628e128P1518j19136P5306r312j90709N7127M9380m5278J2631o7056j4283R4097
2616i0843m5989K1537k0247M3008L1412K6002k4333J09459K2541k26191P068R0477
2604e6099P1473q7406k4613o9301n0289l1004J40862J72821q1593k4733o914p9910
2592a26706l0687P2844m3550M8398o686j05617M2714L6720l1291P9488o1127J3929
2580a11571o6471Q0417P5741j16728k6483M4611J56478R1741j52592j10080M3096
2569i1841j6597O8962l1795j07332m0453L2921M2985J15739j26965k8902K2412
$$ y = [58956, 7159, -32149, -91226, -56772, -60476, -82973, -153733, -113772, -83966, -45181, -75824, -72915, -116194, -178888, -84187, -216399, -180420, -849, -186824, -191902, -44012, -51513, -5128, 66390, -52746, 22560, 13248, -177461, -120334, -70954, -116232, -103601, -170657, -184940, -90843, -136832, -115295, -135542, -92534, -61122, -35120, -59453, 50006, 72547, -153644, -146576, -56099, 15374, -72032, -96645, -165946, -216235, -247239, -106377, 66444, -15149, -39882, -46796, -126706, -157393, -84549, -128099, -79701, -86387, -192004, -149290, -112570, -143861, -64373, -125500, -111571, -178042, -97625, -21884, -138612, -165095, -120484, 35994, 127735, -24857, -134937, -91841, -108438, -39476, -71271, -178603, -219056, -186135, -143150, -27411, -154376, -183278, -160866]
2558a60866J31094P2219J5511k10437R8121l6663j08317J61502j34257j369L5338
2547a38124J19473m0073K6058k8588p6956m2773J48048J13907j04068j76799r407
2536b09302j7125J90633O1914p2591k4508n147J31360m5800k7490l541l0842N2739
2524C00k3516M0369j21029R3782j17419M757K6599O479n361j6676Q7869j1790
2512c5636Q6043K7418L0750j58847Q8897M0151j00888J19308M0320r8031R683
2501D9168k2294j75843N8074J28499Q27l3129j0313j7258l4503L8446q176n7787
2489h4289j30267K5925k7723N1075J37192q6457o0611J00296L9715p1808O7528
2478c9424P0461J14275j203j66069r4956k6028J7178K0290J07142j03648m5692
$$ y = [-160866, -29772, 42447, 57958, -152479, -54358, -91021, -199338, -37836, -172093, -173462, -138124, -18651, -58724, -32666, -61254, -138210, -180983, -32935, 80972, -23096, -199895, -209302, -226427, -35794, 26120, -46471, -70979, -76126, 55234, 9434, -18056, -21597, -52439, 300, -23216, 17153, -103876, -10094, -127513, -122756, -96157, -89678, -95039, -111715, -23846, -35636, 50407, 77825, 108575, -50272, 38625, 78776, -22112, 97196, 137516, 39485, 49168, 26874, -148969, -90895, 37604, 38431, 5302, -5011, -22269, -56772, -18326, -26502, -84289, -214556, -188631, -216354, -165279, -28087, -114544, -175155, -74859, -35144, -106952, -39424, 31037, 145312, 144109, -21960, -116916, -142944, -125766, -105476, 1666, -101982, -147674]
2467a47674Q7392n324p4534O4972J65218j41821j00731J04489Q7628L54j67956
2456a27987L4417o0278J19409m0201n0601J50896n478j86530N8482n844M4072
2445f9643J33916j0705j26931K9826P5073L7154p3728j34112k8861l186Q5238
2434h5959p355M3986J17123j09122L8548l2822M158J35322o8250p968k2854k0451
2422a5644q6566R9234L8578j771l8372n8737M7152K7304l0914J47713k1251o4518
2410D2208N0971o6690j17883J33102k6390m2515l8895L113p0087O1852J1599M6235
2398a3380k0961k3939j7321P689L5993r7457J48181P8783q310K3296M2475j53445
2386A604P878K8583p3962M3483k4017J02724p6142l9782J17582J81983J73542
$$ y = [-147674, -60282, -65606, -140140, -75168, 90050, -51771, -152502, -48013, 39615, 39969, -127987, -93570, -153848, -34439, -74640, -125241, 25655, 20177, -166353, -107871, -113715, -69643, 64273, 53568, -73363, -43537, 31536, 68690, -5038, -139150, -168011, -171197, -85959, -93314, -49328, 67795, -41327, -2779, -35601, -31443, 103879, 35629, 27661, 4807, -15644, -102210, -2976, 35602, 33831, -4541, -63278, -16126, 11178, -19736, 127977, 106726, 42208, 93179, 26489, -91394, 41708, 15318, -27197, -66092, -62979, -133066, -71214, -59615, -13380, -34341, -58280, -75601, -67912, -31919, -129376, 18805, 97588, 89278, 112574, 155049, 1604, 9482, 38065, -35897, 7586, -16431, 86293, 10151, -29631, 87951, 269934, 443476]
2375D43476k02871O7251p3241j1083Q5659L7595l1145M2696O8729o0532n8526
2364C08008O3263j05407j29326J42959j07054o4662O431j54087R1793J5628m0482
2353B7064J27129K0803k5433l2744M1873K0430o4175N1442L2732j19669n051O8594
2341A42995O1646p4963J7769j4454O43j0721J19058P0769p5900j54630l7651m8102
2329c541N8061n1522r149l4882n9442J44408L5147o8033P0419Q1902O7686j58394
2317G2660K9923J54732q8285q4797p5217L7173K407J29600o0833q0908J06950
2306A43405Q4899Q0042r2840p3658j6693K9673J66060j39143j05662J39428Q3856
2295B99367o0780r7406m5131K0510j23170J39087N5270O1740M5146l7825q5831
$$ y = [443476, 240605, 307856, 234615, 223532, 309191, 346786, 315641, 358337, 427066, 366534, 308008, 371271, 265864, 136538, 279497, 172443, 107781, 114212, -39875, 51918, 67546, 27064, 154193, 174996, 149563, 116819, 158692, 179122, 114947, 166389, 199121, 79452, 74401, 142995, 204641, 129678, 147447, 132993, 133636, 122915, 241973, 312742, 236842, 82212, 44561, -3541, 54520, 2998, -6151, -41033, -100475, 43933, 79080, 11047, 81466, 163368, 231054, 72660, 102583, 257315, 169030, 84233, 9016, 46189, 48596, 178196, 117363, 36455, 143405, 228304, 308346, 215506, 141848, 125155, 154828, 320888, 181745, 76083, 215511, 299367, 238587, 141181, 96050, 116560, -6610, 132477, 187747, 249487, 294633, 256808, 170977]
2284A70977N8098L1728m7581J69830j5699o8130p5560j23541O4394j0814L5607
2273A89309k1981O6713K9374o0349J49449n1067m9335k8568j49150R3547R3855
2262B61797j84176K1852j3270m7372J29985j6895N2874l5306j07601M5064O2585
2251A69537M3790O3523j5219K1601r6715J66807l5111L1785Q1835j60328N0285
2240C21790o1937M1018k3343J60588o25j43646J00361o7523N7859J57042o5055
2229D76529n2010J9365q21O891P0423j9869N5928l5124j24550K89P2N3950J30300
2216E81373P4476j52201N331J30457r9922J01722J013j23290N4871L5271J05964
2205G15065n1572Q5951J01027j02064p542J6834k9993Q505L3473l646k9329K1766
$$ y = [170977, 229075, 260803, 213222, 383052, 367353, 299223, 223663, 100122, 164516, 153702, 189309, 167328, 234041, 263415, 203066, 352515, 301448, 252113, 223545, 74395, 167942, 261797, 77621, 99473, 86203, 38831, 168816, 151921, 204795, 169489, 61888, 106952, 169537, 213327, 276850, 261631, 283232, 186517, 353324, 318213, 349998, 431833, 271505, 321790, 259853, 300871, 277528, 438116, 437491, 293845, 394206, 326683, 384542, 541584, 476529, 424519, 443884, 443063, 449954, 520377, 500508, 556436, 521312, 396762, 397051, 397123, 451073, 581373, 655849, 503648, 508979, 639436, 539514, 641236, 642249, 518959, 573830, 609101, 715065, 663493, 749444, 850471, 748407, 740865, 757699, 727706, 736211, 769684, 766038, 736709, 758475]
2193G58475Q8876J8172K10273k9874l881o1648Q3225p970R7467N855Q0077K7897
2181A266944q2172q484j31188J50013J17141K0090Q77J07138N6981j2059Q9762
2170A575043J013J69516M2863n3386M8779P2295o0889Q0798J5103O6711K05738
2159B163584n599l976L9630J21169m1900M1297K6874J79883M9033P4889J82434
2148B827318q9041K24842K77315J16650K55722J8545p825R6769J05542K37673
2138D063510K68415M7661L31953K86358J90164K30724L25312K55267K58346K20573
2128F478283J88402L32397K30977L03716M27619L38785N17162P04483N47796O88136
2118A0757756Q68889J092594R22425J000505J118514P23504J154021J532174J823988
$$ y = [758475, 847351, 865523, 1075796, 1045922, 1042041, 980393, 1063618, 1055648, 1153115, 1158970, 1239047, 1266944, 1184772, 1176288, 1045100, 1195113, 1312254, 1332344, 1333221, 1440359, 1497340, 1485281, 1575043, 1576056, 1745572, 1788435, 1735049, 1783828, 1856123, 1795234, 1876032, 1891135, 1957846, 2163584, 2157985, 2154009, 2193639, 2314808, 2272908, 2314205, 2341079, 2520962, 2569995, 2644884, 2827318, 2738277, 2963119, 3240434, 3357084, 3612806, 3631351, 3623526, 3720295, 3825837, 4063510, 4331925, 4379586, 4711539, 4997897, 5188061, 5418785, 5744097, 5999364, 6257710, 6478283, 6666685, 6999082, 7230059, 7533775, 7961394, 8300179, 8817341, 9521824, 10069620, 10757756, 11626645, 12719239, 13641664, 14642169, 15760683, 16484187, 17638208, 19170382, 20994370]
2109B0994370K291030L033808L943439N153414O726260Q617999J0141758R220305
2101G0122383M575727J027679n603729j1947740j0718036q284912o245706n125165
2093B7800501l898216l052403k229284j756176j497829j263489q77054p18436
2085A2507614q00865o76070r42834r49120o84072o15014m85580m85942l25275
2076F542842l71339m48667l06043k83490k92932l43642k68730k60558k93000j72845
2066C501596q2039q6388j21777j03485n468j13951J18249k08836j00185j83721
2056B613995l6399O8838r2743k7088j81418n7112k3946k27903j08617L6740j791
2045A962556o0790j2485K3422j62547r5037o6340p966m3270l0696M9907M1542
$$ y = [20994370, 23285400, 26319208, 30262647, 35416061, 42142321, 50760320, 60902078, 70122383, 74698110, 75725789, 70122060, 58174320, 47456284, 39171372, 32925666, 27800501, 23902285, 20849882, 18620598, 16864422, 15366593, 14103104, 13226050, 12507614, 11706749, 11030679, 10087845, 9138725, 8454653, 7839639, 7354059, 6868117, 6542842, 6171503, 5722836, 5416793, 5133303, 4840371, 4496729, 4227999, 3967441, 3674441, 3501596, 3419557, 3333169, 3211392, 3107907, 3102439, 2988488, 3106737, 2897901, 2797716, 2613995, 2577596, 2646434, 2553691, 2526603, 2345185, 2288073, 2264127, 2036224, 1927607, 1964347, 1962556, 1901766, 1889281, 1912703, 1750156, 1655119, 1588779, 1580813, 1537543, 1506847, 1556754, 1598296]
2034A598296o6744j00541j37939j13407L6567O8401o7735n0284p1427m0507j93536
2023H61144J4675J06282n8838r213j00375j8326p6128l042J5981J7348N489j47663
2011F07334k109K3591k5300n616n8141l6484O7146q0569k0932k9480O1209L0892
1999E31541j59453L5509R0520J1971j8303q2973j5000q6365j1350J00680l5207
1988C61570l9054K9122Q8643j36742O4196M3096j21279j78432R1604J45241q0231
1977B67734L6377r7902J0348K3856m8449q4099J45704L9848j3460k117r9718J33319
1965C11441O607l956j07658p601J37168k05115k5989K7204l7688M1218r6708Q149
1953D7072K2395L2139N9772j6828l7489m2729Q0567J9555o4616J34390j978L1050
$$ y = [1598296, 1531552, 1431011, 1293072, 1179665, 1216232, 1284633, 1216898, 1166614, 1095187, 1054680, 861144, 875819, 982101, 923263, 914050, 813675, 795349, 719221, 716179, 732160, 749508, 754997, 607334, 605225, 628816, 603516, 597900, 539759, 503275, 570421, 489852, 468920, 439440, 500649, 531541, 372088, 407597, 498117, 510088, 491785, 408812, 393812, 307447, 296097, 396777, 361570, 322516, 351638, 440281, 303539, 367735, 410831, 289552, 111120, 202724, 347965, 267734, 304111, 206209, 216557, 240413, 191964, 107865, 253569, 293417, 279957, 277840, 178122, 311441, 318048, 314092, 206434, 198833, 336001, 130886, 104897, 132101, 94413, 135631, 38923, 47072, 69467, 101606, 161378, 144550, 107061, 64332, 144899, 164454, 99838, 234228, 232250, 263300]
1941B63300K3326l6860M6008j20619N1477p2804n1043k9983q432O7583n3704q2320
1929d071J03781K7683k7561J10606k2919l9213j28661q6377P8505q1299j00297
1918a69823N2359M3607J25676J07907q1810j19943J37276k3018j03035N5502l4374
1907i676O3476o3603m4994P1823q9646J45960P4048k299l1375j4948p0945p5742
1895d7921O6934L9773q2399k9959K7513m3628P5646K9224K2607j07759k9137Q8926
1883I820L3449p0212N2190P3320Q949j4283l7923L6727o980q2861j0048m0134
1871d7986L1430N3955R5025M1402M748r4782j44093O1280l7141k8827N002J39329
1859G9342J212j2530j46486o3836L2119J45473o6387J4089j459Q2640J01357j0877
$$ y = [263300, 286626, 249766, 295774, 175155, 226632, 153828, 102785, 72802, 64370, 131953, 78249, -4071, 99710, 127393, 99832, 210438, 187519, 148306, 19645, -66732, 11773, -69526, -169823, -117464, -73857, 51819, 159726, 77916, -42027, 95249, 72231, -30804, 24698, -9676, 53800, -9803, -54797, 17026, -72620, 73340, 147388, 145089, 113714, 98766, 27821, -47921, 19013, 58786, -23613, -53572, -26059, -69687, 5959, 35183, 57790, -49969, -79106, 9820, 43269, -26943, 25247, 98567, 107516, 93233, 55310, 92037, 85057, 2196, -7852, -47986, -16556, 37399, 132424, 173826, 178574, 83792, -60301, 979, -36162, -64989, -59987, 79342, 80554, 68024, -78462, -142298, -110179, 35294, -31093, -17004, -18463, 64177, 165534, 154657]
1847A54657k3369l7303L3125K7827j0649k8702J29857L9524p9260m6505M875j06643
1835E7434K03651J03167L3060O073m3249Q5951l4378p2892m5245J01259k00413
1824A94418j09892k84P767j13895n7015J84789J0051j02347l110l5068r0250P0572
1812d4264N8194P9400K5282r0895n7382Q4628L5716q1517K972n0914P2796L3298
1800F7314j30721p2903J37597K388q2747p291R0608O2877j3044K4494n5063L550
1788B7059M0333J33102j82584j21984K1576J301M3008m2669N765O0299n5866L3527
1776c7133m9621J13232j90175J6148r997P0870j07183K4686P3046P1305N0947
1765B6125j16797j1267l6253j1481R4959k6182n341N459q8040l006k83J06549
$$ y = [154657, 131288, 93985, 127110, 154937, 144288, 115586, 245443, 284967, 205707, 159202, 164077, 57434, 261085, 364252, 397312, 403385, 360136, 446087, 411709, 338817, 293572, 394831, 194418, 84526, 84242, 92009, -21886, -78901, 105888, 115939, 13592, 10482, -24586, -114836, -44264, 13930, 93330, 118612, 27717, -29665, 54963, 90679, 9162, 12134, -38780, 34016, 67314, -63407, -136310, 1287, 3675, -79072, -86363, 4245, 67122, 54078, 78572, 23509, 27059, 67392, 200494, 17910, -104074, -82498, -81197, -38189, -80858, -75093, -14794, -70660, -37133, -86754, 26478, -163697, -147549, -157546, -86676, -193859, -169173, -96127, -24822, 26125, -90672, -101939, -138192, -149673, -54714, -80896, -86237, -80778, -168818, -171824, -172107, -65558]
1753f5558Q4926q3490n1766n4478J17561K1788r2704M5635m3876M6572O9231j1124
1741a7283O0733K4233l3301O6584j35962n5834j3092J80217k905j10583l3024
1730g0217L0320J1587M3193K1177R8755K9558o9436o2021j4644j03577N8484K6864
1718D3j02405j0961R9588L3979n5325l5204K17642j4378p4891N4128N6139r118
1706A59237l8294M4441j28055M3315k4922j10044M6977J7951P8693K5034k18322
1695a03989l3278l5247P4517P4185J1589K5861j20096m1992j9301L6316k2457
1684a53892Q586J31224O0338o7221J00063j34200j24411l2118O7673M4783l7585
1673a36760M2516J51757o4221j30384p153q489K4509O8057O6264j26847L2116
$$ y = [-65558, 19368, -64122, -115888, -170366, -52805, -31017, -123721, -78086, -121962, -75390, -6159, -17283, 43450, 67683, 34382, 100966, -34996, -90830, -103922, 76295, 73390, -37193, -70217, -39897, -28310, 14883, 36060, 134815, 164373, 94937, 32916, 18272, -85305, -26821, 43, -102362, -113323, -13735, 20244, -35081, -70285, 147357, 132979, 58088, 112216, 168355, 159237, 120943, 165384, 37329, 80644, 55722, -54322, -7345, 10606, 89299, 114333, -103989, -137267, -172514, -97997, -23812, -12223, 13638, -106458, -148450, -167751, -131435, -153892, -145306, -14082, 46256, -20965, 79098, -55102, -179513, -211631, -143958, -99175, -136760, -94244, 57513, -6708, -137092, -144245, -152734, -128225, -60168, 6096, -120751, -88635]
1662h8635J13858Q4724p2817m3588j08392Q5807o0834M433n7301R654O5792j8265
1650h5564o4363p1540J65018M6285j4079N6094M5813j86743J06298J4463j20969
1639a09287k5130J73186j12058k4516P2448n4179k3334r8712O5485n1616P8839
1628a08874J20450M2419P4396o9828r3358L5641j1704m5353j31841M2933p6956
1617b22075R9446O4428n015K7437K137M3816j69934J24319K7762j32738j8282
1606a58699J34057J10326K8930j23095J372J03553n2600q4991K0422M5065l6960
1595a2620k5929J8159n9463Q8743n2853j08313O4712r2916J3459M0612m8759K3556
1583a51612J33835q8133j4625J15480q2945M1760q2717o8234K2348j9996m971
$$ y = [-88635, 25223, 109947, 37130, -6458, -114850, -29043, -89877, -85444, -142745, -133091, -67299, -85564, -149927, -221467, -56449, -10164, -24243, 31851, 77664, -109079, -2781, 11682, -109287, -134417, 38769, -73289, -97805, -25357, -79536, -102870, -201582, -136097, -187713, -108874, 11576, 53995, 128391, 58563, -34795, 846, -10858, -56211, -188052, -145119, -222075, -122629, -58201, -63216, -35779, -33642, 10174, -159760, -35441, -7679, -140417, -158699, -24642, 85684, 114614, -8481, -7109, 96444, 43844, -41147, -20725, 24340, -12620, -38549, -20390, -79853, 8890, -43963, -152276, -87564, -180480, -167021, -126409, -175168, -151612, -17777, -105910, -120535, -5055, -88000, -46240, -128957, -197191, -174843, -194839, -199810]
1572a99810N1988J09252m6012R9509l5669R7015p5262j27469R0593K2192j03482
1561a17155R8962Q549J4062L6911m7571K5331Q930o6087n6249j4800J17720N763
1549A4366M8313N074j34594m8522N2184O913j48768n6396Q2031J05351l2386M255
1537a02179l3217p2523O6687Q4187l1911Q6249n8556n7582O071m393J00708L0602
1525A4143o0893o9703L2525M600j03942J69544O0469j29538o9850J4874J39275
1514A504N4063l1234j04724N9051K8594J3905O5408o2766r2527p4879J9117R9727
1502b4761O7457j16002j0099O4793Q8480q8126j20160J26977J1323o2901j30789
1491a93808O6889O8213K5711l231j18939M4607J47256N53j53082P093M6459J59742
$$ y = [-199810, -147822, -38570, -84582, 14927, -20742, 76273, 1011, -126458, -35865, -13673, -117155, -18193, -9644, 4418, 41329, -6242, 19089, 28019, -38068, -94317, -109117, 8603, 14366, 62679, 67753, -66841, -115363, -63179, -56266, -205034, -261430, -179399, -74048, -106434, -102179, -135396, -207919, -141232, -57045, -88956, -2707, -61263, -118845, -112774, -117167, -16459, 14143, -46750, -116453, -83928, -79328, -183270, -13726, 46743, -82795, -152645, -137771, 1504, 55567, 24333, -80391, -21340, 7254, 21159, 86567, 23801, -68726, -143605, -124488, -24761, 42696, -73306, -83405, -18612, 69868, -18258, -138418, -11441, -118, -63019, -193808, -126919, -58706, -32995, -36226, -155165, -110558, 36698, 37251, -115831, -108738, -62279, 97463]
1479I7463p6643k3788j6894m4094K632o3001L6824m1768O3739j432j56597R3159
1467a30400l7451J3508J35378K1606k8719j02031n7733L3973O9273K4598Q6163
1456B8165P3764P041R067j1712l9487L6976l6995M5484O3741l5833o7005l3602
1444C9604j54811k4680J59917J4001J17963m1733j21488m2628P7994m0778k00665
1433b17304m9007P341K6708J48727O2124K0560J48677o2150k2615M8704j08628
1422C137k767J4447n5459K2337P2461p9985O5766l3324q9178j29418J34008J39611
1410F1636o7904r6170j9232m7780R5822J20054p7850K7157K4461j34991j18983
1399b33780M8840j8918J25329L6221j0911n5614K1108q7910P7972K3556j5987
$$ y = [97463, 20820, -2968, -19862, -63956, -61324, -124325, -87501, -129269, -65530, -66962, -223559, -130400, -167851, -154343, -18965, 2641, -26078, -128109, -185842, -151869, -82596, -57998, 28165, 101929, 108970, 118037, 106325, 66838, 103814, 66819, 112303, 176044, 140211, 73206, 39604, -115207, -139887, 20030, 34031, 151994, 110261, -11227, -53855, 24139, -16639, -217304, -266311, -258970, -232262, -83535, -21411, -851, 147826, 85676, 63061, 111765, 3137, 370, 14817, -40642, -18305, 54156, -25829, 39937, 6613, -82565, -211983, -77975, 61636, -6268, -102438, -121670, -169450, -73628, 46426, -31424, -4267, 20194, -114797, -233780, -184940, -203858, -78529, -42308, -53219, -108833, -87725, -175635, -97663, -74107, -90094]
1388i0094n2592N0653j4108L0734R8337K5386m4569l7618M8187r3148L8336j30248
1376a70744Q3254l0549K9492J54911q0679J899K2822N450O7332j07291M5402L8711
1364F0010j50843K1553j3525J3353J60567M2456q6525J3258k8396r9666j7497
1353h5255L6636J52777j5364r8260L9472K1244j07353q2197R4656m2255m2654
1342a28553O8997O9688R79M9914n4748r5025j18833J51786N7905l0212r974J4181
1330b3895p287r2953J72732P955k1543M8385j27356k3309q3988J52223L6489K361
1318C9814l9191K0989L1495l5632l7028l664r0365J3096O777K6987m9675R3813
1306b2584k7775j46446O0137m4369J13033q7005N9176j0079R7904K8986n9434
$$ y = [-90094, -142686, -92033, -106141, -75407, 22930, 48316, 3747, -33871, 14316, -78832, -40496, -170744, -87490, -118039, -88547, 66364, -14315, -12416, 10406, 15856, 83188, -24103, 21299, 60010, -90833, -69280, -82805, -69452, 91115, 133571, 47046, 60304, 31908, -67758, -85255, -48619, 104158, 88794, -9466, 30006, 51250, -56103, -138300, -43644, -85899, -128553, -59556, 10132, 11111, 61025, 6277, -88748, -207581, -55795, 2110, -28102, -38076, -23895, -31182, -124135, 48597, 56552, 35009, 83394, -43962, -67271, -151259, 964, 37453, 39814, 623, 21612, 53107, 17475, -19553, -23217, -113582, -100486, -93709, -66722, -116397, -22584, -50359, -196805, -136668, -181037, -68004, -155009, -95833, -105912, -8008, 20978, -38456]
1295c8456q1264K0679P9462p3703p5428M1537Q2317j0502o8570m072l0133J09252
1283d8881J29942L139m1910k7278o1516j8976P2363M9437q0162j9373K3401r3044
1271a12858L0445J00116M3247o0780p4987L4201o774J3315j04547k9064J28148
1260c9538R3665m2364M573p8002o1276J11142K6152k6015p7899k7160Q1721R3519
1248E8518o3980j2526l3457n5721Q8618O0279r7865l6935N7809o15o0336P2621
1236b3590Q0509Q0003J570l7567j05773J13943P347j33684r1631J50836l1981
1225I982p3946L7035k5918L9492K2372j8713q5148O0365L5943N7662n6816M3558
1213D5868K1938j7957k06749J51433O2301j5815M545n1243o8391P4070k5334l5250
$$ y = [-38456, -119720, -99041, -19579, -93282, -168710, -127173, -44856, -55358, -123928, -128000, -158133, -48881, 81061, 84200, 42290, 15012, -46504, -65480, 6883, 56320, -23842, -43215, -19814, -112858, -82413, 17703, 60950, 170, -74817, -40616, -47390, -34075, -138622, -167686, -39538, 54127, 11763, 16336, -61666, -122942, -11800, 14352, -11663, -89562, -116722, -35001, 58518, -5462, -17988, -51445, -107166, -18548, 41731, -56134, -93069, -35260, -35875, -96211, -23590, 56919, 136922, 138492, 100925, -4848, 109095, 116442, -17242, -108873, 41963, 9982, -63964, -26929, -52847, -13355, 9017, -9696, -94844, -34479, 1464, 59126, 2310, 45868, 67806, 49849, -156900, -5467, 56834, 41019, 45564, -5679, -74070, 0, -25334, -60584]
1201f0584Q6968l530j06225q7078R4654R7127k6811M7204j04031p096O7895O3372
1189F1865P76J3302j79078L1156O0020N0341M780l9989p490j32456J57363Q8930
1177A09520j13292m5327K9599j24228J20117J4990O4214m294p7210r2066N2667
1166f5310j0066m5777Q2004L0011K6026N6794j29883J00721N3971l6880m9529
1155A2082q5181j13915Q4949p5096j5070R8989J92827K7155j13190J930N6349
1144G1829J64128p6095q6237j35561K8644K1967n7772K3122L1829j5260n3143
1133h2549L349O0091Q1082r980j67474J8607L426p6717K0132J49673L9529j09336
1121g0167n1300L232M6991J7417J2932M6401O9016j10922o2367L8975k5318P6782
$$ y = [-60584, 26384, 22854, -83371, -170449, -75795, 21332, -5479, 41725, -62306, -69402, -1507, 61865, 62641, 75943, -103135, -71979, -11959, 38382, 43162, 3173, -4317, -136773, 20590, 109520, -3772, -49099, -19500, -143728, -23611, -8621, 55593, 51299, -25911, -117977, -65310, -75376, -121153, -39149, -9138, 16888, 73682, -56201, 44520, 98491, 61611, 12082, -73099, -187014, -102065, -177161, -192231, -93242, 99585, 126740, 13550, 15480, 71829, 235957, 159862, 73625, -61936, -33292, -11325, -69097, -45975, -14146, -29406, -82549, -79200, -19109, 61973, 51993, -115481, -96874, -93448, -170165, -150033, -360, 39169, -70167, -121467, -118235, -71244, -53827, -40895, 5506, 74522, -36400, -98767, -59792, -85110, -8328]
1109h328M9633n1286L1373j37156l7299Q4675N8721o5718K6957l8067K3293j3265
1097g6467j37217J42127J09494N6672N0377O5042m9089j38118K454P4857j47011
1086d6879k7977k3259j22798K12743r0544L2297q9852J9852J01685J1111j0536
1075c4157k0614p2224j179O5889L2873J42725O892P0684j13846j28024K8946L970
1063a8065r2983m1916Q1495l0312j11131K76529J5141p9151n3815k4703J51109
1052G2198j430O5684M1450j51209l5400j165q0638l3624J7416M660l4082O2979
1040g3161O1697j10797J75885Q773r9434M9606J9598L4822J5928r1897P5803r2274
1028b5451L6635l1835j0674O8480M685J01255l0140k24880K1935Q7979n5718j55110
$$ y = [-8328, 41305, -9981, 21392, -115764, -153063, -68388, -9667, -75385, -48428, -86495, -63202, -76467, -213684, -71557, 37937, 94609, 144986, 210028, 160939, 22821, 25275, 100132, -46879, -74856, -98115, -220913, -8170, -98714, -66417, -156269, -136417, -34732, -23621, -34157, -54771, -126995, -128174, -62285, -29412, 113313, 120205, 190889, 77043, -50981, -22035, -18065, -111048, -152964, -71469, -101781, -212912, 63617, 78758, -393, -54208, -78911, 72198, 70768, 136452, 177902, 26693, -8707, -9872, -90510, -124134, -106718, -102058, -136140, -73161, -11464, -122261, 53624, 62397, -37037, 12569, 32167, 66989, 82917, -8980, 66823, -25451, 11184, -20651, -31325, 37155, 41840, 143095, 112955, -111925, -89990, -2011, -57729, -212839]
1016b12839O2024J8685l5186R0045R1847M9126j05465R9675l0418j09168p804
1005h9478o151O409n1096K5023O3751J0456Q6888J69830M2340k31087p8141r5734
993a46990L8004J05624N4918m8358K2139K6921j03049K8862L0257r83r5641l188
981i1484l1752q8949J31201K7995P596k0106O2838J5785l9011L2723m3481j2378
969d9023k4166J75565K1617m0479n1336j00644J12372j73L2820j33346q9759n616
957a52168l9746K5828L9791P6682J7905P731l9682P160l7040l6115M0858Q4812
945c984k938p3086n3058J17130p6861K5225J06266L1393P5936p331N9945j03478
933I5159r5530K8366K9800j01167N6899j01538J69017L8637k9433o111j4400k5030
$$ y = [-212839, -150815, -132130, -167316, -77271, 14576, 63702, -41763, 57912, 27494, -81674, -89478, -95629, -89220, -140316, -115293, -51542, -41086, 45802, 215632, 257972, 26885, -51256, -146990, -108986, -3362, 51556, 3198, 25337, 52258, -50791, -21929, 8328, 7345, -88296, -91484, -123236, -212185, -80984, -52989, -45393, -65499, -2661, 13124, -25887, 6836, -36645, -49023, -73189, 102376, 123993, 83514, 32178, -68466, 43906, 43733, 76553, -56793, -146552, -152168, -191914, -166086, -126295, -49613, -31708, -23977, -63659, -56499, -93539, -129654, -88796, -3984, -6922, -80008, -133066, -15936, -92797, -67572, 38694, 70087, 146023, 138692, 198637, 95159, -371, 27995, 57795, -43372, 13527, -88011, 81006, 119643, 90210, 84099, 69699, 44669]
921D4669m5137m4898J7553Q500l5389P9424l4539j9837m4270J27478k2841J2543
$$ y = [44669, -468, -45366, -27813, -19313, -54702, 24722, -9817, -29654, -73924, 53554, 30713, 43256]
$$ [...]
##END NTUPLES=NMR SPECTRUM
##END=
