##TITLE=1H_CA-9105-2
 CDCl3
 8 sc, 
 24.1.2023
##JCAMPDX= 6.0         $$ Bruker NMR JCAMP-DX V2.0
##DATA TYPE= NMR SPECTRUM
##DATA CLASS= NTUPLES
##ORIGIN= UXNMR, Bruker Analytische Messtechnik GmbH
##OWNER= root
$$ XWIN-NMR		Version 3.5
$$ Tue Jan 24 14:08:39 2023 Russian Standard Time (UT+4h)  she@DPX200
##.OBSERVE FREQUENCY= 200.13135
##.OBSERVE NUCLEUS= ^1H
##.ACQUISITION MODE= SIMULTANEOUS
##.ACQUISITION SCHEME= undefined
##.AVERAGES= 8
##.DIGITISER RES= 18
##SPECTROMETER/DATA SYSTEM= spect
##.PULSE SEQUENCE= zg30
##.SOLVENT NAME= CDCl3
##.SHIFT REFERENCE= (INTERNAL, CDCl3, 0, 15.7337)
##AUDIT TRAIL= $$ (NUMBER, WHEN, WHO, WHERE, WHAT)
$$ ##TITLE= Audit trail, XWIN-NMR		Version 3.5
$$ ##JCAMPDX= 5.01
$$ ##ORIGIN= Bruker BioSpin GmbH
$$ ##OWNER= she
$$ F:/spectra/data/she/nmr/H-F/1/pdata/1/auditp.txt
$$ ##AUDIT TRAIL=  $$ (NUMBER, WHEN, WHO, WHERE, WHAT)
(   1,<2023-01-24 14:07:20.57 +0400>,<she>,<DPX200>,
      <created by zg, POWCHK disabled, PULCHK disabled
       configuration hash MD5:
       00 E9 B6 7A A2 85 ED C7 34 08 36 98 17 FE 4E 26
       data hash MD5: 16K
       21 31 C2 05 AD 5B 6F BA 83 49 69 91 FB 5C 5A 64>)
(   2,<2023-01-24 14:07:22.75 +0400>,<she>,<DPX200>,
      <Start of raw data processing
       efp BC_mod = 2 LB = 0.24 FT_mod = 6 PKNL = 1 PHC0 = -19114.93 PHC1 = 13.80079 SI = 16K 
       data hash MD5: 16K
       3F 83 AC 61 09 BE 53 95 73 C7 27 26 91 DE 8C 02>)
(   3,<2023-01-24 14:07:45.31 +0400>,<she>,<DPX200>,
      <pk PHC0 = -3.348483 PHC1 = 3.800001 
       data hash MD5: 16K
       6A CF 73 FB 0F 2D 36 19 CF BE DD B2 41 1D 33 CA>)
(   4,<2023-01-24 14:07:48.64 +0400>,<she>,<DPX200>,
      <abs ABSG = 5 
       data hash MD5: 16K
       D5 98 06 D9 DE F5 99 95 7F A7 92 00 ED C8 00 BC>)
$$ ##END=
$$ 
$$ hash MD5
$$ CA FA D3 9A 61 E7 89 75 07 FF 90 8C 1E E3 B7 79
##$RELAX= 
##$RELAX= 
##$RELAX= 
##$RELAX= 
##$RELAX= 
##$RELAX= 
$$ Bruker specific parameters
$$ --------------------------
##$DU= <F:/spectra>
##$EXPNO= 1
##$NAME= <H-F>
##$PROCNO= 1
##$TYPE= <nmr>
##$USER= <she>
##$AMP= (0..31)
100 100 100 100 100 100 100 100 100 100 100 100 100 100 100 100 100 100 
100 100 100 100 100 100 100 100 100 100 100 100 100 100 
##$AQSEQ= 0
##$AQ_mod= 1
##$AUNM= <au_zg>
##$AUTOPOS= <>
##$BF1= 200.13
##$BF2= 200.13
##$BF3= 200.13
##$BF4= 200.13
##$BF5= 200.13
##$BF6= 200.13
##$BF7= 200.13
##$BF8= 200.13
##$BYTORDA= 1
##$CFDGTYP= 0
##$CFRGTYP= 5
##$CHEMSTR= <none>
##$CNST= (0..31)
1 1 145 1 1 1 1 1 1 1 1 1 1 1 1 1 1 1 1 1 1 1 1 1 1 1 1 1 1 1 1 1 
##$CPDPRG= <>
##$CPDPRG1= <>
##$CPDPRG2= <>
##$CPDPRG3= <>
##$CPDPRG4= <mlev>
##$CPDPRG5= <mlev>
##$CPDPRG6= <mlev>
##$CPDPRG7= <mlev>
##$CPDPRG8= <mlev>
##$CPDPRGB= <>
##$CPDPRGT= <>
##$D= (0..31)
0 1.2 0 0 0 0 0 0 0 0.06 0 0.03 0 0 0 0 0.0002 0 0 0 0 0 0 0 0 0 0 0 0 
0 0 0 
##$DATE= 1674554839
##$DBL= (0..7)
120 120 120 120 120 120 120 120 
##$DBP= (0..7)
150 150 150 150 150 150 150 150 
##$DBP07= 0
##$DBPNAM0= <>
##$DBPNAM1= <>
##$DBPNAM2= <>
##$DBPNAM3= <>
##$DBPNAM4= <>
$$ [...]
##$SUBNAM3= <"">
##$SUBNAM4= <"">
##$SUBNAM5= <"">
##$SUBNAM6= <"">
##$SUBNAM7= <"">
##$SUBNAM8= <"">
##$SUBNAM9= <"">
##$SW= 18.05172834244
##$SWIBOX= (0..15)
0 0 2 0 0 0 0 0 0 0 0 0 0 0 0 0 
##$SW_h= 3612.71676300578
##$TD= 16384
##$TD0= 1
##$TE= 0
##$TE2= 300
##$TE3= 300
##$TEG= 300
##$TL= (0..7)
0 120 120 120 120 120 120 120 
##$TP= (0..7)
150 150 150 150 150 150 150 150 
##$TP07= 0
##$TPNAME0= <>
##$TPNAME1= <>
##$TPNAME2= <>
##$TPNAME3= <>
##$TPNAME4= <>
##$TPNAME5= <>
##$TPNAME6= <>
##$TPNAME7= <>
##$TPOAL= (0..7)
0.5 0.5 0.5 0.5 0.5 0.5 0.5 0.5 
##$TPOFFS= (0..7)
0 0 0 0 0 0 0 0 
##$TUNHIN= 0
##$TUNHOUT= 0
##$TUNXOUT= 0
##$USERA1= <user>
##$USERA2= <user>
##$USERA3= <user>
##$USERA4= <user>
##$USERA5= <user>
##$V9= 5
##$VALIST= <valist>
##$VCLIST= <CCCCCCCCCCCCCCC>
##$VD= 0
##$VDLIST= <DDDDDDDDDDDDDDD>
##$VPLIST= <PPPPPPPPPPPPPPP>
##$VTLIST= <TTTTTTTTTTTTTTT>
##$WBST= 1024
##$WBSW= 4
##$XGAIN= (0..3)
0 0 0 0 
##$XL= 0
##$YL= 0
##$YMAX_a= 92216
##$YMIN_a= -76328
##$ZGOPTNS= <>
##$ZL1= 120
##$ZL2= 120
##$ZL3= 120
##$ZL4= 120
##$ABSF1= 15.66535
##$ABSF2= -2.386497
##$ABSG= 5
##$ABSL= 3
##$ALPHA= 0
##$AQORDER= 0
##$ASSFAC= 0
##$ASSFACI= 0
##$ASSFACX= 0
##$ASSWID= 0
##$AUNMP= <proc_1d>
##$AZFE= 0.1
##$AZFW= 0.1
##$BCFW= 0
##$BC_mod= 2
##$BYTORDP= 0
##$COROFFS= 0
##$CY= -3
##$DATMOD= 1
##$DC= 0
##$DFILT= <>
##$DTYPP= 0
##$F1P= 0
##$F2P= 0
##$FCOR= 1
##$FTSIZE= 16384
##$FT_mod= 6
##$GAMMA= 0
##$GB= 0
##$INTBC= 1
##$INTSCL= 3.70164e-10
##$ISEN= 128
##$LB= 0.24
##$LEV0= 0
##$LPBIN= 0
##$MAXI= 10000
##$MC2= 0
##$MEAN= 0
##$ME_mod= 0
##$MI= 1.114404
##$NCOEF= 0
##$NC_proc= -8
##$NLEV= 6
##$NOISF1= 3.799351
##$NOISF2= 2.8
##$NSP= 0
##$NTH_PI= 0
##$NZP= 0
##$OFFSET= 15.73367
##$PC= 1
##$PHC0= -19118.28
##$PHC1= 17.60079
##$PH_mod= 1
##$PKNL= yes
##$PPARMOD= 0
##$PSCAL= 0
##$PSIGN= 0
##$REVERSE= no
##$SF= 200.130007578568
##$SI= 16384
##$SIGF1= 3
##$SIGF2= 2
##$SINO= 5.538805
##$SIOLD= 16384
##$SREGLST= <1H.CDCl3>
##$SSB= 0
##$STSI= 16384
##$STSR= 0
##$SW_p= 3612.71676300578
##$SYMM= 0
##$S_DEV= 0
##$TDeff= 16384
##$TDoff= 0
##$TI= <>
##$TILT= no
##$TM1= 0
##$TM2= 0
##$TOPLEV= 0
##$USERP1= <user>
##$USERP2= <user>
##$USERP3= <user>
##$USERP4= <user>
##$USERP5= <user>
##$WDW= 1
##$XDIM= 16384
##$YMAX_p= 334728671
##$YMIN_p= -1275596
$$ End of Bruker specific parameters
$$ ---------------------------------
##NTUPLES= NMR SPECTRUM
##VAR_NAME=  FREQUENCY,     SPECTRUM/REAL,   SPECTRUM/IMAG
##SYMBOL=    X,             R,               I
##VAR_TYPE=  INDEPENDENT,   DEPENDENT,       DEPENDENT
##VAR_FORM=  AFFN,          ASDF,            ASDF
##VAR_DIM=   16384,         16384,           16384
##UNITS=     HZ,            ARBITRARY UNITS, ARBITRARY UNITS
##FACTOR=    0.220516191357247, 1,           1
##FIRST=     3148.77954330523, 0,            0
##LAST=      -463.937219700547, 0,           0
##MIN=       -463.937219700547, -1275596,    0
##MAX=       3148.77954330523, 334728671,    0
$$ Real data points
##PAGE= N=1
##DATA TABLE= (X++(R..R)), XYDATA
$$ [...]
6294a27562N02490l42150k35251J51695K8376j54011j99855L12475m96909m48816
6284a009518j34963L26396O36034J68727l92781L92049P4159n69050P4732J35815
6274b98400J47907R7665k92823L02192J19694k40202k44011O7688k21537L14966
6264b46861m13646K7613l0738K76915K19467K56401R7684l53911l32529M76286
6254b3319j32384k00448j90602L47763N74795n73970N3416Q9192K12818m8813
6244A08448L1352m05059J50453n18689p6437J39222L47532Q8309J04951M16000
6234C86082J19806j00764k08495J5454j38658m41304k87752J01060K08383M33561
6224H7373M50780j71474l93448P5002n4698j88441j41063M35380j78897J45206
$$ plain form
6294 -127562 374928 32778 -202473 -50778 -22402 -176413 -376268 -63793 -560702 -1009518
6284 -1009518 -1144481 -818085 -182051 -13324 -406105 -14056 60103 -508947 -434215 -298400
6274 -298400 -150493 -52828 -345651 -43459 76235 -163967 -407978 -340290 -561827 -246861
6264 -246861 -660507 -632894 -663632 -386717 -167250 89151 186835 -167076 -499605 -23319
6254 -23319 -155703 -356151 -546753 -198990 375805 -198165 -144749 -55557 157261 108448
6244 108448 139800 -265259 -114806 -633495 -709932 -570710 -223178 -134869 -29918 386082
6234 386082 505888 405124 196629 212083 73425 -367879 -655631 -554571 -346188 87373
6224 87373 538153 366679 -26769 48233 -6465 -194906 -335969 99411 -79486 65720
6214F5720j43477J29206k05949l43129j43550m6582M05518L64050J13340J54990
6204C50137J74615K6040k75741p7698P1619j19972j81514q2480J74353o5050L6842
6193C1151K7817Q1268j75555J16076M17763l64662P8297J73434l49562K7122K03837
6182B66986J6506Q1228J19201l11810j18605j18344J94152J37238l4197j90083
6172D2272K98428m01511J64132k7477j80264J24138j90828l12787K68423j01812
6162c17286J43972L07163n19122o9606J05571k7250R2008j73553J2239o6558L95821
6151a16601M2956q0381L00638j11977m84738k22176K56277j91536M77P60030k41822
6140h8853n3151N03527k05045M31240P9936j71174j73426m01885O7849J03710
$$ plain form
6214 65720 -77757 51449 -154500 -497629 -641179 -687761 -282243 81807 195147 350137
6204 350137 524752 550792 275051 197353 268972 149000 -32514 -114994 59359 -5691 31151
6193 31151 58968 140236 -35319 80757 498520 133858 212155 385589 36027 63149 266986
6182 266986 283492 364720 483921 172111 53506 -64838 129314 266552 232355 42272
6172 42272 340700 -60811 103321 75844 -104420 19718 -171110 -483897 -215474 -317286
6162 -317286 -173314 133849 -385273 -454879 -349308 -376558 -284550 -458103 -445864 -512422 -116601
6151 -116601 -73645 -154026 146612 34635 -450103 -672279 -416002 -607538 -607061 152969 -88853
6140 -88853 -142004 361523 156478 587718 667654 496480 323054 -78831 -10982 92728
6130I2728J83341k24816k29468K63390k21071j83175K66479j68051L69376J48773
6120B97506j97826j82672j51491M15191K58980n65017l64562P85829j05052j90486
6110D00J33781L08603k54815L7367N05490q5771p0098l72442m46383R7911J5106
6099a30851n7089J52007L16539j77191L0284j56517p9279k67869O59440k5696
6089B63778m74019j19704L43437K69452k98071j24152J1468K84608j55989j97396
6079a96588K05398J61319k39445m8900M71670Q6691m06360J46258L04802m11625
6069G3220L0785l30795J99341M18763j77086o10077j32415j36266K68751M94960
6059I9181j03705K67617l3269q5665J4699J42942m349J70719j94834J81360m35629
$$ plain form
6130 92728 276069 51253 -178215 85175 -135896 -319071 -52592 -220643 148733 297506
6120 297506 99680 -82992 -234483 180708 439688 -125329 -489891 295938 190886 400
6110 400 134181 442784 187969 225336 730826 645055 574957 202515 -243868 -145957 -130851
6099 -130851 -187940 -35933 280606 103415 133699 -22818 -102097 -369966 289474 263778
6089 263778 -210241 -329945 13492 282944 -15127 -139279 -127811 156797 808 -196588
6079 -196588 8810 170129 -69316 -118216 353454 440145 33785 180043 484845 73220
6069 73220 104005 -226790 -27449 391314 214228 -395849 -528264 -664530 -395779 99181
6059 99181 -4524 263093 229824 144159 158858 301800 297451 468170 273336 454696 19067
6048A9067l8924L27637l6600k49942q5546L6382J54601L02084k13323j05435j47125
6037c7124L33549M71764l81699l37601j9998k5033j92844L01482n9833M28132
6027D80795M6461q5277m239K5359J58906j21201P1246J38874j43389m45611J00082
6016B22006M34520K76728N3171m21385n0026m8898O9949n8207m09124J83168k99910
6005d8008j39726M74996k63082j40976J50441k70940J96252J26023K665L83271
5995D70916N8344L41193n0715l66495j14240O8151k02241J65148K29468R1854
5985F91383Q5221l86871O3813P1763P68540k57015l13524n6285k28755k71262
5975A67008J54934K78635j3719j48120L23546l73388k11867M39471J31347n56226
$$ plain form
6048 19067 -19857 307780 271180 21238 -64308 -27926 126675 428759 215436 110001 -37124
6037 -37124 296425 768189 386490 48889 28891 3858 -188986 112496 52663 480795
6027 480795 527256 441979 437740 463099 622005 500804 572050 710924 567535 121924 222006
6016 222006 656526 933254 986425 565040 515014 466116 536065 477858 68734 251902 -48008
6005 -48008 -187734 287262 24180 -116796 33645 -237295 -41043 84980 87645 470916
5995 470916 529260 870453 819738 453243 339003 407154 204913 370061 599529 691383
5985 691383 776604 389733 453546 525309 1293849 1036834 723310 667025 438270 167008
5975 167008 321942 600577 586858 438738 762284 388896 177029 616500 747847 191621
5965A91621Q2580M15563j46076L70887k8446j11218o27730K08079J77511O0564
5955E93335Q0547N6096o4889p1880M27423k50994K85932P7227J39466j77026Q4521
5944A179758m08179j81684k61581o4059M96002m15676J27303L51480l39793k48640
5934B34931K96483K7658j05395k48507M61327J09357L31288m09831j46702P0230
5924F20839J35633l29537M6267j94914l60785K10012J88324L87906J6392P5249
5914G95386m36642J55205j66080J62566p0633k56505K38846J75930L51904j38574
5904H11403j27872k58704J65658J04486J83667J16558j05347M7992K01038l12853
5894H26026q2184J78997n53368N1402L23198k92572R7378K76524M8236J6968m8056
$$ plain form
5965 191621 274201 689764 543688 914575 886129 774911 147181 355260 532771 593335
5955 593335 673882 729978 665089 593209 1020632 769638 1055570 1132797 1272263 1095237 1179758
5944 1179758 771579 589895 328314 264255 760257 344581 471884 823364 483571 234931
5934 234931 531414 559072 453677 205170 666497 775854 1107142 697311 550609 620839
5924 620839 756472 426935 473202 278288 -82497 127515 315839 703745 720137 795386
5914 795386 358744 513949 347869 510435 439802 183297 422143 598073 949977 811403
5904 811403 683531 424827 590485 694971 878638 995196 889849 937841 1138879 826026
5894 826026 743842 922839 369471 420873 744071 451499 548877 825401 873637 890605 842549
5883H42549p0599j46931N5634K25193n34395p4561N79792j31762k6662O5109j11656
5872F71711k35172J84306k02054P87M71955r5704J71968L07381r1877j48027j35285
5861H99989j1859k40261M39379k1236J15351j30818J81096N6923l67857J29063
5851A049770k74235J13445J88092K45211J03991j99117k20729j84422K35617L38740
5841A396363m24842K12268K90807m43197L64509j0996k65582j20783K56824J47241
5831A402612j89352q8178j7996M21343L4311j38970K69342M06494m2956l79661
5821A676989j85488R2859l1127m30669L05644L9204q6621J43810Q3821J9807l3531
5810A594698K62619j23508L6725K18293N48048k20994m01138J82372j10866J15721
$$ plain form
5883 842549 771950 625019 680653 905846 371451 296890 876682 744920 718258 783367 671711
5872 671711 436539 620845 418791 419578 891533 795829 967797 1275178 1183301 1035274 899989
5861 899989 888130 647869 1087248 1066012 1181363 1050545 1231641 1288564 920707 1049770
5851 1049770 775535 888980 1077072 1322283 1426274 1227157 1006428 822006 1057623 1396363
5841 1396363 971521 1183789 1474596 1031399 1395908 1384912 1119330 998547 1255371 1402612
5831 1402612 1213260 1125082 1107086 1528429 1562740 1423770 1693112 2099606 2056650 1676989
5821 1676989 1491501 1584360 1553233 1122564 1428208 1467412 1380791 1524601 1608422 1628229 1594698
5810 1594698 1857317 1733809 1770534 1988827 2536875 2315881 1914743 2097115 1986249 2101970
5800B101970L07569k81001K74135k05212q6499P4051k0574L20067k55625m99279
5790A729602J91548J33075L22461K07843J07692p8037k46578j70028L07K74789
5780B472674R9066J69751J24101J14328j02963L59036j82331K89593K9640m4179
5770C328716l04280J55032j2236J10179M05262N9414j21405n05560P61248l79724
5760C496646j3288M55842J94414Q1697K76739k13194p2398K74369n1640j99163
5750D230024k34924L78746J23880K32134O27200L85140k52023q7220j86373q9849
5740E126735M02310L66022L34238p0863L03981O49024L08618N1944j3742J12814
5730G571081J38037J62921M9109L83395K36661K64760l17504k5663L45228O78447
$$ plain form
5800 2101970 2409539 2128538 2402673 2197461 2110962 2185013 2164439 2484506 2228881 1729602
5790 1729602 1921150 2054225 2376686 2584529 2692221 2614184 2367606 2197578 2197885 2472674
5780 2472674 2571740 2741491 2865592 2979920 2876957 3235993 3053662 3343255 3372895 3328716
5770 3328716 3024436 3179468 3167232 3277411 3682673 3742087 3620682 3115122 3876370 3496646
5760 3496646 3483358 3939200 4133614 4215311 4492050 4278856 4206458 4480827 4429187 4230024
5750 4230024 3995100 4373846 4497726 4729860 5357060 5742200 5490177 5402957 5216584 5126735
5740 5126735 5529045 5895067 6229305 6158442 6462423 7111447 7420065 7472009 7458267 7571081
5730 7571081 7709118 7872039 7921148 8304543 8541204 8805964 8488460 8462797 8808025 9486472
5720I486472J26332K38926L93844J03375L92830K03316N39758P66570N06242L25628
5710A3083293N28715M27899o6898K48993P80210P29559K42139R53051Q13028K05876
5700A7945865R26505Q79035J501317J220268J740153J645821J249082K200699
5692B9308745K319374K570472K859748K655125K791388K941112K733154K203759
5684E0382877K016360J011736N62484r5833m00214j159984j950489j779220j994340
5675D6593377j454964j432795r73766r83934j98131M96122M28191J348603J816805
5666D5639508K290477L047540K883064L703044M518246N192546O064283O735805
5658H0074513P946908Q011193P649869P527873P122820N333977L594556J243020
$$ plain form
5720 9486472 9612804 9851730 10245574 10348949 10741779 10945095 11484853 12251423 12757665 13083293
5710 13083293 13612008 14039907 13973009 14222002 15002212 15731771 15973910 16926961 17739989 17945865
5700 17945865 18872370 19751405 21252722 22472990 24213143 25858964 27108046 29308745
5692 29308745 31628119 34198591 37058339 39713464 42504852 45445964 48179118 50382877
5684 50382877 52399237 53410973 53973457 53877624 53477410 52317426 50366937 48587717 46593377
5675 46593377 45138413 43705618 42731852 41747918 41549787 42045909 42474100 43822703 45639508
5666 45639508 47929985 50977525 53860589 57563633 62081879 67274425 73338708 80074513
5658 80074513 88021421 96032614 103682483 111210356 118333176 123667153 127261709 128504729
5650A28504729p53432l065001n620081o320440p740329q480766p728592p503681
5642H1292407o666468n178640m276312l543366k179388j408454n93188j06641
5634E7339950O43692J679238K366597L182316L654692M284310N185542O618637
5626H4954974P240385P839466P288565O735080N830318M443143K660730R6886
5618A27089547k079891m547082o619989p937206q685753r348490r136163q466213
5610G0268760p623118o326065n537883m504983l286642l002550k100892j300656
5602C6585971q14623m09196o41943M61285Q06470P97650J375403J509137J828876
5593D1499030J351738J467391J984612J800201P62141k54958n38201o59652k098446
$$ plain form
5650 128504729 127751297 124686296 119066215 112745775 105005446 96524680 88796088 81292407
5642 81292407 74625939 69447299 65170987 61627621 59448233 58039779 57446591 57339950
5634 57339950 57983642 59662880 62029477 65211793 68866485 73150795 78336337 84954974
5626 84954974 92195359 100034825 107323390 114058470 119888788 124331931 126992661 127089547
5618 127089547 125009656 120462574 113842585 105905379 97219626 87871136 78734973 70268760
5610 70268760 62645642 56319577 50781694 46276711 42990069 39987519 37886627 36585971
5602 36585971 35771348 35362152 34720209 35181494 35987964 36785614 38161017 39670154 41499030
5593 41499030 42850768 44318159 46302771 48102972 48865113 48610155 48071954 47412302 45313856
5584D5313856k976291l355806l174600l256530l713413k997090k479375k382899
5576B0977852k088688j918816k038031q43560j232778n82478p17120o15185l06809
5567A0634387o81627n96362n12573p06789n90823p9482L0994J4361m56894m77931
5557F577261l55921k41475K69498m42447j62358j43925m53207O5817j93860k60834
5547D658549L0853j87511l98559k84863r3828O7186o0667N36297k72585l66129
5537C628743l1387m91633O8272l07007k30691L75949m4369K33882p01512k941
5527B497306Q7060N4166l11832k69449l52618M9633J93770K11700j96793k91643
5517A671300K00062j38547n1045o6166J8157l9888K31509j14989L9847l89905
$$ plain form
5584 45313856 42337565 38981759 35807159 32550629 28837216 25840126 23360751 20977852
5576 20977852 18889164 16970348 14932317 14088757 12855979 12273501 11556381 10941196 10634387
5567 10634387 9952760 9356398 8843825 8137036 7546213 7466731 7497725 7512086 7055192 6577261
5557 6577261 6221340 5979865 6249363 5806916 5644558 5500633 5047426 5113243 4919383 4658549
5547 4658549 4689402 4501891 4103332 3818469 3724641 3791827 3731160 4267457 3994872 3628743
5537 3628743 3597356 3105723 3173995 2866988 2636297 3012246 2967877 3201759 2500247 2497306
5527 2497306 2584366 2638532 2326700 2057251 1704633 1754266 1948036 2159736 1962943 1671300
5517 1671300 1871362 1732815 1681770 1615604 1633761 1593873 1825382 1710393 1750240 1360335
5507A360335m76251K28497O4696L17652m23343k71702j7967K39979P0146J40781
5497A232823m62184n04183O83596J6211L0718l46066j04391N8561J91557m40973
5487C55669L669M3482L06291J90618J23211Q1342j16557J2732q9816K70705o87201
5476D94145j87062j60063P5073K56883L9667Q6181l87481J31914m65566L22513
5466B06204L97076K85264l4623l54795j8403N06959K39826j62696l18779o34147
5456A11886l3646K77552k76449J1402J03280K92552K6244O72220k082o23918j87596
5445C71445N5663L21591k89363P7908j53373j85133R765O121K76595j33086J18179
5434D76312L04724o99734K06526J94794K23568l70568k75810K27328O0586J76800
$$ plain form
5507 1360335 884084 1112581 1177277 1494929 1071586 799884 781917 1021896 1092042 1232823
5497 1232823 770639 266456 950052 966263 996981 650915 546524 605085 796642 355669
5487 355669 359338 402820 709111 899729 1022940 1104282 987725 1000457 910641 1181346 494145
5476 494145 307083 147020 222093 478976 518643 604824 217343 349257 -116309 206204
5466 206204 603280 888544 853921 499126 480723 987682 1227508 1064812 746033 111886
5456 111886 78240 355792 79343 90745 194025 486577 512821 1185041 1182959 559041 371445
5445 371445 427108 748699 459336 537244 383871 198738 208503 214624 491219 358133 476312
5434 476312 781036 81302 287828 482622 706190 335622 59812 287140 347726 524526
5424E24526k27758J54778J18850l78126m41870j34239J57395K40087J28533Q9822
5414B31998J2716j88466J17989r1067K13056l0261L8107j81435J90141l03165
5404I613j11102M58599J22471m14956j75068j43766M29935Q7120l38476Q1477
5394E847L2817L03858k58867k97772K04722k86458o9604L54040J04111K75809
5384C68503m34886K34373K88144m38389k15647Q5683K23350p5340k74425J96877
5374d1757L7500j75675m6010k6482k3465J31057K94026k87370L66154M20779J2717
5363F61474k69950j46538j28596k94230J91586n4837R7124N52924j83222l96490
5353B9245r8098m043M67369j02361n5642l17654L30398K61321j49808k19468k89112
$$ plain form
5424 524526 296768 451546 570396 192270 -249600 -383839 -226444 13643 142176 231998
5414 231998 244714 56248 174237 83170 296226 265965 304072 122637 312778 9613
5404 9613 -101489 357110 479581 64625 -110443 -254209 175726 262846 -75630 5847
5394 5847 38664 342522 83655 -214117 -9395 -295853 -365457 -11417 92694 368503
5384 368503 -66383 167990 456134 17745 -197902 -112219 111131 35791 -238634 -41757
5374 -41757 -4257 -179932 -225942 -252424 -275889 -144832 149194 -138176 227978 648757 661474
5363 661474 391524 244986 116390 -177840 13746 -41091 56033 608957 425735 29245
5353 29245 -68853 -72896 394473 292112 236470 -81184 249214 510535 360727 141259 -147853
5342a47853Q8993L95273K0076j02770R0897M44203j99642k37065J80492J39676
5332F72280M9177j44119j45505J22316m27679l38144M51006K5338O3070J81887
5322E09627J77959K9488J79129k87832p98578N07137L82702o2278k54893L1216
5312D13677K39474j71080l16253K32198r0999j4431J719J79137j15909k62968
5302I4565J85953N81702N06954j29442k53917n56697N10023n12354Q7507L6761
5292E51055K27577p0047j82340J55504J84252J61545o5502L9396k47913n391l82431
5281C65705J42469J24465M2811J99731r321j82925k80787J20749p5948m79206
5271c2257K74454J89406J83354k28338k37447L24201l4955m77400k69016R0011
$$ plain form
5342 -147853 -58860 336413 356489 253719 344616 788819 589177 352112 532604 672280
5332 672280 721457 577338 431833 554149 126470 -211674 239332 264670 327740 509627
5322 509627 687586 717074 896203 608371 -190207 316930 699632 637354 382461 413677
5312 413677 653151 482071 165818 398016 307017 292586 294305 473442 357533 94565
5302 94565 280518 862220 1369174 1239732 985815 429118 939141 426787 514294 551055
5292 551055 778632 708585 526245 681749 866001 1027546 962044 1001440 753527 748136 365705
5281 365705 508174 632639 675450 875181 865860 682935 402148 522897 446949 -32257
5271 -32257 242197 431603 614957 386619 149172 473373 438418 -38982 -307998 -217987
5261b17987O23607K7775k26775Q2620k24516L74892J25995l31768k18060M95720
5251E11503J95388m89249J22319L53855K73234j43900k73747l88532k15537k68381
5241c23047K71750J23220l57845p2945k06958M72947K73216J18104p2022J35101
5231C61521J0865j94362p0316O7623k92745O0983J24577K9364j95429M07407J82104
5220D91592l40254m53967R5844k42776J42839P3427L63253J86872j16947J00848
5210C00731k15581j0170r9484J03546r195j54607j78095J06741K06975L57801
5200D08662m2758r9159k32088J44321K42420j99937j14245L69097l19622q0082
5190G6609q4034R5588O7992r5975o7740M2141K4470j10061P6989k46426r639k07571
$$ plain form
5261 -217987 405620 433395 206620 289240 64724 439616 565611 233843 15783 511503
5251 511503 706891 217642 339961 693816 967050 823150 549403 160871 -54666 -323047
5241 -323047 -51297 71923 -285922 -358867 -565825 -92878 180338 298442 226420 361521
5231 361521 372386 178024 107708 175331 -117414 -56431 68146 97510 -97919 309488 491592
5220 491592 151338 -302629 -206785 -449561 -306722 -233295 129958 316830 199883 300731
5210 300731 85150 74980 -24504 79042 69847 -84760 -262855 -156114 50861 408662
5200 408662 365904 266745 34657 178978 421398 221461 107216 476313 156691 76609
5190 76609 -7425 88163 156155 60180 -7560 34581 59051 -51010 25979 -220447 -230086 -437657
5178d37657M45809P2287n03744j9063k812Q031J87828M5129J3081p9453J50427
5167a20137l3112m18429J28316K26067J89266l66737M6531j07605J29439K66939
5157e9462k93312K8995P1789K09215k28660m31716K91789P1207L01805r9831M7631
5146i0550m08333K55941R8855J22792K41469k35724l63k54791j65701n1675L55421
5135a32659j36693m124K31316j31113J44557l80127l13498Q8178l3428J35395
5125e32196j92492j837J85850Q8366M52696n17859J66799L87086j83241m7971
5115a94799j78262R7443K261J55139k80624L0827J68473K07364P2440P9430j61715
5104b023j65807j57271m9014j40144k00267K30751J91892m1323k24304J8730K30416
$$ plain form
5178 -437657 8152 80439 -423305 -442368 -445180 -437149 -249321 -204192 -191111 -270564 -120137
5167 -120137 -153249 -571678 -443362 -217295 -28029 -394766 -348235 -455840 -326401 -59462
5157 -59462 -352774 -323779 -251990 -42775 -271435 -703151 -411362 -340155 -38350 -138181 -90550
5146 -90550 -498883 -242942 -144087 -21295 220174 -15550 -15913 -270704 -436405 -488080 -132659
5135 -132659 -269352 -273476 -42160 -173273 -28716 -408843 -722341 -634163 -667591 -532196
5125 -532196 -724688 -726525 -540675 -452309 387 -517472 -350673 36413 -146828 -194799
5115 -194799 -373061 -275618 -273357 -118218 -398842 -368015 -199542 7822 80262 159692 -2023
5104 -2023 -167830 -325101 -374115 -514259 -714526 -483775 -291883 -333206 -557510 -538780 -308364
5093c08364O948M6668K67420j45504k81640N75691k15308l35305m7644J94105
5083b42933j7665J3098j22357K32572L5245J48958J50096m66469J64709k5087
5073a29833J67758n9585p1693k5228K59252K76750k62657k38265l02524Q6940
5063b99085K10261k6767J00360l7618j09047L47893j04316l19605K20655k3485
5053d0754Q2575j90542J78218J67503m1455j50519K88597m24876q9904j61503
5043c82660k52304L49901R4007l10415J97684K09113l19453K00113n54071O07523
5033a60562l3903J69261n4754L22932j19585o26522j92242K99852j62816K55879
5023c02460N50625n32714O6022J0561j38155k83268Q829L40034K53459m20386
$$ plain form
5093 -308364 -301416 -254748 12672 -132832 -414472 161219 -54089 -389394 -437038 -242933
5083 -242933 -260598 -247500 -369857 -137285 -102040 46918 197014 -269455 -104746 -129833
5073 -129833 37925 -21660 -93353 -118581 140671 417421 154764 -83501 -386025 -299085
5063 -299085 -88824 -115591 -15231 -52849 -161896 185997 81681 -237924 -17269 -40754
5053 -40754 41821 -148721 29497 197000 155545 5026 293623 -131253 -221157 -382660
5043 -382660 -634964 -285063 -191056 -501471 -303787 -94674 -414127 -214014 -768085 -160562
5033 -160562 -194465 -25204 -79958 242974 123389 -503133 -695375 -395523 -558339 -302460
5023 -302460 248165 -284549 -218527 -207966 -346121 -629389 -620560 -280526 -27067 -447453
5013d47453J96552L524k54770o7764P9022K84250K60736k0701j36121j72891R7253
5002a78363r39975J62433P38019K229j09496r5743K13024K43913J35694k56452
4992h4717O31298l23690m33611K83523o8975q5624J16356K51342J1538o41516
4982c44076J45611N6165k9458J33593k3562l10360r5507m9686K78964K37607l76028
4971c76737P94320m76829m21653j75787M34070m251K13997O7658m83690J71776
4961b57126J95981j25384m47408K48903N3608k03023Q229n9613n6241J52244M32328
4950e7502K66074l91956k98926n4903K62350l25094M64168J04448m44565J26644
4940c49262K04045l8J4517l38164J6876j64463k98253L95267M12104j06560n03103
$$ plain form
5013 -447453 -250901 -247377 -502147 -569911 -490889 -206639 54097 33396 -102725 -275616 -178363
5002 -178363 -1118338 -955905 -217886 -215657 -325153 -420896 -207872 36041 171735 -84717
4992 -84717 546581 222891 -210720 72803 3828 -81796 34560 285902 297440 -344076
4982 -344076 -198465 -142300 -171758 -38165 -61727 -372087 -467594 -517280 -238316 -709 -376737
4971 -376737 417583 -59246 -480899 -656686 -222616 -226867 -12870 54788 -428902 -257126
4961 -257126 -61145 -186529 -633937 -385034 -331426 -534449 -526220 -585833 -642074 -489830 -57502
4950 -57502 208572 -183384 -482310 -537213 -274863 -599957 -135789 -31341 -475906 -349262
4940 -349262 -145217 -145255 -130738 -468902 -452026 -616489 -914742 -519475 -107371 -213931 -717034
4929g17034J51537q7911j27571L27041N24518l55398L30494n302K55994J1118
4919C07486o89913j62975O6594M9925K36017M8306l36304J19857O5888l65052
4909f60171M9081M39864K40079k23317l30183M27007q0023J50143O6132j28906
4899e0294j43602K86692l0107m64580m0211Q9675m61423O8506L19570J69024k11617
4888d68367j93815j8077O1804L79626j15490J25308K65728k94440k02163K52034
4878b07852L8721n3270l88824L72457K4225q15978M68517M55109J8409m1481k61208
4867c91175O8543r5214M33653o4378k37275L24265j26952J83260L18178o40058
4857b27153J05429j34230n93515L65153R9459K75342j87357k96521J79869K53012
$$ plain form
4929 -717034 -565497 -653408 -780979 -453938 70580 -284818 45676 40374 296368 307486
4919 307486 -382427 -545402 -478808 -428883 -192866 -144560 -480864 -361007 -295119 -660171
4909 -660171 -611090 -171226 68853 -154464 -484647 -57640 -137663 12480 78612 -50294
4899 -50294 -193896 92796 62689 -401891 -442102 -352427 -813850 -745344 -425774 -256750 -468367
4888 -468367 -662182 -680259 -618455 -238829 -354319 -229011 36717 -257723 -459886 -207852
4878 -207852 -169131 -222401 -611225 -238768 -214543 -1030521 -562004 -106895 -88486 -129967 -391175
4867 -391175 -322632 -417846 15807 -48571 -285846 38419 -88533 94727 412905 -227153
4857 -227153 -121724 -255954 -849469 -484316 -384857 -109515 -296872 -593393 -413524 -160512
4847a60512L0915k29306O500j82270P4414M31270J21286l00192k95879j59625
4837f63399M67317q8833N3205J51209l175k05112k79683L70232K42721J58943
4827B03425p1729Q8751r0346m17108K52763K29660m92978R5620J62484n6540L73303
4816B77305k89k61849j87948j2713J92731r5428j83195N02K21452P7215J18522
4805A46305j70178k15268L95711r9950l19620L58447l14034R4710J67595Q3787
4795A27505K74742r1361j99827l43654k4593M681J94999L77664L43585j64041
4785D99700l94642k44590k0091L94674m58132K79638N2024K26095k70802j51563
4775h7689M8159Q5973K47830l76628k06703J43996K38028m26917J03639O3879
$$ plain form
4847 -160512 -129597 -358903 -352403 -534673 -460259 -28989 92297 -207895 -503774 -663399
4837 -663399 -196082 -284915 -231710 -80501 -83676 -288788 -568471 -198239 44482 203425
4827 203425 131696 220447 130101 -287007 -34244 195416 -297562 -201942 -39458 -95998 277305
4816 277305 277016 15167 -172781 -185494 7237 -88191 -271386 -270884 -49432 27783 146305
4805 146305 -23873 -239141 156570 56620 -263000 95447 -218587 -123877 43718 127505
4795 127505 402247 310886 111059 -232595 -257188 -252507 -57508 320156 663741 499700
4785 499700 105058 -139532 -159623 235051 -223081 56557 108581 334676 63874 -87689
4775 -87689 -39530 46443 294273 -82355 -289058 -145062 92966 -333951 -230312 -166433
4765a66433k1477J16484k74094M0487M00645J3651N963j63302p96110k1066M70248
4754c95004N4025L58849K20674J21018J3902p4955m10735N0404k01952l11543
4744e75317K07335m357k2406O80458o73044l31443J7889K84682M54879J43810
4734A82486o28173m03884M27647L08909n2181Q9402L60129k29076j14954n31328
4724e91023L04974K74473q8036j29685O1944L21616p6562j56921R2295J72508
4714A85583L0759m82994L00348j8827l84056Q5818l5340J99141J73482n01725
4704d47811J83176K48377P1177p2076Q7167L55626n08909J18814K99312k5613
4694C09240j23700j62189m30370L14116K95720k39663j18941k12261M01116J87868
$$ plain form
4765 -166433 -187910 -71426 -345520 -305033 95612 109263 115226 -48076 -844186 -865252 -395004
4754 -395004 -340979 17870 238544 359562 373464 298509 -112226 -61822 -263774 -575317
4744 -575317 -367982 -372339 -394745 285713 -387331 -718774 -700885 -416203 38676 182486
4734 182486 -445687 -849571 -421924 -113015 -165196 -75794 284335 55259 -59695 -591023
4724 -591023 -286049 -11576 -99612 -229297 -167353 154263 77701 -79220 13075 185583
4714 185583 216342 -266652 33696 14869 -369187 -283369 -318709 -119568 53914 -447811
4704 -447811 -264635 -16258 54919 -17157 70010 425636 -83273 35541 334853 309240
4694 309240 185540 23351 -407019 -92903 202817 -36846 -155787 -368048 33068 220936
4684B20936q1588k52888k00718j1371K66545L46869j59930j89789J52537k69673
4674a79070j09427J26714l0869K01191l1087O2137l40615J77861l2953j68059
4664c24177r2251m0439J91604m02878J77816L34726m9296L80420l47551L9514
4654a32512m04935L31539K68512L6072L9794m02911P113J67659L80975o4819m07059
4643a80572k8492q2757l2188L0687j31120J5621J38503M53886j68701j53143J50475
4632A2199j23333j55291l67751j28988J29204K26743n0910P4061R2892N57630
4622B66456L90021l32486K85388o89791l16994J65292J78988K51846J58907o60673
4612c03046K742J28509m9786l39427L83609M4253K65752k50299O846M46640j58274
$$ plain form
4684 220936 139348 -113540 -314258 -325629 -59084 287785 127855 -61934 90603 -179070
4674 -179070 -288497 -161783 -192652 8539 -22548 39589 -301026 -123165 -156118 -324177
4664 -324177 -416428 -456867 -265263 -668141 -490325 -155599 -204895 175525 -172026 -132512
4654 -132512 -537447 -205908 62604 98676 138470 -264441 -257328 -89669 291306 226487 -180572
4643 -180572 -209064 -291821 -324009 -293322 -424442 -408821 -270318 183568 14867 -138276 12199
4632 12199 -111134 -266425 -634176 -763164 -633960 -407217 -458127 -384066 -291174 266456
4622 266456 656477 323991 609379 -80412 -397406 -232114 -53126 198720 357627 -303046
4612 -303046 -300304 -171795 -221581 -561008 -177399 -133146 132606 -117693 -110847 335793 177519
4601A77519j47698k05514J45587K60391J64112m43733J54782j23366k63229r2831
4591c73980j23314K57077K11263N3284n16601l07495M47393K63658k18518m3596
4581c50829L131k77846J8231j23994K57080N04569j49408k19952j43231j57176
4571f39425J79563M45442J47602N6743m1476j78346Q1712K8190l22o0886l29721
4560c10924K94r131K14677j14708M24079L94003n04285Q330l59248l79792K91432
4549c45273J15334k57990L90711N1542l15237l28323L75512L75789J26311l5767
4539A52609J60740k58214r21918K57198P9350J50438J87073k06022K66907L68414
4529B36575j17363j54096J92366q5249R2626j72894M41926J53561l26342Q0380
$$ plain form
4601 177519 29821 -175693 -30106 230285 394397 -49336 105446 -17920 -281149 -373980
4591 -373980 -497294 -240217 -28954 24330 -492271 -799766 -352373 -88715 -307233 -350829
4581 -350829 -347698 -625544 -607313 -731307 -474227 30342 -119066 -339018 -482249 -639425
4571 -639425 -459862 -14420 133182 189925 148449 -29897 51815 80005 79683 18797 -310924
4560 -310924 -310630 -319761 -105084 -219792 204287 598290 94005 102335 -256913 -636705 -345273
4549 -345273 -229939 -487929 -97218 -45676 -360913 -689236 -313724 62065 188376 152609
4539 152609 313349 55135 -866783 -609585 -530235 -379797 -192724 -398746 -131839 236575
4529 236575 119212 -34884 157482 72233 164859 -8035 433891 587452 261110 341490
4519C41490j21840l50593n0817K28983q1561k31460L53648J32938N1906n41394
4509b68700m3345N23425J60237l04028j83366j49424J49893J84525j25863o9926
4499a26572K57192p277P2747j88071R7473J08663j20507j01681l46528R8337N86761
4488C30537J33749k2639R0451m39418k23959j23618K01710j78054J92201m7601
4478h6641n768L50959R7469j94342k39196J45469k82375r4094j25993L94152L90261
4467C49901j59307L55279m3911J02222j08288k82589j74685M7324J56310n24231
4457b81975m06305N99826p6189J57304O1508M4096J30220k68118J65966k37360
4447a11027q9154J64916J52103P3386k08265j62090N7011L40989L42030k60067
$$ plain form
4519 341490 219650 -130943 -181760 47223 -34338 -265798 87850 220788 272694 -268700
4509 -268700 -312045 211380 371617 67589 -115777 -265201 -115308 69217 -56646 -126572
4499 -126572 130620 123343 196090 8019 105492 214155 93648 -8033 -354561 -256224 330537
4488 330537 464286 441647 532098 92680 -131279 -254897 -53187 -231241 -39040 -86641
4478 -86641 -92409 258550 356019 161677 -77519 67950 -214425 -308519 -434512 -40360 349901
4467 349901 190594 545873 501962 604184 495896 213307 38622 85946 242256 -281975
4457 -281975 -688280 -88454 -164643 -7339 54169 98265 228485 -39633 126333 -111027
4447 -111027 -200181 -35265 116838 190224 -18041 -180131 -123120 217869 559899 299832
4437B99832n78542K96706o6478K18689J15654K43288k65699J27931k77446K89126
4427D03061j84125k09022M49110q4643k94341Q0848k92467r989L05648O8258K10888
4416D43226l55371M5484K99068m5109k73450L78627m17537l80248M1989K39952
4406b3369J0733O9421L04307N12785j49687l53095l23272j3389J6126J96996M89864
4395G37420k98087m70467Q1305J12038l253o3692l11042k77707L99159q408j3941
4384a16675j85831j4408j09791o9568K79569J59999K65897K40964l45885o7245
4374C7026j75509P6593K92495j11949J9198L44323j31031j25823k92380N08251
4364D41194Q1690k43463N7839k48413J29944K27939O13j52371K6628j9102K70757
$$ plain form
4437 299832 -278710 17996 -48482 170207 285861 529149 263450 391381 113935 403061
4427 403061 218936 9914 459024 374381 80040 160888 -131579 -141568 164080 232338 443226
4416 443226 87855 133339 432407 387298 113848 492475 74938 -305310 -263321 -23369
4406 -23369 -12636 56785 361092 873877 724190 371095 47823 34434 50560 247556 737420
4395 737420 439333 -31134 50171 162209 158956 95264 -215778 -493485 -94326 -102734 -116675
4384 -116675 -302506 -316914 -426705 -496273 -216704 -56705 209192 450156 104271 37026
4374 37026 -138483 -61890 230605 118656 137854 482177 351146 225323 -67057 441194
4364 441194 522884 279421 337260 88847 218791 446730 447343 294972 321600 302498 573255
4353E73255J08059r0402l20981j7279M00251L02100l84770j02303K01906K73274
4343I43110j97937r6557L074J40020k36017L60231j85588k12379Q8871k7564l25981
4332B53283J55338M6535l37229K73446j26095l04575J8308L16331L10273j17185
4322D88430R7386M7740j25215p791K3456J24476K95109P7565j08460L8322j74940
4311G76078K4076L1883K31273k98964k99126L34182K15815l30831K11184J50935
4301A046505R1267j21510j05147K07129k62776l39649O245j5135J48754J047J34992
4290G91722k01910K16724j89875K42455K55053r840j75154L09799j42951n12185
4280E83838j52451j10007N87094K02979J14168k860J47597L26912k97946l12114
$$ plain form
4353 573255 681314 590912 269931 252652 652903 955003 570233 467930 669836 943110
4343 943110 745173 648616 651690 791710 555693 915924 730336 517957 606828 579264 253283
4332 253283 408621 455156 117927 391373 265278 -39297 -20989 295342 605615 488430
4322 488430 585816 633556 508341 500550 524006 648482 943591 1021156 912696 951018 776078
4311 776078 800154 832037 1063310 764346 465220 799402 1015217 684386 895570 1046505
4301 1046505 1137772 1016262 911115 1118244 855468 515819 522064 506929 655683 656730 791722
4290 791722 589812 806536 616661 859116 1114169 1104329 929175 1238974 1096023 583838
4280 583838 431387 321380 908474 1111453 1225621 1222761 1370358 1697270 1399324 1087210
4270A087210O9598k5255M88546L4071l40819j18114K76303l4158K89267J08974
4260A835623K07545k48192K69259j96089l09257L8582j58638p2816L01273l870
4250A663420n44243j99253J29498O4151P85618j70430j97208M53972N6774J71413
4240B213712k60097L13663j68480j51028J91897q0090N19264N32750k46036K70328
4230C135883J01500n63795N36079K62990M68267M2885r6703N500j14119M95917
4220D274404N23352L21690k8221N96425N85724J73693K48278R03543J000314J071927
4210I671129M19350J276110J519173K398338K054445K209091K198329J908201
4202B3654166l49213l493906l559578k851582k438514j692115j007495p08903
$$ plain form
4270 1087210 1156808 1131553 1620099 1654170 1313351 1195237 1471540 1437382 1726649 1835623
4260 1835623 2043168 1794976 2064235 1868146 1558889 1597471 1438833 1366017 1667290 1663420
4250 1663420 1119177 919924 1049422 1113573 1899191 1728761 1531553 1985525 2042299 2213712
4240 2213712 1953615 2267278 2098798 1947770 2139667 2059577 2578841 3111591 2865555 3135883
4230 3135883 3237383 2673588 3209667 3472657 3940924 3983809 3887106 3892606 3778487 4274404
4220 4274404 4797756 5119446 5091225 5687650 6273374 6447067 6695345 7598888 8599202 9671129
4210 9671129 10090479 11366589 12885762 15284100 17338545 19547636 21745965 23654166
4202 23654166 23304953 19811047 16251469 13399887 10961373 9269258 8261763 7552860
4194G552860r21441r30660l91563m19944l73766o80549k44473K31960l32120j74828
4184C315476j43275k88137J27718n67226k79930p2630j02122j76435J38034m23971
4174A527502o8492J00308J43738J35477R0862k34285l01455R4234j3780K61675
4164A735784o8151L33579q5508l58065k70864o062K8692J41655p3952j14097L72539
4153A635550k84748Q9889R2358K56736J27838k36082p1329K35315j88531k60074
4143A396922J17431K64577l46940k27442k04577Q8294P8363P5129L6219m15817
4133H62159N87889J65285J56441K63641J32822k41604m7523L0432N18206L30637
4123B758385L48294n5444r8256K66423k60562M7678J07193m34533k27164k48156
$$ plain form
4194 7552860 6631419 5700759 5309196 4889252 4515486 3834937 3590464 3822424 3490304 3315476
4184 3315476 3172201 2884064 3011782 2444556 2164626 2091996 1989874 1813439 1951473 1527502
4174 1527502 1459010 1559318 1703056 1838533 1929395 1695110 1393655 1487889 1474109 1735784
4164 1735784 1667633 2001212 1915704 1557639 1286775 1280713 1309405 1451060 1377108 1263011 1635550
4153 1635550 1350802 1440691 1533049 1789785 1917623 1681541 1610212 1845527 1656996 1396922
4143 1396922 1514353 1778930 1431990 1204548 999971 1088265 1166628 1241757 1277976 862159
4133 862159 1450048 1615333 1771774 2035415 2168237 1926633 1879110 1909542 2427748 2758385
4123 2758385 3106679 3051235 2952979 3219402 2958840 3006518 3113711 2679178 2452014 2203858
4113B203858J77183j27380l43750j94464k90065J03813J18787m23030m88300O9855
4103H06507k55933M86753l5481r7853M1987K45072j98988p0197J33679j29959
4093I25587J47959K33539N5113q0982k75008m48367K43238K1373L33133j73677
4083I81908j86379K47506J81722J47381j61153j50033p9322l21852J98886N51839
4073A410503l2642k59092M33266j14815l76695J72235K5315Q1503k52726K62512
4063A349364K92339l03623p6372L0932K92310n69878k36809L7481m8209J91248
4053I58783M36643N1905n17611M8353J29516L86995n12527k21931K97962J82544
4043A240632J54860r2327j6859J14185Q7958J06964l20034j13611Q9142L73740
$$ plain form
4113 2203858 2381041 2253661 1909911 1715447 1425382 1529195 1647982 1224952 736652 806507
4103 806507 550574 1037327 1001846 903993 945980 1191052 992064 921867 1055546 925587
4093 925587 1073546 1307085 1362198 1281216 1006208 557841 801079 822452 1155585 981908
4083 981908 795529 1043035 1224757 1372138 1210985 1060952 981630 659778 858664 1410503
4073 1410503 1377861 1118769 1552035 1437220 1060525 1232760 1258075 1339578 1086852 1349364
4063 1349364 1641703 1338080 1261708 1292640 1584950 1015072 778263 815744 767535 958783
4053 958783 1395426 1447331 929720 978073 1107589 1494584 982057 760126 1058088 1240632
4043 1240632 1395492 1303165 1286306 1400491 1488449 1595413 1275379 1161768 1250910 1624650
4033A624650n60986M5428J23684k18991K7675k33548k30438n8652j824L31821
4023H48819P5535l91719n3761L81386K41781j89389J95088L64782m10674k15254
4013H46594K33307L32882k46927j45464K59716L28901m7787R3378m3745j66228
4003A444627K37803l29082k77194J55756j20211k49735J47591K91569J20726k25507
3993A196343K41683L46979J38894m82910K38644K70769j46010o70528J05759p988
3983A231635J27373m30602J34908K85697J9872M58831J33431p7335j89577l47266
3973A346967L66898L87187j41981j48239j99327j50949J40449L07835L58869J94407
3963B462116L19180J2656k15320K44279k89616m58155J21974j55764J32306R5097
$$ plain form
4033 1624650 1063664 1109092 1232776 1013785 1041460 807912 577474 518822 516998 848819
4023 848819 924354 532635 478874 860260 1102041 912652 1107740 1472522 1061848 846594
4013 846594 1079901 1412783 1165856 1020392 1280108 1609009 1561222 1654600 1610855 1444627
4003 1444627 1682430 1353348 1076154 1231910 1111699 861964 1009555 1301124 1421850 1196343
3993 1196343 1438026 1785005 1923899 1440989 1679633 1950402 1804392 1133864 1239623 1231635
3983 1231635 1359008 928406 1063314 1349011 1368883 1827714 1961145 1883810 1694233 1346967
3973 1346967 1713865 2101052 1959071 1810832 1611505 1460556 1601005 1908840 2267709 2462116
3963 2462116 2781296 2793952 2578632 2822911 2533295 2075140 2197114 2041350 2173656 2268753
3953B268753m73558J23348L14446j6337J22644L47287p6841P703J07025o565J50499
3942B868404L79517M77190K08832k75824L82056O58325K99890o31946r11811o3839
3932C390794k29003r55704k67054O5024L89570K43517l17987j41269k83731q0071
3922A814086K56424L09057m08035J58497J01511J2143K77644j40457j00925l28654
3912A951291j02230j73835n490L42786M10287j45908l59905l16417j25232K95424
3902A770771K05129P6550J61169m18705K83816J93646O9891m93454J28406k9754
3892A947465J855M24846j43265J29061j91013m61813K84282J44418J18420J3066
3882B267322l83659K89546L40333j45543J06985j07696N62945O92302j01417j75752
$$ plain form
3953 2268753 1795195 1918543 2232989 2216652 2339296 2686583 2609742 2617445 2724470 2717905 2868404
3942 2868404 3247921 3725111 3933943 3658119 4040175 4698500 4998390 4366444 3454633 3390794
3932 3390794 3161791 2206087 1939033 2004057 2393627 2637144 2319157 2177888 1894157 1814086
3922 1814086 2070510 2379567 1971532 2130029 2231540 2243683 2521327 2380870 2279945 1951291
3912 1951291 1849061 1675226 1669736 2012522 2422809 2276901 1916996 1600579 1475347 1770771
3902 1770771 1975900 2052450 2213619 1794914 2078730 2272376 2342267 1848813 1977219 1947465
3892 1947465 1949320 2374166 2230901 2359962 2168949 1707136 1991418 2135836 2254256 2267322
3882 2267322 1883663 2173209 2513542 2367999 2474984 2367288 2930233 3622535 3521118 3345366
3872C345366R8633K02724L08295O74310K17556r2463j142215n27944j64495j05992
3862B813775R7049p01545j93335L88083r8563p4223l19661l59055K53424K92143
3852B098092J33815o826m577P28588m61920j1003k78124n84946N04819M1486l11074
3841A848330Q2848R2100j01830K43401J08316k7565j72422J79217J75887q6791
3831B341491l89838J84622l42648r0015M04533m8601L7649q1651k82241M91225
3821B224526j12311l94012K14921j32085K8407j75884L06989J90104o2066r2231
3811A996358K1504J71009k8439l33238K46619K8898j74551m82249L02059K60526
3801B008496R436J17696r3461J74628m99968Q6987J32150q4484J06244o3847M57744
$$ plain form
3872 3345366 3443999 3646723 3955018 4629328 4846884 4754421 3612206 3084262 2919767 2813775
3862 2813775 2910824 2209279 2015944 2404027 2305464 2231241 1911580 1552525 1805949 2098092
3852 2098092 2231907 2225081 2220504 2949092 2487172 2476169 2198045 1613099 2117918 2159404 1848330
3841 1848330 1931178 2023278 1921448 2164849 2273165 2245600 2073178 2252395 2428282 2341491
3831 2341491 1951653 2136275 1793627 1703612 2108145 2059544 2097193 2015542 1733301 2224526
3821 2224526 2112215 1718203 1933124 1801039 1829446 1653562 1960551 2150655 2088589 1996358
3811 1996358 2017862 2188871 2160432 1827194 2073813 2102711 1928160 1445911 1747970 2008496
3801 2008496 2017932 2135628 2042167 2216795 1716827 1803814 1935964 1851480 1957724 1893877 2351621
3790B351621l81572j87608J78057O1098J37023l84733K33136M68211r6684l62904
3780B015645L10569L14175L3834j96182m07650M10998j58736l36858P5355L05395
3770B366545J47659p86020J40250K44407j56357K69161Q1003K71815j29393k36290
3760B212780O1053k24675l92364r4619M93460j66621J59113L5012J44489j09492
3750B118136k85131P01735J62094m4143k47237l81371J42358L33977J62197k20699
3740B441916k07658J97183k12051j45899n9134n4538L16827j07014k6831R6486
3730B239287k89953j73304K19071K52851j52777L32283J19846o23857J37341Q8061
3720B148849L79519K58415n0004j50445j53315n192j65178n9184L52662l1908
$$ plain form
3790 2351621 1970049 1782441 1960498 2021596 2158619 1773886 2007022 2475233 2378549 2015645
3780 2015645 2326214 2640389 2674223 2478041 2070391 2481389 2322653 1985795 2061150 2366545
3770 2366545 2514204 1728184 1868434 2112841 1956484 2225645 2306648 2578463 2449070 2212780
3760 2212780 2273833 2049158 1656794 1562175 2055635 1889014 2048127 2083139 2227628 2118136
3750 2118136 1833005 2534740 2696834 2652691 2405454 2024083 2166441 2500418 2662615 2441916
3740 2441916 2234258 2431441 2219390 2073491 2014357 1959819 2276646 2169632 2142801 2239287
3730 2239287 1949334 1776030 1995101 2247952 2095175 2427458 2547304 1923447 2060788 2148849
3720 2148849 2528368 2786783 2736779 2586334 2433019 2427827 2262649 2203465 2556127 2524219
3710B524219l91142j5851j7678J25300j21409m78128J05919M43828K21952Q530
3700B405540R6281j36414o6474J16474l49036O36176J97555m20115k58397J92462
3690B414052K1078l42852N3555j5588J7880K39699j74991J09581J18761l44737
3680B096438K15767Q4650O6083N0544K28719o88196N7830M75246j7703o4423p23
3669B504232N6957O3051k28971M07809l35618l46054Q1148K59029J91774o38783
3659B014574j18623K94168L33555l44928L81577K09275N75121j24530n02458N0948
3649B768679R1044J85633k20489m41157j6278K82732j28291J27615J75428k09960
3639B614956O28750J41619l31950J93194K87886M27447l01485p8774M9107l89173
$$ plain form
3710 2524219 2133077 2117226 2099548 2224848 2103439 1625311 1731230 2175058 2397010 2405540
3700 2405540 2501821 2365407 2298933 2415407 2066371 2702547 2900102 2479987 2221590 2414052
3690 2414052 2435130 2092278 2145833 2130245 2148125 2387824 2212833 2322414 2441175 2096438
3680 2096438 2312205 2396855 2462938 2513482 2742201 2054005 2111835 2587081 2569378 2504955 2504232
3669 2504232 2561189 2624240 2395269 2803078 2467460 2121406 2202554 2461583 2653357 2014574
3659 2014574 1895951 2190119 2523674 2178746 2560323 2769598 3344719 3220189 2717731 2768679
3649 2768679 2859723 3045356 2824867 2383710 2367432 2650164 2521873 2649488 2824916 2614956
3639 2614956 3243706 3385325 3053375 3246569 3534455 3961902 3660417 3581643 3630750 3241577
3629C241577l01932Q852Q9614j23697J83612k20688J60604O3171j75295J78688
3619C104506k38861K00184p7179j22406j38991M5402J88464L5128Q3494j82510
3609B897231r1248J94095K91799J50671M02335K238k32037l24193k63241n41946
3599B485704K41747M34070k88124p8340j59499j77306J64974j46572k76698l44913
3589A855043M13414M53926m2877k93940L4416j07657K25597J12297l16552K54384
3579B588051j69980M28772m10150m8381L05395k47546L16741L03824k69061l71289
3569B426376q2534K9747n8373j22278K40527K25649l92424j74203Q9250o0697
3559B121040k31J96486j58657k72722k97901L11366L12200j56603L25954K67213
$$ plain form
3629 3241577 2939645 2948497 3038111 2914414 3098026 2877338 3037942 3101113 2925818 3104506
3619 3104506 2865645 3065829 2988650 2866244 2727253 2772655 2961119 2996247 3079741 2897231
3609 2897231 2805983 3000078 3291877 3442548 3844883 3847121 3615084 3290891 3027650 2485704
3599 2485704 2727451 3161521 2873397 2795057 2635558 2458252 2623226 2476654 2199956 1855043
3589 1855043 2268457 2722383 2679506 2385566 2419982 2312325 2537922 2650219 2333667 2588051
3579 2588051 2418071 2846843 2436693 2388312 2693707 2446161 2762902 3066726 2797665 2426376
3569 2426376 2343842 2373589 2315216 2192938 2433465 2659114 2266690 2092487 2181737 2121040
3559 2121040 2120809 2317295 2158638 1885916 1588015 1899381 2211581 2054978 2380932 2648145
3549B648145j86767J78285j53242m03416l86602J40411K57976K48378q8239l61507
3539A893422j15238N97755j07376n2092j84925j7415M55126k71924j42989j62682
3529A891662K68713R5542j55403Q0431R8592l03875Q9873J47979l42037k9762
3519A841715q4659O9122K66446L32368K15966j27524J50967J65676k04359l32944
3509B292774L26013j2912L09672L26032m55994o86972P18549J2780k46518o9082
3499B514342J56658L19690p56403K43417L73105O3731j48639n89334L53323j42359
3489B387531O6423P6523L40360J84785L4758m83484M24872L37256o339m5193N93490
3478C910982q457n57532j37824K48482J69865j74943j15630k09236N32840j57452
$$ plain form
3549 2648145 2461378 2639663 2486421 2083005 1696403 1836814 2094790 2343168 2254929 1893422
3539 1893422 1778184 2375939 2268563 2216471 2031546 2014131 2469257 2197333 2054344 1891662
3529 1891662 2160375 2255917 2100514 2180945 2279537 1975662 2065535 2213514 1871477 1841715
3519 1841715 1757056 1826178 2092624 2424992 2640958 2513434 2664401 2830077 2625718 2292774
3509 2292774 2618787 2605875 2915547 3241579 2785585 2098613 2817162 2829942 2583424 2514342
3499 2514342 2671000 2990690 2234287 2477704 2850809 2914540 2765901 2176567 2529890 2387531
3489 2387531 2453954 2530477 2870837 3055622 3090380 2606896 3031768 3369024 3362685 3317492 3910982
3478 3910982 3902525 3344993 3207169 3455651 3625516 3450573 3334943 3125707 3658547 3501095
3468C501095J40357M54107j41006k4256P86905p8493k33416K51740L681q7785
3458D572929l09071j08211O16701p12089L08060n9957l5152R7860K08353J57759
3448D737182J69727N01863n145N2985j05177l26383J82515L31779J85359J72162
3438E896867L333J80893L12281O290K92410j26192n1549N93645J34459J59646
3428G402083r4841L93984O58546k17587L42672L0681K09537J64849j09106P0724
3418H851542N98123J77341j717p3492R9149M36509j38727m6325M11579N25044
3408A0839026N04477J5550L64171O46716O62317l79495J29111L75951P21522Q04408
3398A4683754j79193N32747P52970L86084j06065M60615N00426J84112L02821
$$ plain form
3468 3501095 3641452 4095559 3954553 3930297 4717202 4638709 4405293 4657033 4660714 4572929
3458 4572929 4263858 4155647 4772348 4060259 4368319 4308362 4273210 4371070 4579423 4737182
3448 4737182 4906909 5408772 5403627 5456612 5351435 5025052 5207567 5539346 5724705 5896867
3438 5896867 5900200 6081093 6393374 6399664 6692074 6565882 6514333 7107978 7242437 7402083
3428 7402083 7307242 7701226 8359772 8142185 8484857 8515538 8725075 8889924 8780818 8851542
3418 8851542 9449665 9627006 9625289 9551797 9650946 10087455 9948728 9902403 10313982 10839026
3408 10839026 11343503 11359053 11723224 12369940 13032257 12652762 12781873 13157824 13879346 14683754
3398 14683754 14504561 15037308 15790278 16176362 16070297 16530912 17031338 17215450 17518271
3389A7518271R21182L79595K95989N14615Q23229K21981O29426P98331Q93132
3380B2995751O58710J068936J194987J321282Q70183R83640J358421J276974J371683
3371C3100567J699177O42560J555462J422698J538359K179266K083675K604497
3363D6826261L205024L686998L687378M296806M888770N235642O495742Q177756
3355H6500377R475584J1271429J3119166J4866579J6340510J6992531J4303130
3348A82869306O665533q074035k0034078k1532224j7590371j3030993r231812
3341A00041326o606737n042753l852485k582508j362764p40914N23402J284883
3333H1661450K423417L213436L860762M692128N794652P371137Q160132R399232
$$ plain form
3389 17518271 18439453 18819048 19115037 19629652 20452881 20674862 21304288 22102619 22995751
3380 22995751 23654461 24723397 25918384 27239666 28109849 29093489 30451910 31728884 33100567
3371 33100567 34799744 35442304 36997766 38420464 39958823 42138089 44221764 46826261
3363 46826261 50031285 53718283 57405661 61702467 66591237 71826879 78322621 86500377
3355 86500377 95975961 107247390 120366556 135233135 151573645 168566176 182869306
3348 182869306 189534839 181460804 161426726 139894502 122304131 109273138 100041326
3341 100041326 93434589 88391836 84539351 81956843 80594079 79853165 80376567 81661450
3333 81661450 84084867 87298303 91159065 95851193 101645845 109016982 117177114 126576346
3325A26576346J1321195J4296838J7591302K1045546K4316124K8356828L1441867
3318B74946046L0832805K4559975M389845k7654560m6431190m4678410l4879304
3311A81085207k5680718j9336258j5194601j1371760r527623p500109n623877
3304H6850261m908649k516512k342474j696743j059724m9663Q28624J397764J271394
3295G7774278K500032L964248M922110N808697P507900R803871J1588129J3380228
3287A37249493J3152631J2811349Q573007k137679j6402975k3076604k1195319
3280A08973903j6630823j2667031r827350p754823o195183n214562m044638l618867
3272D3020626k571448j838261k088351j639615j440218j549656j154706j192776
$$ plain form
3325 126576346 137897541 152194379 169785681 190831227 215147351 243504179 274946046
3318 274946046 305778851 330338826 334728671 307074111 260642921 215964511 181085207
3311 181085207 155404489 136068231 120873630 109501870 99974247 92474138 86850261
3304 86850261 81941612 79425100 77082626 75385883 74326159 74276496 75105120 76502884 77774278
3295 77774278 80274310 84238558 89160668 94969365 102477265 112281136 123869265 137249493
3287 137249493 150402124 163213473 171786480 169648801 153245826 130169222 108973903
3280 108973903 92343080 79676049 69848699 62093876 55898693 50684131 46639493 43020626
3272 43020626 40449178 38610917 36522566 34882951 33442733 31893077 30738371 29545595
3264B9545595p67554n73527o51474p02059j23607m34608k67659m05957k48641
3255B5370509o8614m79900j000917m76519k86983j424443m22379p85484q20566
3246A9604704k69110p44613j069895n30141l82317n49298n68223k10028m8183
3237A5232896j043088r75199l52555q51675l51606o09303n1053k29690p21328
3228A0047399m36885j96405j75780k75274l25437j08164j35684l09384N6191j13102
3218H027475l43098j75594o47800m43940j94412J4350q869j70887L2611n02620
3208E587216l05388o0811l39293J87151M29701m97983k8392l98943l390M75328
3198E045196l08018m01828J03788J08681m22337j60616k38356j86145Q4263o4276
$$ plain form
3264 29545595 28778041 28204514 27553040 26850981 26727374 26292766 26025107 25619150 25370509
3255 25370509 25301895 24821995 23821078 23344559 23057576 21633133 21210754 20425270 19604704
3246 19604704 19335594 18590981 17521086 16990945 16608628 16059330 15491107 15281079 15232896
3237 15232896 14189808 13214609 12862054 12010379 11658773 11049470 10998417 10768727 10047399
3228 10047399 9610514 9414109 9238329 8963055 8637618 8529454 8393770 8084386 8140577 8027475
3218 8027475 7684377 7508783 6860983 6417043 6222631 6236981 6228112 6057225 6089836 5587216
3208 5587216 5281828 5221017 4881724 5068875 5498576 5000593 4972201 4573258 4569868 5045196
3198 5045196 4737178 4335350 4439138 4547819 4125482 3964866 3726510 3540365 3624628 3560352
3188C560352o34706m1905K97011j79833K70868l40081j17262j05429K48430O00795
3178C558240J06418q3732m61598J13693o31406Q3883J59427j54608p1442j44241
3168B474634L925p2177L84833r5891j31793K41013j57689n56537l7761M8562k19909
3157A881210j3261j85494J44087o0727L28624m5721J23702l64701r9455Q0261
3147A788525m4906l3946J92345N6244l18370K28373Q3843J44864j12319O9542
3137B054195l84989n12747L19867j88981J9321K5472M39318P8462n1399j99578
3127A598941l80142K73058n72379Q0586K11102j02173N1372R7552J76512M0506
3117A474935m17706K38486K39552L0223l86634j34003l92618L25679L88373m1337
$$ plain form
3188 3560352 2925646 2883741 3180752 3000919 3271787 2931706 2814444 2709015 2957445 3558240
3178 3558240 3664658 3580926 3119328 3233021 2601615 2685498 2844925 2690317 2618875 2474634
3168 2474634 2478559 2406382 2791215 2695324 2563531 2804544 2646855 2090318 2052557 2101119 1881210
3157 1881210 1867949 1682455 1826542 1765815 2094439 2048718 2172420 1807719 1708264 1788525
3147 1788525 1743619 1709673 1902018 1958262 1639892 1868265 1952108 2096972 1984653 2054195
3137 2054195 1669206 1156459 1476326 1287345 1306666 1332138 1771456 1849918 1798519 1598941
3127 1598941 1218799 1491857 919478 1000064 1211166 1108993 1160365 1257917 1434429 1474935
3117 1474935 1057229 1295715 1535267 1565490 1178856 1044853 652235 977914 1366287 1324950
3107A324950k16851M47538L13371o9240k6281j55258k6045j74201j27916n8428
3097A231639j37114j22983L45386K50542n33245j36608m10999K36189J00763K83546
3087A107116L44359k32075j07003L9704K36364j64934j29729j4261J52618l20366
3077I11793L68517J7101p9771j34183J39988Q3234J59368M74296m96820j97855
3067A245668K94960j83288M21284K01787j91293P9872K34695K40246Q2522k46350
3057B180103K76561R7648K12379K56236l1372l67774j37469M68318l53041N6074
3047B657663L00909j75108j29941l7585J43606K09925q0865P1271l75116j21099
3037B463660O3327j10635K1315j05499n8393M07284L88809J58403l69619m60915
$$ plain form
3107 1324950 1108099 1555637 1869008 1799768 1773487 1618229 1592184 1417983 1290067 1231639
3097 1231639 1094525 971542 1316928 1567470 1034225 897617 486618 722807 823570 1107116
3087 1107116 1451475 1219400 1112397 1152101 1388465 1223531 1093802 1079541 1232159 911793
3077 911793 1280310 1297411 1217640 1083457 1223445 1306679 1466047 1940343 1443523 1245668
3067 1245668 1540628 1357340 1778624 1980411 1789118 1868990 2103685 2343931 2426453 2180103
3057 2180103 2456664 2554312 2766691 3022927 2991555 2623781 2486312 2954630 2601589 2657663
3047 2657663 2958572 2783464 2653523 2615938 2759544 2969469 2888604 2959875 2584759 2463660
3037 2463660 2526987 2416352 2437667 2332168 2273775 2681059 3069868 3228271 2858652 2397737
3027B397737N57527k6688J9857K84445k84016P2824m1253k50234L4859k5543l294
3016B736221k16841k26618L80086m2146N53756r99075p09306L35959K94254j06189
3006B000101k35171M50486M01379m35265n73871K02632k08899J9906K4646L07858
2996A953802J11879o2033o8039J3373J48482r9328j31279K3659p39377K69425
2986A420564J35066O5011K39580J62686o56994p6710l18588O6258j2032l6384
2976I88457K08501K74384J65995k106m34250k46703K01388J01680K01367R9501
2966A558214J16406j74725j11256q1360j62650K7310O33776j90296P003P1500
2956A693922k83602J33753L05374k39186k3111j16080j76767R2154L27603K0209
$$ plain form
3027 2397737 2955264 2928576 2948433 3232878 2948862 3021686 2980433 2730199 2765058 2739515 2736221
3016 2736221 2519380 2292762 2672848 2630702 3184458 2185383 1476077 1812036 2106290 2000101
3006 2000101 1764930 2215416 2616795 2181530 1607659 1810291 1601392 1621298 1645944 1953802
2996 1953802 2065681 2003648 1935609 1948982 2097464 1998136 1866857 1890516 1151139 1420564
2986 1420564 1555630 1620641 1860221 2022907 1365913 1289203 970615 1036873 1024841 988457
2976 988457 1196958 1471342 1637337 1635231 1200981 954278 1155666 1257346 1458713 1558214
2966 1558214 1674620 1499895 1388639 1307279 1144629 1171939 1805715 1615419 1622422 1693922
2956 1693922 1410320 1544073 1849447 1610261 1587150 1471070 1294303 1386457 1714060 1734269
2946A734269n3864J12397K21805N6130L92404O97406n6501l12867K73207j45752
2936B918634J43646K8036J14837q2122L50928j99637j73248L28679j84244l46503
2926B899006J84855M73161j67687J20775O5098K46612l48019l8709L80310l51218
2916C464184l2622L24964J30252K53876J1688j64400J2297P03547Q12709J00036
2906E616531J04995j44539k06231j89607n48612p36709k88919l81661o0669K46850
2896C411429J5325K81012l69552l11872M5535k01637k43437k48188m48271J45639
2886B075983P81701L5526m44023r0447M67917k64958J15091K32699p6515j12350
2876B720624L08226J17227m77815o3070m6661n13072O9121K64607l54080l74501
$$ plain form
2946 1734269 1680405 1792802 2014607 2070737 2463141 3160547 3104046 2791179 3064386 2918634
2936 2918634 3062280 3090316 3205153 3123031 3473959 3274322 3101074 3429753 3245509 2899006
2926 2899006 3083861 3557022 3389335 3510110 3575208 3821820 3473801 3435092 3815402 3464184
2916 3464184 3431562 3756526 3886778 4140654 4152342 3987942 4000239 4703786 5516495 5616531
2906 5616531 5721526 5576987 5370756 5181149 4632537 3895828 3606909 3225248 3164579 3411429
2896 3411429 3426754 3707766 3338214 3026342 3071877 2870240 2626803 2378615 1930344 2075983
2886 2075983 2857684 2893210 2449187 2358740 2826657 2561699 2676790 2909489 2832974 2720624
2876 2720624 3028850 3146077 2668262 2605192 2558531 2045459 2114580 2379187 2025107 1650606
2866A650606j20141K14375m10839j28768J28241n5497J2863j86357n1898l96900
2856F55685Q425L63314J79356j73579n14735n5204L3105P6251l09284k0461M7779
2845B90652K5847K21391M8795j15530K08922p1323m69661j55155K24669l9596
2835A69011q4596O07999j61664k09753K20372j21166q5091k62684m8622p1939
2825d8133K27773O5707q3631n2637j79146L8223O7876J23790l9548k88383j8479
2814a86588j14513L12036q5424k46143M33565k65486j94883N53563l6221j11131
2804E8775o3402L04535j197j57860N2211M81781R6037l31348J61383l28144k72908
2793a37j45517O50398j75575j60971J07228k20645J55114k05830J98177R3283
$$ plain form
2866 1650606 1530465 1744840 1334001 1205233 1333474 1277977 1290840 1104483 1052585 655685
2856 655685 664110 1027424 1206780 1033201 518466 463262 496367 572618 263334 242873 290652
2845 290652 316499 537890 586685 471155 680077 608754 139093 -16062 208607 169011
2835 169011 84415 692414 530750 320997 541369 420203 335112 72428 23806 -48133
2825 -48133 179640 245347 161716 109079 -70067 -31844 36032 159822 120274 -168109 -186588
2814 -186588 -301101 10935 -74489 -320632 112933 -152553 -347436 206127 169906 58775
2804 58775 -4627 299908 298711 140851 193062 674843 770880 439532 600915 272771 -137
2793 -137 -145654 504744 329169 168198 275426 54781 209895 4065 202242 295525
2783B95525J39358l87494m8649l3238N6406j29860J7907L08931l71663J98464
2773D5687l3270M45917j9120l60753n8651j86621K78562j44046j78813J13894
2763i7214k51242k22216J52354K27311J52996m94880k08804M69334L30549j28993
2753g0805K31289K6552j35233k81258L71210K60977j51983l87904k48823J97902
2743a88076k82834L65439J96023k00285N5633j39698L16312J24404O2889M9321
2733C59128p49501j12063J02265L00382r9081l41861K39391N04039l02728k5219
2723a25248J75173J90038l09457l64235L63577o3451L7486j26038k36164K42086
2713b16233N4628K3917j90973N50006k65804j60803j1242L43601m34046K0839
$$ plain form
2783 295525 434883 47389 -1260 -34498 21908 -107952 -90045 218886 -152777 45687
2773 45687 12417 458334 439214 78461 19810 -166811 111751 -32295 -211108 -97214
2763 -97214 -348456 -570672 -418318 -191007 -38011 -532891 -741695 -272361 58188 -70805
2753 -70805 160484 187036 51803 -229455 141755 402732 250749 -137155 -385978 -188076
2743 -188076 -470910 -105471 90552 -109733 -54100 -193798 122514 246918 309807 359128
2733 359128 -390373 -502436 -400171 -99789 -198870 -540731 -301340 202699 -100029 -125248
2723 -125248 49925 239963 -69494 -433729 -70152 -133603 -96117 -222155 -458319 -216233
2713 -216233 -161605 -137688 -328661 221345 -44459 -205262 -216504 127097 -306949 -286110
2703b86110J03945k23564J2261K89003p1399j23384J10771j3713j34514j42886
2693d79590M1973K14715O2313M2101M2025o37976K11314L36534L6071M19887k15997
2682G3370n32236K73574j05490J47095O1304k20900K99374n06410k26659N57786
2672a79192L3036j01577k39833L00353J59933l38108n62750L05768m998p6958
2662g04326j13921L27433M12285R6050N0815o1531n1248K90772j53477j75307
2652h2455k0717K73628k89621l15755J4633J58218k4989R9663j55619k5438K95098
2641g3354K0952j87869K74153p8695m5644j79093j74290M12504j36490j60288
2631c28114o1888j9601j10701L10558Q5576j35871o7193j2402L88790l29571m5432
$$ plain form
2703 -286110 -182165 -405729 -393468 -104465 -175864 -299248 -188477 -202190 -336704 -479590
2693 -479590 -437617 -222902 -160589 -118488 -76463 -714439 -503125 -166591 -130520 289367 73370
2682 73370 -458866 -185292 -290782 -143687 -82383 -303283 -3909 -510319 -736978 -179192
2672 -179192 -146156 -247733 -487566 -187213 -27280 -365388 -928138 -622370 -627368 -704326
2662 -704326 -818247 -490814 -78529 17521 68336 6805 -44443 246329 92852 -82455
2652 -82455 -103172 170456 -119165 -434920 -420287 -262069 -287058 -187395 -343014 -368452 -73354
2641 -73354 -52402 -240271 33882 -44813 -90457 -269550 -443840 -31336 -167826 -328114
2631 -328114 -390002 -409603 -520304 -209746 -124170 -260041 -327234 -339636 49154 -280417 -325849
2620c25849M63306k20419J59713l56630n0398k19838j47621J99815K24955J17261
2610a55705J10405Q3227J53168j33177J22813j27267k33359J82086k0019p1960
2600h9788l24982J95511J07764k32637M71035k68559k0609N4965J327K86554j06265
2589G4316P3740j99911k28505j02883L227K30491J29180k93533P2477L22261l5649
2578D5211p24400R5076J53520J69529k37989J81970M20727M4735l88629L30992
2568I0742k1733j87222l61497K33000M74489o51326N1772K10896P4053k33537
2558c20363K68718J0412K408L9740l85758l2648l6700j78827K20029l99246K51499
2547e60736O40260M03733m88051m19445N9313O6295K02967m51333L0953K1942
$$ plain form
2620 -325849 137457 -82962 76751 -279879 -330277 -550115 -697736 -497921 -272966 -155705
2610 -155705 -45300 37927 191095 57918 180731 53464 -179895 2191 -17828 -89788
2600 -89788 -414770 -219259 -111495 -344132 126903 -141656 -162265 -107300 -105973 180581 74316
2589 74316 148056 -51855 -280360 -383243 -380016 -149525 -20345 -313878 -241401 80860 45211
2578 45211 -679189 -584113 -430593 -261064 -499053 -317083 103644 148379 -240250 90742
2568 90742 69009 -118213 -479710 -246710 227779 -423547 -371775 -160879 -86826 -320363
2558 -320363 -51645 -41233 -38825 915 -384843 -417491 -454191 -633018 -412989 -812235 -560736
2547 -560736 79524 483257 -4794 -424239 -364926 -298631 -95664 -546997 -516044 -494102
2537d94102K60842J32978j38756K47262r4722l42960k45045J43219L72896J63733
2527E345K22379p4541m17123L06506k05680o6557K98633L20042l66701j41869
2517a19566k36173j10369M6190K10047K86523M8216l16761J75881P5545k6809
2507C2724j26799m6827K01909j52442k44272k65074K64488J17090O2374L78636
2497B21807k70808j1236K54640k67122j39725J77798k2364j01968j14116j53155
2487d26249J37414j60022P535o724j74084J6186K60096j1408L58038j50412P3046
2476g6584L51242M3947m18208J10896j53326M08948k20034l91629l0813l8634
2466d14195J66992l25868p1127J66961j3491Q86L97190j2338l1428k95095L5006
$$ plain form
2537 -494102 -233260 -100282 -239038 8224 -86498 -429458 -674503 -531284 -158388 5345
2527 5345 227724 153183 -263940 42566 -163114 -229671 68962 389004 22303 -119566
2517 -119566 -355739 -466108 -419918 -209871 76652 124868 -191893 -16012 59533 32724
2507 32724 -94075 -140902 61007 -91435 -335707 -600781 -336293 -219203 -156829 221807
2497 221807 -49001 -60237 194403 -72719 -212444 -34646 -57010 -158978 -273094 -426249
2487 -426249 -288835 -448857 -441322 -448046 -622130 -605944 -345848 -357256 782 -149630 -76584
2476 -76584 274658 318605 -99603 11293 -142033 266915 46881 -344748 -375561 -414195
2466 -414195 -247203 -573071 -644198 -477237 -490728 -489842 -92652 -104990 -136418 -431513 -396507
2455c96507K09716O93R9568m28687L31672l5468k76160O0872j95472l35792j93866
2444a159431K51248P5208O4565J41285Q40295J00265p54442k06699M52162J92990
2434b554K48351k92592K3782K9590j36572J24072q7208J13803k56951j08508K62750
2423h2037r445j27999N1474n0686J71602L28362k75764j90782N307O6889K43546
2412A30467l17970O5037p8958j36360J59832J8309P4388l20712K51373K79829
2402A25235r5076O5786m5224K34069l5483j07029R148L8487P233l54980j57701
2391c15535O08479Q0592l53743l45201L59411L75272j48148J5370l00988J49103
2381A24612q8316N3457j00277J95471K78431N06177O5794Q1258j76196K34937
$$ plain form
2455 -396507 -186791 -186098 -86530 -515217 -183545 -219013 -495173 -434301 -629773 -965565 -1159431
2444 -1159431 -908183 -832975 -768410 -627125 213170 313435 -441007 -647706 -195544 -2554
2434 -2554 245797 -46795 -23013 6577 -129995 -5923 -93131 20672 -236279 -344787 -82037
2423 -82037 -91482 -219481 -168007 -218693 -47091 281271 5507 -185275 -179968 -113079 130467
2412 130467 -187503 -122466 -201424 -337784 -177952 -159643 -85255 -405967 -154594 125235
2402 125235 30159 95945 50721 284790 249307 142278 151426 189913 197146 -157834 -315535
2391 -315535 292944 373536 19793 -325408 34003 409275 261127 276497 -24491 124612
2381 124612 36296 89753 -10524 184947 463378 969555 1035349 1116607 940411 1175348
2371A175348N8823P4532K77757m95541J4871k78269j58841n90973P6645j21461
2361C2891j17548M12159L47123O2767k35192m11994J69872K09256j0638k76910
2351A81786k15560M17080l4267j23296N5631l11812r8450K10948l48464j58054
2341d24458K84438K51069O55147j20264n60830P077m588k49126O62337j47289
2331C53513K7436j46221j26490J40977l12310O30754J14654o21809n48386K66876
2321b21006k04197k24445M25389P44486M2708k90319N9035n16186J29718q6487
2311a41304J53605K85900l44563m0336J14144K45633J20698M6278l01761K90487
2301D28781K67152J73906j61152l90164k81950L49776k62072P1478L40561j06123
$$ plain form
2371 1175348 1234171 1308703 1586460 1090919 1105790 827521 668680 77707 154352 32891
2361 32891 -84657 327502 674625 737392 502200 90206 260078 469334 458696 181786
2351 181786 -33774 383306 349039 225743 281374 -30438 -128888 82060 -266404 -424458
2341 -424458 -140020 111049 766196 645932 85102 92179 87591 -161535 500802 353513
2331 353513 380949 234728 108238 249215 -63095 567659 682313 60504 -487882 -221006
2321 -221006 -425203 -649648 -224259 520227 562935 272616 331651 -184535 -54817 -141304
2311 -141304 12301 298201 -46362 -86698 27446 273079 393777 440055 138294 428781
2301 428781 695933 869839 708687 318523 36573 386349 124277 195755 536316 430193
2291D30193J0912j39975J28913n483J88035M4305k58676n78078L78827K44423
2281D43396J7326L16751l45792N2879J11095j21931J05920N0737L1337K28211
2271H89929m32651J91425M01977j92103k14925K64677K18291p8126n59908o262
2261D82324J79090J3002J17889M61396J14779m70778m20894j14177M52837j47750
2251F67718m43731O38432K5142l0393K02194j03441l015j97332J8686k32876K20860
2240G62244j60772J26188M08675K92125m29851K1716M21505k22691l55858j52908
2230G10373M2583K83814M23323L33554j70615l59197p4198j07335J94744K83619
2220A560665j00052J76132J52914N0583K38627J69432l62357k43388P74862j1480
$$ plain form
2291 430193 441105 301130 430043 424560 612595 656900 398224 -179854 198973 443396
2281 443396 460722 777473 431681 484560 595655 473724 579644 630381 661718 889929
2271 889929 457278 648703 1050680 858577 643652 908329 1126620 1048494 488586 482324
2261 482324 661414 674416 792305 1253701 1368480 897702 476808 362631 815468 667718
2251 667718 223987 862419 887561 857168 1059362 955921 952906 755574 774260 541384 762244
2240 762244 601472 727660 1136335 1428460 998609 1020325 1441830 1219139 863281 710373
2230 710373 752956 1036770 1460093 1793647 1623032 1263835 1189637 1082302 1277046 1560665
2220 1560665 1460613 1636745 1789659 1840242 2078869 2248301 1885944 1642556 2417418 2405938
2210B405938k13679j1524j96222J21529N51243O7268k7823k0961m22859l31542
2200A921368L59085K34115l26254J48808N44225Q202m8963K15509P46964k65793
2190C537266k86397L41612L72949j47060l53982M49045J31167K39295k09154P47014
2180D821755K45808q936K55954J08332J02915M76983n63549l34391P53978M81033
2170F339882m15929M46466J17614J0375N92529m0128P1436j12415M69009K73041
2160G751880J48155K65013j39073J86680L58527O05623J49326M67444K30106n0079
2150I973602j0088L99054R97830K77531K01090M56775Q64823N12201N02567M73717
2140A4649102N30472L55632R98539Q65316P25382J090328J007450Q87828Q32223
$$ plain form
2210 2405938 2192259 2180735 1984513 2106042 2657285 2724553 2696730 2675769 2252910 1921368
2200 1921368 2280453 2514568 2188314 2337122 2881347 2889549 2840586 3056095 3803059 3537266
2190 3537266 3250869 3592481 3965430 3818370 3464388 3913433 4044600 4283895 4074741 4821755
2180 4821755 5067563 5058627 5314581 5422913 5525828 6002811 5439262 5104871 5858849 6339882
2170 6339882 5923953 6370419 6488033 6498408 7090937 7050809 7122245 7009830 7478839 7751880
2160 7751880 7900035 8165048 8025975 8212655 8571182 9176805 9326131 9793575 10023681 9973602
2150 9973602 9963514 10362568 11360398 11637929 11839019 12295794 13160617 13672818 14175385 14649102
2140 14649102 15179574 15535206 16533745 17399061 18124443 19214771 20222221 21110049 21942272
2131B1942272J695017J453358J378627J410279J081361J541580J846493J819130
2123C4168117J884677K761835L596181L388147M093914L462457L731133M670694
2115F1757155N475806O345547P656546R327445J2371965J5794668J7998159K1650586
2107A58377877K4690863K7900368K6599427K4116732r308364m7767507m5647337
2100A58962059l2488763k1794402j5667624j3063599j0387392q193690o455619
2093E0910970m619505l198988l106134k279855j438272k289345l245927k824188
2085B7908756k718426j928295j386819j124550q92707j708089q69117m46281p82281
2076A6052191n91004r01325j512555r75585P6200n81870n43412l36722n73306
$$ plain form
2131 21942272 23637289 25090647 26469274 27879553 28960914 30502494 32348987 34168117
2123 34168117 36052794 38814629 42410810 45798957 49892871 53355328 57086461 61757155
2115 61757155 67232961 73578508 81235054 90562499 102934464 118729132 136727291 158377877
2107 158377877 183068740 210969108 237568535 261685267 252376903 204609396 158962059
2100 158962059 126473296 104678894 89011270 75947671 65560279 57366589 50910970
2093 50910970 46291465 43092477 39986343 37706488 36268216 33978871 30732944 27908756
2085 27908756 25190330 23262035 21875216 20750666 19857959 18149870 17280753 16834472 16052191
2076 16052191 15461187 14559862 13047307 12071722 12147922 11566052 11022640 10685918 10112612
2067A0112612l28606k89878l97760l76477o47430l11474O615l05965j74500l28968
2057F958169j68062O4074n994k8451p30041j9175N278m4000J40117n13764m02748
2046E255403k73909j3752n8078M1153n25743m09804K3913j84754J50567N48641
2036D553637q84l64741k70296l13761J68566m566m02528m22446l19527k9820k4014
2025B569620k05939k27476P6544m07412M89557P7360l42766k74059N7298J19820
2015A932547j83693j57050L42297L0003j51355J14121k72369m10363j08908N66328
2005A701558l769j66163l95602K31543j01599P7478j66104o3686l00714K31966
1995A044908O8582L33853r9296l43732L37600k52373J85417k20794j65558P5638
$$ plain form
2067 10112612 9784006 9494128 9096368 8719891 8072461 7760987 7767602 7461637 7287137 6958169
2057 6958169 6790107 6854181 6848187 6819736 6089695 6070520 6075798 6031798 6171915 5658151 5255403
2046 5255403 4981494 4967742 4909664 4950817 4425074 4015270 4039183 3854429 4004996 4553637
2036 4553637 4552753 4188012 3917716 3603955 3772521 3767955 3365427 2942981 2623454 2593634 2569620
2025 2569620 2363681 2136205 2212749 1805337 2294894 2372254 2029488 1755429 1812727 1932547
2015 1932547 1748854 1591804 1934101 1964104 1812749 1926870 1654501 1244138 1135230 1701558
2005 1701558 1697789 1531626 1136024 1367567 1265968 1343446 1177342 1113656 812942 1044908
1995 1044908 1113490 1447343 1348047 1004315 1341915 1089542 1274959 1054165 888607 964245
1985I64245L00761R1300k25297l15729L02460M8081l76723L65922J85567k80362
1975A060225r4799o7965l9807R4815J81750K77287m0640l74441J95423p462k52537
1964I31849J04115n99922L99637N44822K02951O2418n33402l58001k35204K8028
1954E47291N4455n6368j68790L01001k32401p9749m9764j03512L65730N7270j95241
1943D39922J88377r6513P4719l04270k39789K86594L80831j38394K96037n65030
1933C22484J5720K05015k25515m12794K8358L30406j4587L84187k66216m25449
1923e8391K82710J36680j8289M07013k81906K0889L2892l22899K24098k57643
1913A65154n81444P4703O54403J42351J0320K81628o28358L12551j30143l21951
$$ plain form
1985 964245 1265006 1356306 1131009 815280 1117740 1165821 789098 1155020 1340587 1060225
1975 1060225 965426 897461 857654 952469 1134219 1411506 1370866 996425 1191848 1184386 931849
1964 931849 1035964 436042 835679 1380501 1583452 1645870 1112468 754467 519263 547291
1954 547291 601746 545378 376588 677589 445188 365439 315675 212163 577893 635163 439922
1943 439922 628299 531786 606505 302235 62446 349040 729871 591477 887514 322484
1933 322484 338204 543219 317704 -95090 -66732 263674 249087 633274 367058 -58391
1923 -58391 224319 360999 342710 749723 467817 488706 521598 198699 422797 165154
1913 165154 -416290 -341587 312816 455167 465487 747115 118757 431308 301165 -20786
1903b0786L04009j08464K09840J53027K65778l14876j7004k90028j6728Q4898
1893B49666n7855J98271k04127j20603k07977k67406J9324O66046n8662n82113
1883c65436K20692L05191p8750k8853L2127R8014Q7965j5227M231K30987n34104
1872d3163P6892R2024j2108L21209j942p23199K78174O4587j83078n0406L0576
1861a50434N28343k69457l01969N50161j21753J89972m35638k7166L91035m0656
1851C12438o4114m8430J2600j18532m3435N83244r0921k64164j72124J57309L32313
1840E96184K84958J67730k9955J42402l9773L33440J03572j24411m62259j36763
1830H35125j14935o0914K90331k17382j64267l32896k54682L95322J02985q20321
$$ plain form
1903 -20786 283223 174759 384599 537626 803404 488528 471524 181496 164768 249666
1893 249666 191811 390082 185955 65352 -142625 -410031 -390707 275339 216677 -365436
1883 -365436 -144744 160447 81697 52844 84971 182985 270950 255723 259954 490941 -43163
1872 -43163 33729 125753 113645 434854 432912 -290287 -12113 52474 -130604 -181010 -150434
1861 -150434 377909 108452 -193517 356644 234891 424863 -10775 -37941 353094 312438
1851 312438 248324 199894 212494 93962 50527 633771 542850 278686 106562 263871 596184
1840 596184 881142 1048872 1018917 1161319 1121546 1454986 1558558 1434147 971888 835125
1830 835125 720190 659276 949607 732225 567958 235062 -19620 375702 478687 -341634
1820c41634k44697N99073k0330L13250J95693k23542o7367L1367j29705R1367
1810B03475J60671K40821n05881K77968p6723j59543K23665M59550p03348p25067
1800f04412M60776n1182K43572J45374J32795k02574K53209J04231m95910O1084
1790D6963k60846k6043M88137L9764n23389K24980j30550M20964j91013k02336
1780a13369J20512o4370j72798k25667K67955k36691L83585K05521o618J3460
1770A71520k97813k11494k9954k83138L64056M14388J40176l77694k04041L3199
1760b80795J75994K81592k28190O5744K54962N4612l85329M586l2367J01085K96525
1749C08419k13110O24464j94363n04951L78457k3036j25499m59502j3705j53667
$$ plain form
1820 -341634 -586331 12742 -7588 305662 501355 277813 210446 241813 112108 203475
1810 203475 364146 604967 99086 377054 300331 140788 364453 824003 120655 -604412
1800 -604412 -143636 -194818 48754 194128 326923 124349 377558 481789 -14121 46963
1790 46963 -213883 -239926 248211 287975 -235414 -10434 -140984 279980 88967 -113369
1780 -113369 7143 -57227 -230025 -455692 -187737 -424428 -40843 164678 158060 171520
1770 171520 -126293 -337787 -367741 -650879 -286823 127565 267741 -109953 -313994 -280795
1760 -280795 -104801 176791 -51399 14345 269307 323919 -61410 -56824 -89191 11894 308419
1749 308419 95309 719773 525410 20459 398916 375880 250381 -209121 -222826 -376493
1739c76493K34284k43616P9172L14001o781N4815j76503j93018K53295l02106
1729c62950j1778L48120J20818r5500l20565L74245L8076k03649j29134L02821
1719F0504p6471o4211P7962J09956j13074r4233p4987o4805l6246j89740K9869
1708d35476k37373J61662O13165K45657k89736l12082O3999j92689K56168L9057
1698h7648L6355K92882J75508l32020k74555L29971M48196j64464l96658o9219
1688d1652K16388j11403j05712k61363J42842p366k12182Q8428J78470K19103
1678A05553K81145L83372o33125n19295j43150O03318j40331r95p2395K5279J22361
1667A1737k57801L66624l72965m2428J61143P0457L67710k80177m27180j78911
$$ plain form
1739 -376493 -142209 -385825 -306653 7348 567 55382 -121121 -314139 -60844 -362950
1729 -362950 -374728 -26608 94210 -1290 -321855 52390 90466 -113183 -242317 60504
1719 60504 -15967 -80178 -2216 107740 -5334 -99567 -174554 -239359 -275605 -465345 -435476
1708 -435476 -672849 -511187 101978 347635 57899 -254183 -190184 -382873 -126705 -87648
1698 -87648 -51293 241589 417097 85077 -189478 140493 588689 424225 27567 -41652
1688 -41652 174736 63333 -42379 -303742 -160900 -168266 -380448 -292020 -113550 105553
1678 105553 386698 770070 136945 -382350 -525500 77818 -62513 -63508 -135903 -110624 11737
1667 11737 -246064 120560 -252405 -294833 -133690 -63233 304477 24300 -402880 -581791
1657e81791J61796L79240j55215L15472k51563k06568R4496m1938J80718K738
1647a02615m89074J38196J6613J26438J18241k45080J61822O103L70786L6531
1637A37961L9981L6437m06354q3818K9034k36309L41406J91354l66608M3367J54692
1626a18857J8067n9369k24488K18206K6978K78533j97478n27500N84532k32010
1616b33386l34898Q5957J62419L65090o6793J91524q8654K61552p0036m18030
1606a45255R5580K8089j89067q396k24463j2962Q1741J86541K35849q3233m453
1595d0029q3852J27613K01o7209l83208k11454M18942N18591p0279j35815k46580
1584a73079l7107q0379J02373J87760j86246K3984j93205q8089J32712O0544j1831
$$ plain form
1657 -581791 -419995 -40755 -195970 119502 -132061 -338629 -244133 -286071 -105353 -102615
1647 -102615 -591689 -453493 -436880 -310442 -192201 -437281 -275459 -269356 101430 137961
1637 137961 177942 214379 -191975 -275793 -246759 -483068 -141662 49692 -316916 -273549 -118857
1626 -118857 -100790 -160159 -384647 -166441 -139463 139070 -58408 -585908 -1376 -233386
1616 -233386 -568284 -482327 -319908 45182 -21611 169913 81259 342811 272775 -145255
1606 -145255 -49675 -21586 -210653 -219049 -443512 -456474 -374733 -188192 47657 -35576 -40029
1595 -40029 -123881 3732 3933 -63276 -446484 -657938 -238996 279595 209316 73501 -173079
1584 -173079 -210186 -290565 -188192 -432 -186678 -162694 -355899 -443988 -311276 -250732 -262563
1573b62563l15008L57915k72291L58228L1796J62431J43769k63209K21335o735
1563A55668j25055k749m7459K44517m43589L8058R1661k79212R747o17635O01677
1552c74371L78244j87438L32489J72497l34702J77469L06340n8946j49374l54356
1542i2148k05548J04039l48085O50288j72187j81806J52528k1251Q4340J52479
1532A22649m36891o2436K95860K822k92380K87372K52020L37648m2243k26959
1522B37462p63639l4028N41814l30295J36369J15299k45406k3380j45045L97686
1512a13163k81358J35902K14756j75568M95310Q1690k13186n15674J92350N3254
1502a25687N3238m3850N3870R6530j80583l32236R31255l78521l69464P15366
$$ plain form
1573 -262563 -577571 -219656 -491947 -133719 -101923 60508 204277 -58932 162403 155668
1563 155668 30613 27864 -19595 224922 -218667 -180609 -88948 -368160 -358413 -976048 -374371
1552 -374371 3873 -183565 148924 321421 -13281 164188 470528 411582 262208 -92148
1542 -92148 -297696 -193657 -541742 108546 -63641 -245447 -92919 -114170 -29830 122649
1532 122649 -314242 -376678 -80818 -77996 -370376 -83004 169016 506664 464421 237462
1522 237462 -526177 -560205 -18391 -348686 -212317 -97018 -342424 -365804 -510849 -113163
1512 -113163 -394521 -258619 -43863 -219431 275879 357569 144383 -371291 -178941 -125687
1502 -125687 -72449 -116299 -62429 34101 -146482 -478718 452537 74016 -295448 419918
1492D19918k63431n57475J21095j88406K18614j02558K9745J94805m56377N79160
1482d910k66670n9107k17216J77457L87512k7713R9802q8954q9097l03974k23481
1471f16351M86304K16102l98081K05073J0238j96807L51160O4809j86383j10159
1461a74095m44634J16757K77422q6889K75742j43303N4241J72226l31145L67988
1451H4310l7677j85361L30710m90715k91259M53943O0161K23826j14248k8726
1441D964k48600j69096p9645J14778L09852K97932n23583j61081K97348l878J33320
1430b7689j16614j83216l1870K67404L5553m14334L76892L0845L30103o36758
1420c69684m22387P72075j56045N7257J45711J66159M69595n2036l58534k2553
$$ plain form
1492 419918 156487 -400988 -279893 -468299 -249685 -352243 -322498 -127693 -584070 -4910
1482 -4910 -271580 -330687 -547903 -370446 17066 -10647 89155 201 -88896 -392870 -616351
1471 -616351 -130047 86055 -312026 -106953 -96715 -293522 57638 122447 -63936 -174095
1461 -174095 -618729 -501972 -224550 -311439 -35697 -179000 -124759 47467 -283678 84310
1451 84310 46633 -138728 191982 -298733 -589992 -136049 -75888 147938 33690 4964
1441 4964 -243636 -412732 -492377 -377599 -67747 230185 -293398 -454479 -157131 -161009 -27689
1430 -27689 -144303 -327519 -359389 -91985 -56432 -470766 -93874 -63029 267074 -369684
1420 -369684 -792071 -19996 -176041 -118784 26927 193086 662681 610645 252111 229558
1410B29558J53614k74028l97576l01037k4979R2305K43466L31588M38495o55500
1400a64094n32057L36237N54037k2857l00069N2248J60895m18170k13782L29850
1390b17762K17745J10726k10803n82769L48487K58837l59240R09109j97953q1481
1380A94896k34938J61536R3461n6028n65712k7762k90877K73081N7701r7646M33957
1369e8331K0121L0361q8765j37951K63506k16416j48660K83533J82105R4273r6745
1358A27031k65127j84366K64094L1440N9357o2275l52246L64515p2444K67543
1348A77522J59682j32319k7146k00169J7623k68728K44606Q5928j11268n0679
1338a04948J91j21396Q7622j02442o8793L02021k67158p7815J56088J72438L66925
$$ plain form
1410 229558 383172 109144 -288432 -589469 -614448 -522143 -278677 52911 491406 -164094
1400 -164094 -696151 -359914 194123 171266 -128803 -76555 84340 -333830 -547612 -217762
1390 -217762 -17 110709 -100094 -682863 -334376 -75539 -434779 474330 276377 194896
1380 194896 -40042 121494 214955 158927 -406785 -434547 -725424 -452343 -394642 -492288 -58331
1369 -58331 -38210 -7849 -96614 -234565 28941 -187475 -336135 -52602 129503 223776 127031
1358 127031 -138096 -322462 -58368 -26928 32429 -29846 -382092 -17577 -90021 177522
1348 177522 337204 204885 177739 -22430 -4807 -273535 -28929 56999 -54269 -104948
1338 -104948 -104757 -226153 -138531 -240973 -309766 -7745 -274903 -352718 -196630 -24192 342733
1327C42733M5639l39897N3926j74847k32961J90953j51201N93071o25677M262
1317b93999N14498l86788k87630o232M47510m49832K22949o1052J92641n6319
1307a64254n6277J18458k32260J73840O076J69076l30522K33888L9760J44955
1297A02740K93589J02596l30266o1762K6923n99352Q5681j05006R7965P98078
1287D11186J8063p55017j27892P20846j86804J9377l45775n1096j09985K22581
1277a84516M3705n1827J9385K0685n2397k18203Q4506l3630j29951j12050J14728
1266d99565K94492M31746j19772j07050k83259j3965l779J01998M15969Q6698
1256C03513N046l61580L97274j47072n93800O511L90321J8639o36789r0186L70114
$$ plain form
1327 342733 388372 48475 102401 -72446 -305407 -114454 -265655 327416 -298261 -293999
1317 -293999 220499 -166289 -453919 -460151 -12641 -462473 -239524 -300576 -107935 -164254
1307 -164254 -220531 -102073 -334333 -160493 -154417 14659 -315863 -81975 -42215 102740
1297 102740 396329 498925 168659 106897 133820 -465532 -379851 -484857 -386892 411186
1287 411186 429249 -325768 -453660 267186 80382 99759 -246016 -297112 -407097 -184516
1277 -184516 -140811 -192638 -173253 -152568 -204965 -423168 -338662 -372292 -502243 -614293 -499565
1266 -499565 -205073 226673 106901 -149 -283408 -297373 -301152 -199154 216815 303513
1256 303513 308559 -53021 344253 197181 -396619 -390108 213 18852 -617937 -708123 -338009
1245c38009N35009n63523K5077j24878R1702L12594K3552M19402j43033p0855
1235A67038l1127j58212r1171L23235J6972l01051k02392j69292k09825J67815
1225d88010O64469j66876K07781N9928J84076k81986o8992M00690J57082k75607
1215C92555o6659m29732l0680J42765k06280k6154K86467j03323j09781K20077
1205F9255j69M5263q025j61787q5484l97280L86439J94983q0365K33972k40491
1194d3689N95585j53000l73333K36546j24159l85179K16182K39692n90166J18439
1184b63082K6838J91792Q7814p603k6945k20658M8829k59932J75864j32915L85875
1173E877l22444J39251m9966P3297p8716q2609L85906j81698p1963L25223L2514
$$ plain form
1245 -338009 197000 -366523 -341446 -466324 -374622 -62028 -38476 380926 237893 167038
1235 167038 135911 -22301 -113472 209763 226735 -74316 -276708 -446000 -655825 -488010
1225 -488010 176459 9583 217364 277292 461368 179382 110390 511080 668162 392555
1215 392555 325896 -103836 -134516 8249 -198031 -224185 62282 -41041 -150822 69255
1205 69255 69086 114349 106324 -55463 -140947 -538227 -151788 43195 -37170 196802 -43689
1194 -43689 551896 398896 25563 262109 137950 -247229 -31047 208645 -381521 -263082
1184 -263082 -236244 -44452 43362 35759 8814 -211844 -163015 -422947 -247083 -379998 5877
1173 5877 -316567 -177316 -227282 -153985 -232701 -315310 70596 -111102 -183065 142158 174672
1162A74672j72830m8934R1084J60736J1048j71276j78577N49670l48349l12639
1152b45395J04233k83005j5928J6402K33537k58102j5617L80588M79560l50194
1142D6079m29513j11456M20512J4922Q7440j19777J92740K98119k67711l78970
1132b47615J53437N8509l168r012n54546l8361O74427J62480k44005j63995j93072
1121d04921O15681L52526n02455j00159M47488j04822l88737J24707K10396n64672
1111c14968J44630K53407n09597j28083n1809J36607M85228Q1469j71620J17604
1101D2868P8547l40315K35887l23703K43755L19677l70904l32897J57382J37186
1091a52517k5046K22107Q3385K3871R0049K46343r8592l50584K9722l10245K55444
$$ plain form
1162 174672 1842 -47092 43992 204728 215776 44500 -134077 415593 67244 -245395
1152 -245395 -141162 -424167 -440095 -423693 -190156 -448258 -463875 -83287 396273 46079
1142 46079 -383434 -494890 -74378 -59456 27984 -91793 100947 399066 131355 -247615
1132 -247615 -94178 -35669 -38837 -47849 -602395 -640756 33671 196151 -47854 -211849 -404921
1121 -404921 210760 563286 60831 -39328 408160 303338 -85399 39308 249704 -314968
1111 -314968 -170338 83069 -426528 -554611 -606420 -469813 15415 96884 -74736 42868
1101 42868 121415 -218900 16987 -306716 -62961 256716 -114188 -447085 -289703 -152517
1091 -152517 -177563 44544 127929 151800 241849 488192 389600 39016 68738 -241507 13937
1080A3937m54221j23344J7731N63078P9011j75858M6700K6808K01602L1981J44732
1069C72157l27786m8739p465j08454p1585J14812k18533k69967M07586Q15517
1059F57543m08237k25260J71032M37997K5772l18459j64009n78944o2600o9418
1049e34583J58639N54507N15915q07392J6296K11218m22308k7008J79015j59833
1039c15534K90241j32595L04625L30112k86293q9215j60177K94943l02607q345
1029g4845M79854p9189m90196L20933j64782k9729K72275k72605J47757o4255
1019D5218o96191K57061M65670J04987l06922j65776K3157K36212j47529r3684
1009b77797J52788k54945n7265j4335o1303j00036M89785L66498J13416O809l62453
$$ plain form
1080 13937 -440284 -563628 -545897 17181 96192 -79666 -32966 -6158 195444 227425 372157
1069 372157 44371 -4368 -11833 -120287 -191872 -77060 -295593 -565560 -157974 657543
1059 657543 249306 24046 195078 633075 658847 340388 176379 -402565 -465165 -534583
1049 -534583 -375944 178563 694478 -112914 -96618 114600 -307708 -334716 -155701 -315534
1039 -315534 -25293 -157888 146737 476849 190556 101341 -58836 236107 -66500 -74845
1029 -74845 405009 325820 -164376 156557 -8225 -37954 234321 -38284 109473 45218
1019 45218 -650973 -393912 71758 176745 -130177 -295953 -272796 -36584 -184113 -277797
1009 -277797 -125009 -379954 -437219 -451554 -512857 -612893 -123108 243390 356806 363615 1162
998A162K77987K42181o12654q9648J40051K13418m30491j03250M9915k82722M56431
987a37620k70416J35815J18900J93894l27536J81808J27128K15512J07769J23295
977D68549k18317Q5090k69418m4849q8498k64794j78517k3760J85401P08456M181
966C63524l33577m25006K77238N8907j07462K1861j59004L41434m55300J17801
956b99584j85899N53768N6100j68549m56015N14781r004R3490j15498j88630M99299
945B94259k36928J5738L4806J88133r079m53974K03023K12207j67819j30j81976
934a01740L9652J88719k79682K08646N4446J83820j50382K34565N0969l49144
924G9869L0182K18009j60858J39342L51920k30066o05993M73L54768k69414J09820
$$ plain form
998 1162 279149 521330 -91324 -180972 -40921 172497 -257994 -361244 -311329 -594051 -137620
987 -137620 -408036 -272221 -153321 40573 -286963 -105155 21973 237485 345254 468549
977 468549 250232 335322 65904 21055 -67443 -332237 -510754 -534514 -349113 359343 363524
966 363524 29947 -395059 -117821 -58914 -166376 -144515 -303519 37915 -417385 -299584
956 -299584 -485483 68285 124385 -44164 -500179 14602 5598 99088 -16410 -205040 294259
945 294259 57331 73069 107875 296008 286929 -167045 35978 248185 80366 80236 -101740
934 -101740 -62088 126631 -153051 55595 110041 293861 143479 378044 429013 79869
924 79869 110051 328060 167202 306544 658464 428398 -177595 -177122 177646 -91768 18052
913A8052p6918j3761j36543J61356k47059n8057J46184p3090L4393l2973l71273
902f49689n0438L07250M46244O2520K01112k43752k95314N97109Q9533m69751
892e176k03306M50858J88878o5612O2583j93509J54600k97357l73966J52270L597
881a26140Q1224M84472l87964J25890k77795m08099J43168K39668K27025n35113
871d33664K52274N5634L52766N8689k84675K51399O7895Q5421L2296n61007K80237
860A57265J00450j09793n9691O4579k77892k47095L19167M12532L78274l55389
850C82407m41565K31215j2060K71047n11046K88575m73534l22497M38444j68506
840c17520N5413k6715j98789J75460L74407k91781N2578Q4170K18608p2298q7870
$$ plain form
913 18052 -58866 -72627 -209170 -47814 -294873 -352930 -206746 -279836 -245443 -278416 -649689
902 -649689 -700127 -392877 53367 115887 316999 73247 -222067 375042 464575 -5176
892 -5176 -208482 242376 431254 365642 428225 234716 389316 91959 -282007 -129737 -126140
881 -126140 -44916 439556 51592 177482 -100313 -508412 -365244 -125576 101449 -433664
871 -433664 -181390 -125756 227010 285699 1024 252423 320318 405739 438035 -122972 157265
860 157265 257715 147922 88231 152810 -125082 -372177 -53010 359522 737796 382407
850 382407 -59158 172057 159997 431044 -80002 208573 -264961 -587458 -149014 -317520
840 -317520 -262107 -288822 -487611 -312151 62256 -229525 -176947 -92777 125831 53533 -34337
829c4337L91466k1421N921j73681M700j74845j38163q4104m9023J65715P9385
818b8387j64662o8643R6194n7958L96670M2712j64553l25112m9997J16563K47317
807D0144P7111q7619j43086L06928k32263N0344k43937l9208j24092J60592L6671
796a98415j01927N92014j61253j62505J21958k87628J31499K51415j43418J73427
786B15167L18867p5370m37549k05932K55178M26531m71620j75003N05282R2675
776D48226l09595k7959p4927N201k50251l0143J32634K29798J62629j30687j02041
765E2885k24684o0580j55406L73103m30716K33200j67759K03760M7132n58583
755f87648L04209M26794k15533J47824J72968j33759M32909l9606j34227M7253
$$ plain form
829 -34337 357129 335708 341629 167948 172648 -2197 -140360 -224464 -273487 -107772 -28387
818 -28387 -193049 -261692 -165498 -223456 173214 215926 51373 -273739 -323736 -207173 40144
807 40144 117255 29636 -113450 193478 -38785 11559 -232378 -271586 -395678 -235086 -198415
796 -198415 -300342 291672 130419 -32086 89872 -197756 -66257 185158 41740 215167
786 215167 534034 458664 21115 -184817 70361 496892 25272 -149731 355551 448226
776 448226 138631 110672 35745 40946 -209305 -239448 -106814 122984 285613 154926 52885
765 52885 -171799 -232379 -387785 -14682 -445398 -212198 -379957 -176197 -129065 -687648
755 -687648 -383439 43355 -172178 -24354 148614 14855 447764 408158 273931 321184
745C21184j61641L09210j92815m02966L7443r1977K2953J57588L6974n058j50656
734a19761K65938q5114l16199K32539j07197J6398J9935P6794l77626k5851N23404
723A03260K21043P5387J42178n86184j76759k32416M9615O9623N68739J26029
713C60515l89936j43907j81527K88059K0060Q2436J08208k18790J1587O9805k38421
702b31911K69700N3853R5913q762J84753j49214n66896R3405J78618L70344j37216
691A52587q6404l2515m65266J16492J40214L68482j23322M4346j32127r6908K64003
680A49582k44331L3955J13340q6829j36490K31112P2899j40437M58335j96816
670B54320l53881J29235j10147L45286j75071j5607Q4310r2213p9690L85244k95412
$$ plain form
745 321184 159543 468753 275938 -127028 -89585 -181562 -158609 -1021 35953 30895 -119761
734 -119761 146177 61063 -255136 -22597 -129794 -113396 -93461 -16667 -394293 -420144 103260
723 103260 324303 399690 541868 -44316 -221075 -453491 -403876 -334253 234486 360515
713 360515 -29421 -173328 -354855 -66796 -46736 35700 143908 -74882 -63295 6510 -231911
702 -231911 37789 91642 187555 178793 363546 214332 -352564 -259159 -80541 289803 152587
691 152587 66183 33668 -431598 -315106 -174892 193590 70268 114614 -17513 -114421 149582
680 149582 -94749 -60794 52546 -34283 -170773 60339 133238 -7199 451136 254320
670 254320 -99561 29674 -80473 264813 89742 74135 158445 66232 -13458 371786 76374
659G6374j58901J75320j09451j31971N03955k45645k51528k9085M15422P5992
649C20482k23165j58573k69791J79131p9760J2155j5913p4337N71705p4916k08380
638b1362k4546p8573M0758j88551K70361K77187l24626k98962J84606L76574J12156
627C25022k38289k46435j38776l8099Q5949L42888k51567j16694M3522j20542
617c53021J25367K62853J18101J7139J42579m63282R099o5381l60167Q48979l53837
606g1571k5791R3757L1051J12991q0555K62623k08864J14283k2336k33786N9151
595C0953J52145J61526j62926J1592o1607J9780j3874q2131K51593p1077k83028
584d7054n4762Q5133L91804j58762L41480j72363k42144j74487Q2226L54138p26736
$$ plain form
659 76374 -82527 92793 -16658 -148629 355326 109681 -141847 -170932 244490 320482
649 320482 97317 -61256 -331047 -151916 -231676 -219521 -235434 -309771 261934 187018 -21362
638 -21362 -45908 -124481 -83723 -272274 -1913 275274 -49352 -348314 -163708 212866 325022
627 325022 86733 -159702 -298478 -336577 -250628 92260 -159307 -276001 -232479 -353021
617 -353021 -227654 35199 153300 170439 313018 -150264 -141165 -206546 -566713 282266 -71571
606 -71571 -97362 -3605 27446 140437 59882 322505 113641 227924 205588 -28198 30953
595 30953 183098 344624 181698 193290 131683 151463 137589 55458 307051 235974 -47054
584 -47054 -101816 -16683 375121 216359 557839 385476 143332 -31155 51071 405209 -321527
573c21527J17022O99036m62251L8663o4650J89640l0366m54490K9638L69257M38276
562E48248n94780o90814M71737N05053l22444L57795L62373n9348m6336j91039
552C40445k50736L8787p6428j98608N7537N31921j98488l47894N36818K5922J68732
541F28008l27446k50013Q7235O0827J2341m5287Q7754o01900q5799m08774K5117
530h17937P10119K5985J3292K99208R5280m6083J56036k82314p707l83625L23643
519H5897J49654o08010J04212J55527J4298J82317j67360J75878j94662j80725
509b82974N7K73392L55310j69100m1158j17362j26740j79913J97828k21748L24214
498A1806J90559l54502R6712J23186r1917N91584l90392l09745J16473j55695
$$ plain form
573 -321527 -204505 494531 32280 70943 6293 195933 165567 -288923 -259285 109972 548248
562 548248 -46532 -737346 -265609 239444 -83000 274795 637168 577820 531484 340445
552 340445 89709 128496 52068 -146540 -89003 442918 244430 -103464 433354 459276 628008
541 628008 300562 50549 137784 198611 210952 165665 253419 -348481 -434280 -843054 -817937
530 -817937 -107818 -81833 -68541 230667 325947 279864 435900 153586 145879 -237746 85897
519 85897 235551 -372459 -268247 -112720 -98422 83895 -83465 92413 -102249 -282974
509 -282974 -282917 -9525 345785 176685 135527 18165 -108575 -288488 -90660 -312408 11806
498 11806 202365 -152137 -55425 67761 -24156 567428 177036 -132709 -16236 -171931
488a71931L67627K3067k45317J40671k67529j8384K72748J02985J54571J21933
478D80441n37202p146K42764N7232m86038L84912J88601n33600k42707r6764K52913
467b96594M50988o58889k83888N60189N00026K85849m4595L860m95970j85238
457a64262k8547J42163p9472K33683O7269j13518M5514p475K44012N3691k96779
446I6279j87100R2039q5490O38052j30550l85691L5736k0501J07205l23456K2912
435a40565j51836R2646M41666k0752j12435j13565l11617K59710l0184O4333j57388
424a79987L66319P05921k46563m59685K3006R7285k70767j09692k3388k40346
414c37897K31677J5129j28236J90093J97397m29480k89032L55860j37419N6498
$$ plain form
488 -171931 195696 218763 -26554 114117 -153412 -171796 100952 203937 358508 480441
478 480441 -56761 -63907 178857 236089 -249949 134963 323564 -210036 -452743 -549507 -296594
467 -296594 154394 -504495 -788383 -228194 271832 557681 513086 516946 20976 -164262
457 -164262 -192809 -50646 -130118 103565 170834 57316 102830 95355 339367 393058 96279
446 96279 -90821 1218 -84272 553780 423230 37539 73275 52774 159979 -163477 -140565
435 -140565 -292401 -199755 241911 221159 108724 -4841 -316458 -56748 -86932 -22599 -179987
424 -179987 186332 892253 645690 186005 209011 306296 35529 -74163 -97551 -337897
414 -337897 -106220 -91091 -219327 -29234 168163 -261317 -550349 -194489 -331908 -275410
404b75410K46898l08268K818L38529j46147q202J04843k7219P183l9246P3487
393c0734L70081p4764n39678L56139j14056j57645M32244j54950j76225M87153
383C97565J25750k10209k45995j28554q787j04802j3623M5840K65880k59381J07212
372b9104J06510P3586O8394j13573l53927j02878R0918k53876N24496k4628k04884
361b18966K91559q5482O6406k15258l8459p4629P4200N00998j21949j31398Q3625
350A30647k69102k96173J07246l40071O4743M23330K16920N3653k03398l67129
340d79334J67342K16361J64311m8450j67581n2656J66994j56284J04977j57043
330b41363J34106L34201k33835j22561O6112L38249l88889p2087O8880K61581
$$ plain form
404 -275410 -28512 -336780 -333962 4567 -141580 -149782 -44939 -72158 -64975 -104221 -30734
393 -30734 339347 264583 -275095 81044 -33012 -190657 241587 86637 -89588 397565
383 397565 523315 313106 67111 -61443 -70230 -175032 -188655 -142815 123065 -136316 -29104
372 -29104 77406 150992 219386 105813 -248114 -350992 -260074 -513950 10546 -14082 -218966
361 -218966 72593 -12889 53517 -161741 -200200 -274829 -200629 300369 178420 47022 130647
350 130647 -138455 -434628 -327382 -667453 -602710 -179380 37540 91193 -112205 -479334
340 -479334 -311992 -95631 68680 20230 -147351 -200007 -33013 -189297 -84320 -241363
330 -241363 -107257 226944 -6891 -129452 -63340 274909 -113980 -186067 -117187 144394
320A44394M0055n56659L65761M36337j21465o71863k1005L60705j43716m35482
310f02938K31288K91558j09331l91320j35807P87793n61651J36717M34240K05074
300B85623j75948J39680j24164j98086M3244k58365k7758J76752J973J72212J81580
$$ plain form
320 144394 184449 -372210 -6449 429888 308423 -363440 -384445 -23740 -167456 -602938
310 -602938 -371650 -80092 -189423 -580743 -716550 71243 -490408 -353691 80549 285623
300 285623 109675 249355 125191 -72895 -29651 -288016 -315774 -139022 -137049 35163 216743
$$ [...]
##END NTUPLES=NMR SPECTRUM
##END=
