##TITLE=1H_CA-9101
 CDCl3
 8 sc, 
 20.1.2023
##JCAMPDX= 6.0         $$ Bruker NMR JCAMP-DX V2.0
##DATA TYPE= NMR SPECTRUM
##DATA CLASS= NTUPLES
##ORIGIN= UXNMR, Bruker Analytische Messtechnik GmbH
##OWNER= root
$$ XWIN-NMR		Version 3.5
$$ Fri Jan 20 14:40:16 2023 Russian Standard Time (UT+4h)  she@DPX200
##.OBSERVE FREQUENCY= 200.13135
##.OBSERVE NUCLEUS= ^1H
##.ACQUISITION MODE= SIMULTANEOUS
##.ACQUISITION SCHEME= undefined
##.AVERAGES= 8
##.DIGITISER RES= 18
##SPECTROMETER/DATA SYSTEM= spect
##.PULSE SEQUENCE= zg30
##.SOLVENT NAME= CDCl3
##.SHIFT REFERENCE= (INTERNAL, CDCl3, 0, 15.737)
##AUDIT TRAIL= $$ (NUMBER, WHEN, WHO, WHERE, WHAT)
$$ ##TITLE= Audit trail, XWIN-NMR		Version 3.5
$$ ##JCAMPDX= 5.01
$$ ##ORIGIN= Bruker BioSpin GmbH
$$ ##OWNER= she
$$ F:/spectra/data/she/nmr/H-F/1/pdata/1/auditp.txt
$$ ##AUDIT TRAIL=  $$ (NUMBER, WHEN, WHO, WHERE, WHAT)
(   1,<2023-01-20 14:37:25.26 +0400>,<she>,<DPX200>,
      <created by zg, POWCHK disabled, PULCHK disabled
       configuration hash MD5:
       00 E9 B6 7A A2 85 ED C7 34 08 36 98 17 FE 4E 26
       data hash MD5: 16K
       5B 7E BB 9C 32 8B 84 A1 DA E7 01 0B 31 E1 E6 27>)
(   2,<2023-01-20 14:37:27.40 +0400>,<she>,<DPX200>,
      <Start of raw data processing
       efp BC_mod = 2 LB = 0.24 FT_mod = 6 PKNL = 1 PHC0 = -19266.08 PHC1 = 4.800791 SI = 16K 
       data hash MD5: 16K
       3B 31 6E B0 9D 3A B6 FC C6 9E 44 9A 11 E3 02 6E>)
(   3,<2023-01-20 14:37:46.90 +0400>,<she>,<DPX200>,
      <pk PHC0 = -2.174701 PHC1 = 3.4 
       data hash MD5: 16K
       EE 7B F8 B1 32 8B 2C 4A BC 7E 2F 6C 64 C0 03 BF>)
(   4,<2023-01-20 14:37:51.23 +0400>,<she>,<DPX200>,
      <abs ABSG = 5 
       data hash MD5: 16K
       35 07 D7 EE 19 12 E0 C4 A7 9F 1D DA 2E FB 14 32>)
(   5,<2023-01-20 14:39:03.07 +0400>,<she>,<DPX200>,
      <abs ABSG = 5 
       data hash MD5: 16K
       AD C2 FA E8 55 6E 3B F8 B4 51 92 31 B6 9C 49 5D>)
$$ ##END=
$$ 
$$ hash MD5
$$ A7 13 17 A5 A4 DB 47 9F 34 F4 B6 E8 F2 B7 5B 90
##$RELAX= 
##$RELAX= 
##$RELAX= 
##$RELAX= 
##$RELAX= 
##$RELAX= 
$$ Bruker specific parameters
$$ --------------------------
##$DU= <F:/spectra>
##$EXPNO= 1
##$NAME= <H-F>
##$PROCNO= 1
##$TYPE= <nmr>
##$USER= <she>
##$AMP= (0..31)
100 100 100 100 100 100 100 100 100 100 100 100 100 100 100 100 100 100 
100 100 100 100 100 100 100 100 100 100 100 100 100 100 
##$AQSEQ= 0
##$AQ_mod= 1
##$AUNM= <au_zg>
##$AUTOPOS= <>
##$BF1= 200.13
##$BF2= 200.13
##$BF3= 200.13
##$BF4= 200.13
##$BF5= 200.13
##$BF6= 200.13
##$BF7= 200.13
##$BF8= 200.13
##$BYTORDA= 1
##$CFDGTYP= 0
##$CFRGTYP= 5
##$CHEMSTR= <none>
##$CNST= (0..31)
1 1 145 1 1 1 1 1 1 1 1 1 1 1 1 1 1 1 1 1 1 1 1 1 1 1 1 1 1 1 1 1 
##$CPDPRG= <>
##$CPDPRG1= <>
##$CPDPRG2= <>
##$CPDPRG3= <>
##$CPDPRG4= <mlev>
##$CPDPRG5= <mlev>
##$CPDPRG6= <mlev>
##$CPDPRG7= <mlev>
##$CPDPRG8= <mlev>
##$CPDPRGB= <>
##$CPDPRGT= <>
##$D= (0..31)
0 1.2 0 0 0 0 0 0 0 0.06 0 0.03 0 0 0 0 0.0002 0 0 0 0 0 0 0 0 0 0 0 0 
0 0 0 
##$DATE= 1674211044
##$DBL= (0..7)
$$ [...]
##$SUBNAM3= <"">
##$SUBNAM4= <"">
##$SUBNAM5= <"">
##$SUBNAM6= <"">
##$SUBNAM7= <"">
##$SUBNAM8= <"">
##$SUBNAM9= <"">
##$SW= 18.05172834244
##$SWIBOX= (0..15)
0 0 2 0 0 0 0 0 0 0 0 0 0 0 0 0 
##$SW_h= 3612.71676300578
##$TD= 16384
##$TD0= 1
##$TE= 0
##$TE2= 300
##$TE3= 300
##$TEG= 300
##$TL= (0..7)
0 120 120 120 120 120 120 120 
##$TP= (0..7)
150 150 150 150 150 150 150 150 
##$TP07= 0
##$TPNAME0= <>
##$TPNAME1= <>
##$TPNAME2= <>
##$TPNAME3= <>
##$TPNAME4= <>
##$TPNAME5= <>
##$TPNAME6= <>
##$TPNAME7= <>
##$TPOAL= (0..7)
0.5 0.5 0.5 0.5 0.5 0.5 0.5 0.5 
##$TPOFFS= (0..7)
0 0 0 0 0 0 0 0 
##$TUNHIN= 0
##$TUNHOUT= 0
##$TUNXOUT= 0
##$USERA1= <user>
##$USERA2= <user>
##$USERA3= <user>
##$USERA4= <user>
##$USERA5= <user>
##$V9= 5
##$VALIST= <valist>
##$VCLIST= <CCCCCCCCCCCCCCC>
##$VD= 0
##$VDLIST= <DDDDDDDDDDDDDDD>
##$VPLIST= <PPPPPPPPPPPPPPP>
##$VTLIST= <TTTTTTTTTTTTTTT>
##$WBST= 1024
##$WBSW= 4
##$XGAIN= (0..3)
0 0 0 0 
##$XL= 0
##$YL= 0
##$YMAX_a= 51120
##$YMIN_a= -60743
##$ZGOPTNS= <>
##$ZL1= 120
##$ZL2= 120
##$ZL3= 120
##$ZL4= 120
##$ABSF1= 15.73477
##$ABSF2= -2.31708
##$ABSG= 5
##$ABSL= 3
##$ALPHA= 0
##$AQORDER= 0
##$ASSFAC= 0
##$ASSFACI= 0
##$ASSFACX= 0
##$ASSWID= 0
##$AUNMP= <proc_1d>
##$AZFE= 0.1
##$AZFW= 0.1
##$BCFW= 0
##$BC_mod= 2
##$BYTORDP= 0
##$COROFFS= 0
##$CY= -3
##$DATMOD= 1
##$DC= 0
##$DFILT= <>
##$DTYPP= 0
##$F1P= 0
##$F2P= 0
##$FCOR= 1
##$FTSIZE= 16384
##$FT_mod= 6
##$GAMMA= 0
##$GB= 0
##$INTBC= 1
##$INTSCL= 3.70164e-10
##$ISEN= 128
##$LB= 0.24
##$LEV0= 0
##$LPBIN= 0
##$MAXI= 10000
##$MC2= 0
##$MEAN= 0
##$ME_mod= 0
##$MI= 1.114404
##$NCOEF= 0
##$NC_proc= -7
##$NLEV= 6
##$NOISF1= 3.799351
##$NOISF2= 2.8
##$NSP= 0
##$NTH_PI= 0
##$NZP= 0
##$OFFSET= 15.73697
##$PC= 1
##$PHC0= -19268.25
##$PHC1= 8.20079
##$PH_mod= 1
##$PKNL= yes
##$PPARMOD= 0
##$PSCAL= 0
##$PSIGN= 0
##$REVERSE= no
##$SF= 200.130006918833
##$SI= 16384
##$SIGF1= 3
##$SIGF2= 2
##$SINO= 5.538805
##$SIOLD= 16384
##$SREGLST= <1H.CDCl3>
##$SSB= 0
##$STSI= 16384
##$STSR= 0
##$SW_p= 3612.71676300578
##$SYMM= 0
##$S_DEV= 0
##$TDeff= 16384
##$TDoff= 0
##$TI= <>
##$TILT= no
##$TM1= 0
##$TM2= 0
##$TOPLEV= 0
##$USERP1= <user>
##$USERP2= <user>
##$USERP3= <user>
##$USERP4= <user>
##$USERP5= <user>
##$WDW= 1
##$XDIM= 16384
##$YMAX_p= 270204080
##$YMIN_p= -618602
$$ End of Bruker specific parameters
$$ ---------------------------------
##NTUPLES= NMR SPECTRUM
##VAR_NAME=  FREQUENCY,     SPECTRUM/REAL,   SPECTRUM/IMAG
##SYMBOL=    X,             R,               I
##VAR_TYPE=  INDEPENDENT,   DEPENDENT,       DEPENDENT
##VAR_FORM=  AFFN,          ASDF,            ASDF
##VAR_DIM=   16384,         16384,           16384
##UNITS=     HZ,            ARBITRARY UNITS, ARBITRARY UNITS
##FACTOR=    0.220516191357247, 1,           1
##FIRST=     3149.43990453767, 0,            0
##LAST=      -463.276858468109, 0,           0
##MIN=       -463.276858468109, -618602,     0
##MAX=       3149.43990453767, 270204080,    0
$$ Real data points
##PAGE= N=1
##DATA TABLE= (X++(R..R)), XYDATA
$$ [...]
7693A5874n3287L6362M1957n0188o7537K1416J1419K1048j06236M5942J4651j1420
7681g9999N2767k7278R288O4042l5045Q272k1431N8010N3407o7345K6359l1175
7669I872j5313L127j3620J5642k9653n1594K2557O752P627K3719k4923Q598M7848
7656A0639Q843n2608J066L6558j6215r511n332J9265l2397J07386o902n7479j0641
7643g328o384m5156j3540j4640M106M6069K6774M112p5793P8232l9242M9961R6709
7630A03880l8111l7212l1127n4421L3297L837M9457j7763k6833o432l9299l0476
7618i1203J1761L9278K8443J4795q4954K4180L9604j0869j0199n4409L549n8769
7606a48793K7221N3671L884N5516l2984J4160M0425K5495k7608l533K6876k0507
$$ y = [15874, -37413, -1051, 40906, -9282, -76819, -55403, -43984, -22936, -129172, -83230, -68579, -79999, -27232, -54510, -45222, 18820, -16225, -7953, -29384, 28626, 82033, 14688, 41047, 9872, -5441, -2314, -15934, -292, -29945, -81539, -58982, -52230, -44603, -20884, -45807, -37209, 10639, 19482, -33126, -32060, 4498, -11717, -21228, -26560, -7295, -39692, 67694, 60792, 3313, -7328, -13712, -58868, -72408, -87048, -82942, -36873, -10099, -5987, -81780, -3548, -42790, 7171, 103880, 65769, 28557, -2570, -56991, -23694, -19857, 29600, 11837, -14996, -21428, -60727, -91203, -79442, -40164, -11721, 3074, -81880, -57700, -18096, -28965, -39164, -93573, -90024, -148793, -121572, -67901, -64017, -8501, -41485, -27325, 13100, 38595, 10987, 7454, 34330, 13823]
7594A3823k7878l4266j7836J0099p7364M8196L8617J2508L3661j7580P270j8956
7582b9706L3079q2346r0841J20256N9114k3856K4206m5766k3155K6137J0977O3734
7570D1833K1772n2532m5930q438m6131J0046Q342k702M3246m4183k4551Q5143
7558a4085J7356j8737k5955K4467K0807J0493M5243J9154j11705j3372L3237j0785
7546b3882o7567O6630O693J1298o194l5499M5047j9289j03302n5403Q8623l2709
7534a25554M2872j8777J0912P1450M0229r4069M2627m4742M9036K9993k8988K6476
7522A465p6150L1050M9233q1266J4724O6214l9795L560l8079L9760N222j4148
7510c8210P4037J7048k7823M6448n4289Q975L1494k2197j1321n3811k9245Q2194
$$ y = [13823, -14055, -48321, -66157, -56058, -133422, -85226, -46609, -34101, -440, -18020, -10750, -29706, 3373, -78973, -169814, -49558, 9556, -14300, 9906, -35860, -59015, -32878, -21901, 41833, 63605, 11073, -34857, -43295, -89426, -79380, -71038, -73740, -30494, -74677, -99228, -14085, 3271, -15466, -41421, -16954, 3853, 14346, 59589, 78743, -32962, -46334, -13097, -23882, -91449, -24819, -18126, -6828, -13022, -48521, -3474, -22763, -126065, -181468, -92845, -125554, -82682, -101459, -90547, -19097, 21132, -72937, -30310, -75052, -26016, 3977, -25011, 1465, -74685, -43635, 5598, -75668, -60944, 5270, -34525, -30965, -69044, -29284, -24062, -38210, 35827, 52875, 25052, 71500, 17211, 26186, 57680, 35483, 24162, -29649, -58894, 23300]
7498B3300M7511o4061j46891L7306O1872J3252k9718J1762P067K4544O879j5582
7486b2759M566l639Q252l1304J0712j696k1668n63L0175O5589k3879p6316J638
7473f0892j9847O8281P2419r5398o7100J8302Q335L6408l2095L9341j6501L236
7461d5511l5187j50Q4826n7897K3504J4395k395Q3011m9434m2096N138j4181K9677
7448f300n953n9612O5379k5371J4306p774q984j963j755J2555L6001K4107n2424
7435a7788m1704m6517j1272M6385N1930l9544k2998L3681m3718L1617l6893P63
7423i6058O2090K7061J9799r5919m120M9348N059o892j1866Q9802K8533j06781
7411c9944m580O1941P8130q8554J9915p8840k1411L7893k6526L0147j0551M2466
$$ y = [23300, 70811, 6750, -140141, -102835, -40963, -27711, -57429, -45667, -38600, -14056, -7177, -22759, -18193, -21832, -13580, -44884, -34172, -35868, -57536, -58099, -27924, 37665, 13786, -62530, -60892, -80739, -12458, 59961, -35437, -102537, -84235, -75900, -39492, -71587, -32246, -48747, -45511, -80698, -80848, 3978, -53919, -30415, -16020, -18415, 64596, 15162, -26934, -21796, -35977, -6300, -12253, -71865, -6486, -31857, -17551, -25325, -34309, -36272, -38027, -25472, 10529, 34636, -17788, -59492, -106009, -117281, -70896, -18966, -58510, -81508, -47827, -91545, -59928, -96821, -96058, -33968, -6907, 12892, -83027, -87147, -37799, -32740, -39632, -51498, 38304, 66837, -39944, -44524, 17417, 95547, 6993, 26908, -51932, -73343, -35450, -61976, -31829, -42380, 86]
7399H6M4348j9322k1208J7903n2852j31534K3823K2345j1525R7285l4482l4070
7387i9203l4949J15899j2389M9680j8459k9959M7586n4034j0996J0479J901k1815
7375e6259l63J366q534M360J0141l3660L6393j0375l3431L5469R7746j20708k2340
7362a00195Q8309p833o363M3447k2452l770K2496l3298o726k9561k5730K3778
7350e7898j9176M2181N6328K734m1750K3067o3602K9271J2502o0348L1950j7930
7338f2671j3285L2557j1100j1081L368J5772k0503j4567L2484k3567q5J4239M9558
7325h881n57K7494N0722o6489Q759J7535R845o3450p356L2893P7951K0425q1440
7312A7451K0765k5966o638o4090M011R4O331L7348L2337j111m7334O7275q411
$$ y = [86, 44434, 25112, 3904, 21807, -31045, -162579, -138756, -116411, -127936, -30651, -65133, -99203, -134152, -18253, -30642, 19038, 579, -29380, 18206, -35828, -46824, -36345, -34444, -56259, -56622, -55256, -63790, -59430, -49289, -82949, -46556, -56931, -90362, -54893, 42853, -77855, -100195, -11886, -19719, -26082, 17365, -5087, -8857, 13639, -19659, -26385, -55946, -81676, -57898, -77074, -34893, 21435, 24169, -17581, 5486, -58116, -28845, -16343, -76691, -44741, -62671, -75956, -43399, -54499, -65580, -62212, -46440, -66943, -81510, -49026, -72593, -72678, -58439, -8881, -9438, 18056, 68778, 2289, 11048, 28583, 38428, -25022, -32378, 515, 78466, 98891, 17451, 38216, 12250, 5612, -58478, -54467, -54373, -48042, -10694, 21643, 20532, -26802, 40473, 32062]
7299C2062j53o7269J0606P4889q2603n2690L027L3236k1029K174J7503N4932l0668
7286b5983J968j0281P6207J4468m8773m4760P193p002k3143N1066l3989r350K609
7273d9770k4075l2393k2277K7676P5742J8179l9008L3309O2924k7872n1415j9993
7261d8973L8728N0855j8649Q559m4284q451p3320L4151J02797k3043n5028l7303
7249g3961L3091Q0401p3889j8914j527K2856m8774M7245M4361o1835N0778M9713
7237D9545j7434n2871N264m7722J4423l6740n388L6636M1555L5263R541n9388
7225b7316l633K8769j1047N754K1143q3541k0063P4019K4568n4363Q887n6872
7213i3695J3914N6389j9626M1798l6678j6054j5835R668K9002p518l3606J9923
$$ y = [32062, 31909, -35360, -24754, 50135, -32468, -85158, -82131, -48895, -69924, -67750, -50247, 4685, -25983, -24015, -34296, 41911, 56379, 7606, -37154, -29961, -36963, -60106, -9040, -43029, -52379, -49770, -73845, -106238, -128515, -100839, -25097, -6918, -45926, -12617, 50307, 22435, -28980, -48973, -10245, 40610, 21961, 30520, -13764, -22215, -95535, -61384, 41413, 18370, -36658, -73961, -40870, 39531, -34358, -53272, -54799, -31943, -80717, -33472, 10889, -50946, -168, 49545, 32111, -20760, -15496, -63218, -48795, -85535, -90923, -54287, -12732, 22531, 32072, -27316, -30949, -2180, -13227, -7473, 13670, -69871, -89934, -15915, 8653, -45710, -36823, -93695, -79781, -23392, -43018, -1220, -37898, -53952, -69787, -60119, -31117, -38635, -72241, -52318]
7201e2318M548q3655M2077M4810j4308K2710O308m1179o5874l93Q3774n6928J9529
7188i0899J0709L5456L3675k6432K8741k4141m3717M1360N1974l522k2905O0431
7176E0730k8510j3926J6666Q882j5407n3282k4557L0941O6234l1609m0244m8926
7164h3008j0007k2406N7641K9349J2948j0563n79K2416j5766n0936L4236r581
7152d6256N674n3121M4645P1559L725j5567j4985o4979n5483J6190R3456K0647
7140E505j5646M3803q530j2605l7594L727m9336j6078J4603k10J491N8518O118
7127f234l1764N213l7868L6230N8994m5408m3446K773J0463K2733L0097l2114
7115c0331n3523m6710Q7295M212k5514m111n2191L7317N0818M0704L8825n2741
$$ y = [-52318, -47770, -131425, -89348, -44538, -58846, -36136, -29828, -71007, -136881, -137274, -53500, -110428, -90899, -80190, -44734, -11059, -37491, -8750, -32891, -76608, -35248, 16726, 13204, -9701, 50730, 22220, 8294, 24960, 33842, 18435, -34847, -59404, -28463, 37771, 6162, -34082, -83008, -93015, -115421, -57780, -28431, -15483, -26046, -26625, -4209, -19975, -70911, -36675, -46256, -40582, -93703, -49058, 22501, 26226, 10659, -4326, -69305, -124788, -108598, -15142, 5505, -10141, 33662, 25132, 12527, -25067, -21340, -70676, -86754, -72151, -72361, -70870, -12352, -6234, -37998, -32785, -70653, -34423, 24571, -20837, -64283, -61510, -51047, -28314, 1783, -30331, -83854, -130564, -43269, -39057, -64571, -68682, -120873, -83556, -32738, 7966, 46791, -5950]
7103e950o0596N7562k7284J9190N1429l6411J0139O886n8430o2129M7658j8852
7091g6788L716j8930J8103J09307p7081j1250Q0385n9350R7165m8761l4160m166
7079b1810r6305J4120R7215O2741J8238r1139l7543M341J0698m2915m6430N0139
7067g8650O5095M133q7004N5957k39r367J4390o30l3872O257J2834M9474j3936
7054a5558j2024L6117K1387n5369k9097l302l6897R7160j5408r5886L1023L256
7042g4598L1472N1635j8735m1041j6044O5612M991n3438J4785n3840O2015j1670
7030c8856L070N4678k9803l9594p6129L3628K3595M5448l7927j02867M4629M6733
7018g3395Q902l9609k2582R6976q896o5095Q6817M606k7637o7695N7736l1051
$$ y = [-5950, -66546, -8984, -36268, -17078, 34351, -2060, 8079, 14965, -43465, -105594, -57936, -76788, -73072, -92002, -73899, 35408, -41673, -52923, 27462, -31888, 65277, 16516, -17644, -21810, -118115, -103995, -6780, 55961, 74199, -16940, -54483, -50142, -39444, -82359, -128789, -78650, -13555, -9422, -96426, -40469, -40708, -50075, -35685, -36315, -70187, -63930, -51096, -1622, -15558, -27582, 8535, 29922, -25447, -54544, -57846, -94743, 2417, -12991, -108877, -77854, -74598, -43126, 8509, -10226, -51267, -67311, -1699, 3292, -50146, -35361, -89201, -27186, -38856, -35786, 18892, -10911, -50505, -126634, -93006, -69411, -23963, -61890, -164757, -120128, -73395, -64493, -104102, -126684, -29708, -38604, -103699, -16882, -12276, -39913, -107608, -49872, -80923]
7006h0923L4245J8503J356j4845n3590M9368M615k5644j4676j2801K1599P829
6994f4964j0761K9929n002l2060l7406K6871L5531o3731K5153O8435M7959N3457
6982G3411j03048p4416L4643k9098N3764J6274o3012K8439k2313P0053p6092Q477
6970h2918j0958O8210N1643m5092K8787J0173m8809m3329M4196N1531n7495p325
6958d1386p836m653J1774L9954o851j9181j4557l8886L3399j3078K7730k4483
6946e8054L1041K4630q221P958l1935m5118M4815M2313N366n9254n0892L7149
6934f0202j9922O281L9220q039k8848N0552L3072o477l8187L5953J69l0151L4540
6921G961k7268o4295K1495Q9536r5914n3365P5495k4246K7018k9262J0270L3949
$$ y = [-80923, -46678, -28175, -26819, -41664, -95254, -45886, -41271, -66915, -81591, -94392, -72793, -64964, -75725, -45796, -50798, -82858, -120264, -93393, -57862, -121593, -96440, -28005, 19954, 73411, -29637, -104053, -69410, -98508, -44744, -28470, -91482, -63043, -85356, -15303, -91395, -82918, -93876, -25666, 25977, -19115, 9672, 19845, -28964, -72293, -28097, 23434, -34061, -41386, -49222, -53875, -42101, -2147, -8998, -28179, -42736, -81622, -48223, -61301, -33571, -58054, -27013, -2383, -10604, -2646, -34581, -79699, -34884, 7429, 12795, -46459, -97351, -60202, -80124, -73843, -34623, -42662, -71510, -20958, 12114, 5637, -32550, 3403, 3572, -26579, 7961, -19307, -83602, -62107, 27429, -68485, -121850, -46355, -70601, -43583, -72845, -62575, -28626]
6909b8626l0472j5313j1072r22L0078p1985n62M7985K7311l8785j0630K934l0595
6896a30654R5740J8302k0932L7695J0085m9804j7843L2108L516l5092k9110Q299
6884g7690K3813J6780o0440Q559O2878n4667P1179m908N432j3391r3221k863Q3329
6871c5210p790k7501j1180l1448J38006j8775J1738n2862o1853J7307L8581J2105
6859b8882K4151M4724j08495J8071N339M1403k6866q6966J8552N5610l5600K6982
6847e1977O4755m872m5006O074m4013P12K0032j8244N3511J0066l950n098q4115
6834a02125k9691p673N1832M109J13100N3629o5234q758l3548k4979K9425N8812
6822C8899l6511m6954L9336q82M8537P596l7222p7803P2538l4008m2920K1946
$$ y = [-28626, -59098, -74411, -85483, -86405, -56327, -128312, -128874, -80889, -53578, -92363, -102993, -100059, -130654, -34914, -16612, -37544, 151, 10236, -39568, -57411, -25303, -21787, -56879, -85989, -77690, -53877, -37097, -97537, -88978, -26100, -80767, -9588, -14496, -9064, -22455, -115676, -118539, -35210, -43000, -70501, -81681, -113129, 24877, 6102, 17840, -35022, -96875, -79568, -40987, -28882, -4731, 39993, -68502, -50431, -45092, -3689, -30555, -117521, -98969, -43359, -78959, -51977, 12778, 7906, -37100, -31026, -75039, -74327, -54295, -72539, -19028, -8962, -12912, -18010, -102125, -131816, -139489, -87657, -83548, 29552, 83181, 17947, 9189, -24359, -49338, -19913, 38899, 2388, -44566, -5230, -6112, 42425, 50021, 12799, -65004, 7534, -26474, -69394, -47448]
6810d7448p2584r163J5297J325p0042P5083J7267k755O6707N910m590K8309n6480
6797e3164J2051K6882r360O0078J3685j5423p3856J2069J3992p9893J5931N98
6785g6410j3852k088J28691K2742m7671j4441J210K7198l9725l3256J0581N162
6773c1859L0012o8453K0309k8902J16940n2424o480Q2532o1020l7623l2105K9126
6761c9947R500L1630l2544K2494L8773l5552Q343k6855J2464P4767K273n0535
6749A4811m241l4310j5207J7163L7890J8530k0947o4632l1023L2885R713J8169
6737b1199o827o5238m3076J11671M9081L749p9355M580O1554j5111j9086L4516
6725A5259n1620j3170P083L4712l431n4507L0313l9548O6732J6477L231J6146
$$ y = [-47448, -120032, -129195, -113898, -112573, -182615, -107532, -90265, -93020, -26313, -20403, -24993, 3316, -53164, -41113, -14231, -23591, 36487, 50172, 34749, -39107, -27038, -13046, -92939, -77008, -76410, -90262, -92350, 36341, 59083, 11412, -3029, -1819, 25379, -14346, -47602, -37021, -31859, -1847, -70300, -49991, -78893, 38047, -14377, -20857, 61675, 655, -36968, -69073, -39947, -30447, 1183, -31361, -8867, 29906, -5646, 2697, -24158, -11694, 63073, 65346, 14811, 10570, -23740, -38947, -21784, 16106, 34636, 13689, -50943, -81966, -49081, -39368, -21199, -28026, -93264, -136340, -24669, 24412, 28161, -51194, -46614, 14940, -171, -19257, 15259, -36361, -49531, -42448, -7736, -11167, -65674, -35361, -74909, -8177, 8300, 11531, 27677]
6713B7677n6835m5464N8595j6746j1827R0331N722j1959j21002m4181M8950K4779
6701e1960j4219M5300m095K25l3461o976K2413J5460n6370P591K5153j9232j2717
6688h2888N892K4714N9379m1828j515P9258o0768l2314L75q684P1604k4662j9109
6675c0546l2091L2631r453l3813L1824L4374P3104k2175n8028k9216L0896l7182
6663d9675J5054M152N1557j5913r151o3615N0424K1525n2826J1718j3737K8870
6651b1617O3844N1720j0165m9856J9611r60l712n5021J3959L4708q3877M1552
6639A86L7552p0334n4775Q2646N1494n8124J9210k0398K967l6879L2939M1872
6627B8356K4190k3634n6440M1926l2916R4649q246l5606m1657l7676J9653j6230
$$ y = [27677, -29158, -74622, -16027, -32773, -44600, 45731, 51453, 39494, -81508, -125689, -76739, -51960, -66179, -20879, -24974, -24749, -58210, -65186, -42773, -27313, -83683, -76092, -50939, -70171, -82888, -76996, -52282, 7097, -34731, -36246, 43012, -17756, -50070, -49695, -58379, 13225, -11437, -30546, -62637, -30006, -39459, -73272, -41448, -7074, 66030, 43855, -14173, -43389, -12493, -49675, -34621, -30469, 21088, 5175, -3976, -67591, -17167, 4358, -48468, -36750, -50487, -21617, 42227, 93947, 83782, 33926, 53537, 52577, 48865, -6156, 7803, 42511, -41366, 186, 37738, -32596, -87371, -4725, 46769, -11355, 7855, -12543, -9576, -46455, -13516, 28356, 52546, 28912, -27528, 14398, -18518, 76131, 67885, 32279, -9378, -47054, -27401, -43631]
6615d3631O0438m647o458k5421j2185j7209K612j3367N6236l0322j1622J3029
6603c2547k2008j4906L0306M1451k6683O2509o9855k0847J2091O5167m5330o346
6591b6998n417k8707M8327r054j158l3489J4376J9842P26j9898j4553K3999j8332
6578e0336P199m3582N9203o829m1387R1628l6424p4750O3776M598Q3579j8100
6566C8575q8927K5946Q528j485O0508M3673n5895k6400n9149N5525K9522j4519
6554A5902m1905m278L8490j9161J431l7081j5181L6989R5584j8750m2272L5093
6542D4861p6277J2842J00993N602o7949J7710M0302J308j9052n7303L9221K4626
6530F6884l7405n1032M1979L9269R638n3070q5202J313N1364l3720k6432Q356
$$ y = [-43631, 16807, 12160, 5702, -19719, -31904, -49113, -46501, -59868, -3632, -33954, -45576, -32547, -54555, -69461, -39155, 2296, -24387, 38122, -31733, -52580, -40489, 24678, -20652, -26998, -32415, -61122, -12795, -21849, -23007, -56496, -42120, -22278, -21552, -41450, -56003, -32004, -50336, -43137, -86719, -27516, -34345, -75732, 15896, -20528, -95278, -31502, -26904, 56675, 38575, -50352, -24406, -15878, -17363, 43145, 86818, 30923, 4523, -54626, 899, 30421, 15902, -26003, -30281, 8209, -10952, -9521, -46602, -61783, -24794, 70790, 52040, 9768, 44861, -31416, -18574, 82419, 88021, 20072, 37782, 78084, 79392, 60340, 3037, 42258, 66884, 29479, -21553, 20426, 59695, 69333, 16263, -68939, -67626, -16262, -49982, -76414, -68058]
6518f8058J7711M6063o8469j0164N2838Q1715j0602l8057j656n0410K5958J704
6506b1427k9376Q005K1224M1946o3554O7022q118n1676K660j6191L2747R4313
6494G7575n566l9659M9429L9440j3252l7236m3421R7952k3247r0783j9052k2833
6482c0653P723K7066j6721J0917L0175o8013M474m7351J8929Q0120N624k1965
6470C25J795n0408L8770n9583k9490K7000K8317l6788K2421O9076n3426k36o300
6457d8527m6634k412Q2696l8228L5980k6824K4153Q5957m9888J845L2954k3893
6445B7179q2955L0456P2619p7873m3641P1655M3244m3558k3232P3855P94r2304
6433d3761o5026k7176Q9683M0310L7654j1380j4842k4823J8941K048o617j6843
$$ y = [-68058, -50347, -4284, -72753, -82917, -30079, 51636, 41034, 2977, 1321, -49089, -23131, -21427, -50803, -42798, -21574, 20372, -43182, 23840, 15722, -35954, -33294, -49485, -16738, 77575, 72009, 32350, 81779, 121219, 107967, 70731, 27310, 125262, 102015, 11232, -7820, -30653, -22930, 4136, -12585, -1668, 28507, -39506, -35032, -82383, -63454, 16666, 22290, 325, 2120, -48288, -9518, -69101, -98591, -71591, -43274, -80062, -57641, 11435, -41991, -42227, -48527, -95161, -97573, -14877, -53105, -17125, -43949, -19796, 66161, 16273, 18118, 51072, 27179, -55776, -25320, 47299, -30574, -74215, -2560, 40684, -2874, -26106, 47749, 48543, -43761, -108787, -135963, -46280, -5970, 31684, 20304, 5462, -19361, -420, 1628, -4989, -21832]
6421b1832m1673R093N1952L0832k0670K7485k6803J5598k1602n49K2314j1130
6409A3015m6377K0394l9336J5108J1442K2288l4415M938K4260l784m4621J5222
6397d1866l272M8452P7211k3478j4721k2135O181J795n2156n9960J01726K1716
6385C9493j5127k6144j5941L293l2202j7625M8603o120l9175Q7260J9155j00915
6373e5445k4177L3369K501k3768P2138M3510p4262l8506o0413P010M8923J4904
6361e4216L7359K4221M2773m0510j1584j1829m22L3279k813J4401o646k8888J1645
6348F770n7305o5407J30432M395j7252K4383J1880J441n3864m309n3914J0937
6336f1813P910m6538O1832M4894L1240m0018J2847J6214L180K9520m5131n1148
$$ y = [-21832, -63505, -54412, -2460, 28372, 7702, 35187, 8384, 23982, 2380, 1831, 24145, 13015, -33362, -12968, -52304, -37196, -25754, -3466, -37881, -32943, -8683, -12467, -57088, -41866, -45138, 3314, 80525, 57047, 42326, 20191, 26372, 28167, -23989, -83949, 17777, 39493, 24366, -1778, -17719, -14426, -46628, -64253, -15650, -21770, -60945, 26315, 45470, -55445, -79622, -46253, -43752, -67520, 4618, 48128, -26134, -64640, -125053, -118043, -69120, -54216, -16857, 7364, 50137, 9627, -1957, -13786, -14208, 19071, 16258, 30659, 24013, -4875, 6770, -50535, -115942, 14490, 18885, 1633, 26016, 37896, 39337, -14527, -18836, -72750, -61813, -53903, -100441, -38609, 6285, 37525, -2493, 10354, 26568, 29748, 59268, 14137, -37011]
6324c7011q2281J08591N4697l9309J6961p7864j0752k1212O200L7032k0267L6944
6312b8271M3007k7540K3595j1438p856O9613m9375k5849m3623K8597k0519j7931
6300f7590Q40m3790O4375L3672M4159m4645l8675N1447J2359j4232j4387l0165
6288d6632l2180j36N0062P8751K5072K2775n9136l3692q3944O0095P951K4123
6276A3109J5249n0713J9624q282L2730n253L254o8332O5698o9782N6862K9483
6264C3647q2165P149N921l1887M1408J4687o4416K3010K5204O7981J4754l8241
6252A7052j10394K9750N954J8087P410l940m9382L1660n051L157J986j9692j32
6239g3535j1400L9920n696K893k6686K8696k0534K8687J9631J3962l9704l0201
$$ y = [-37011, -119292, -10701, 43996, 4687, 21648, -56216, -66968, -88180, -81980, -44948, -65215, -28271, 14736, -12804, 10791, -647, -8503, 61110, 11735, -14114, -57737, -29140, -49659, -67590, -66750, -110540, -46165, -12493, 31666, -12979, -51654, -207, 12152, -2080, -16467, -46632, -78812, -78948, -28886, 49865, 74937, 97712, 38576, 4884, -79060, -18965, -11014, 13109, 28358, -22355, -2731, -11013, 21717, 16464, 19718, -48614, 17084, -52698, 4164, 33647, -48518, -41369, -35448, -67335, -25927, -11240, -75656, -52646, -27442, 40539, 55293, 17052, -93342, -63592, -57638, -39551, -32141, -36081, -85463, -53803, -58854, -55697, -53711, -73403, -73535, -84935, -45015, -50711, -47818, -74504, -45808, -66342, -37655, -18024, -4062, -43766, -73967]
6227g3967J1446R1591M816m6684k9233r567M3280k8676n3833M9976Q6915k3759
6215B2305o6615r4102J39430O8963o2256j8823K2006M5439o3383J4435J4314k6307
6203d594M5077m2868o905K1229j18993J9434L0058m5763J6281N048k2688J076
6191a03608O9573R544J5617l0150O1277k0671m9914R1811L7013n1739k0240P848
6179A6361N6722R469j12155K9760l6520M7928P004k839o9374J9954o021M1379
6167A668p1411M9632N755m2389N3270l6395L1321q965J6843m3195o658K1588k0539
6154d9475M9347J4409j0499N762m6055l2900l4637L5160N7963L688J6866j3962
6142d333k6364K9848M7598J0644n3763r177l739L7546j8125K0904p4715M4296
$$ y = [-73967, -62521, 29070, 33886, -12798, -42031, -51598, -8318, -36994, -90827, -40851, 46064, 22305, -44310, -138412, 1018, 69981, 7725, -11098, 10908, 56347, -7036, 7399, 21713, -4594, 40483, -2385, -9290, 11939, -107054, -87620, -57562, -103325, -87044, -81996, -104684, -103608, -34035, -24491, -8874, -39024, 22253, 1582, -48332, 43479, 80492, 28753, 8513, 16361, 73083, 82552, -29603, 157, -36363, 11565, 18569, 15730, -53644, -33690, -39711, 1668, -69743, -20111, -14356, -56745, -3475, -39870, -8549, -17514, -671, -43866, -50524, -28936, -49475, -128, 14281, 3782, 9544, -36511, -69411, -104048, -68888, -10925, -7237, 9629, -4333, -30697, -849, 46749, 57393, 3630, -5547, -9286, 28260, 10135, 31039, -43676, 620]
6130F20l7435J4839J6777L4374j0398K7146o2165n1439m74K0615m6376k5875P6972
6117d2819K586O572K5254J3349l1383J4318J5788L3111K0044K5365l2768l4588
6105A4829k9680L2490j6776R905l5534L7293P254l8499K2708N791M4109j0961
6093D2929J8328k8739j508K0186l4874k4509J7741M8296N1777n0156n56J529q910
6080E1534Q1057o7386p3436J9708k0273k96N6345m7956N447K0134O5613o7636
6068B2855j7080P593Q1276m3989M7241n1348K1271m5926M5783j2328n4145k7685
6056b6482J7632O5386j08132N4378J3600K2663m4275p803j5334m9011k7107O574
6044i7911O0110Q7378l825L227q4418J6928M8658N3697m751J2640k2161j0860
$$ y = [620, -36815, -21976, -5199, 29175, 18777, 45923, -16242, -67681, -68155, -47540, -93916, -119791, -42819, -40233, -33661, -8407, 4942, -26441, -12123, 3665, 36776, 56820, 82185, 49417, 14829, -14851, 17639, 863, 10768, -24766, 12527, 19781, -18718, 3990, 9781, 53890, 42929, 61257, 32518, 31010, 51196, 16322, -8187, 9554, 57850, 109627, 59471, 58915, 60444, 51534, 132591, 65205, -8231, 11477, -8796, -9092, 47253, -703, 4744, 24878, 90491, 22855, 5775, 13368, 94644, 50655, 97896, 46548, 67819, 21893, 67676, 55348, 1203, -26482, -8850, 56536, -51596, 2782, 16382, 39045, -5230, -13033, -28367, -77378, -104485, -97911, -37801, 49577, 45752, 48979, -35439, -18511, 30147, 83844, 79093, 91733, 69572, 58712]
6032E8712o6450j2109k714p268N6688N5843o9177n1399j4083M305N6438R28n9183
6019d9469k1997J7567J9357Q757N8652j3229L1142J8949k6656O6396l6881m2991
6007B9597p7466J31171O5599l2363n2110o9919J9101l149N7706n1020j321J0308
5995B6134p9805M4353P5739q3107j5937N476k4258J09388m6989l7478R9523K5762
5983I8801n8262K8509l25l6926J6601K7697o2538p184k2860k2386O8785J0659
5971D0571k1642M9508J7471k5193j0747p1432M6058N4281l6172o7943K6506p780
5959f514J1951K4700l3579K7490n6380j1604k0308j1314P0468N3036j3733k0538
5947A3675m393K1857M8836q3475N5319L3382k3517l3935l704O9075q638j2534
$$ y = [58712, -7738, -19847, -22561, -29829, 26859, 82702, 13525, -37874, -51957, -47652, 8786, 9714, -49469, -71466, -53899, -34542, -25785, 32867, 19638, 50780, 69729, 43073, 109469, 72588, 29597, -47869, 83302, 148901, 116538, 64428, -5491, 13610, 10461, 68167, 17147, 15826, 26134, -53671, -9318, 66421, -16686, -32623, -27147, -51405, 57983, 10994, -26484, 73039, 98801, 40539, 69048, 68723, 31797, 48398, 76095, 13557, 6373, -16487, -38873, 29912, 40571, 18929, 68437, 85908, 60715, 49968, -21464, 24594, 78875, 42703, -25240, 1266, -6514, 5437, 30137, -3442, 24048, -32332, -43936, -64244, -75558, -5090, 47946, 34213, 13675, 9282, 31139, 79975, -3500, 51819, 85201, 61684, 27749, 24045, 93120, 84482, 71948]
5935G1948O0768J9707j6917l1162k7713j5901m0180P0247K5609q5529p725o277
5923A6875K7420k422n5692j3877M0507J998K3116K5942K2893l1568q7788M5672
5911A3076l7349l6430M590N5862p4507Q1716K652M1501m0163l4765M0326L3769
5899E0278L3855j6676o349r681n4940J1299K2168o2498R9504p325K5648N7195
5887A42478L128n8614n8477j3970m711o737q3338N5308M5679J0981J3873J5247
5875F0847J891k0878n822j8601J9176J1559M6299o3422j9854l454M9711J6684
5863G4136K4152n7740q2770l1710M4090N3041n0039L3856J9898j1800n338J9057
5851B8833M1150o2414l7402O6065K3304m171K8755R819p221l7509P542K396M6149
$$ y = [71948, 132716, 152423, 135506, 104344, 76631, 60730, 20550, 90797, 116406, 30877, 23152, 16875, 44295, 41873, -13819, -27696, 12811, 14809, 37925, 63867, 86760, 55192, -32596, 13076, -24273, -60703, -56113, -251, -74758, 6958, 9610, 51111, 10948, -23817, 16509, 50278, 84133, 67457, 61108, 51427, -3513, 7786, 29954, -32544, 66960, 59635, 85283, 142478, 145606, 86992, 28515, 14545, 9834, 3097, -80241, -24933, 20746, 31727, 45600, 60847, 62738, 41860, 36038, 17437, 36613, 48172, 94471, 31049, 11195, 7741, 57452, 74136, 98288, 40548, -42222, -73932, -29842, 23199, -26840, 7016, 26914, 15114, 9776, 28833, 69983, 7569, -29833, 36232, 59536, 55365, 84120, 93939, 86718, 49209, 56751, 59147, 105296]
5838A05296L8004r2617p741N4489m5868r3391k393M0991M9237j01343k038J04689
5826D7315L0353J7343j0104j8512o8990N3339K3710k5417K922R464k8862M757
5814C7318l0408j8810k5230M3049J04913J1253n7838m0157K4925L125Q60J7323
5802G0323K130m8078k2149L7609J2019q0528l8421J19597k947l2356L4064m824
5790D6439J4704k0927p0717j560M9129K4150J8915j8914K2867J0957l6672r220
5778B9151L5488m3940k0226J271M1424J3024J6451m9968k5695K4715M9480J6375
5766H7550n528j0474q652k0097l1867o63j2930k858M2346M0931r0703r498j0226
5753c2669J7277M4031k351j9060j02430P6452N8639l9925k5961J7401R2409M0784
$$ y = [105296, 143300, 50683, 42942, 97431, 51563, -41828, -44221, -3230, 46007, -55336, -57374, 47315, 77668, 95011, 84907, 66395, -2595, 50744, 74454, 49037, 51959, 61423, 32561, 37318, 6910, -11900, -37130, 5919, 110832, 122085, 64247, 24090, 49015, 52140, 53000, 70323, 72453, 24375, 2226, 39835, 51854, -28674, -67095, 52502, 49555, 17199, 51263, 46439, 61143, 40216, -30501, -32061, 17068, 41218, 60133, 41219, 64086, 75043, 38371, 29151, 64639, 20699, 473, 1744, 43168, 56192, 72643, 22675, -3020, 21695, 71175, 87550, 82022, 71548, 62896, 42799, 10932, 10269, -2661, -5519, 36827, 77758, -12945, -22443, -32669, -15392, 28639, 26288, 7228, -95202, -18750, 39889, -36, -25997, -8596, 83813, 124597]
5741A24597p5097p3088O980K5590j2565m7254P1743N9364p4738l325Q7536o7929
5729B1814O997o361m8254L8682N7032m4097j9962Q267q449K084q7235l188Q3937
5716A267O7424N935k8396K8824J176m9214m9795m3697Q7963J9077m1510K6031
5704B5085J5105j3260k7745L7351j8244L4911J21998l3444m9699n9888j0580j2740
5692H850Q0806l1994j11783Q7480K5122l455P487j7533p499k9450O451j02J4988
5679B9368l2619l1905O3096q480k7403M0653P879o4443K3176j2591j0337K4800
5667A194K469m6162l4027O3787K1092K3738K4929m4605j4968n3421J4824L9567
5655a583Q0539M2281p6856o3083j3294O3161P0142l059r1060k001O2737m0551
$$ y = [124597, 49500, -23588, -16608, 8982, -3583, -50837, 20906, 80270, 5532, 2207, 89743, 21814, 28811, 22450, -25804, 12878, 69910, 25813, 5851, 14118, 5669, 7753, -79482, -82670, 1267, 68691, 74626, 46230, 75054, 76230, 27016, -22779, -66476, 21487, 40564, -946, 25085, 40190, 26930, -815, 36536, 18292, 53203, 175201, 141757, 92058, 32170, 21590, 8850, 89656, 57662, -54121, 33359, 58481, 55026, 62513, 44980, 37481, 8031, 14482, 14380, 29368, -3251, -35156, 27940, 19460, -7943, 32710, 40589, -23854, -678, -13269, -23606, 1194, 3663, -42499, -76526, -12739, 8353, 32091, 57020, 12415, -2553, -55974, -41150, -1583, 78956, 121237, 44381, -18702, -31996, 31165, 101307, 98248, 7188, 5187, 67924, 27373]
5643B7373k4656L9925N6121n8408Q835l8255r077Q7492J5476n2541r3944M2548
5631H89M0458M407M858l520j6533R842M1488L3265K5358n9060o8592M4312l5585
5618B1587Q810R0035J8542m8753l2338k5283l332N788M1647K4558N342l4223j0993
5605F1387n2086N312J0671L1841L7427k5227j1056J6772L6239o216j9907Q199
5593I3356p371o4209L7018j9614m7423k3247N5696Q1659N6554r0481L4580J7617
5581A24135p2363j0526l4332l317j1013O1783J6793o701r747N8075N2337l456
5569A61668m4386k6727J1012P2268k1512m3023J2233Q438Q7517J8381p9361k6200
5557A30308n494k055O5294J9015n6081l2573N5898N289k2749K2469p333J372M4052
$$ y = [27373, 2717, 42642, 98763, 40355, 49190, 10935, 1858, 89350, 104826, 52285, -41659, 889, 41347, 45754, 50612, 47092, 30559, 40401, 81889, 115154, 140512, 81452, 12860, 57172, 21587, 30397, 120432, 138974, 90221, 57883, 32600, 29268, 35056, 76703, 101261, 106603, 72380, 61387, 9301, 14613, 25284, 57125, 94552, 69325, 58269, 75041, 111280, 105064, 85157, 93356, 85985, 21776, 58794, 39180, -8243, -31490, 24206, 105865, 162419, 71938, 106518, 124135, 51772, 41246, 6914, 3597, -7416, 54367, 71160, 64459, 54712, 112787, 165124, 161668, 117282, 90555, 101567, 173835, 152323, 109300, 121533, 129971, 217488, 235869, 156508, 130308, 124814, 122759, 188053, 207068, 150987, 118414, 174312, 179601, 156852, 179321, 171988, 173360, 217412]
5544B17412N3635M0845k5814m968J5078M859Q3353J3829M4326O9606O759J68581
5532F87501J48576N1736L7505O4838j4291j28343j12105p7948k2787l2189N463
5521F07956m8163p2590O708P5684L2362q2772M5809N4448n3792l0775R158K8971
5509E73004L4660J42691Q5514P7878M6182Q5430J89626J91262K61054L38398K52918
5498B278617J50783J67376j61030l45117l62745l11818j84133j37364j36727o8807
5488H89035j32312P791K0106K6368k6476L0345o4196p6395o1746J01014J01310
5477H14844j08752K6977J35940J00690O1392J20299J03438K45727K43459L50393
5467B094407L19666J26342K7941k27398l13009l18074l33738k60067j62548j02327
$$ y = [217412, 271047, 311892, 286078, 281110, 296188, 301047, 384400, 398229, 442555, 512161, 518920, 687501, 836077, 887813, 925318, 990156, 975865, 847522, 735417, 657469, 634682, 602493, 607956, 559793, 487203, 493911, 569595, 601957, 519185, 564994, 619442, 565650, 534875, 544033, 573004, 607664, 750355, 835869, 913747, 959929, 1045359, 1234985, 1426247, 1687301, 2025699, 2278617, 2429400, 2596776, 2435746, 2090629, 1727884, 1416066, 1231933, 1094569, 957842, 889035, 756723, 764514, 784620, 810988, 784512, 814857, 750661, 674266, 612520, 713534, 814844, 706092, 733069, 869009, 969699, 1031091, 1151390, 1254828, 1500555, 1744014, 2094407, 2414073, 2540415, 2568356, 2340958, 2027949, 1709875, 1376137, 1116070, 953522, 851195]
5457H51195n9232p6901j32058M5918j556q2823m6192J9599m5995j1387J7237K5337
5445E03142J8613j6547k249J6831O8632O016j7532M3114M8389J27763J06480J07068
5433A009720J7634q2500j99243j15740j06154q4382j3405l5267n1535J263L878
5422C44269l5137q4564Q2685J8973k8470m4360n2476l1432N846k6265k8945M8290
5410A68414k0932r3513R0682O0086K4K6556o7871N703j2411n7255K0304J437J7126
5397A38350L1370l1083m6165J4911Q500M8215M9210r7099l8813m1540k055j7416
5385A6385P9238o9278K3699N8957N2254n2036j2427k5713K5983K527P218J766
5373A08573n0433L1030K4644o622r8144k3867P2747K3037o921K7490n334p5846
$$ y = [851195, 791963, 715062, 583004, 628922, 627366, 544543, 498351, 517950, 471955, 460568, 477805, 503142, 521755, 505208, 502959, 519790, 588422, 594438, 576906, 620020, 668409, 796172, 902652, 1009720, 1027354, 944854, 745611, 629871, 523717, 439335, 425930, 390663, 339128, 340391, 344269, 309132, 224568, 307253, 326226, 297756, 253396, 200920, 169488, 175334, 149069, 120124, 168414, 147482, 53969, 144651, 204737, 204761, 231317, 163446, 169149, 156738, 99483, 119787, 121224, 138350, 169720, 138637, 92472, 107383, 115883, 164098, 213308, 116209, 77396, 35856, 33801, 16385, 95623, 26345, 50044, 109001, 161255, 109219, 96792, 71079, 97062, 99589, 106807, 108573, 58140, 89170, 113814, 107192, 9048, -14819, 57928, 80965, 74044, 101534, 96200, 20354]
5361B0354M3762L2229m5918N4276J2420l0151j9406m581m2436k3631O6531j6948
5349D6501j0565L4408l5593k2283M7234M0996P5901m3368k1026K7572j197j02621
5337C5959m7056O8380K95J91l798O9077m8661K1032N2809j9844j8071o8740j2292
5324B9281K6277M9205N488K7879m0239o5386P7073R097Q41j1432m7975M3763m3116
5311F0756n9680k7962Q2394N6961L1885n9152k5222p555L0392M2814L6815o010
5299A56436r5292k2185n3332O8619J2623Q654k8713K1749M6207L5865m5530l9151
5287F5950N8175l716j6236J0981m3614L8356O945l832M1446o0712j1350J1605
5275I3998m1513j8606M606n982l8851J7905R175k0409j6333L7506N6268R603m1810
$$ y = [20354, 64116, 96345, 50427, 104703, 117123, 86972, 67566, 62985, 20549, -3082, 63449, 46501, 35936, 70344, 34751, 12468, 59702, 100698, 176599, 133231, 112205, 139777, 138580, 35959, -11097, 57283, 57578, 57769, 53971, 123048, 74387, 95419, 148228, 128384, 110313, 41573, 29281, 55558, 104763, 110251, 138130, 97891, 32505, 109578, 118675, 119516, 108084, 60109, 103872, 60756, 1076, -26886, 55508, 112469, 144354, 85202, 59980, 52425, 82817, 125631, 162446, 156436, 61144, 38959, -14373, 54246, 66869, 75523, 46810, 68559, 114766, 150631, 105101, 65950, 124125, 120409, 104173, 115154, 71540, 109896, 116841, 113009, 154455, 93743, 82393, 93998, 52485, 33879, 38485, 32503, -6348, 11557, 20732, 323, -16010, 21496, 77764, 87367, 45557]
5262D5557K9173l2904K6292Q1099m5035L8979J00711j0876o4248M2877m0054r5346
5250G6225O5484J6836L4769l2447j2266q0091k5734P6075J9389L4657P6385m5755
5238B03527r3664K664o807l7786Q9409j2039n3700M0876K4905j7561o6393L1823
5226A05254J0529o2741J7840M303n370Q9398j8035l8733j5121j4726K7232k836
5214I6994l175J1677n0113M4892m084k9254m2003r686N8447k2418k5165M7428
5202G3540J771l4299M5799J4497l4729o7755j8722R7332Q0968L5025q2273j9273
5190I1881q0733K4860o895l5635L5919M1277O2650j7377k2422K0258k5832m796
5178H3155o9968j4244O4580p303K0989l9802l1232O284K9885K7767q132k7060
$$ y = [45557, 74730, 41826, 68118, 149217, 104182, 143161, 243872, 232996, 168748, 211625, 171571, 76225, 141709, 158545, 193314, 160867, 148601, 68510, 42776, 118851, 138240, 172897, 249282, 203527, 109863, 112527, 105720, 67934, 157343, 145304, 91604, 132480, 157385, 139824, 73431, 105254, 115783, 53042, 70882, 75185, 69815, 159213, 141178, 102445, 87324, 72598, 99830, 96994, 93819, 105496, 55383, 100275, 96191, 66937, 24934, 15248, 73695, 51277, 26112, 73540, 75311, 41012, 86811, 101308, 66579, -1176, -19898, 77434, 158402, 193427, 111154, 91881, 11148, 36008, 29113, -6522, 29397, 70674, 133324, 115947, 93525, 113783, 87951, 83155, 13187, -1057, 63523, 56220, 77209, 37407, 6175, 12459, 42344, 70111, 61979, 34919]
5166C4919j8568l6006J3067J19352J3241m3668o4379N6152j0067m2171L0646K1877
5154G4395J502n4797j0870N6221M3043q060M050J4699n0656j2075M415j3871k9154
5141A8842J0640J0196K4073Ql3648M6823M0374m1856k1386P784j0507k1118N782
5128C6007J03030q3589k1220N6889M4957n5229J9858K901K2278M1261l0160n9243
5116G7740k2031m7884Q2004J1674m5743J9072K4261p018j6480l925m0689L9820
5104G0801N6435L2233q2743L0774J7782l4866N2825l2429o1844L3168K8873J2933
5092A23942m8520L3561m143p8749m2159j1714N192N5963j1507M2480Q340P6082
5080A48768n5290k7858M7543L6989J5458j28326M65J8510L2774K6874j0787o3774
$$ y = [34919, 16351, -19655, -6588, 112764, 126005, 82337, 17958, 74110, 64043, 21872, 52518, 74395, 75897, 21100, 10230, 66451, 109494, 101434, 105484, 120183, 69527, 57452, 61867, 47996, 18842, 29482, 39678, 63751, 63759, 30111, 76934, 117308, 75452, 54066, 61850, 51343, 30225, 36007, 139037, 55448, 34228, 91117, 136074, 80845, 100703, 103604, 125882, 167143, 136983, 77740, 55709, 7825, 89829, 101503, 55760, 74832, 99093, 92075, 75595, 71670, 30981, 70801, 127236, 159469, 76726, 107500, 125282, 90416, 143241, 110812, 48968, 82136, 111009, 123942, 75422, 108983, 104840, 26091, -16068, -27782, -22590, 33373, 21866, 64346, 72686, 148768, 93478, 65620, 113163, 150152, 165610, 37284, 37749, 56259, 89033, 115907, 105120, 41346]
5068D1346N3715l7882j0066L629k1108j716K1696k4781j4237q834K194P0285j8687
5055E5554N240j3290Q8600L5481p4965j5182j0632J1888M4323n2459o927R005
5043G6636m2863L1486J9162J5022l2841r418J7664j4861J076K443K9979l3817
5031E9668j4235N7427J6554m7857r063j2865k5470K7840m8429K4158L7310K9931
5019I4969K6762J1632j8459N065l0998l966M7122l5303L7736k5696n7274J6565
5007F8155k9135M1243N1164L3225O798o4064p2325n1765J9512M3025m5027J00229
4995A01035J0523l864j3647k3306P449j703L962k8490J4900k6318N386k0406K4565
4982E0086Q7197k7904p492K016o688j2615L7227r544R592j8425l0339K88J5516
$$ y = [41346, 95061, 57179, 47113, 50742, 29634, 27918, 49614, 24833, 10596, 1762, 3956, 74241, 55554, 60794, 47504, 136104, 171585, 96620, 81438, 70806, 82694, 127017, 74558, 67631, 76636, 33773, 65259, 84421, 99443, 66602, 57184, 74848, 59987, 61063, 63506, 93485, 59668, 45433, 102860, 119414, 71557, 62494, 49629, 24159, 51999, 3570, 27728, 65038, 94969, 121731, 133363, 114904, 119969, 88971, 85005, 132127, 96824, 134560, 108864, 51590, 68155, 39020, 80263, 131427, 164652, 171450, 107386, 35061, -16704, 2808, 45833, 806, 101035, 111558, 107694, 94047, 70741, 78190, 76487, 80449, 51959, 66859, 40541, 45927, 25521, 50086, 137283, 109379, 101887, 103903, 97215, 84600, 121827, 112283, 121875, 103450, 73111, 73399, 88915]
4969H8915L4696l7995n1877k4807M7877J9562o1488K7977M0203O6040l2558j91
4957A16354J4784n1784P5087L0715j4816n6509O819O656J18815m3992q6991o1921
4945E3217L149l0839M5677M292L3207l467L4568J6182K5981j4562o9064p5988
4933B2353M045J3902m8662O5999Q4651l6585K5061m6986j9675L415j748L5910
4921A01680l1078R9149J8168n908l6919l7594O4029o5895P174J6382o7330M2534
4909A04392J9017M4505L2071j7508N3843J0321k2211n8597l1492l798n935J3548
4897A38156N4074l1181k8180K7229J025K7037p9148J3739K3440n8393m3072k408
4885D2318K5487J6616N5950K3943p1461N0240k0195j0633q098l8845m4703N1624
$$ y = [88915, 123611, 85616, 33739, 8932, 56809, 76371, 14883, 42860, 83063, 149103, 116545, 116354, 131138, 79354, 154441, 185156, 170340, 113831, 120650, 127306, 246121, 202129, 115138, 53217, 56366, 25527, 71204, 75496, 108703, 105236, 139804, 155986, 181967, 167405, 98341, 22353, 26398, 40300, -8362, 57637, 142288, 105703, 130764, 83778, 64103, 67518, 65770, 101680, 70602, 169751, 187919, 182011, 145092, 107498, 171527, 105632, 112806, 129188, 61858, 104392, 123409, 167914, 199985, 182477, 236320, 246641, 224430, 165833, 134341, 130543, 124608, 138156, 192230, 161049, 132869, 160098, 161123, 188160, 109012, 122751, 146191, 87798, 44726, 42318, 67805, 84421, 140371, 164314, 92853, 143093, 122898, 112265, 104167, 65322, 20619, 72243]
4873G2243p597M412L038L4368O088p352j1973J5997O718J4739j2671j0703j0283
4860I7024M2527j4738j0K2694J136k6695m2105N386M7877j1490n85O772K3056
4847A50849l867M5542l6006n3105L1476M1381J9876O1357l4688n4403J1805l1690
4835A48527M0740j08575O066M0285N9290M930L0816k4544m5538m5046j3863J0597
4823A03685L1123k1657J8651O6553O5590K4789o4568j50687K0113K8667M0413
4812A62672K7741k9832j4118j831J2417j4932O2122n7299m7012P1928L1468j7632
4800A85692J7963l8119j0238P3437K7104k1441p0009n781N2060M262r0062p0009
4788E4859Q3718N887R888m8117j8217K3718K7933k3181m6092M6700l9167m4797
$$ y = [72243, 64646, 69058, 72096, 106464, 112552, 105200, 93227, 109224, 115942, 130681, 118010, 107307, 97024, 139551, 124813, 124803, 147497, 148633, 121938, 79833, 85219, 133096, 121606, 121021, 127793, 150849, 146982, 192524, 156518, 103413, 134889, 176270, 196146, 257503, 222815, 168412, 180217, 148527, 189267, 80692, 86758, 127043, 186333, 191263, 222079, 197535, 151997, 106951, 93088, 103685, 134808, 113151, 131802, 198355, 263945, 288734, 224166, 73479, 93592, 122259, 162672, 190413, 160581, 146463, 144632, 157049, 142117, 204239, 146940, 99928, 171856, 203324, 185692, 203655, 165536, 155298, 228735, 255839, 234398, 164389, 158608, 210668, 214930, 124868, 54859, 138577, 144464, 154352, 106235, 88018, 111736, 139669, 116488, 70396, 117096, 77929, 33132]
4776C3132M9089N5094k1915J4086K5760K4412K9194q0315m8361L6021j5460M7494
4764A48231O5930M2254o795l3982k5759k1521O490r857l3188L1526N9675J2147
4752B35151M6905m4417k2199n831j3504R4191J40711m8370j05497l5876r175M0407
4740B72496N5506r413p8618j2591m55m1244r644j3544J436m7249K2575L4609l1931
4727A41933N0313L2605k3012L320J1138o52K283l2240O9813j0884J7110l8072
4715B23655J6101k5017K4944R174l5970N5578J6631m4171n736K427L0172k67P411
4702B74932k5898J7882L7039n5169o6418O9197L9359o6488o310K7799R585o2104
4690A93406P9320L9371k7390m8025K6230J6017m2653M889J3365j9506P6844m2303
$$ y = [33132, 82221, 137315, 115400, 129486, 155246, 179658, 208852, 128537, 80176, 116197, 100737, 148231, 214161, 256415, 249620, 215638, 189879, 168358, 174848, 164991, 131803, 163329, 223004, 235151, 282056, 237639, 215440, 209609, 196105, 290296, 431007, 382637, 277140, 241264, 232089, 272496, 328002, 318589, 239971, 227380, 226925, 185681, 176037, 162493, 163929, 116680, 139255, 173864, 141933, 192246, 224851, 201839, 205159, 216297, 215645, 217928, 185688, 255501, 244617, 261727, 223655, 239756, 214739, 239683, 248857, 212887, 268465, 285096, 240925, 235189, 237616, 267788, 267521, 274932, 249034, 266916, 303955, 248786, 182368, 251565, 290924, 224436, 218126, 245925, 255510, 193406, 272726, 312097, 284707, 236682, 262912, 278929, 236276, 241165, 254530, 235024, 311868, 269565]
4678B69565M704K6747j2675K258K2719o0298j2153j0525k9316N4101l7747P6154
4666B93534K0837p1282k0238Q488m4245j3954j121L9030O307O7146K358o0724
4654B26136K0191k5495K4428P2586P5993r4668J3020L3810J8534o5800K1125m8143
4642B71717M5884n10q3612O4275k7262m7865R737J16535j6701J4641k4132N6703
4630C79410k2332n6058j0606P0105J0846n2710K4913N3583m2167o7594O3792L177
4618C54359m0808K542K4908M5453m6113M8307l0517l8989P7302K6128j9776o0123
4606C42673J4013n019k7622m9551J048J972J24340k6209l285k2360J0724J0196
4594C70920N58k0692J3136N0357m8673L7823l6821N1487O9950k1918k9264k1232
$$ y = [269565, 274269, 301016, 288341, 290599, 313318, 253020, 240867, 230342, 201026, 255127, 217380, 293534, 314371, 243089, 222851, 231339, 187094, 173140, 172019, 211049, 217356, 284502, 286860, 226136, 246327, 220832, 245260, 317846, 393839, 299171, 312191, 346001, 364535, 298735, 319860, 271717, 317601, 317091, 233479, 297754, 270492, 222627, 232364, 348899, 332198, 346839, 322707, 379410, 357078, 301020, 290414, 360519, 371365, 318655, 343568, 397151, 354984, 287390, 351182, 354359, 313551, 316093, 341001, 386454, 340341, 388648, 358131, 319142, 396444, 422572, 402796, 342673, 356686, 351667, 324045, 274494, 275542, 277514, 401854, 375645, 372360, 350000, 360724, 370920, 371478, 350786, 363922, 414279, 365606, 403429, 366608, 418095, 488045, 466127, 436863, 415631]
4582D15631m1970k51P7340l6990k494J9178j3432K5209p832O8662R165k090L0155
4569E40281p9318O012J1481O2418N617p2133N2382J131j2396m0938K6680l214
4557D98003K1759N9731O522m4436k5976J8203Q764J2454j6535J4419m1903N6833
4545E67838o507l6904K8114O836K8315R062l1741o132L7162J2199n907J9151K1816
4532F43302j4425O2500n7080j2373K6236p387n9098j6750J69708k0548q0186K2663
4520F56562R1703r251m6730n3191K9737P3648m6016J9679K1355n891O3278o3209
4508G31674j6574J66905l052P818K4460k5537O453J9100L4772O2492K3459P9262
4496A111232L5917J33703M6634R1536J70234J51288K11043O9343k458l7566k09523
$$ y = [415631, 373661, 373410, 450750, 413760, 411266, 430444, 417012, 442221, 434389, 503051, 512216, 510126, 540281, 460963, 466975, 478456, 540874, 546491, 474358, 526740, 527871, 515475, 474537, 501217, 498003, 519762, 579493, 586015, 541579, 515603, 533806, 542570, 555024, 538489, 552908, 511005, 567838, 561331, 524427, 552541, 559377, 587692, 596754, 565013, 558881, 596043, 608242, 602335, 621486, 643302, 628877, 691377, 634297, 621924, 648160, 640773, 581675, 564925, 734633, 714085, 633899, 656562, 748265, 739014, 692284, 639093, 668830, 742478, 696462, 716141, 737496, 731605, 794883, 731674, 715100, 882005, 878953, 886771, 911231, 885694, 892147, 911247, 946019, 1008511, 1031970, 1111232, 1147149, 1280852, 1327486, 1419022, 1589256, 1740544, 1951587, 2020930, 2018472, 1980906, 1771383]
4485A771383k32613j89323r4163m2226K81j33285q0090o7988j8883l4344o896
4474H71853L4522l5369j003M1392P596j1542J0862n9680p648K6073J21921k4585
4462I74392m5731M884j7022J840R5924j04031j1077J7473j5903m6419m812M2790
4450H92308K4568j6799N6949k8295p0447J3229j2212O4939l725m3405L1582l0644
4438H78048k8334K3863K5035J925Q5248R0l1383r5826o1533O7401J3857M708l0265
4425H52834J15175n150Q757N4495K8703l3653P1179l5162k9438k560N586M7695
4413A078461K3006M6052r603N0366n0624j8446k9054j3367r353K6893L483k8234
4401A069580k2940m7938J4826n9702m67K5997J9060j6250K8746K7931P9187n574
$$ y = [1771383, 1538770, 1349447, 1255284, 1213058, 1213339, 1080054, 999964, 931976, 913093, 878749, 871853, 906375, 871006, 870003, 911395, 918991, 907449, 918311, 858631, 850983, 877056, 998977, 974392, 928661, 933545, 916523, 918363, 1014287, 910256, 899179, 916652, 900749, 854330, 849518, 892308, 916876, 900077, 957026, 928731, 858284, 871513, 859301, 924240, 920515, 877110, 908692, 878048, 849714, 873577, 898612, 900537, 985785, 985875, 954492, 858666, 797133, 864534, 878391, 883099, 852834, 968009, 962859, 971616, 1026111, 1054814, 1021161, 1092340, 1057178, 1027740, 1025180, 1030766, 1078461, 1101467, 1147519, 1137916, 1188282, 1137658, 1119212, 1090158, 1076791, 1067438, 1094331, 1097814, 1069580, 1046640, 998702, 1013528, 953826, 953359, 979356, 998416, 982166, 1010912, 1038843, 1118030, 1112456]
4389A112456L2215k1558L739Q1762n9801m669J3166M8967q751l7882N7385K8306
4377A245335J5302O789J7961L7722M2906k4106j18604N3045K0760O0665m5842
4366A311933l2032L8658M7692j1702J913J40881O9324n1605m981O3303l9613K7494
4354A561265N4846K0977m4996p1901P2203J6499K1103N9139M413O2441N4527j953
4342A808563L4001J7029l9077M6924K8078R525J1961r969O8290O1131n185M8843
4330B080114N9314P5674J00600L641N4491Q6925M3426K5961n6071j1103J07868
4319B570840p01l4560l2759l9560M3255J2592M9447R1764k3706N2202L5566J05011
4307B829391R7823P9395k4427L3614O7053J2376M800l0159L4383N0136K627K8085
$$ y = [1112456, 1144671, 1123113, 1126852, 1208614, 1148813, 1144144, 1157310, 1206277, 1197526, 1159644, 1217029, 1245335, 1260637, 1267426, 1285387, 1323109, 1366015, 1341909, 1223305, 1276350, 1297110, 1357775, 1311933, 1279901, 1318559, 1366251, 1354549, 1356462, 1497343, 1566667, 1515062, 1510081, 1573384, 1533771, 1561265, 1616111, 1637088, 1592092, 1520191, 1592394, 1608893, 1629996, 1689135, 1693548, 1755989, 1810516, 1808563, 1842564, 1859593, 1820516, 1867440, 1895518, 1905043, 1917004, 1907035, 1975325, 2036456, 2031271, 2080114, 2139428, 2215102, 2315702, 2319343, 2373834, 2460759, 2504185, 2530146, 2474075, 2462972, 2570840, 2570139, 2535579, 2502820, 2463260, 2506515, 2519107, 2568554, 2660318, 2636612, 2688814, 2724380, 2829391, 2927214, 3006609, 2982182, 3015796, 3082849, 3095225, 3100025, 3069866, 3104249, 3154385, 3157012, 3185097]
4295C185097P5847M6685Q0852J0608R6872J10719J16426R8989N0944Q9839J15734
4284D078612J39268J57371J87074J51885J79254N7332J01786J70179R3333P8229
4274E394323K02943J20687Q4912K08007J68541J17160J76388J64225J14089J87356
4264F938631J52388R7253J66023J67049N4217J25775O1116J51104J46753J60989
4254H221298J44763K74345K61309J40830J81197K77594K43282K22389K52608K72099
4244A0491714K94555K82464J77753K43105K86551K45912L16164M46309L91811
4235A3176338N45771O03819O54062P03565Q40458Q41410R13481R45129R64892
4226B0188925R27551Q63853P32533Q10032R88104J099359J067552J137892J436977
$$ y = [3185097, 3260944, 3307629, 3388481, 3399089, 3495961, 3606680, 3723106, 3822095, 3873039, 3962878, 4078612, 4217880, 4375251, 4562325, 4714210, 4893464, 4950796, 5052582, 5222761, 5316094, 5394323, 5597266, 5717953, 5802865, 6010872, 6179413, 6296573, 6472961, 6637186, 6751275, 6938631, 7091019, 7188272, 7354295, 7521344, 7575561, 7701336, 7762452, 7913556, 8060309, 8221298, 8366061, 8640406, 8901715, 9042545, 9223742, 9501336, 9744618, 9967007, 10219615, 10491714, 10786269, 11068733, 11246486, 11489591, 11776142, 12022054, 12338218, 12784527, 13176338, 13722109, 14325928, 14979990, 15683555, 16524013, 17365423, 18278904, 19224033, 20188925, 21116476, 21980329, 22712862, 23522894, 24510998, 25610357, 26677909, 27815801, 29252778]
4217B9252778J600538J636601J915969K122572K408181K664170K909659L063228
4209D7573696L495504M103239M889444N777946P004726Q060128R523224J1506620
4201A01934527J4859559J9756874K6804516L4267246L5025831K4184760J3370767
4194B70204080p843909l7183559m2978226l6086602k7362344k0029725j4917228
4187H3802487j1631406r178429p341933n937978m735828l992869l387309k906121
4179C4690614k476211k150239k033545j864673j707886j441728j160923j109148
4171B0746261r97425q72637p93649q42665q09708p56098o66787o46455o30702
4162A3730135m99967m41200l94798l96497l82532l36328l15479k68575l21067
$$ y = [29252778, 30853316, 32489917, 34405886, 36528458, 38936639, 41600809, 44510468, 47573696, 51069200, 55172439, 60061883, 65839829, 72844555, 80904683, 90427907, 101934527, 116794086, 136550960, 163355476, 197622722, 232648553, 256833313, 270204080, 262360171, 225176612, 182198386, 146111784, 118749440, 98719715, 83802487, 72171081, 62992652, 55650719, 49712741, 44976913, 40984044, 37596735, 34690614, 32214403, 30064164, 28030619, 26165946, 24458060, 23016332, 21855409, 20746261, 19748836, 18876199, 18082550, 17239885, 16430177, 15674079, 15007292, 14360837, 13730135, 13230168, 12788968, 12394170, 11997673, 11615141, 11278813, 10963334, 10694759, 10373692]
4153A0373692k87947k89515k61099k03683k13060k13451j87930j41536r4665r1041
4143H389765R1481j3223j10580n7736O8439J1428L504J5305J12316M0670R4697
4132H646066J63128J34194J59014K00931J56348L10176M16583M91613N49142P12950
4122A1940145Q94571J170991J526072K018490K725841L185579K893842J872848
4114B8228379J03227j922989l474340l872564l285993k460207j832840j379101
4106A0103572j010800q25442p26474n80590m67448m37884l72286k86538l50841
4097E045269k41876j76576k64681j34612j51367j98270j08250k04088j43119j59756
4087C262674j09002j32142o9518l5950j01571m4666o1792K169J692M03K1664O551
$$ y = [10373692, 10085745, 9796230, 9535131, 9331448, 9118388, 8904937, 8717007, 8575471, 8480806, 8389765, 8481246, 8468023, 8357443, 8299707, 8368146, 8379574, 8383078, 8398383, 8510699, 8551369, 8646066, 8809194, 8943388, 9102402, 9303333, 9459681, 9769857, 10186440, 10678053, 11227195, 11940145, 12834716, 14005707, 15531779, 17550269, 20276110, 23461689, 26355531, 28228379, 28331606, 26408617, 22934277, 19061713, 15775720, 13315513, 11482673, 10103572, 9092772, 8267330, 7540856, 6960266, 6492818, 6054934, 5682648, 5396110, 5045269, 4803393, 4626817, 4362136, 4227524, 4076157, 3877887, 3769637, 3565549, 3422430, 3262674, 3153672, 3021530, 2952012, 2916062, 2814491, 2769825, 2708033, 2710202, 2711894, 2712297, 2733961, 2740512]
4075B740512L768j13979L8638p4692k00507q4054q8674j30631n4869o6570o7862
4064A901080K0679r9351k1807M9242l5887m651o0024N9640M9557n4605o7610o7917
4052A668346j4952J4792j06492n5592j853l8710k0386R001N911n2170n2999k6572
4040A328324M71J1596j30885J4103o7989n1235k1584Q206O743J6144Q9732o967
4028A196659K0318j7191L5863N2583n2001m8284M2289j41437m0191j9911k0991
4017A007706l3815K0605j1951K0543L5891J5954o7290k2735n5212P0816J0894
4006I91406m4595J384K3284K9933O005J2356O0799j6578P4731o6186l6888L2785
3994A068436J8469l2955p3443m3200n1804m2735O3624j287q1461l8240J8131n904
$$ y = [2740512, 2744280, 2630301, 2668939, 2594247, 2393740, 2309686, 2221012, 2090381, 2035512, 1968942, 1901080, 1921759, 1822408, 1800601, 1849843, 1813956, 1809305, 1749281, 1808921, 1858478, 1803873, 1736263, 1668346, 1653394, 1668186, 1561694, 1506102, 1504249, 1465539, 1445153, 1454154, 1460065, 1407895, 1354896, 1328324, 1328795, 1340391, 1209506, 1223609, 1155620, 1104385, 1082801, 1091007, 1097750, 1113894, 1203626, 1196659, 1216977, 1199786, 1235649, 1288232, 1236231, 1187947, 1230236, 1088799, 1048608, 1028697, 1007706, 973891, 994496, 982545, 1003088, 1038979, 1054933, 987643, 964908, 909696, 980512, 991406, 946811, 948195, 971479, 1001412, 1007417, 1019773, 1080572, 1063994, 1138725, 1072539, 1035651, 1068436, 1086905, 1053950, 980507, 937307, 885503, 842768, 906392, 905105, 823644, 785404, 803535, 797631]
3982G97631n4934M572j7031K6658n1858p8306M4929j5793q493m2114r6001l0623
3970D78637N3307Q4212K4857j3887K4007m4481J544Q5167k9170k2514l8631k8546
3958E74502K4643k7906j916O2737m8646j931p9581n1312J3879P3271j1002P360
3946E34098J5696n0303q5573O0118n1589l5544P4128l1378o284k7623P1272K9626
3934D96644k9517m4786M1855M3602n9214J5173K1234n0760N7479L752J8247j6103
3922D97606J686P3188l7315K1773M0709N2679P111q808O212N1376k7467N71K8545
3909G07866O8423R4875o9190k3787J23542J53739R3718J28246K23827J99559J17790
3898A818608J2977j72564j91133j83336j56566j60449j15883l3417l3616n639
$$ y = [797631, 742697, 747269, 730238, 756896, 705038, 626732, 671661, 655868, 647375, 605261, 509260, 478637, 531944, 616156, 641013, 627126, 651133, 606652, 608196, 693363, 664193, 641679, 603048, 574502, 599145, 571239, 569323, 632060, 583414, 581483, 501902, 450590, 464469, 537740, 526738, 534098, 549794, 499491, 413918, 474036, 422447, 386903, 461031, 429653, 423369, 395746, 467018, 496644, 467127, 422341, 464196, 507798, 448584, 463757, 484991, 434231, 491710, 495462, 513709, 497606, 499292, 572480, 535165, 556938, 597647, 650326, 657437, 648629, 654841, 706217, 678750, 679321, 707866, 776289, 871164, 801974, 778187, 901729, 1055468, 1149186, 1277432, 1501259, 1700818, 1818608, 1831585, 1659021, 1467888, 1284552, 1127986, 967537, 851654, 818237, 784621, 778982]
3888G78982p8882p1923k2693N7908r6245p8764o3495L9403L7531m3900K8122k0657
3876D65387l0915L3318p970j8889o1825j6340N4054k0955j7163j657j2406K2395
3864C87034n6894K407J36415m1372l6908K654K941n9584m083L0860p6553K1149
3852C08066K0652k1792K9057l2047m8427J1249p20L3589n296M1009m6124o9357
3840B19859k4530q479Q113m705O2997j9905j1846O874O423J7562L0152l4218o0018
3827A88279L9180J9693k1958N8746k1241m2248J6194M7120J3588J2004P3642o113
3815C76886j2836m7387L0421Q618j788j05241K7571j5987p1237L0064M5163n848
3803B58399r3901p0735O1876L7814p295o5579m3852J4863L5831O3843l9483L4514
$$ y = [778982, 700100, 628177, 605484, 663392, 567147, 488383, 424888, 464291, 501822, 457922, 486044, 465387, 434472, 467790, 459820, 440931, 379106, 362766, 416820, 395865, 378702, 377045, 364639, 387034, 330140, 332547, 468962, 427590, 390682, 393336, 396277, 336693, 332610, 363470, 286917, 308066, 328718, 306926, 335983, 303936, 255509, 266758, 266038, 299627, 294331, 335340, 289216, 219859, 195329, 186850, 194963, 190258, 253255, 233350, 221504, 228378, 234801, 252363, 282515, 248297, 188279, 227459, 247152, 225194, 283940, 262699, 220451, 236645, 283765, 297353, 309357, 382999, 376886, 364050, 316663, 347084, 355702, 353914, 248673, 276244, 260257, 189020, 219084, 264247, 258399, 164498, 93763, 155639, 193453, 186158, 120579, 76727, 91590, 127421, 191264, 151781, 186295]
3791A86295L4826l3252J0266O6352j4719o0432J2714J9819M9376l7583r8463j2547
3779A22652O213N6473k4239L1892n6087j2637k8753O3570J4373J7689J5266m6208
3767A60204j0892K8211k8630L6861n5595J196m5602m4256L1645k4532j6895N8066
3755H9781O6882O1873l3789k3576k0171P150r5339m2400M7841N251o8638k8818
3743c3953N9003N1436M4635k2193K5367k636M020j7058l5162O2981J3787o731
3731A43496K0600K3371m8211j0428O190o3235r411L9465P1047r5601j674m5034
3719C0575n111m0949L6624J878N8430n531l3297j8079N5998N7691n452m2521l86
3706H9870R828l7657K2259l0439J4016l5283k5338l4449K8630L3269n2679O3179
$$ y = [186295, 221121, 187869, 198135, 264487, 249768, 189336, 202050, 221869, 271245, 233662, 135199, 122652, 128865, 185338, 161099, 192991, 136904, 124267, 95514, 159084, 173457, 191146, 206412, 160204, 149312, 177523, 148893, 185754, 130159, 131355, 85753, 41497, 73142, 48610, 31715, 89781, 156663, 218536, 184747, 161171, 141000, 148150, 52811, 10411, 58252, 63503, -5135, -33953, 25050, 76486, 121121, 98928, 124295, 121659, 125679, 108621, 73459, 136440, 150227, 143496, 164096, 187467, 139256, 128828, 135018, 71783, 62372, 101837, 172884, 77283, 75609, 30575, 25464, -15485, 21139, 23017, 81447, 75916, 42619, 24540, 80538, 138229, 132777, 90256, 89870, 99698, 62041, 84300, 53861, 67877, 32594, 7256, -27193, 1437, 34706, -17973, 45206]
3694D5206k997l1519m5743L5475O5282k0317j6213M6518m7k601J3573j5209K3618
3681I5026k2557J6841k147M8917L9745m6095n8836k3876L8725q018m0531M7409
3669H4603j2391K7900L5081o437j5343l6776j222l942K8726P4750q1351n0147
3657D3451K4444Q9032O0971q2178k2521K9183L2807j5195P0659j7450L0556m1551
3645B02208J1894m984K1184p6378m5062M414m8052l0713N0152Q344p9194M2563
3633E6376k4386N3165m331k5749l7492J2281M5644J7993l2704K5593l4530j4540
3621C7320M3825o0393L9644j1776R155m483O041L6970L196k2020K3416j05498
3609d603l6158J04359J7048j5967n0836K0094K4518n7862n4119m6834Q5415J0319
$$ y = [45206, 42209, 10690, -35053, 422, 65704, 45387, 29174, 75692, 75645, 73044, 86617, 71408, 95026, 72469, 89310, 87163, 136080, 175825, 129730, 70894, 47018, 85743, 77725, 37194, 84603, 72212, 100112, 135193, 128756, 113413, 76637, 75415, 71473, 100199, 174949, 93598, 43451, 67895, 156927, 217898, 135720, 113199, 142382, 175189, 159994, 230653, 213203, 243759, 202208, 214102, 209118, 230302, 153924, 108862, 113276, 65224, 34511, 84663, 93007, 13813, 56376, 31990, 85155, 80824, 55075, 17583, 29864, 75508, 93501, 60797, 86390, 51860, 37320, 81145, 20752, 60396, 48620, 57775, 53292, 59333, 96303, 99499, 77479, 100895, -4603, -40761, 63598, 80646, 64679, 13843, 33937, 58455, 593, -53526, -100360, -14945, -4626]
3597d626k2627j9087j2427J7373O6370K085k4182N1824j5253Q234n3213q0764
3585h6293Q7096R4009q9097j8839l1014M0618J8174n2150K4718P5421p6931M3682
3573B9394m8748l0621N087M9338O7125n2988k9922M9105L4568l372m2879j6380
3561I707J141o358L7878k0412j32785M3302K7173K3548L7867n0767m1656r221
3549h0583N030L8084K361J3728K4857m5278q5850O3779N485m0351O8034K2820
3537g884j0342L7599J2393k6949J8730o8447K1645K7399j8263m0260N8988K4184
3525B8793K7142J8834m4737k245k965k4247L0300Q654M2390L1888q1402m713J8293
3512D5985n2377K2598j6929J3776l1528p5625L3059P0851j2604P999j1542k3372
$$ y = [-4626, -27253, -46340, -58767, -41394, 24976, 27061, 2879, 54703, 39450, 47684, -5529, -86293, 803, 94812, 5715, -13124, -44138, -3520, 14654, -37496, -12778, 62643, -14288, 29394, -19354, -49975, -44888, 4450, 71575, 18587, -11335, 37770, 72338, 68966, 26087, 9707, 10848, 4490, 42368, 21956, -110829, -67527, -40354, -16806, 21061, -29706, -71362, -80583, -75553, -37469, -35108, -21380, 3477, -41801, -127651, -63872, -58387, -98738, -30704, -7884, -18226, 19373, 31766, 4817, 23547, -44900, -23255, 4144, -14119, -54379, 4609, 28793, 55935, 74769, 30032, 27787, 24822, 575, 30875, 39529, 81919, 113807, 32405, 27692, 45985, -6392, 16206, -723, 13053, -18475, -94100, -61041, 9810, -2794, 5205, -6337, -29709]
3500b9709k1294k6693J16817j337R996k5466K8950K6388m708m6804l1868n0879
3488e6607K7605J18380l8798J0461R751m9919q391L7742K2136k8248k2267j4652
3476G193J4491K6210L5925l1239p5891O000j470Q3700n7597M0814N54J6231r3940
3463b9019J1184R8965n4489n2953J6781m785j66L3602O4267o0004L513M0924O7792
3450A35612J7171o2423L87k6830k5217m4045K8475m3249l3334k5369M7950M7506
3438A6634k2505M7094n8898k9091K2274N2789K7941j6952l7229m144M4017M280
3426D6210p24o6730k596k612K8203J8889K3754j2288Q6102l8509q150J5546p19
3413H6376k906o0239l3491P0034l8536o938O835o934M0163m6575j2276K5377L1390
$$ y = [-29709, -51003, -77696, 39121, 37784, 47780, 22314, 51264, 77652, 72944, 26140, -5728, -56607, -29002, 89378, 50580, 61041, 70792, 20873, 12482, 50224, 72360, 44112, 21845, 7193, 21684, 47894, 83819, 52580, -23311, -17311, -18781, 64919, 7322, 48136, 48690, 64921, -29019, -17835, 81130, 26641, -26312, -9531, -14316, -14482, 19120, 83387, 23383, 26896, 67820, 135612, 152783, 90360, 90747, 63917, 38700, -5345, 23130, -20119, -53453, -78822, -30872, 16634, -5871, 41223, -17675, -46766, -24492, 28297, 56238, 39286, 2057, -2087, 41930, 46210, 45486, -21244, -23840, -26452, 1751, 20640, 44394, 32106, 118208, 79699, 71549, 87095, 86376, 83470, 23231, -10260, 59774, 21238, 14300, 21135, 14201, 54364, 7789, -4487, 20890, 52280]
3400E2280j6873Q859n781m4052K4652J0711O6412Q223k8019j4546k8253j1954
3388B1659J2707J2709l3019Q704l373J0045p198L4087r888M7915o05l0320M4033
3375A07456Q5467j9896p0546M0208k3245K957r373j22374K5170m3231L2425O9429
3363G4447N2259J8735l5638k2606n7381L6775Q515j3297N591j1915m6175L9079
3351D8389N053j3936M2161L2522J6670l3402N1499M5101k2526o2173J3515L2194
3339A55067m805k4698l1642J5259O3906l2989k2393N9998p302r139L283J1184
3327A75729k6535M3349k5356l4682N083K2463L2886p4711j01855J39327O0961
3316B16659m2525p836O6656k660M2520j4929N4338J2838l6870m261N8083M9859
$$ y = [52280, 35407, 44266, 38485, -5567, 19085, 29796, 96208, 104431, 76412, 61866, 33613, 21659, 34366, 47075, 14056, 22760, 19387, 29432, 22234, 56321, 46433, 94348, 93743, 63423, 107456, 192923, 173027, 102481, 142689, 119444, 122401, 113028, -9346, 15824, -27407, 5018, 74447, 126706, 145441, 109803, 87197, 29816, 66591, 75106, 61809, 67400, 55485, 9310, 48389, 53442, 39506, 81667, 114189, 130859, 97457, 148956, 194057, 171531, 109358, 122873, 155067, 150262, 125564, 93922, 109181, 173087, 140098, 117705, 177703, 170401, 161262, 164545, 175729, 149194, 192543, 167187, 132505, 137588, 160051, 192937, 118226, 16371, 155698, 216659, 174134, 166298, 232954, 230294, 272814, 257885, 312223, 325061, 288191, 283930, 342013, 391872]
3304C91872p4424P683O2401n824J4930O5707n8778n714K0572O1942p519L2916
3292E05764m5423k4260j7475l7512J01638j0568J9379J6358M6407l026m249Q5595
3280F32628j5557L0706l6981J12602J4447J0546J11691O242M0912R0306P7809
3269A075351N7899J35318J12796K55640L22578K30225K97821L49905J91258k2863
3259C005928l76600m73846j91915j93191k38663j68644k2088k4429o8165P424
3249A255811K4803O0228m1566k4874k5383J36110J58589N4598P5255Q4064J62008
3238A919643N9692J84038J89437K32763K50145M14077N84608O67782N05053K63462
3228E270700j98769o70372q35256o98689n27812l00805k35424k46038j03185j39466
$$ y = [391872, 317448, 325131, 387532, 381708, 396638, 462345, 403567, 397853, 418425, 480367, 472848, 505764, 460341, 436081, 418606, 381094, 482732, 472164, 491543, 507901, 554308, 551282, 547033, 632628, 617071, 647777, 610796, 723398, 737845, 748391, 860082, 866324, 907236, 997542, 1075351, 1133250, 1268568, 1381364, 1637004, 1959582, 2189807, 2487628, 2837533, 3028791, 3005928, 2629328, 2155482, 1963567, 1770376, 1531713, 1363069, 1340981, 1316552, 1248387, 1255811, 1280614, 1340842, 1299276, 1274402, 1249019, 1385129, 1543718, 1598316, 1673571, 1757635, 1919643, 1979335, 2163373, 2352810, 2585573, 2835718, 3249795, 3834403, 4502185, 5007238, 5270700, 5071931, 4401559, 3566303, 2867614, 2339802, 2038997, 1803573, 1557535, 1454350, 1314884]
3218A314884l9387r3276p4109p9565l2958j8695k8833L9173K3995n456m1002M6715
3206A011486J08545R664P4884J76025J18916J91202L01830L19062K12218n443
3196B518389j40704k96997l42686k95441k96642k00883j36168r1889o9619q2904
3186E64456j1727o0763l144j4000o4390k8341l3174n9524j0422M1552m1402m2355
3174B36766L2373L0403j4338J4025o6927l6525P0228l1744o4236l512j7366j1170
3162A37977R9462m3787l4168j2940p5905K7973K2940l217L3174N635n1824L528
3150A08848j3507J9518m0767O01j4973j9025M5699o1685O7299O6984J0384l7020
3138A32356o256n4747K4785M7681l9100k3464M3046r919m8503J8897j8191K6913
$$ y = [1314884, 1275497, 1182221, 1108112, 1028547, 995589, 976894, 948061, 987234, 1011229, 1005773, 964771, 1011486, 1120031, 1129695, 1204579, 1380604, 1499520, 1690722, 1992552, 2311614, 2523832, 2518389, 2377685, 2080688, 1738002, 1442561, 1145919, 945036, 808868, 716979, 647360, 564456, 552729, 491966, 488822, 474822, 410432, 382091, 348917, 289393, 278971, 320523, 279121, 236766, 269139, 299542, 285204, 299229, 232302, 195777, 266005, 234261, 170025, 166513, 149147, 137977, 237439, 193652, 159484, 146544, 70639, 98612, 121552, 118335, 151509, 157144, 105320, 108848, 95341, 114859, 74092, 74693, 59720, 40695, 86394, 24709, 92008, 158992, 169376, 132356, 126100, 71353, 96138, 143819, 104719, 81255, 124301, 114382, 65879, 84776, 66585, 93498]
3126I3498M8857k848n4760m1474M6488K3169l874L5983o1438m9658M320Q504p206
3113C9561R134L706O3501L6849k8792o9475l1173q2227N2690Q0345j6974k533
3101E4612N2686j5619m5412m5500k3058j7579J5818M4621j4380N8651M8389j18161
3089d932n1375N9376j3868K0604K3115M6017n0857m195j1660Q662K9416M5444
3077I5747l8271P261K7571m0622Q254K4322l7716j336j2559l3245K8004j5077
3065A2333o7764L8093j7042l0016R703M0029k3203J5414K6935p392l3411J9706
3053a6615K6854q79P66j7844L55N43K4830J4747j8947j50906M6380N3348J9013
3040a8355m5155R708N9725K8400M6289m7015l3295q4632q7804N4320L6093p613
$$ y = [93498, 142355, 139507, 84747, 43273, 89761, 112930, 109056, 145039, 83601, 33943, 38263, 46767, 39561, 48695, 52401, 115902, 152751, 123959, 54484, 23311, -58916, -6226, 74119, 57145, 54612, 107298, 91679, 46267, 767, -22291, -39870, -24052, 20569, 6189, 64840, 113229, -4932, -56307, 3069, -10799, 9805, 32920, 78937, 28080, 23885, 12225, 20887, 50303, 95747, 57476, 64737, 92308, 51686, 59940, 84262, 46546, 45210, 32651, -594, 27410, 12333, -55431, -17338, -34380, -64396, -54693, -14664, -37867, -22453, 4482, -2910, -36321, -16615, 10239, 9360, 10126, -7718, -7363, -6820, 18010, 32757, 13810, -137096, -90716, -37368, -18355, -63510, -53802, 5923, 34323, 80612, 33597, 302, -84330, -172134, -117814, -81721, -89334]
3028h9334P0980J10749k2372p5483q7386m5179L1963Q7951L2867L0748j2690j2979
3016A9835r5481R4743k0682m6278K9080R841k8853J6959o956R046P1826k5746
3004B7334o2289n2574j7199N423M6301j0156K8378O261L5375n1945N133k4395
2992f4353Q35J7184K5115K8612N5517p753J7858r419j6186K3636j9353r5482l3060
2979g6849N2742J8245p0281k1565R6668M8126p0447j6746J4489o4726j4406N9397
2967d5353k4511j3551J09514j6820j9853k1158N1223m7156o0136M0756l6881J08359
2955B4433N4549k716o3012o0356O1847m0989q106J8473l6520K1092P4754L8910
2943H2359l1572m1208J5983l073M692J8198m4640p0569l8947L8617J0532Q667
$$ y = [-89334, -18354, 92395, 70023, -5460, -92846, -138025, -106062, -18111, 14756, 45504, 32814, 19835, -75646, 19097, -1585, -47863, -18783, -8942, -37795, -20836, -27792, -18746, 53080, 27334, -34955, -87529, -104728, -99305, -53004, -63160, -34782, -28521, 6854, -45091, -39958, -64353, -63518, -46334, -21219, 7393, 62910, 55157, 73015, 63596, 47410, 71046, 51693, -43789, -76849, -24107, -5862, -76143, -97708, -1040, 47086, -23361, -40107, -25618, -90344, -104750, -45353, -69864, -83415, 26099, 9279, -10574, -31732, 19491, -27665, -87801, -47045, -83926, 24433, 78982, 76266, 13254, -47102, 14745, -26244, -34350, -15877, -52397, -31305, 43449, 82359, 50787, 9579, 25562, 22489, 27181, 45379, 739, -69830, -108777, -70160, -59628, -50961]
2931e0961L7413l7656o861L5472J8234l4921o655K4845k4833L4069L6725o7885
2919d3014j9776J0507p3837O0923L2495K406M0540L8596l2202p8331J5177L7340
2907i176l5384k7206L4464N3346K127q0457l9145Q5772J8953j3491L6786k1906
2895D683k3587J1021R232o2609l772K8577K4567M4787J01239p7407m2085j616
2883A3030j3218N2347l1744k6465K2270J5393m806k3297R378k6895J5208L3476
2871C4677O345q200O329m1032J5455j7078K4457N1599n5676m1742N4411O5012
2859I4557p2711j2069n732J6521J0472l5882j5729O3866l9416J894K8424j1944
2847B2251o0670M8689K2568m3428r306L5862n2300n4938L7547K5221j1779L9913
$$ y = [-50961, -13548, -51204, -58065, -22593, -4359, -39280, -45935, -21090, -45923, -11854, 24871, -43014, -62790, -52283, -126120, -65197, -32702, -30296, 10244, 48840, 16638, -61693, -46516, -9176, -44560, -71766, -37302, 16044, 18171, -62286, -101431, -15659, 3294, -10197, 26589, 4683, -18904, -7883, 1349, -61260, -65032, -36455, -11888, 32899, 134138, 56731, 14646, 13030, -188, 52159, 20415, -6050, 16220, 31613, 26807, 3510, 12888, -14007, 1201, 34677, 41022, 32822, 39151, -1881, 13574, -3504, 20953, 72552, 16876, -24866, 29545, 94557, 21846, 9777, 4045, 20566, 31038, -4844, -20573, 43293, 3877, 5771, 34195, 22251, -38419, 10270, 32838, -10590, -19896, 15966, -36334, -91272, -53725, -28504, -40283, -370]
2835c70O6778n4173r936l1445K8300L7898k0773n9188m1027L3938M4765l8196
2823d3429L753j7497J7483J7618n1372K3693J8621l3456l4937N6262M4279j6277
2811a5259m4065p545m516K8683M6249L2359j19440q8708L7545k9022P6566K7822
2799e9331j2765O5649j1572l3416N1625K9043o207k3201q620j4018J1561K2070
2787A0818m5355k514k1574M3452k0201K2262j9383n7463J4667m0079L86J2820
2775a02164l2987j8624N9011M6061k8699k3952J4283n4225K8818K1530K664J5857
2763g2427J4986P147j6202J0240P9264j0588p0449q3758M2259K9839K3506L6932
2751i251j7578J4342m0433K648O1001m8158j6927J4103l3695m3161n0907P2166
$$ y = [-370, 66408, 12235, 2299, -29146, -846, 37052, 16279, -42909, -83936, -49998, -5233, -43429, -39676, -57173, -39690, -22072, -73444, -49751, -31130, -64586, -99523, -43261, 1018, -15259, -59324, -66869, -71385, -42702, 3547, 35906, -83534, -172242, -134697, -163719, -87153, -59331, -72096, -6447, -18019, -51435, 190, 29233, 23026, -175, -8795, -22813, -11252, 10818, -34537, -37051, -58625, -15173, -35374, -13112, -32495, -89958, -75291, -115370, -114984, -102164, -135151, -153775, -94764, -48703, -77402, -101354, -87071, -141296, -112478, -90948, -88284, -72427, -57441, -50294, -66496, -56256, 23008, 12420, -58029, -141787, -99528, -69689, -46183, -9251, -26829, -12487, -52920, -50272, 10729, -37429, -54356, -40253, -73948, -117109, -168016, -95850]
2739i5850j9476O5537o806k4190Q5866n0243n7059K6940M2747m9079k9259l0352
2727a41224Q5883J8690J8689K7717j8407M576l5919L1629n1687o6249j9740r204
2715a55246K0671N010R822l825l8601N1199P2626Q4569l4569k0808j08585K473
2703a15264M945o9542J4568Q5257j802m0078l9694K7460j686k4373K5228N4139
2691h0842k762n6743N2056l0369K4212O5928O110l1004O0411k9775m4546K9069
2679c8255n4014M5622M4228p0283K10j2734j1528k0600M4163P812J092O1791j0868
2666a3364n9027l5128m4162L4045N6374K2560p7347m075J2513m6924L5328L4917
2654h4290K4952K0041q7492J8789l59m7624l548M2463K9303N1361l1876k5638
$$ y = [-95850, -115326, -49789, -56595, -80785, 5081, -45162, -102221, -75281, -32534, -81613, -110872, -141224, -55341, -36651, -17962, 9755, -8652, -4076, -39995, -8366, -60053, -126302, -146042, -155246, -134575, -129565, -119743, -123568, -162169, -110970, -38344, 46225, 11656, -9152, -117737, -115264, -110319, -179861, -165293, -80036, -81838, -121916, -161610, -134150, -135836, -160209, -134981, -80842, -83604, -140347, -88291, -118660, -94448, -28520, -22410, -53414, 6997, -22778, -67324, -38255, -92269, -46647, -2419, -72702, -72492, -85226, -96754, -117354, -73191, -65379, -64287, -2496, -13364, -72391, -107519, -151681, -117636, -61262, -38702, -116049, -120124, -107611, -154535, -119207, -84290, -59338, -39297, -126789, -108000, -108359, -155983, -159531, -117068, -87765, -36404, -68280, -93918]
2642i3918J9614K377O8661k7057l2499N6083j6300k0941Q0052N3599p0085m5216
2630b5630n8529Q6691o1628j17958R0901M0666L5056J3879k6526L7124O5989k3130
2618E6905p6595l5265k0581o8596K9237K5675l816L5606j507j4911m875K6034
2606e2689O990n8163M6019m335n5860M0478K8197l9201K1127m0095P1548L0348
2594e636J0384O179k5417o3433N905L5219O8812p5907k5016J3424k0552j9963
2582i6001N5187N8630p671n7710N1002m5462p1559J6412K2179L5347N2618K772
2570A5744M7177q7455j0230k5354l5785l9722K3999J6348N7112j1347j9055K6817
2558d1751l0414N7897p4131l9759j0410M2213P440n2357p987P9938o1762j2068
$$ y = [-93918, -74304, -71927, -3266, -30323, -62822, -6739, -23039, -43980, 36072, 89671, 19586, -25630, -84159, 2532, -59096, -177054, -86153, -45487, -10431, 3448, -23078, 14046, 80035, 56905, -19690, -54955, -75536, -144132, -114895, -89220, -93036, -57430, -58937, -73848, -78723, -52689, -45699, -103862, -57843, -62178, -118038, -77560, -49363, -88564, -67437, -107532, -35984, -5636, 4748, 10927, -14490, -77923, -72018, -36799, 32013, -43894, -68910, -55486, -76038, -96001, -40814, 17816, 10145, -47565, 3437, -42025, -113584, -97172, -74993, -39646, 12972, 15744, 62921, -24534, -34764, -60118, -95903, -135625, -111626, -95278, -38166, -49513, -68568, -41751, -72165, -14268, -88399, -128158, -138568, -96355, -88915, -141272, -149259, -69321, -131083, -143151]
2546a43151K6911O5176J9288M0383l270L9800o223l9706n5558O3k5482M7156k7843
2533f2456K6388K3770P31j26383J8922q306J8266j5428P2907m9398p1830O5909
2521a06908Q9583Q304J7321p543P562m1836j2675k6151m8366o565K1967N6262
2509d9045l2635J0085l8345N5709l395J8217j03944N1285n8193J3100O9909k5719
2497i2971k7694M314N8340j0500n1443q026k9707L7193O9543J687N0395K7078
2485B8209j08658N341l0075l3450L0278J0830J4565K5610J05213l0728n5084K8456
2473i493Q03j3801O9051J507l1074o4513M3592k2017l4581P2158q0091j4117R4911
2460A2335O956n1988q432l5871N0805n119l7665r465L8158M8935P3699l4700k25
$$ y = [-143151, -116240, -51064, -31776, 8607, 5337, 45137, 38914, -792, -56350, -56287, -81769, -34613, -62456, -36068, -12298, -11567, -137950, -119028, -127334, -109068, -124496, -51589, -100987, -172817, -106908, -17325, -9021, 8300, 757, 8319, -33517, -46192, -72343, -120709, -127274, -105307, -49045, -81680, -71595, -109940, -54231, -57626, -39409, -143353, -92068, -150261, -137161, -67252, -92971, -120665, -116351, -58011, -68511, -119954, -127980, -157687, -120494, -50951, -49264, 1131, 28209, -80449, -75108, -105183, -138633, -108355, -97525, -82960, -57350, 47863, 17135, -37949, -9493, -8690, -22491, 46560, 48067, 16993, -47520, -3928, -25945, -60526, 11632, -68459, -82576, 12335, 19291, -32697, -41129, -77000, -26195, -31314, -68979, -78444, -40286, 8649, 82348, 47648, 47423]
2447D7423n8294q8515J1491J23254l6179p148l2340n1035R174L5939L0442l3387
2435d9175L4834j1540Q398J9505m0735k2903Q2103M747o2312m6098R369K8744
2423d5063J6182q965L8012N1613o5042n7897L1258l1141q301p5221R1461M7519
2411a5585q426K7947m6945J521o0463j6758M0689R8631j6646n9303j5203m0713
2399a11254J2600N8046J17148j7213q6300o809Q610k0343j4055K4375Q286K8358
2387A449K2281r726J0901r7012O6581j0688n4925j01688O5740J21554L8571L784
2375E6822L6564L3161j2557J7370L310L5528M2048n2873M9546j7181j32458k9381
2363B9899R246Q8863l4179k4229n849O3387p573l1957j18647N7119J6940N0920
$$ y = [47423, -10871, -99386, -87895, 35359, -820, -7968, -40308, -91343, -82169, -46230, -15788, -49175, -14341, -25881, -17483, 2022, -38713, -61616, 20487, 25234, -37078, -83176, -73807, -45063, -28881, -37846, 166, 51779, -13263, -71160, -39902, -71043, -79344, -154565, -63104, -15585, -24011, 3936, -43009, -41488, -101951, -118709, -78020, 20611, 3965, -55338, -70541, -111254, -98654, -40608, 76540, 59327, -26973, -33782, -25172, -45515, -59570, -35195, -26909, 1449, 23730, 14004, 24905, -72107, -5526, -16214, -71139, -172827, -107087, 14467, 53038, 56822, 93386, 126547, 113990, 131360, 134670, 170198, 212246, 159373, 208919, 191738, 59280, 29899, 39145, 128008, 93829, 69600, 63751, 127138, 119565, 87608, -31039, 26080, 43020, 93940]
2351I3940j9370m8253n1154N1516O3338p5006k591J7037j0772N9165n6126n2141
2339c0417j4692K1771L2343L6552p0916O353L3620L2660M021p8805J679m7503
2327g3334O1758q2391j3050L6301P140o8753J02473l6610J1484L8252o4867J2173
2315f9424M1871Q0917k8911L5402K3745m6915m9409q067J9976O8025M378j04794
2303c3206O2073K1119J098l9231j6550M516M7304o4176J2428J0980R1292R687
2291A07334l625K891J590L804p1660l2361q836J02076L2157k6934r475K9328K1745
2278A48034Q375q3134L446k2422P605j06468L311O3726j9389j3241N6468M8391
2266I4702j6023K0799k788R958L9208n9051J0978m1391L9152M4206k7116j0749
$$ y = [93940, 74570, 26317, -24837, 26679, 90017, 15011, 12420, 29457, 18685, 77850, 21724, -30417, -45109, -23338, 9005, 45557, -25359, -19006, 14614, 47274, 51295, -27510, -25831, -73334, -11576, -93967, -107017, -70716, -63576, -132329, -29856, -66466, -54982, -16730, -81597, -69424, -27553, 53364, 24453, 59855, 83600, 36685, -12724, -20791, -815, 67210, 71588, -33206, 28867, 49986, 51084, 11853, -4697, -181, 47123, -17053, -4625, 6355, 97647, 107334, 103709, 106600, 108190, 111994, 40334, 7973, -863, 101213, 133370, 106436, 96961, 126289, 148034, 156409, 73275, 76721, 54299, 61904, -44564, -41253, 22473, 3084, -10157, 46311, 94702, 78679, 99478, 96690, 106648, 145856, 86805, 97783, 56392, 95544, 139750, 112634, 101885]
2254A01885J1573k5620J3031j9106l205K8154n0119M0611N30J3219M5567K0237
2242A76757p2746K6856P1087N512k0809J2965J6375k7686k7649N418L403k7749
2230A41734N5781M287K4085Q336L1534o7505l604O8768j0493o8564K3735J9355
2218B27449o6945J011R1084J6426L1029k2421L2542J8373k2500K8708o972P4814
2206D02598m6490k5177n4686K9232J1835j4920O3926R7927p3385j11275J0547
2195B90132P4308O9R9938j3376o812K8268M2181L3984K4144J5947K6678K3188
2183F38649N8778o0577J5927N1970M0154R495K3774L5413J3013P903K310O4058
2171I00867P183M1360K8622J0125J2118q354J3968m4916N9818M1665M4933k543
$$ y = [101885, 113458, 87838, 100869, 81763, 78558, 106712, 56593, 97204, 97734, 110953, 156520, 176757, 104011, 130867, 201954, 207466, 186657, 199622, 215997, 188311, 160662, 166080, 169483, 141734, 197515, 201802, 225887, 234223, 265757, 198252, 194648, 263416, 252923, 184359, 208094, 227449, 160504, 161515, 252599, 269025, 300054, 277633, 310175, 328548, 306048, 334756, 327784, 402598, 356108, 330931, 276245, 305477, 317312, 302392, 366318, 464245, 390860, 279585, 290132, 364440, 364509, 464447, 451071, 444259, 472527, 514708, 548692, 572836, 588783, 615461, 638649, 697427, 636850, 652777, 704747, 744901, 754396, 778170, 813583, 826596, 834499, 836809, 900867, 908050, 949410, 978032, 988157, 1000275, 991921, 1005889, 960973, 1020791, 1062456, 1107389, 1104846]
2159A104846N4402N8565P855R3652N5548N7772k0706Q4140K4211j7657Q6928K8592
2147A618148M3002j670M9170L8482M2088J14932L2399J12331O0143J32573L5827
2136B277425J78991J67754J25484J18334J37778J46592Q1212J28973J85832J45051
2126C693426J44066K04999K38751K30049K87977L03330L85026L57949N18410M68081
2116F832064M53878N28015M93726N25234N80747P55136J020906J219033J501583
2107A3910322J755560K448364L245518M649380N992297N592567L174372K226073
2099D2994453l029261p852360o748595n282453l650503k795234j972926j593198
2091A0069923j244591r68499o43814n42623l64488m25890m14486m08719m26155
$$ y = [1104846, 1159248, 1217813, 1225668, 1319320, 1374868, 1432640, 1411934, 1496074, 1520285, 1502628, 1589556, 1618148, 1661150, 1659480, 1708650, 1747132, 1789220, 1904152, 1936551, 2048882, 2109025, 2241598, 2277425, 2456416, 2624170, 2749654, 2867988, 3005766, 3152358, 3233570, 3362543, 3548375, 3693426, 3837492, 4042491, 4281242, 4511291, 4799268, 5102598, 5487624, 5845573, 6363983, 6832064, 7285942, 7813957, 8307683, 8832917, 9413664, 10168800, 11189706, 12408739, 13910322, 15665882, 18114246, 21359764, 26009144, 32001441, 37594008, 40768380, 42994453, 39965192, 32112832, 25364237, 20081784, 16431281, 13636047, 11663121, 10069923, 8825332, 7856833, 7213019, 6670396, 6305908, 5880018, 5465532, 5056813, 4630658]
2082D630658n50611l27932k48623k49238k08439j35955j41731q5006j97122j61255
2072B324746j60690r4365j16511p5862j9009m5933j00165j24733o3426l8891q0962
2061A404199k0811K4837r1085j69998j4660L4698j09267p6361l0091p9623O975
2050H78813k9821k9081K4421l1511j8342o1696O8812M5544p4159n8645j2794J3475
2038G15016j5570R220j7874o5707k1039J2152n0205l1438k2093K2827J2895n9946
2026D88238p7078L219j4437l9276l9350N194K9383Q655k2111m5451J6983q566
2014C05403m641P1441r253k3011J2143o1068M0061m6649K3032k4147n6874j7894
2002B08543m6729o1278L2319J15244n1894m3209K7649j3315q182m9731J19113
$$ y = [4630658, 4080047, 3752115, 3503492, 3254254, 3045815, 2909860, 2768129, 2683123, 2486001, 2324746, 2164056, 2069691, 1953180, 1877318, 1858309, 1812376, 1712211, 1587478, 1524052, 1485161, 1404199, 1383388, 1408225, 1317140, 1147142, 1132482, 1167180, 1057913, 981552, 951461, 871838, 878813, 848992, 819911, 844332, 812821, 794479, 732783, 801595, 847139, 772980, 714335, 701541, 715016, 699446, 708666, 690792, 625085, 604046, 616198, 565993, 534555, 512462, 535289, 548184, 488238, 411160, 414379, 399942, 360666, 321316, 326510, 355893, 364548, 342437, 296986, 313969, 305403, 300762, 372203, 362950, 339939, 352082, 291014, 331075, 284426, 307458, 283311, 226437, 208543, 161814, 100536, 132855, 248099, 196205, 152996, 180645, 167330, 159148, 109417, 228530]
1991B28530K7746j7485l8601j454o7172k0426R0322J7696m3076L316n6823K6116
1979A48689R557j0301M423p934j6983n0324k5523M3725Q1687J9500p1249q9909
1967C5358O9421J4439k9623k248k6040N297O024K806M934N3676l6331m7070j6191
1954C4452j9913P0790k7364k5557N8717p762l547j3003m308j1682O412l4246M9672
1941G2661j3595K732k7167q7489N8159M078Q1571j33L0304p9244L1824k8056j4899
1928C0746j6319n7j4853J7116l7599Q038K1070m879N0982l2091K229O7804p3128
1915A9059m5901J5024j4106J06123Q991K9834j3136L3913P512J5576j04518J0920
1903F9291j1800j09033M2889O4611j3881j1432n6292J4974O646j0043O2445n330
$$ y = [228530, 256276, 238791, 200190, 198736, 131564, 111138, 201460, 219156, 176080, 179396, 122573, 148689, 158246, 147945, 152368, 144434, 127451, 77127, 51604, 95329, 177016, 196516, 125267, 35358, 104779, 119218, 89595, 87347, 61307, 66604, 72628, 75434, 80368, 134044, 97713, 50643, 34452, 14539, 85329, 57965, 32408, 91125, 83363, 79816, 66813, 62505, 50823, 57235, 22989, 72661, 59066, 61798, 34631, -52858, 5301, 9379, 90950, 90817, 121121, 41877, 73701, 45645, 30746, 14427, 14370, -483, 16633, -20966, -12928, 8142, 3263, 54245, 22154, 24383, 92187, 19059, -26842, -11818, -25924, 80199, 89190, 119024, 105888, 139801, 147313, 162889, 58371, 69291, 57491, -51542, -8653, 55958, 42077, 30645, -25647, -10673, -4027, -14070, 48375, 43045]
1891D3045j9323j560R894k6269O3728R055p2134j3791J3405r622P1140o6181o2748
1878f1361K8354M8774o6274j109k2013k3974O5972j0565L179N4839K1329O5056
1866A02207l634o7777M183O705K6876o5994j809K4340k8748L7858R573j3341m7122
1853a6683J5266N4195o0020k6373L430R1487L3470n0231l4831L4579M8604L7541
1841A30434J3557l990o3759l6160K6345j6698Q7096O1673l5702l4467m4945M5316
1829A28700K9881l0376k7897n9430m9770R5831j809j6977q561k8443n1054j2092
1817c1997Q7760j293j7215O5190o1852k9836O059Q996L290k1868j9746K5061m6869
1804c4320j244R1368l9629k5278K7358p880j8903K0850R035k1821m5675L1883
$$ y = [43045, 23722, 22162, 32056, 5787, 69515, 78570, 6436, -7355, 6050, -3572, 67568, 1387, -61361, -33007, 15767, -50507, -51616, -73629, -97603, -31631, -42196, -39017, 15822, 37151, 102207, 98573, 30796, 34979, 41684, 68560, 2566, 757, 25097, -3651, 34207, 43780, 30439, -16683, -1417, 52778, -7242, -33615, -30185, 61302, 94772, 44541, 9710, 44289, 92893, 130434, 143991, 140001, 76242, 40082, 66427, 49729, 136825, 198498, 162796, 128329, 83384, 128700, 158581, 128205, 100308, 40878, -8892, 86939, 85130, 68153, 59592, 31149, -19905, -31997, 55763, 54470, 37255, 102445, 40593, 10757, 16816, 25812, 29102, 7234, -12512, 12549, -34320, -35564, 55804, 16175, -9103, 18255, 10375, -8528, 12322, 21357, -464, -46139, -14256]
1792a4256l922J3354j8691l4428l1622l7663K9314M2874J2827K0243m2022K0331
1780d3661n701J2401l59m0701J645k6510P0097j7131n1231J00273l5038O92M6868
1767A1644L6574o3278L7636P99l8609o2660K1880K939j0482K3800j2860J7572
1755c5045j4032r634L1953L7305M19M0714o9965k8264n4115P3657K1217q623j076
1742a5489j0612P609J7546K705k5847N7735M2772l0338l4021K4041r203O1673
1730H8571l5142m8793k2151K2342K1545m8637O6804k3512r0423M6110K3371j322
1718a237m7639L74M7815j2719l6024o207l2099l9669O4719M5743q535j7988k2106
1705f5572k7449M1325J1615K1516J027J5293L8811j8380o1063Q371J6795p6180
$$ y = [-14256, -18178, -4824, -23515, -57943, -89565, -127228, -97914, -55040, -42213, -21970, -63992, -43661, -49362, -36961, -37320, -78021, -76376, -102886, -32789, -49920, -101151, -878, -35916, -35224, 11644, 48218, -15060, 22576, 23375, -15234, -77894, -56014, -53075, -63557, -39757, -52617, -35045, -49077, -58711, -26758, 10547, 10966, 51680, -18285, -46549, -100664, -27007, -5790, -14413, -15489, -26101, -18492, -946, 1759, -24088, 33647, 76419, 46081, 12060, 36101, 26898, 88571, 53429, 4636, -17515, 4827, 26372, -22265, 44539, 21027, -69396, -23286, 85, -1237, -48876, -48502, -687, -13406, -49430, -55637, -87736, -127405, -62686, -16943, -25478, -43466, -65572, -93021, -51696, -40081, -18565, -17538, -2245, 36566, 18186, -42877, -34506, -17711, -93891]
1693i3891o4711N7510K4651N7883K1680j0393L2782k5770p053N3769l1880l5337
1681b0760j7385L9050M5164m4283M4664K3185q2390l5892j0770j4872k182J8082
1669e8389j3785K2196N9265j10922K2286N2240m0563L1963K3907J6081n7468K7481
1657b5708L7835J6381l6869m3596o212L0476O178p5769Q812Q0543k4603j3875
1645d6407j2747N7749L2871q574J9583Q49r8324j9396J1475r1070R1798L4457
1633b7736k7920Q2705N194o8549j3648l0785k95P7379m974q515o3351l0466O2250
1620d8711J6169k0912L1161J9005L2420K0357k1909P879q7042J6434N7387n3116
1608c0878K9428k2580o6594P4655O4423k9073Q950R168K215k3068o7895P58j9699
$$ y = [-93891, -158602, -101092, -76441, -18558, 3122, -7271, 25511, -259, -7312, 46457, 14577, -20760, -38145, 905, 46069, 1786, 46450, 69635, -12755, -48647, -59417, -74289, -76471, -58389, -72174, -49978, 9287, -101635, -79349, -27109, -67672, -35709, -11802, 4279, -53189, -25708, 12127, 28508, -8361, -51957, -58169, -27693, -21515, -97284, -88472, -7929, -32532, -46407, -59154, -1405, 31466, 22892, 42475, 43324, -55000, -74396, -62921, -153991, -62193, -27736, -55656, 27049, 32243, -36306, -49954, -80739, -81034, -3655, -8629, -17144, -80495, -110961, -48711, -32542, -53454, -22293, -3288, 29132, 49489, 27580, 35459, -51583, -35149, 22238, -30878, -1450, -24030, -90624, -15969, 48454, 19381, 28331, 37499, 39714, 16646, -51249, -50491, -70190]
1595g0190Q6593r9155K993N6601K4946n3843L1118j1492J1109k1499q367L1634
1583a9552J6523N4686l0117r046k3028j6911L7312j5522L0912K1309K566P641
1571E6773k6947M317p7762l5552q039K2302j6615l5144L0229K7348P1081n7041
1559d5050J4266J8105j7391K548n9176J5854j099j2953P887P920n8888K8563K8337
1546g1077K9092Q339r3782M5348M8969k386l4994R952k2890J5126K322m423O3839
1533f565j3515k1370n4073N8101L4129o2181k0165K2138j8022M5501Q59L775N0401
1520A9013n6270O99l2306J1592Q7770r301M5323N989m1374k820K6461n3516r124
1507g864N491N504k9492l4090L9173j02j623k2053j3849L3833K0380M2368p2215
$$ y = [-70190, 16403, -82752, -79759, -23158, 1788, -52055, -20937, -32429, -21320, -42819, -51186, -19552, -3029, 51657, 21540, 12494, -10534, -27445, 9867, -5655, 25257, 46566, 49132, 56773, 29826, 34143, -43619, -79171, -87210, -64908, -81523, -116667, -86438, -59090, 11991, -45050, -30784, -12679, -30070, -27522, -86698, -70844, -71943, -84896, -77009, -69089, -127977, -99414, -71077, -41985, -33646, -127428, -82080, -33111, -35497, -70491, -60539, -83429, -68303, -65981, -70404, -6565, -20080, -41450, -95523, -37422, -3293, -65474, -85639, -63501, -81523, -36022, -35163, -31388, 19013, -37257, -36558, -68864, -57272, 30498, 21197, 66520, 72509, 31135, 28315, 54776, 1260, -7864, -2373, 3131, -26361, -60451, -21278, -21380, -23003, -45056, -58905, -25072, -4692, 37676, -34539]
1494c4539j5547k9607k2488N5551P5670K6343l1676l0779q997j9275j2568j0627
1482e8539R2334n149j01289j112J2748j8005J7429K9792M267L6910k3803m2858
1470e7275L2677K3743J9177k8202J386j7311j4671k8265M0818M968M2579J9116
1458C8740J3122k9649J4141o8352m131j9369m8685M9708M5054k7091j0316J5900
1446c0928r7761J7392j1146N2757n811O4849k8556l733l5747J0196M7365q145
1434b9268L3444K5921o146l9323N9565q174r1103o239m8883L0895Q92N0819l1505
1421e9105L9709L8488n9109K3979M4535q4536J9067L3457k3862j4524k0098l0363
1409i2362Q4904K1673o3301L6589l0603N4825j1799O2083l7558l3385K4924J6077
$$ y = [-34539, -50086, -79693, -102181, -46630, 29040, 55383, 23707, -7072, -16069, -35344, -47912, -58539, 33795, 28646, -72643, -73755, -61007, -79012, -61583, -31791, -27524, 9386, -14417, -57275, -24598, -855, 18322, -9880, -8494, -25805, -40476, -68741, -27923, -22955, 19624, 38740, 51862, 22213, 36354, -31998, -36129, -55498, -104183, -54475, -9421, -36512, -46828, -30928, -128689, -111297, -122443, -69686, -75497, -10648, -39204, -42937, -78684, -68488, -21123, -29268, 4176, 30097, 23951, -15372, 44193, 36019, -55084, -61323, -110206, -79311, -78419, -27600, -59105, -19396, 19092, -40017, -16038, 28497, -56039, -36972, -3515, -27377, -41901, -61999, -92362, -7458, 14215, -49086, -12497, -43100, 11725, -74, 62009, 24451, -8934, 15990, 32067]
1397C2067o3742q5099M6879K8587L6173k5003P785J6117L9365p0849O7478J6521
1385D6279j0336n7516l5682M9489o9231J4954K0257o7366N9024M1579k1779K3912
1373f416K6141J0811o20L3788o9184L8031K0803l9007m679p3217m1092K0479L85
1360h3777N4787K0131n3621L8167K8967N0951O773j20083M931L1843K9426j7531
1348i036o632K0874J6015p5085L4513N6202n0958o945K6161J8572k6116o7207
1336f9642l5095N9277O5180m3699l58J192m8829M0097K8890m2580q2242j8280
1324a46089N6660O5770N4840K0409q114o3617j0103j0934P328J791K0829N011
1312f219m148J1248J0101o320l6757M7350n0327L0062K919m316N9336k9497r493
$$ y = [32067, -31675, -116774, -69895, -41308, -5135, -30138, -22353, -6236, 33129, -37720, 29758, 46279, 35943, -21573, -57255, -7766, -76997, -62043, -41786, -109152, -50128, -8549, -30328, -6416, 19725, 30536, 29916, 63704, -5480, 32551, 53354, 14347, 9668, -63549, -104641, -84162, -83777, -28990, -8859, -62480, -24313, 4654, 55605, 62378, -57705, -52774, -20931, 8495, -9036, -15668, 5206, 21221, -53864, -19351, 36851, -14107, -21052, 5109, 23681, -2435, -69642, -104737, -45460, 19720, -23979, -24337, -23145, -71974, -31877, -2987, -45567, -127809, -146089, -89429, -23659, 31181, 51590, 43476, -20141, -30244, -41178, -33850, -32059, -11230, -6219, -10367, 881, 10982, 4662, -32095, 15255, -35072, -5010, -2091, -6407, 52929, 23432, 13939]
1299A3939K4720m9271J7201L0482j0P209o7860q6943k7678J314P7849M1719r128
1286b6457K4923l03j0668O3970m8429j02922N023k9323k0075R0787L0834J253
1274b1387L6909k4948N3669j4903j957l4704k7326l436m93N0505o1962j2353N4325
1261h061n1138k7949P4473K6611p5476k1585j5483Q3833K522Q1722j5059j0547
1249D3863l6175j1788j1666L9919j0846p6789J7212J459k0488N7270K9057o1787
1237d0759K5M5484N132l2978N4575K3839k685l0705o4511q096P0358j9525k1108
1224b0954J1094K7959l1075L8558o212J2882Q142j7253m2506M3746l8596n849
1212b0064l8218n5408J2117P5623K6321L6677n404K799j8375o5149L2113j8859
$$ y = [13939, 38659, -10612, 6589, 37071, 37061, 44270, -23590, -110533, -138211, -136897, -59048, -17329, -26457, -1534, -1837, -12505, 51465, 3036, -99886, -94863, -124186, -144261, -53474, -22640, -21387, 15522, -9426, 44243, 29340, 27383, -7321, -34647, -38083, -38576, 11929, -50033, -62386, -8061, -59199, -87148, -12675, 13936, -61540, -83125, -98608, -14775, -12253, 69469, 54410, 43863, 7688, -4100, -15766, 24153, 13307, -63482, -46270, -44811, -65299, -8029, 21028, -40759, -40734, 4750, 9882, -23096, 31479, 55318, 52633, 21928, -42583, -50679, 19679, 154, -20954, -9860, 18099, -12976, 25582, 19370, 32252, 40394, 23141, -19365, 24381, -14215, -20064, -58282, -113690, -101573, -25950, 371, 37048, 31644, 34443, 16068, -49081, -16968, -35827]
1200c5827l2446L7246M6237n4404j0738J5380r3807O3251N4151j4892N4463o1662
1188c3048K5427Q754P158r377n1170j6729L2518N05O2037M7611p9591m3829l6508
1175h6242j4263n0840O0341L2299k9791J19665j2661J5014n5530k6362R7174m3379
1163E425L8733K5954j5974m2500o9943Q263K321j3304N0043p7419n4962L4225
1151a09138R2646Q0031j9786n6536o3758J2438J10222j9077r9035J1062M2251
1140a8680J6935l0483K9418p715k6104K4070L9137p9075l963l0122L2208l3199
1128h7573N5931Q9064l4992p6260l2579K6565L3405M9262O092o298n0138l7165
1116f4686Q513J8449N9588O5049l3361r3968l1626M0561J4866j8599m4416P8419
$$ y = [-35827, -68273, -31027, 15210, -39194, -49932, -34552, -128359, -65108, -10957, -25849, 28614, -33048, -7621, 1133, 8291, -1086, -52256, -68985, -36467, -35962, 26075, 73686, -5905, -49734, -86242, -100505, -151345, -91004, -58705, -88496, 31169, 18508, 33522, -22008, -48370, 48804, 5425, 44158, 70112, 54138, 11638, -58305, -50042, -47721, -61025, -10982, -88401, -143363, -109138, -16492, 63539, 43753, -12783, -76541, -64103, 46119, 27042, -71993, -60931, -18680, -1745, -32228, -2810, -10525, -36629, -12559, 26578, -52497, -56460, -86582, -54374, -87573, -31642, 57422, 22430, -53830, -86409, -59844, -26439, 22823, 28915, 22617, -27521, -64686, -56173, -37724, 21864, 86913, 53552, -40416, -72042, -31481, -16615, -35214, -79630, -1211]
1104a211l95J3237R187q5241J3448K8385o3705j8150k4674N6281M7653K6613l547
1091b119j7615p046j0973K280O006j6817K3910K9327r616p883M0585N2454M1707
1078A24200m4812p9734j6447J0826Q0869j1396o6826M5387J6128n1874o1005M9516
1066e168L6152j00336l3740N7381J19008k9287m6088K1945L5134k1828J2239o735
1054C8677K0296l8253m2298J0467P097m9066L1611p468j6026O1981j4087l5706
1042c2775K3303M7666K88l5801P119K3072P750M6718p7005m7626P916N0414k0093
1029I46k9736K1535M3135k2647j0877k0726K880p036l2397J3424P8936m8419j9234
1016c0216L3407j1414l00l1965J6165N2227K6649l4662J3898o1562L0525L1152
$$ y = [-1211, -1606, 11631, 20818, -64423, -50975, -22590, -86295, -104445, -129119, -72838, -25185, 1428, -2119, -19734, -26780, -37753, -35473, -29467, -46284, -22374, 6953, -2663, -10546, 30039, 82493, 124200, 79388, -346, -16793, -5967, 74902, 63506, -3320, 42067, 58195, 6321, -54684, -5168, 30984, -69352, -103092, -45711, 73297, 44010, -2078, 19867, 55001, 33173, 45412, 38677, 58973, 20720, -21578, -11111, -4014, -53080, -21469, -28937, -44963, 17018, 2931, -32775, -9472, 38194, 38482, 2681, 9800, 32872, 40622, 87340, 10335, -37291, -29375, 21039, 946, -28790, -7255, 35880, 13233, 2356, -18370, -15490, -22526, -54923, -41499, 37437, -10982, -30216, 3191, -8223, -8523, -40488, -24323, 27904, 54553, 19891, 33789, -27773, 2752, 33904]
1004C3904N166j7651j0978k3664O369M8190J7453l3659k0529P239o7537J2416
992d3281N6154O6542m4276R673p225j8167K8945q8854r743K4405j8338j3960N1082
979g043J9853L0043o387n1172m2208O3769l0373K6805J0619k1330M0490m0585
967g519J1750p916K7805o6102k2839N610M4735J17875o043J9278n9338r6900l1938
954g1542M2858O9605q0823K444n331J5465M7277K636o098J8294N266k4701q1091
941f5741K0689L6516k9996K6010j5296P2253K8289m6425o3995N7610l0194k6415
929c6695j9021Q468r005j0194K0689P9127j6103K5817j5010o5156N5170l9131
917b1044O1802L0021J6908r7976K3258R158n3049j13629K3725R3198J6082J4070
$$ y = [33904, 39070, 21419, 10441, -13223, -6854, 41336, 58789, 25130, 4601, 11840, -55697, -43281, 12873, 79415, 35139, 44812, 37587, 19420, 48365, -40489, -50232, -25827, -44165, -58125, -7043, 12810, 42853, 36466, -14706, -56914, 6855, -23518, 3287, 13906, -7424, 33066, -7519, 4231, -3685, 24120, -41982, -64821, -59211, -14476, 103399, 97356, 116634, 57296, -39604, -71542, -28684, 40921, -39902, -37458, -42789, -27324, 19953, 22589, 16491, 34785, 40051, 15350, -65741, -45052, -8536, -38532, -12522, -27818, 44435, 72724, 26299, -37696, 19914, -10280, -36695, -55716, -47248, -56253, -66447, -45758, 33369, 17266, 43083, 28073, -37083, 18087, -21044, 40758, 70779, 87687, -10289, 12969, 22127, -30922, -144551, -120826, -27628, -11546, 2524]
905B524J3318K3422K0887l6772K3024j4959O943L2011o5357K6727j9099N2023
893F4692l7900P127J632k8823M7611j5667j7722K45M6408l2491n2710j7040l846
880c8484l2568L0785M3104K9030n9782P7381R886n9248M2863M9659n3051r3767
868e4192j9374j0202K8366Q5408P201k5849j6996l3485N3193n0185K4682P9675
856F8242m3418n9253K7512M9692J1235k3750k2256j6490J1516J8609o1036k3765
844f3162M342j28j6055J01630K7596q766J4962j7237J3238l5289M8129l4191J7472
831E2541L7304m1442p0578O184l7098j3383K1561N6935j2358m114k0916l1249
819e6613O2754P2014p6719K211N5236o9610r09k8961j8498k9900R5410J9336k5187
$$ y = [2524, 15842, 39264, 60151, 23379, 46403, 31444, 38387, 70398, 5041, 31768, 12669, 64692, 26792, 33919, 35551, 6728, 54339, 38672, 20950, 21195, 67603, 35112, -17598, -34638, -38484, -71052, -40267, 2837, 31867, -27915, 49466, 59352, 104, 42967, 92626, 39575, -54192, -73566, -83768, -55402, 30006, 37207, 11358, -5638, -39123, 14070, -36115, -11433, 68242, 24824, -34429, -6917, 42775, 54010, 30260, 8004, -8486, 3030, 21639, -39397, -63162, -58820, -58948, -75003, 26627, 54223, 45457, 60419, 43182, 56420, 21131, 69260, 35069, 52541, 89845, 48403, -22175, -15991, -53089, -66472, -44911, 12024, -334, -4448, -25364, -56613, 6141, 78155, 1436, 3647, 58883, -10727, -11636, -40597, -59095, -88995, 6415, 25751, 564]
806E64K6144n802k1014J5880n1804j5283L1587M3301m5970m2075K660q533J5550
793e4795k3670N3261j9834k1555K7882N1261J2261J6482m8766O6594o6663K4690
781A7148L1987o1087J8107K4920j1942r538K316J9827J6314j4616n967O896K66
768C4631J0756J096K7403n3256J5842j3110P150K5079k2690k2517J3043K7417
756E0844l4157l7752j4297J1612n1066N9692n625m6419K0909L1343J0072R033
744D189l7577J3556K3300n970l1050K9843l3280n864P6094q677j1588N7390J0927
731H1293j771n0748j1465k2916L2050K9682J8153m3873k4855J8764k4670n3835
719e4191K9793N3195M0012L0442m1362r6796L3507j0024J5535N7298J0908K1514
$$ y = [564, 26708, 20906, -108, 15772, -36032, -51315, -19728, 23573, -22397, -64472, -61812, -70345, -54795, -78465, -25204, -45038, -66593, -38711, 12550, 24811, 41293, -7473, 59121, -7542, 17148, 49135, -11952, 6155, 31075, 19133, 9595, 11911, 31738, 48052, 33436, 27469, 34365, 34631, 45387, 46483, 73886, 20630, 36472, 23362, 30512, 55591, 32901, 10384, 23427, 50844, 16687, -21065, -35362, -23750, -74816, -15124, -20749, -67168, -46259, -14916, -4844, 4189, -33388, -19832, 3468, -2502, -33552, -3709, -36989, -42853, 33241, 24564, 12976, 70366, 81293, 79522, 28774, 17309, -5607, 26443, 56125, 74278, 30405, 5550, 24314, -356, -54191, -24398, 28797, 68809, 99251, 57889, -38907, -5400, -15424, 111, 57409, 68317, 89831]
$$ [...]
##END NTUPLES=NMR SPECTRUM
##END=
