##TITLE=1H_CA-9100
 CDCl3
 8 sc, 
 20.1.2023
##JCAMPDX= 6.0         $$ Bruker NMR JCAMP-DX V2.0
##DATA TYPE= NMR SPECTRUM
##DATA CLASS= NTUPLES
##ORIGIN= UXNMR, Bruker Analytische Messtechnik GmbH
##OWNER= root
$$ XWIN-NMR		Version 3.5
$$ Fri Jan 20 14:32:41 2023 Russian Standard Time (UT+4h)  she@DPX200
##.OBSERVE FREQUENCY= 200.13135
##.OBSERVE NUCLEUS= ^1H
##.ACQUISITION MODE= SIMULTANEOUS
##.ACQUISITION SCHEME= undefined
##.AVERAGES= 8
##.DIGITISER RES= 18
##SPECTROMETER/DATA SYSTEM= spect
##.PULSE SEQUENCE= zg30
##.SOLVENT NAME= CDCl3
##.SHIFT REFERENCE= (INTERNAL, CDCl3, 0, 15.7348)
##AUDIT TRAIL= $$ (NUMBER, WHEN, WHO, WHERE, WHAT)
$$ ##TITLE= Audit trail, XWIN-NMR		Version 3.5
$$ ##JCAMPDX= 5.01
$$ ##ORIGIN= Bruker BioSpin GmbH
$$ ##OWNER= she
$$ F:/spectra/data/she/nmr/H-F/1/pdata/1/auditp.txt
$$ ##AUDIT TRAIL=  $$ (NUMBER, WHEN, WHO, WHERE, WHAT)
(   1,<2023-01-20 14:31:20.39 +0400>,<she>,<DPX200>,
      <created by zg, POWCHK disabled, PULCHK disabled
       configuration hash MD5:
       00 E9 B6 7A A2 85 ED C7 34 08 36 98 17 FE 4E 26
       data hash MD5: 16K
       C8 FF AE 2B 3C FC 78 4E 86 F7 D9 36 AC E3 24 F7>)
(   2,<2023-01-20 14:31:23.31 +0400>,<she>,<DPX200>,
      <Start of raw data processing
       efp BC_mod = 2 LB = 0.24 FT_mod = 6 PKNL = 1 PHC0 = -19268.35 PHC1 = 7.600791 SI = 16K 
       data hash MD5: 16K
       46 F2 AF D5 6C 04 FE E6 D2 93 B3 32 AA E5 E3 77>)
(   3,<2023-01-20 14:31:44.26 +0400>,<she>,<DPX200>,
      <pk PHC0 = 2.272359 PHC1 = -2.8 
       data hash MD5: 16K
       86 C0 5F 5F B3 5F 2C 5B BE DE 86 81 E4 65 27 0E>)
(   4,<2023-01-20 14:31:47.35 +0400>,<she>,<DPX200>,
      <abs ABSG = 5 
       data hash MD5: 16K
       9A 78 1E 95 87 17 FA CE D2 12 B8 A7 66 A1 72 22>)
(   5,<2023-01-20 14:32:16.96 +0400>,<she>,<DPX200>,
      <abs ABSG = 5 
       data hash MD5: 16K
       42 11 A1 D6 25 57 F0 7C FB 6F 0E BA 78 72 6D EF>)
$$ ##END=
$$ 
$$ hash MD5
$$ BB 02 7F 02 74 70 FE 27 B7 BC C6 EB 0B AB CA 8C
##$RELAX= 
##$RELAX= 
##$RELAX= 
##$RELAX= 
##$RELAX= 
##$RELAX= 
$$ Bruker specific parameters
$$ --------------------------
##$DU= <F:/spectra>
##$EXPNO= 1
##$NAME= <H-F>
##$PROCNO= 1
##$TYPE= <nmr>
##$USER= <she>
##$AMP= (0..31)
100 100 100 100 100 100 100 100 100 100 100 100 100 100 100 100 100 100 
100 100 100 100 100 100 100 100 100 100 100 100 100 100 
##$AQSEQ= 0
##$AQ_mod= 1
##$AUNM= <au_zg>
##$AUTOPOS= <>
##$BF1= 200.13
##$BF2= 200.13
##$BF3= 200.13
##$BF4= 200.13
##$BF5= 200.13
##$BF6= 200.13
##$BF7= 200.13
##$BF8= 200.13
##$BYTORDA= 1
##$CFDGTYP= 0
##$CFRGTYP= 5
##$CHEMSTR= <none>
##$CNST= (0..31)
1 1 145 1 1 1 1 1 1 1 1 1 1 1 1 1 1 1 1 1 1 1 1 1 1 1 1 1 1 1 1 1 
##$CPDPRG= <>
##$CPDPRG1= <>
##$CPDPRG2= <>
##$CPDPRG3= <>
##$CPDPRG4= <mlev>
##$CPDPRG5= <mlev>
##$CPDPRG6= <mlev>
##$CPDPRG7= <mlev>
##$CPDPRG8= <mlev>
##$CPDPRGB= <>
##$CPDPRGT= <>
##$D= (0..31)
0 1.2 0 0 0 0 0 0 0 0.06 0 0.03 0 0 0 0 0.0002 0 0 0 0 0 0 0 0 0 0 0 0 
0 0 0 
##$DATE= 1674210679
##$DBL= (0..7)
$$ [...]
##$SUBNAM3= <"">
##$SUBNAM4= <"">
##$SUBNAM5= <"">
##$SUBNAM6= <"">
##$SUBNAM7= <"">
##$SUBNAM8= <"">
##$SUBNAM9= <"">
##$SW= 18.05172834244
##$SWIBOX= (0..15)
0 0 2 0 0 0 0 0 0 0 0 0 0 0 0 0 
##$SW_h= 3612.71676300578
##$TD= 16384
##$TD0= 1
##$TE= 0
##$TE2= 300
##$TE3= 300
##$TEG= 300
##$TL= (0..7)
0 120 120 120 120 120 120 120 
##$TP= (0..7)
150 150 150 150 150 150 150 150 
##$TP07= 0
##$TPNAME0= <>
##$TPNAME1= <>
##$TPNAME2= <>
##$TPNAME3= <>
##$TPNAME4= <>
##$TPNAME5= <>
##$TPNAME6= <>
##$TPNAME7= <>
##$TPOAL= (0..7)
0.5 0.5 0.5 0.5 0.5 0.5 0.5 0.5 
##$TPOFFS= (0..7)
0 0 0 0 0 0 0 0 
##$TUNHIN= 0
##$TUNHOUT= 0
##$TUNXOUT= 0
##$USERA1= <user>
##$USERA2= <user>
##$USERA3= <user>
##$USERA4= <user>
##$USERA5= <user>
##$V9= 5
##$VALIST= <valist>
##$VCLIST= <CCCCCCCCCCCCCCC>
##$VD= 0
##$VDLIST= <DDDDDDDDDDDDDDD>
##$VPLIST= <PPPPPPPPPPPPPPP>
##$VTLIST= <TTTTTTTTTTTTTTT>
##$WBST= 1024
##$WBSW= 4
##$XGAIN= (0..3)
0 0 0 0 
##$XL= 0
##$YL= 0
##$YMAX_a= 43912
##$YMIN_a= -52394
##$ZGOPTNS= <>
##$ZL1= 120
##$ZL2= 120
##$ZL3= 120
##$ZL4= 120
##$ABSF1= 15.73477
##$ABSF2= -2.31708
##$ABSG= 5
##$ABSL= 3
##$ALPHA= 0
##$AQORDER= 0
##$ASSFAC= 0
##$ASSFACI= 0
##$ASSFACX= 0
##$ASSWID= 0
##$AUNMP= <proc_1d>
##$AZFE= 0.1
##$AZFW= 0.1
##$BCFW= 0
##$BC_mod= 2
##$BYTORDP= 0
##$COROFFS= 0
##$CY= -3
##$DATMOD= 1
##$DC= 0
##$DFILT= <>
##$DTYPP= 0
##$F1P= 0
##$F2P= 0
##$FCOR= 1
##$FTSIZE= 16384
##$FT_mod= 6
##$GAMMA= 0
##$GB= 0
##$INTBC= 1
##$INTSCL= 3.70164e-10
##$ISEN= 128
##$LB= 0.24
##$LEV0= 0
##$LPBIN= 0
##$MAXI= 10000
##$MC2= 0
##$MEAN= 0
##$ME_mod= 0
##$MI= 1.114404
##$NCOEF= 0
##$NC_proc= -8
##$NLEV= 6
##$NOISF1= 3.799351
##$NOISF2= 2.8
##$NSP= 0
##$NTH_PI= 0
##$NZP= 0
##$OFFSET= 15.73477
##$PC= 1
##$PHC0= -19266.08
##$PHC1= 4.800791
##$PH_mod= 1
##$PKNL= yes
##$PPARMOD= 0
##$PSCAL= 0
##$PSIGN= 0
##$REVERSE= no
##$SF= 200.130007359756
##$SI= 16384
##$SIGF1= 3
##$SIGF2= 2
##$SINO= 5.538805
##$SIOLD= 16384
##$SREGLST= <1H.CDCl3>
##$SSB= 0
##$STSI= 16384
##$STSR= 0
##$SW_p= 3612.71676300578
##$SYMM= 0
##$S_DEV= 0
##$TDeff= 16384
##$TDoff= 0
##$TI= <>
##$TILT= no
##$TM1= 0
##$TM2= 0
##$TOPLEV= 0
##$USERP1= <user>
##$USERP2= <user>
##$USERP3= <user>
##$USERP4= <user>
##$USERP5= <user>
##$WDW= 1
##$XDIM= 16384
##$YMAX_p= 458546948
##$YMIN_p= -485120
$$ End of Bruker specific parameters
$$ ---------------------------------
##NTUPLES= NMR SPECTRUM
##VAR_NAME=  FREQUENCY,     SPECTRUM/REAL,   SPECTRUM/IMAG
##SYMBOL=    X,             R,               I
##VAR_TYPE=  INDEPENDENT,   DEPENDENT,       DEPENDENT
##VAR_FORM=  AFFN,          ASDF,            ASDF
##VAR_DIM=   16384,         16384,           16384
##UNITS=     HZ,            ARBITRARY UNITS, ARBITRARY UNITS
##FACTOR=    0.220516191357247, 1,           1
##FIRST=     3148.99960011422, 0,            0
##LAST=      -463.717162891563, 0,           0
##MIN=       -463.717162891563, -485120,     0
##MAX=       3148.99960011422, 458546948,    0
$$ Real data points
##PAGE= N=1
##DATA TABLE= (X++(R..R)), XYDATA
$$ [...]
7489a35846J01131n0917N0635m8063k0497Q4456n1617J7097J10636J172J2222
$$ -135846 -34715 -85632 -34997 -83060 -103557 -19101 -70718 -53621 57015 58187 70409
7478G0409q6519l0761K5909L8610M878p7538K22828K0836m8507l5131q8352j17041
$$ 70409 -16110 -46871 -20962 17648 22526 -55012 167816 188652 140145 105014 16662 -100379
7466a00379P7316j16084J8049J00991O673J7726q0655j4880j02338K3241J34289
$$ -100379 -23063 -139147 -121098 -20107 -13434 4292 -76363 -91243 -193581 -170340 -36051
7455c6051J00293j899o8423J8364Q8835N275L602q7243J82489J3890j24045o4896
$$ -36051 64242 62343 -6080 12284 101119 106394 109996 22753 205242 219132 95087 30191
7443C0191j7891K7768P7035m0840j44114o69k9147J0722o131Q0696R974m6623
$$ 30191 12300 40068 117103 76263 -67851 -68520 -97667 -86945 -93076 -12380 -2406 -49029
7431d9029p4087K2594J0552O2683m2544J9947L7l9573q299J80753k2380o7358
$$ -49029 -123116 -100522 -89970 -27287 -69831 -49884 -49847 -89420 -97719 83034 60654 -6704
7419f704o5591P7890j5383n0560k1004O7329m4588M144j0658J1354J4955l8018
$$ -6704 -72295 5595 -9788 -60348 -81352 -14023 -58611 -54467 -65125 -53771 -38816 -76834
7407g6834j59121k6746J04829q0989l9114Q3568L8186k4018J06616j9735j2446
$$ -76834 -235955 -262701 -157872 -238861 -277975 -194407 -156221 -180239 -73623 -93358 -105804
7396a05804j947p8554j04990J47719N2298P98j34221O4740J2137p5867O9993J7687
$$ -105804 -107751 -186305 -291295 -143576 -91278 -90480 -224701 -159961 -147824 -223691 -153698 -136011
7384a36011J6382L301K02513O7773j36982j93519o1773O4830M6585n0104K9127
$$ -136011 -119629 -116328 86185 153958 16976 -176543 -238316 -173486 -126901 -177005 -147878
7373a47878q5315p9198J84929k9853J43456n8085q372J5080j50026K6217J96420
$$ -147878 -233193 -312391 -127462 -157315 -13859 -71944 -80316 -65236 -215262 -189045 7375
7362G375j5597o8886r5978J57026j01920k0064J1407J434L8831M7538N934M7114
$$ 7375 -8222 -77108 -173086 -16060 -117980 -138044 -126637 -125203 -86372 -38834 -32900 14214
7350A4214k6523j76233J39031j5909k4803n6297P5461J34990j28273n3977N2595
$$ 14214 -12309 -188542 -49511 -65420 -90223 -146520 -71059 63931 -64342 -118319 -65724
7339f5724Q0233j21296k1299j9455J18990J12410j80055O5484n3148j8325J8078
$$ -65724 14509 -106787 -128086 -147541 -28551 83859 -96196 -30712 -83860 -102185 -84107
7328h4107J19139n6253j73429M9694M4965n9838j46944l055J31571m579M1452
$$ -84107 35032 -21221 -194650 -144956 -99991 -159829 -306773 -309828 -178257 -182836 -141384
7317a41384J20936J9815o0611j34065Q5297N7632P0025o8791M3007L6082n7756
$$ -141384 -20448 -633 -61244 -195309 -110012 -52380 17645 -51146 -8139 27943 -29813
7306b9813j48680k4746J45266M0812p9172M9675O1678j74743J6755Q2057M9600
$$ -29813 -178493 -203239 -57973 -17161 -96333 -46658 15020 -159723 -142968 -60911 -11311
7295a1311r1345N1716j4558p5966M4664K8957M68k0954L4242o2578k1522J07980
$$ -11311 -102656 -50940 -65498 -141464 -96800 -67843 -67375 -88329 -54087 -116665 -138187 -30207
7283c0207N9368m7202K1485K1069r7765q2040m4973P336R0059N5351l685j5875
$$ -30207 29161 -18041 3444 24513 -73252 -155292 -200265 -192929 -102870 -47519 -51204 -67079
7271f7079j9613N6526k0838J12609j86253k9004O2290m8589j3021R6305m9278
$$ -67079 -86692 -30166 -51004 61605 -124648 -153652 -91362 -139951 -152972 -56667 -105945
7260a05945J9323o4282Q587L8412n937j69862O9629J47918L7557l8048j7149K28
$$ -105945 -86622 -150904 -142317 -103905 -109842 -279704 -210075 -62157 -24600 -62648 -79797 -79569
7248g9569n7725L67J4912Q5598k4380o5343L3391N5049n8947Q3169l8283j2229
$$ -79569 -137294 -136927 -122015 -36417 -60797 -126140 -92749 -37700 -96647 -13478 -51761 -63990
7236f3990n784P0141L0485j13272P6753O5722J5202j14116j44246J68350L5702
$$ -63990 -69774 367 30852 -82420 -5667 60055 75257 -38859 -183105 -14755 20947
7225B0947j0150P3597j24338j03857J60258J8253j07984o2361k1685P8697K7874
$$ 20947 10797 84394 -39944 -143801 16457 34710 -73274 -135635 -157320 -78623 -50749
7214e0749J2505O9024m4552m353o1006k3036J26573L228L8204j42741j6546J9747
$$ -50749 -38244 30780 -13772 -18125 -79131 -102167 24406 27634 65838 -76903 -93449 -73702
7202g3702K482J25345j81186k4127m8910Q4038m5501k8042J35435N2593j787N0402
$$ -73702 -71220 54125 -127061 -151188 -200098 -116060 -161561 -189603 -54168 -1575 -3362 47040
7190D7040j02711j34794Q8409J8914J58456L9101j46519O9458l5479n616M8886
$$ 47040 -55671 -190465 -102056 -83142 75314 114415 -32104 37354 1875 -3741 45145
7179D5145p4889j18183O1870P0936l850L1455m2366M9413k8458j28567r870o9228
$$ 45145 -29744 -147927 -86057 -15121 -18971 12484 -29882 19531 -8927 -137494 -147364 -216592
7167b16592qL3619O0635J10723n5825J0996J29833j03235Q5275l8490o0624o9827
$$ -216592 -216600 -182981 -122346 -11623 -67448 -56452 73381 -29854 55421 16931 -43693 -113520
7155a13520M5421J7596J4448k7571N4929J2644l0883k1983j5435R618j5325P5659
$$ -113520 -68099 -50503 -36055 -63626 -8697 3947 -26936 -48919 -64354 -54736 -70061 5598
7143E598o7254R6728l7753n2384k2980O3089o1622N4504r7958P46J4917K423j39921
$$ 5598 -61656 35072 -2681 -55065 -78045 -14956 -76578 -22074 -120032 -119286 -104369 -101946 -241867
7130b41867Q7638K3868Q9661J00989n582m2444j860n9389k8219O5192M588o5859
$$ -241867 -154229 -130361 -40700 60289 54707 12263 10403 -48986 -77205 -12013 -7425 -73284
7118g3284o922J9856J09159p2308j4399j00278p1341J29754M8049r3913n6565
$$ -73284 -80206 -60350 48809 -23499 -37898 -138176 -209517 -79763 -31714 -125627 -182192
7107a82192P8944j4785R6684P9674j48964P4333j6980j43624k9510L7770N1719
$$ -182192 -103248 -118033 -21349 58325 -90639 -16306 -33286 -176910 -206420 -168650 -116931
7096a16931l0208O2140q0892J87154M4214K2202j19651L7187j09595p4272r5781
$$ -116931 -147139 -84999 -165891 21263 65477 87679 -31972 5215 -104380 -178652 -274433
7085b74433K58150P0957j42884J71942Q2159j49656L7555m9247m87m6354K2301
$$ -274433 -16283 54674 -88210 83732 165891 16235 53790 4543 4056 -42298 -19997
7074a9997k9254l5069R1614l9619l096R8543j03751L3859J63046q9563l9417j85622
$$ -19997 -49251 -84320 7294 -32325 -35421 63122 -40629 -6770 156276 66713 27296 -158326
7062a58326l0476R6010J23058j34927n4906O1012q0168R5568Q3042r2727K5234
$$ -158326 -188802 -92792 30266 -104661 -159567 -98555 -178723 -83155 -113 -92840 -67606
7051f7606o8735J69718J9593j17109j3569p3259P2050J2978J6070q7553J18167
$$ -67606 -136341 33377 52970 -64139 -77708 -150967 -78917 -65939 -49869 -137422 -19255
7040a9255j98889P4184j7687l2080J24778N5355J48441j42491n245j75638N6809
$$ -19255 -218144 -143960 -161647 -193727 -68949 -13594 134847 -7644 -12889 -188527 -131718
7029a31718k063p6489M6866n063L5305Q4278l1568J61456p3353j9424J23130j62487
$$ -131718 -133781 -210270 -163404 -168467 -133162 -48884 -80452 81004 7651 -11773 111357 -51130
7017e1130R400r3915l8831Q6504n1902J14501J0664K1704n3577k03497K15958
$$ -51130 -41730 -135645 -174476 -87972 -139874 -25373 -14709 6995 -46582 -250079 -34121
7006c4121N5635n1558J1290j39778K6172N416K262j48558J5962Q6591J75162k4607
$$ -34121 21514 -30044 -18754 -158532 -132360 -126944 -124682 -273240 -257278 -170687 4475 -20132
6994b0132J41602m5360j1650k2500m0930p4522k7253O5084R4698k0490j80675
$$ -20132 121470 76110 64460 41960 1030 -73492 -100745 -35661 59037 38547 -142128
6983a42128J34838Q4126l5851j35574M3631l5935q4684Q2644k06047K0524J15349
$$ -142128 -7290 76836 40985 -94589 -50958 -86893 -171577 -88933 -294980 -274456 -159107
6972a59107K5389Q9456K6959L5232l2319p3875M4269K08797J2015r1905j01867
$$ -159107 -133718 -44262 -17303 17929 -14390 -88265 -43996 164801 176816 84911 -16956
6961a6956J03167K6129m6267M8912J52320j11743k69015p1757R6612n5592n8585
$$ -16956 86211 112340 66073 114985 267305 155562 -113453 -185210 -88598 -144190 -202775
6950b02775P9689j1694K2226O7458j25895J08614o8519M5009L9634M8135N6482
$$ -202775 -123086 -134780 -112554 -45096 -170991 -62377 -130896 -85887 -46253 1882 58364
6939E8364m2504J9098j12945J6886j52560N9410J28247k6546J10228p0088L9931
$$ 58364 15860 34958 -77987 -61101 -213661 -154251 -26004 -52550 57678 -12410 27521
6928B7521P3440n0948p7667j4936J07450j4565j54517n7015O2342J7728o5750
$$ 27521 100961 50013 -27654 -42590 64860 50295 -104222 -161237 -98895 -81167 -146917
6917a46917j59541N9840J82585Q5972j53059l4456L6960N2890P3648j23896M9967
$$ -146917 -306458 -246618 -64033 21939 -131120 -165576 -128616 -75726 -2078 -125974 -76007
6906g6007n8827R1861o9487q480k6389O5038M15m0579N2054J3424N7266N1699
$$ -76007 -134834 -42973 -112460 -120940 -147329 -82291 -81876 -122455 -70401 -56977 289 51988
6894E1988M1703o5986p2072k5747j1331J8872Q2323q2205n5103R0264K9346o7773
$$ 51988 93691 27705 -44367 -70114 -81445 -62573 19750 -62455 -117558 -27294 2052 -65721
6882f5721o9304P5279N4261n7186p8817q5357K05046J37619o0338n227q6122L5899
$$ -65721 -135025 -59746 -5485 -62671 -141488 -226845 -21799 115820 55482 50255 -35867 32
6870C2m1338r0022M6268n9350n3809N2893M6438J8859R6126J7765l9140j35704
$$ 32 -41306 -131328 -85060 -144410 -198219 -145326 -98888 -80029 16097 33862 -5278 -140982
6858a40982K292J04825q4552j31246k6023P1228L8522Q7590J52525m3822m8332
$$ -140982 -138690 -33865 -118417 -249663 -275686 -204458 -165936 -78346 74179 30357 -17975
6847a7975j66753O9381L8245m6494L0519L4525r686N3624o378k4338j1414J2572
$$ -17975 -184728 -115347 -77102 -123596 -93077 -58552 -68238 -14614 -20992 -45330 -56744 -44172
6835d4172n3086n813p000o2403K8312L0546Q5864N6930o9311J08375J7065o4408
$$ -44172 -97258 -103071 -110071 -172474 -144162 -113616 -27752 29178 -40133 68242 85307 20899
6823B0899j05862N5373N33L9686j0696j04417R3117k3519n1749O7634M3963j88504
$$ 20899 -84963 -29590 -29057 10629 -67 -104484 -11367 -34886 -86635 -19001 24962 -163542
6811a63542j39922k528K06743Q819R830r56O9510m1295m442O6785j07973Q7091
$$ -163542 -303464 -305992 -99249 -90430 -80600 -81556 -12046 -53341 -57783 9002 -98971 -11880
6799a1880j4560l4710N1348n9681J1475K0237j4418o900j39794o079P7307l6325
$$ -11880 -26440 -61150 -9802 -69483 -58008 -37771 -52189 -59089 -198883 -204962 -127655 -163980
6787a63980P8508R2281j23603M2459J09126j49916j7002J17335N683L5409r689
$$ -163980 -85472 6809 -116794 -74335 34791 -115125 -132127 -14792 -9109 26300 16611
6776A6611j02347N2215M9457J5644L0576p1000j58523J7682N0612p7165l9663
$$ 16611 -85736 -33521 15936 31580 62156 -8844 -167367 -149685 -99073 -176238 -215901
6765b15901J59014K12311q144j35094j67843k8160l919J65574Q0525j95640M0740
$$ -215901 -56887 155424 147280 12186 -155657 -183817 -187736 -22162 58363 -137277 -96537
6754i6537J0011L0834O8708l0219j31475j7023n3692J09837P9011o322J6298j54838
$$ -96537 -86526 -55692 13016 -17203 -148678 -165701 -219393 -109556 -30545 -36867 -20569 -175407
6742a75407l8597K8181M1875J14818J21109q9532L1864J03687N7854j28436q1132
$$ -175407 -214004 -185823 -143948 -29130 91979 2447 34311 137998 195852 67416 -13716
6731a3716j15752J4118J27229l0583O8000K8359r0777l1297j08751l693Q1115
$$ -13716 -129468 -115350 11879 -18704 49296 77655 -13122 -44419 -153170 -156863 -75748
6720g5748Q1193J33171n8688j47704k1227J4319m4992o2321P4199P5069K3349
$$ -75748 5445 138616 79928 -67776 -89003 -74684 -119676 -181997 -107798 -32729 -9380
6709i380J9057o1364L3645j09417R5603m1065Q1968p0165N2777j09480j9655O1064
$$ -9380 9677 -51687 -18042 -127459 -31856 -72921 9047 -61118 -8341 -117821 -137476 -76412
6697g6412O6434O7653j65371j1700j27421Q4101J43241R186j09003N1222K8857
$$ -76412 -9978 57675 -107696 -119396 -246817 -162716 -19475 -10289 -119292 -68070 -39213
6686c9213j20267M1678K16374L943o2211p8037k3058K9100K8728k3625r3345K8074
$$ -39213 -159480 -117802 98572 102515 40304 -37733 -60791 -31691 -2963 -26588 -119933 -91859
6674i1859J5913N7655n9828N7545J3830j0384q8197j31051J61898J05493j29331
$$ -91859 -75946 -18291 -78119 -20574 -6744 -17128 -105325 -236376 -74478 31015 -98316
6663i8316N4270L4673l842o5382j40957J20857P7153o7001n1253J46931j09932
$$ -98316 -44046 -9373 -13215 -78597 -219554 -98697 -21544 -88545 -139798 7133 -102799
6652a02799j01442j8112M0358L9828O0222J1622J31044j0168m4946L4839N6143
$$ -102799 -204241 -222353 -181995 -142167 -81945 -70323 60721 50553 5607 40446 96589
6641I6589M064q8348k4829N4667m6431j20431J12620k5755P7796K1791j7515p6015
$$ 96589 100653 12305 -12524 42143 -4288 -124719 -12099 -37854 39942 61733 44218 -31797
6629c1797r5751P9074O6222P9577m2944l2394j81373q9177J22754Q2231q9919
$$ -31797 -127548 -48474 17748 97325 54381 21987 -159386 -248563 -125809 -43578 -133497
6618a33497o9794O573J90738J46003n7518J1822j08980K1097j6567O6005J05138
$$ -133497 -203291 -196718 -5980 140023 82505 94327 -14653 6444 -10123 55882 161020
6607A61020o7851l4689j58671m7548O7775J34478O4259q2023k3004O266l1549
$$ 161020 93169 58480 -100191 -147739 -79964 54514 118773 36750 13746 20012 -11537
6596a1537m9649O3967J01468j16859j28218M4589O5946o3326r7529R5639Q8967
$$ -11537 -61186 2781 104249 -12610 -140828 -96239 -30293 -93619 -191148 -95509 -6542
6585f542N2901q132r1982o725N4004R2504j84825L7413J58077o1711m9518P3551
$$ -6542 46359 38227 -53755 -60480 -6476 86028 -98797 -61384 96693 34982 -14536 59015
6573E9015n6997q1937J9254p0293J09034o1874O0152p4972n5367J84766m6709
$$ 59015 2018 -79919 -60665 -130958 -21924 -83798 -23646 -98618 -153985 30781 -15928
6562a5928m3484Q0449J3586j15229J25952M8070j03423j880J8437r9317j11404
$$ -15928 -59412 21037 34623 -80606 45346 93416 -10007 -11887 6550 -92767 -204171
6551b04171K13272J14386q7651j07883j21183J49916K8822j78422P047J31400
$$ -204171 9101 123487 35836 -72047 -193230 -43314 -14492 -192914 -185867 -54467
6541e4467J2850N6404J20602q4410j05502r3647k6022R8109p7282Q3304n6709
$$ -54467 -41617 14787 135389 50979 -54523 -148170 -174192 -76083 -153365 -70061 -126770
6530a26770j1523k8787N2771J41187k8169J3152n6902o3821Q2954J57246j01223
$$ -126770 -138293 -167080 -114309 26878 -1291 11861 -45041 -108862 -25908 131338 30115
6519C0115J48174j4852q8013l8420p2526K452N5734q9384R6338J0278o9272L3768
$$ 30115 178289 163437 75424 37004 -35522 -33070 22664 -66720 29618 39896 -29376 4392
6507D392O1678J1501j12637R1848J0911j9027L6710r1651M1546O0921J3602m5061
$$ 4392 66070 77571 -35066 56782 67693 48666 85376 -6275 35271 96192 109794 64733
6495F4733o9605o4493p3774O1587o2673M1026R4516n8603P4523o825q9527J690
$$ 64733 -4872 -69365 -143139 -81552 -144225 -103199 -8683 -67286 7237 412 -89115 -87425
6483h7425J5819k6283r1823M8668J10577o1444N0805m4954r0528J2518J36390
$$ -87425 -71606 -97889 -189712 -141044 -30467 -91911 -41106 -86060 -176588 -164070 -27680
6472b7680J66021l3076j17989m6793J05670k7397m8408P3624o0039r2182J27478
$$ -27680 138341 105265 -12724 -59517 46153 18756 -29652 43972 -16067 -108249 19229
6461A9229K8476j62680J83318O4530j21719R0575q7191j44604J98435n399j29317
$$ 19229 47705 -114975 68343 132873 11154 101729 14538 -130066 68369 62970 -66347
6450f6347p9551P6170l2671M43l404K6634m4094P8199J54371j91834J10797K7887
$$ -66347 -145898 -69728 -102399 -101956 -105360 -78726 -122820 -44621 109750 -82084 28713 56600
6438E6600j29455L7185L7470K0602j4761n2608L6612k6004P2955O8562R463n3216
$$ 56600 -72855 -35670 1800 22402 7641 -44967 -8355 -34359 38596 107158 116621 63405
6426F3405p0772l9217r6729N3132N4666J10860N5669p2660j5120j21261R4579
$$ 63405 -7367 -46584 -143313 -90181 -35515 75345 131014 58354 43234 -78027 16552
6415A6552J7879M0596j45211R4805K2604k4874l5317J7975o7076p4231Q099K1935
$$ 16552 34431 75027 -70184 24621 47225 22351 -12966 5009 -62067 -136298 -128199 -106264
6403a06264o1164M2671j05659q0897J81610J66988q7602j746Q0791L110o1556
$$ -106264 -167428 -124757 -230416 -311313 -129703 37285 -50317 -52063 28728 31838 -29718
6392b9718j3934j3450J3402O6893j1598n2465Q0541L847n7365J07281k9914k4071
$$ -29718 -43652 -57102 -43700 23193 11595 -40870 39671 43518 -13847 93434 63520 39449
6380C9449j14923l930N8053q0854j9361m203p9208P9753L6130K2620m7958M3748
$$ 39449 -75474 -79404 -21351 -102205 -121566 -125769 -204977 -125224 -89094 -66474 -114432 -70684
6368g0684p5853J03339q0150q8486j9166R2524K15878P2212p4452q4668k9384
$$ -70684 -146537 -43198 -123348 -211834 -231000 -138476 77402 149614 75162 -9506 -38890
6357c8890k7688R0141p3935K0861r3809m1420K61149o806j18870m3290n6607J68658
$$ -38890 -66578 23563 -50372 -29511 -123320 -164740 96409 89603 -29267 -72557 -129164 39494
6345C9494L2887r4000Q7114m8857N3290p7326j38560R6234J88344q1745N3527
$$ 39494 72381 -21619 65495 16638 69928 -7398 -145958 -49724 138620 56875 110402
6334A10402l5230L1854j46614j52983O5792R7400n1192J8084p77M9628L2052j02596
$$ 110402 75172 107026 -39588 -192571 -126779 -29379 -80571 -62487 -63264 -13636 18416 -84180
6322h4180R3386j1719n0109O7824j57177j6817J16771M5154l7089j7558n149L9092
$$ -84180 9206 -2513 -52622 15202 -141975 -158792 -42021 3133 -33956 -51514 -56663 -17571
6310a7571P8692m1830L9888l0866k2575Q2812m0916K4917o0004j46275j09571
$$ -17571 61121 19291 59179 28313 5738 88550 47634 72551 12547 -133728 -243299
6299b43299Q2565J13153j17931K6091j9719J9584J14976K7343K073M2378p8802
$$ -243299 -160734 -47581 -165512 -139421 -159140 -139556 -24580 2763 4836 47214 -31588
6288c1588J33552j09232K9825J8844L7603r4919k4828O9475R9106n2056j1953
$$ -31588 101964 -7268 22557 41401 79004 -15915 -40743 28732 127838 75782 63829
6277F3829N1456N0729m5610q9039j69654K8574m236j5678K5066p429Q7874m7321
$$ 63829 115285 166014 120404 31365 -138289 -109715 -113951 -129629 -104563 -111992 -24118 -71439
6265g1439o2670N1978O1505k7647M4412o2957O6418L8253J2883r2001p3162P1661
$$ -71439 -134109 -82131 -20626 -48273 -3861 -66818 -400 37853 50736 -41265 -114427 -42766
6253d2766J29572j21639p4084J81276K0279n8726j1309n7612K4845J19202q2213
$$ -42766 86806 -34833 -108917 72359 92638 33912 22603 -35009 -10164 109038 26825
6242B6825j44692j2741J57309R8883k9812r7587q3388k1237J08591n8155N3800
$$ 26825 -117867 -130608 26701 125584 95772 -1815 -85203 -106440 2151 -56004 -2204
6231b204N5315J41948J23930k36674j28807J42501K2168k9248M7384p9458Q1433
$$ -2204 53111 195059 318989 82315 -46492 96009 118177 88929 136313 56855 138288
6220A38288k4458o3081j09253m5824k3268P7623l6112P8375n0730q3533k4268
$$ 138288 113830 50749 -58504 -104328 -127596 -49973 -86085 -7710 -58440 -141973 -166241
6209a66241j9418J01412J34714j8627J546R091r583q8242O3825k4539o3669N639
$$ -166241 -185659 -84247 50467 31840 33386 42477 32894 -55348 8477 -16062 -79731 -74092
6197g4092R2485J00831p2091P025P3427m1651j33522K1716o9795j7895j6221K7726
$$ -74092 18393 119224 47133 54158 127585 85934 -47588 -25872 -95667 -113562 -129783 -102057
6185a02057J58269k2623m4161J09133j54853p9789l6429N8228k6537J70034K2871
$$ -102057 56212 33589 -10572 98561 -56292 -136081 -172510 -114282 -140819 29215 52086
6174E2086m8376J6424J7328L4690j01339N6069j61660n8509J23973Q0076R3190
$$ 52086 3710 20134 37462 72152 -29187 26882 -134778 -193287 -69314 10762 103952
6163A03952j3128N6655q1790j42593r060R3932m9711M0109N6781j05597n8563
$$ 103952 90824 147479 65689 -76904 -85964 7968 -41743 -1634 55147 -50450 -109013
6152a09013R3024J44234k28480J64507r0333j12733L2197O7596j7430Q7696R2266
$$ -109013 -15989 128245 -100235 64272 -26061 -138794 -106597 -39001 -56431 31265 123531
6141A23531k25580k1336J02495Q6929n5656K7094R5502m1422q9555k6133R4822
$$ 123531 -102049 -123385 -20890 66039 10383 37477 132979 91557 2002 -24131 70691
6130G0691L010k9852q8609l1837K588J6894N6523o0778J8595q750J3857L4187
$$ 70691 73701 43849 -44760 -76597 -74009 -57115 -592 -61370 -42775 -51525 -37668 -3481
6118c481q8785J14981J26913j96432j20838n1348R0452N7815O5084K8571q4711
$$ -3481 -92266 22715 149628 -46804 -167642 -218990 -128538 -70723 -5639 22932 -61779
6107f1779p7865K7668J3369P5035O6631o596J28L8929k664l8086J58972r6587
$$ -61779 -139644 -111976 -98607 -23572 43059 36463 36591 75520 72856 34770 193742 97155
6095I7155P6461j9190k4946O957j53301J06879J2395j03087l577N419K3069k0611
$$ 97155 173616 154426 129480 136437 -16864 90015 102410 -677 -4254 1165 24234 3623
6083C623j08505L8711J9376J6410M5590k3520N6448J00572n3366K7885o2006O5271
$$ 3623 -104882 -66171 -46795 -30385 15205 -8315 48133 148705 95339 123224 61218 126489
6071A26489j31385J2607N3318J46890k11661m3662L8230n367N2551j8324k0081
$$ 126489 -4896 7711 61029 207919 -3742 -47404 -9174 -14541 38010 19686 -395
6060c95J6661N7992k7648l4145l348K19140p0333r2256j69996J06128J04166o1952
$$ -395 16266 74258 46610 12465 9117 228257 157924 65668 -104328 1800 105966 44014
6048D4014m3842K471L4576l8643K6870j21521O8492Q7556o9530J19065Q8088K5310
$$ 44014 172 2643 37219 -1424 25446 -96075 -27583 59973 -9557 109508 197596 222906
6036B22906P9754r3720j25586K183L8671j9689Q6924m9147p8331J03561p8290
$$ 222906 302660 208940 83354 85537 124208 104519 191443 142296 63965 167526 89236
6025H9236j1423j47220J44150N7751L047n1086K377J40388l05523K2275P5781
$$ 89236 77813 -69407 74743 132494 135541 84455 86832 227220 -78303 -56028 19753
6014A9753m2781Q0530O7452p6791r2903L1419l8386m8025o6293J67832j9481P9594
$$ 19753 -23028 57502 124954 48163 -44740 -13321 -51707 -99732 -166025 1807 -17674 61920
6002F1920n8361j1577m6106M7013L5551j01935J12503L7384n7013j4846R226j48193
$$ 61920 3559 -8018 -54124 -7111 28440 -73495 39008 76392 19379 4533 13759 -134434
5990a34434r0077L8801J42333J7853q3287L0999P3681L6610j7447J2750L5493
$$ -134434 -224511 -185710 -43377 -25524 -108811 -77812 -4131 32479 15032 27782 63275
5979F3275j61102j36246O9655J23985j7461j03798R8212J4230J39006m9836J0434
$$ 63275 -97827 -234073 -164418 -40433 -57894 -161692 -63480 -49250 89756 39920 50354
5968E0354J41501J0433j39668o724R2953P9581j58517q7244J08329j0442k7566
$$ 50354 191855 202288 62620 55896 148849 228430 69913 -17331 90998 80556 52990
5957E2990p3989J23961L5384k8093o1159j34802N6939O8647O9351P594k60587
$$ 52990 -20999 102962 138346 110253 49094 -85708 -28769 39878 109229 116823 -143764
5946a43764q563K31039J49454j08428j94780k6432J09302J18647K42m7040L3066
$$ -143764 -152327 78712 228166 119738 -75042 -101474 7828 126475 126717 79677 112743
5935A12743q0105N8594n1927J00927J9583n1709R389l1285l0130Q8777r4972r4320
$$ 112743 32638 91232 39305 140232 159815 108106 117495 86210 56080 144857 49885 -44435
5923d4435J80166l818r8475l4165L3319J23983L5806k08848j54990J69011Q3546
$$ -44435 135731 131913 33438 -727 32592 156575 192381 -16467 -171457 -2446 81100
5912H1100k01589Q9195n080j19140K8304J01707Q5517J592o0870o6067M5171M1432
$$ 81100 -120489 -31294 -36374 -155514 -127210 -25503 60014 61606 736 -65331 -20160 21272
5900B1272J4102k7441J14807j933j29186p8939K7703M1366K7468q9986j64729
$$ 21272 35374 7933 122740 120807 -8379 -87318 -59615 -18249 9219 -80767 -245496
5889b45496J12484J47940M4183R0341j83337N7365L5543J8716o1910K8265J2245
$$ -245496 -133012 14928 59111 149452 -33885 23480 59023 77739 15829 44094 56339
5878E6339J0636O0466Q0950j27913j35768j2506n6172j41858J78115K98007j51214
$$ 56339 66975 127441 208391 80478 -55290 -67796 -123968 -265826 -87711 210296 59082
5867E9082n1644l095L4798J04301n8865o6534K2474J9425q9482m4622p6424L4410
$$ 59082 7438 4343 39141 143442 84577 18043 40517 59942 -29540 -74162 -150586 -116176
5855a16176J52377j75314J76149O9383o0404k4706N8008j14366j4020N5466M4773
$$ -116176 36201 -139113 37036 106419 46015 21309 79317 -35049 -49069 6397 51170
5844E1170l070j03737r5560Q4849M056N1103L166K5526l9319q1469N1791P6529
$$ 51170 48100 -55637 -151197 -66348 -62292 -11189 -8023 17503 -21816 -103285 -51494 25035
5832B5035J8508R701J08186R3146o0724j06841R0871j1311j91200J39162k832
$$ 25035 43543 53244 161430 254576 193852 87011 177882 166571 -24629 114533 111701
5821A11701j08451r8306P5078P0855q0217q3352k5675J3272J30566L0825j81026
$$ 111701 3250 -95056 -19978 50877 -29340 -112692 -138367 -125095 5471 36296 -144730
5810a44730L078J29809P8978j68896K03267J4190K2712l4998j10001j8462J45519
$$ -144730 -141652 -11843 67135 -101761 101506 115696 138408 103410 -6591 -25053 120466
5799A20466j8578j07090j4651r1187n6790K33113P9338j17622m4262J2185Q6950
$$ 120466 101888 -5202 -19853 -111040 -167830 65283 144621 26999 -17263 -5078 81872
5788H1872J908m0653L3023j1189r3674p811P171K31k9057o4856K2617J74188j24381
$$ 81872 83780 43127 76150 64961 -28713 -36524 -29353 -29122 -58179 -123035 -100418 73770 -50611
5775e0611J09089j68550j0532J36196l7626J06602Q9646K0189j12341j9238K9453
$$ -50611 58478 -110072 -120604 15592 -22034 84568 174214 194403 82062 62824 92277
5764I2277q9021o7744Q6389k7075l5084Q4487n6105o3521m4319n7849J51596K2872
$$ 92277 3256 -64488 21901 -5174 -40258 44229 -11876 -75397 -119716 -177565 -25969 -3097
5752c097J17701M4479j00595p7376O5083n3317j37913m4364P4058J379J7774J79623
$$ -3097 114604 159083 58488 -18888 46195 -7122 -145035 -189399 -115341 -113962 -96188 83435
5740H3435q4900K1607P8491N7754j27218j10042K5046j1073K1609R6218M4181
$$ 83435 -1465 20142 98633 156387 29169 -80873 -55827 -66900 -45291 50927 95108
5729I5108P9120j24251p8342J42675r389P0840m0696j21202J2848j23954L5626
$$ 95108 174228 49977 -28365 114310 104921 175761 135065 13863 26711 -97243 -61617
5718f1617J17581q0263l6259L9178M6680o1310m0774M0923j0787J3537J63532
$$ -61617 55964 -24299 -60558 -21380 25300 -36010 -76784 -35861 -46648 -33111 130421
5707A30421J218m3130N2761l3671q5961P1034R9468j69539l3664L6995j6901j41550
$$ 130421 131639 88509 141270 107599 21638 92672 192140 22601 -11063 25932 9031 -132519
5695a32519L7926O8521n1394J83501l0575J13797j24674k7757K3313p2329J8254
$$ -132519 -94593 -26072 -77466 106035 75460 189257 64583 36826 60139 -12190 6064
5684F064L7000r690J1055K0980N1254L6204L9541m5048j67444n752J74819j40943
$$ 6064 43064 33374 44429 65409 116663 152867 192408 147360 -20084 -25836 148983 8040
5672H040J6946P5755q4410M811o1705L1994N604J8375M4496Q8093q6090m3925
$$ 8040 24986 100741 16331 21142 -40563 -8569 -2965 15410 59906 147999 61909 17984
5660A7984L9507Q588p2111k833K6894N067l5688K990J01005n2445l4514k8671
$$ 17984 57491 66079 -6032 -8865 18029 23096 -12592 -9602 91403 38958 4444 -24227
5648b4227N081L1834j13804J10851r988n6960o7626N0664o3538K7963J03938l3047
$$ -24227 -19146 12688 -101116 9735 -253 -57213 -124839 -74175 -137713 -109750 -5812 -38859
5636c8859M4954J07643j14563n3579j29888L5330J54982J02427o4873m9943J36623
$$ -38859 6095 113738 -825 -54404 -184292 -148962 6020 108447 43574 -6369 130254
5625A30254j5276l6128l2827J4543k0033J07873l8822p9221o6894K27973j38641
$$ 130254 114978 78850 46023 60566 40533 148406 109584 30363 -36531 191442 52801
5614E2801K509j06311M9221J35092o4131r8090J4796O099l7585J62979M3748j82835
$$ 52801 55310 -51001 -1780 133312 69181 -28909 -14113 -8014 -45599 117380 161128 -21707
5602b1707k4361J50452q8074O2832N6147L3381J04489q6163n0243j28895l1759
$$ -21707 -46068 104384 16310 79142 135289 168670 273159 186996 136753 7858 -23901
5591b3901J95604J9097j19284m0787j02421N1704J17748J7863j20441j44390J18327
$$ -23901 171703 190800 71516 30729 -71692 -19988 97760 115623 -4818 -149208 -30881
5580c0881O1178m8814j7639O6725M389J4908j4444J9743j08021j86N0484M8246
$$ -30881 30297 -18517 -36156 30569 34958 49866 35422 55165 -52856 -53042 -2558 45688
5568D5688q9567J91370J9342o9850M1589M573m4094J1606M6275O607k948p4247
$$ 45688 -43879 147491 166833 96983 138572 143145 99051 110657 156932 163539 160591 86344
5556H6344p2237l5435k0399M6321k5184J45447Q401O6008m9619o8018N2031q4324
$$ 86344 14107 -21328 -41727 4594 -20590 124857 133258 199266 149647 81629 133660 49336
5544D9336l8883J8845P1105J44542J24872l3765m5286J7596n0117J79991J58121
$$ 49336 10453 29298 100403 244945 369817 336052 290766 308362 258245 438236 596357
5533E96357j03557Q2032O8267o6904l4898P2087j16011l6226n6955J25104l0850
$$ 596357 492800 574832 643099 576195 541297 613384 497373 461147 404192 529296 498446
5522D98446M07k0978j45352j09361P7040Q5236m0022J8851R8349P0949k9087M9203
$$ 498446 498853 477875 332523 223162 300202 385438 345416 364267 462616 533565 504478 553681
5510E53681j43433l9260J12286J17367M1448j19378K17963J71120M9374J59224
$$ 553681 410248 370988 483274 600641 642089 522711 740674 911794 961168 1120392
5500A120392Q8810J83087m5745M8113j48031k21760j79639j74110j03744R458
$$ 1120392 1209202 1392289 1346544 1394657 1246626 1024866 845227 671117 567373 576831
5490E76831K3379j07126n1866j1190L8525R8265R908k0327L5167J1817r0131p7904
$$ 576831 600210 493084 441218 430028 468553 566818 576726 556399 591566 603383 513252 435348
5478D35348P8697Q3528J8009n5043K30212O7362q0776M5060K95632J42284R1349
$$ 435348 514045 597573 615582 560539 790751 858113 777337 822397 1118029 1260313 1351662
5467A351662L2787P4900l8581k38419k47826j74126j29727j37713j19480J65161
$$ 1351662 1384449 1459349 1420768 1182349 934523 760397 630670 492957 373477 538638
5457E38638L5132k41298q901n4650J19464j4152O6678l1099m6588M1195P1989
$$ 538638 573770 332472 323571 268921 388385 374233 440911 409812 363224 404419 476408
5446D76408q1971k20982K9234M485J30915P9260O848o5763M8351J35586P8576
$$ 476408 394437 173455 202689 207174 338089 417349 424197 358434 406785 542371 620947
5435F20947l9953J49786k50442n1104j10768n8908j01538K7755J43795Q6885k8859
$$ 620947 580994 730780 480338 429234 318466 259558 158020 185775 329570 416455 387596
5424C87596o5573j7561r7581L7965k03108k9416P8961j9510j48411J07880N1712
$$ 387596 322023 304462 206881 244846 41738 12322 91283 71773 -76638 31242 82954
5413H2954R7371J3829N7043Q0778o8737q8167l4522K732m8004L2995K7503M138
$$ 82954 180325 194154 251197 331975 263238 175071 140549 143281 95277 128272 155775 159913
5401A59913l1097k2367J44996J53659Q1440j86062p3119r671k1251r1648O4372
$$ 159913 128816 106449 251445 405104 486544 300482 227363 217692 196441 104793 169165
5390A69165M2900k23650M9083j163N9549Q9641m4141o3357q3480J48664r9370
$$ 169165 212065 -11585 37498 36335 95884 185525 141384 78027 -5453 143211 43841
5379D3841K0427J31111l9006M5922r679K1418M6244q4225M9385k9203j6553Q0829
$$ 43841 64268 195379 156373 202295 192616 214034 260278 176053 225438 196235 179682 260511
5367B60511L4404r3717j31149N5641Q8272l9485p5006J6765K7507n017R710M7043
$$ 260511 294915 201198 70049 125690 213962 174477 99471 116236 143743 138726 148436 195479
5355A95479p2576j00509J15339l7838r4972J23975j66029K7220K15881j45576
$$ 195479 122903 22394 137733 99895 4923 128898 -37131 -9911 205970 60394
5345F0394k30j23495J50681o2127j03344P2133P8048J7275P7799K9084P7753j26561
$$ 60394 60164 -63331 87350 25223 -78121 -5988 72060 89335 167134 196218 273971 147410
5333A47410j90427N7791o1217M9146P1637J15728k2609J07106m5076o8840l2506
$$ 147410 -43017 14774 -46443 2703 74340 190068 167459 274565 229489 160649 128143
5322A28143m9771j09528J42784M1901R4681k7798q0448j49084k8539J90154R4131
$$ 128143 78372 -31156 111628 153529 248210 220412 139964 -9120 -37659 152495 246626
5311B46626P8221j36666q2373P1364L6823J6350j00342Q013q647o080O4996p4639
$$ 246626 324847 188181 105808 177172 213995 230345 130003 138016 129369 123289 188285 113646
5299A13646j26286R126J84697q5007J7597J46L1086j32079q0923J09908O2382
$$ 113646 -12640 -3514 181183 96176 113773 113919 145005 12926 -67997 41911 104293
5288A04293j1553n9829J22288n8984O7309Q9981J7363j4909k0209j08415o6084
$$ 104293 92740 32911 155199 96215 163524 253505 270868 255959 235750 127335 61251
5277F1251L5663m9142L4043J08988L7066p0205K468J36178L625p194m6020j65553
$$ 61251 96914 47772 81815 190803 227869 157664 160132 296310 299935 292741 246721 81168
5265H1168m6589J94747K1744q0682l8389J54554j24075k6869N7575j38363L6519
$$ 81168 34579 229326 251070 170388 131999 286553 162478 135609 193184 54821 91340
5254I1340O371k1926l1107J09795O8674o4389p3527J30492r6580J7927L2432J39464
$$ 91340 97711 75785 44678 154473 223147 158758 85231 215723 119143 137070 169502 308966
5242C08966m6373j50291L8843O6418p5785p7298J23675J6686k3612P6201p8912
$$ 308966 262593 112302 151145 217563 141778 64480 188155 204841 181229 257430 178518
5231A78518p9889n8804L0416o2750J1190J91309m8772m4951k6103M33M605J2717
$$ 178518 98629 39825 70241 7491 18681 209990 161218 116267 90164 90597 95202 107919
5219A07919J59009j29212N5166K4496q6861m7210j536O8196N8779j01979Q9785
$$ 107919 266928 137716 192882 217378 130517 83307 81771 149967 208746 106767 196552
5208A96552P5774k00841o7075O5601M0403j157K01522l3863R0697j09944q3103
$$ 196552 272326 71485 4410 70011 110414 109257 310779 276916 367613 257669 174566
5197A74566R632q586k156l6178m6809M6627j33079J60205j20385n0623r8827j3355
$$ 174566 184198 175612 173456 137278 90469 137096 4017 164222 43837 -6786 -105613 -118968
5185a18968J14255R7084J10068M4098j41969j04149M8753J30438q5481M4282j01454
$$ -118968 -4713 92371 202439 246537 104568 419 49172 179610 94129 138411 36957
5174C6957o1844k216J61056J22875j01664K0929n5437J12067j06599k4636M4891
$$ 36957 -24887 -27103 133953 256828 155164 176093 120656 232723 126124 101488 146379
5163A46379j6004n6534P8228q1268J9876r37J70682l3411r2190M7748Q4319j19110
$$ 146379 130375 73841 152069 70801 90677 89740 260422 227011 134821 182569 266888 147778
5151A47778l0434R192m9805l7401O3819n9598J02999N1176K4240o9163O4823l9116
$$ 147778 117344 126536 76731 39330 103149 43551 146550 197726 221966 152803 217626 178510
5139A78510j24582q491J0139K05727j31143N9110J0341O5765o2304j22672k5135
$$ 178510 53928 45437 55576 261303 130160 189270 199611 265376 203072 80400 55265
5128E5265P1366J03889K0927j35768L0358R3931j9606J2126j42460p114j11350
$$ 55265 126631 230520 251447 115679 146037 239968 220362 232488 90028 82914 -28436
5117b8436o3238q76L0136L4175J49493j09250l7648j5353Q1932N7000J00170R6020
$$ -28436 -91674 -92550 -62414 -28239 121254 12004 -25644 -40997 40935 97935 198105 294125
5105B94125j93367r7196J11668q9497Q5890j5916O9103n6617N8844P7359j38065
$$ 294125 100758 3562 115230 25733 111623 95707 164810 108193 167037 244396 106331
5094A06331K1959k4448J06080L5546O264r2883j9310q993P3925j9102n2363k2564
$$ 106331 128290 103842 209922 245468 251732 158849 139539 130546 204471 185369 133006 110442
5082A10442q9744p0120J44799o5759P682J05003M4441m566r3578N1677j36356
$$ 110442 20698 -49422 95377 29618 37300 142303 186744 182178 88600 140277 3921
5071C921M8019J13904k8217r9361n9750J94010R9480p5444k60659J67490n1898
$$ 3921 51940 165844 137627 38266 -21484 172526 272006 196562 -64097 103393 51495
5060E1495K7387P4193n8507p6354L6434l5595M6864K6269j38222O9647O5433l3436
$$ 51495 78882 153075 94568 18214 54648 19053 65917 92186 -46036 23611 89044 55608
5048E5608p962j5609J84233o5879k12021J5659o3018K13092J6650q9273J16308
$$ 55608 47646 32037 216270 150391 -61630 -45971 -108989 104103 120753 31480 147788
5037A47788j07854l3638k9412j97937J79118K5260o5110l6340J22202P151r1836
$$ 147788 39934 6296 -23116 -221053 -41935 -16675 -81785 -118125 4077 11228 -80608
5026h0608N0453J17373M8181l0703l2064j22410J11518j01412M4417R5196p9415
$$ -80608 -30155 87218 135399 104696 72632 -49778 61740 -39672 4745 99941 20526
5015B0526o8922P2268J2361J0568J0504l1449N0607l3077O1275M7870K3213M5336
$$ 20526 -48396 23872 36233 46801 57305 25856 76463 43386 104661 152531 175744 221080
5003B21080N2930m0230R204J7475j0856j04703n7296l9613L7614N5151k8982N2094
$$ 221080 274010 233780 242984 260459 249603 144900 87604 47991 85605 140756 111774 163868
4991A63868j75814j840O6068O2895M2434j39055J44082L5061j14347O6403L9046
$$ 163868 -11946 -13786 52282 115177 157611 18556 162638 197699 83352 149755 188801
4980A88801l2499j11044N3006J05675j7019o5976o0587j3147R1186J24283j5519
$$ 188801 156302 45258 98264 203939 186920 120944 60357 47210 138396 262679 247160
4969B47160o5816j17918J58544L5534m5997q3722L7744J89121o8224j87239n4715
$$ 247160 181344 63426 221970 257504 211507 127785 165529 354650 286426 99187 44472
4958D4472J39965o4818J1267N2490n9610j46155k7131O5180K5268O6054j785m456
$$ 44472 184437 119619 130886 183376 123766 -22389 -49520 15660 40928 106982 105197 100741
4946A00741J2251q0807R1651J10718j12725J4795k3563J77327k8972k5333j00574
$$ 100741 112992 32185 123836 234554 121829 136624 113061 290388 261416 236083 135509
4935A35509m1051O1796o6230k969k8047l8441o2660J67158J07252l8125n5856
$$ 135509 94458 156254 90024 87055 59008 20567 -42093 125065 232317 194192 138336
4924A38336P1612n3185m7852J6994r4139l6236M8701J11328l509K2228K8128j51737
$$ 138336 209948 156763 108911 125905 31766 -4470 44231 155559 152050 174278 202406 50669
4912E0669m7439m6585J18980J04075l9587l7396l68p3974k1183O9138O6402q5813
$$ 50669 3230 -43355 75625 179700 140113 102717 102349 28375 7192 76330 142732 56919
4900E6919P7367J19057l4298p4564p6295n7796J4224O6888m8443k9770j76861
$$ 56919 134286 253343 219045 144481 68186 10390 24614 91502 43059 13289 -163572
4889a63572J19744L0709P5215L0133m796j41934Q0116K7488j57105J22500n639
$$ -163572 -43828 -13119 62096 92229 87433 -54501 25615 53103 -104002 18498 12859
4878A2859p563M7568O7398q8624J2453P0397Q589q2258l3249J19656l5853o454
$$ 12859 5296 52864 120262 31638 44091 114488 123077 40819 7570 127226 91373 84919
4866H4919K4530q8535O1391J10566p5372n4646J53448P1603q7092j1721k0279
$$ 84919 109449 20914 82305 192871 117499 62853 216301 287904 200812 189091 168812
4855A68812L2009n0774j18476N3540J3705l7202K9195O1281m8345P2967o3377
$$ 168812 200821 150047 31571 85111 98816 61614 90809 152090 103745 176712 113335
4844A13335J6488k0646q5715k3852J34767m3976J0786L4174n9480J76268P4380
$$ 113335 129823 109177 23462 -390 134377 90401 101187 135361 75881 252149 326529
4833C26529n7232j53529k2520l4524L3536J07642r6340m5971N4180j19877l7724
$$ 326529 269297 115768 93248 58724 92260 199902 103562 57591 111771 -8106 -45830
4822d5830M6046L8261N7015P3864o8175J24151r9400N8542J12014j8708k6706
$$ -45830 216 38477 95492 169356 101181 225332 125932 184474 296488 277780 251074
4811B51074j47246L6482O7315l2883j67514k3144P9302M4026O5193J2269o7776
$$ 251074 103828 140310 207625 174742 7228 -15916 63386 107412 172605 184874 117098
4800A17098Q3527k70862M888K17010q0086N9440R4944N5107j38742n250J57149
$$ 117098 200625 -70237 -65349 151661 71575 131015 225959 281066 142324 137074 294223
4789B94223N3243l5667r6945o0665j840m4818m2471P0758J30480n4130j3705o2524
$$ 294223 347466 311799 214854 154189 152349 107531 65060 135818 266298 212168 198463 135939
4777A35939P4845o8049j06432O2304Q3460P9969j45834j06113J27946Q284J89896
$$ 135939 210784 142735 36303 98607 182067 262036 116202 10089 138035 146319 336215
4766C36215k17697j59406J21425J5528J2441L4020M9875l2227l653p8465l932
$$ 336215 118518 -40888 80537 96065 108506 142526 192401 160174 156521 78056 74124
4755G4124n7085R1877J37819j01273k8454P1995m6084Q5725n2773J77985j94928
$$ 74124 17039 108916 246735 145462 117008 189003 142919 228644 175871 353856 158928
4744A58928J9993Q2725j38842L571J12431j16478p1029l4643M4078Q2923L4843
$$ 158928 178921 261646 122804 126375 238806 122328 51299 16656 60734 143657 178500
4733A78500K8197r3327q0726j13454J53243K20000o0759j20591q599R6204j25113
$$ 178500 206697 113370 32644 -80810 72433 292433 231674 111083 102484 198688 73575
4722G3575j0959O4743O0798L2027o5402j1567K2305k0815N547q3422Q0855R1121
$$ 73575 62616 127359 188157 220184 154782 143215 165520 144705 150252 66830 147685 238806
4710B38806j08520K3713j322m1736R8884m6313j9827j67030k0952J61837r8747
$$ 238806 130286 153999 152677 110941 209825 163512 143685 -23345 -44297 117540 18793
4699A8793q181k3201Q5679L4849n9656J24191k7111j30175J44391j43840Q6444
$$ 18793 10612 -12589 73090 107939 48283 172474 145363 15188 159579 15739 102183
4688A02183J12679J9520m6495M0842J0958M455K9185j10297J1323m7482O15J3171
$$ 102183 214862 234382 187887 228729 239687 244142 273327 163030 174353 126871 127486 140657
4676A40657J7895J01800j65876P665J08951k8599L3596q0305k8716r565L1920
$$ 140657 158552 260352 94476 102141 211092 182493 216089 135784 107068 97503 129423
4665A29423J7819k1812J68786o762O7719m0869j16075M2059L1192l9579J47701
$$ 129423 147242 125430 294216 287454 355173 314304 198229 240288 271480 231901 379602
4654C79602j1159K4693N0200l3244j10002P7307o0682o8411Q3668O2455j6214
$$ 379602 368443 393136 443336 410092 300090 377397 316715 248304 331972 394427 378213
4643C78213O823j7076j86454Q5811N774J12152j3369j20094J80954J4358q796
$$ 378213 385036 367960 181506 267317 273091 385243 371874 251780 432734 447092 438296
4632D38296R9418p2938J7396L8346N2826j52564m9168K8336q66r3329R0750k5121
$$ 438296 537714 464776 482172 520518 573344 420780 371612 399948 399082 305753 396503 371382
4620C71382j19249K4313p5600J69816J4759r4738j74290P4120R8909Q263l8315
$$ 371382 252133 276446 200846 370662 385421 290683 116393 190513 289422 297685 259370
4609B59370p1455J63903P7816k7890j14310l402N4770j34647N6702n7020j398
$$ 259370 187915 351818 429634 401744 287434 284032 338802 204155 260857 203837 202439
4598B02439M0420P4394j1093m8866J33060k0005p8044q4527M0225m6979p1805
$$ 202439 242859 317253 306160 257294 390354 370349 292305 207778 248003 201024 129219
4587A29219l4988J63123P9208p5970P560k6057J11252K911j12661j7223Q8639
$$ 129219 94231 257354 336562 260592 268152 242095 353347 356258 243597 226374 315013
4576C15013J23621j14706o93L5655L7898K7341J5873r2620J29164J06358L4898
$$ 315013 438634 323928 323235 358890 396788 424129 440002 347382 476546 582904 617802
4565F17802M6336l6058l6333j39231N9072j20795j1484J43584o877P3134o9412
$$ 617802 664138 628080 591747 452516 511588 390793 379309 522893 516016 589150 519738
4554E19738j55981k8263q227J08907K9939j75944M6866O9905m9014q761M2577
$$ 519738 363757 335494 327267 436174 466113 290169 337035 406940 357926 349165 391742
4543C91742J8652r9722j7047P8163M2586Q9369J1538j32436P0077O1756M0269
$$ 391742 410394 310672 293625 371788 414374 503743 515281 382845 452922 514678 554947
4532E54947q1813J14684K4940O6821O9160Q2497O4667L1625j54111l8299R2613
$$ 554947 473134 587818 612758 679579 748739 831236 895903 927528 773417 735118 827731
4521H27731j10760l7597l0535L947R073Q3494O4615J86338j52041q9469M1483
$$ 827731 716971 679374 648839 652786 661859 745353 809968 996306 844265 754796 796279
4510G96279K13380J5030O4076l3907J20802l7196J8299J17428M1582Q1228J33999
$$ 796279 1009659 1024689 1088765 1054858 1175660 1138464 1156763 1274191 1315773 1397001 1531000
4499A531000M5512L26798J06858K13244J90326K11309J85977R0762k45564m08889
$$ 1531000 1576512 1903310 2010168 2223412 2413738 2625047 2811024 2901786 2656222 2247333
4489B247333k56232k39954j22249k19939L9707j97575j46605O800K6792j34694
$$ 2247333 1991101 1751147 1628898 1408959 1448666 1251091 1104486 1111286 1138078 1003384
4479A003384j75116P4156J48173j38296Q081J71296N824q8817k7203J51634k1001
$$ 1003384 828268 902424 1050597 912301 920382 1091678 1097502 1008685 981482 1133116 1112115
4468A112115o5018M8320L3177j0073m8000j42788R8170Q4360M1357M4715j9009
$$ 1112115 1047097 1095417 1128594 1118521 1070521 927733 1025903 1110263 1151620 1196335 1177326
4457A177326p3823j14802K3879O7585R0539j15619K6234J363R9005r0145J3418
$$ 1177326 1103503 988701 1012580 1080165 1170704 1055085 1081319 1082682 1181687 1091542 1104960
4446A104960L503K9406k9071J0997N7497m5075j15909j18551m701Q959O5546J67572
$$ 1104960 1108463 1137869 1108798 1119795 1177292 1132217 1016308 897757 893056 902015 967561 1135133
4434A135133K5980J12974j5426j5909j0164j34987q9411o410R0838P7085m5084
$$ 1135133 1161113 1274087 1258661 1242752 1232588 1097601 1008190 1001780 1092618 1169703 1124619
4423A124619K48228m1087p892J0033j09547J17217P7582K14845J6919j63326J31569
$$ 1124619 1372847 1331760 1323868 1333901 1224354 1341571 1419153 1633998 1650917 1487591 1619160
4412A619160P268L9275N0994Q9646j2017o6276n3062N8581k3880M3540l1922j2724
$$ 1619160 1626428 1665703 1716697 1806343 1794326 1728050 1674988 1733569 1709689 1753229 1721307 1708583
4400A708583n6334n417J7326n4580M858Q4549M0306K6981P3421j07239N3055j2693
$$ 1708583 1652249 1646832 1664158 1609578 1614436 1698985 1739291 1766272 1839693 1732454 1785509 1772816
4388A772816K6806N1574n2103l0296n6616n3324M380J14603k6244o9631P9378
$$ 1772816 1799622 1851196 1799093 1768797 1712181 1658857 1663237 1777840 1751596 1681965 1761343
4377A761343l8385P6132k4778R2615J24345k10792J70247J04126k10277J03034
$$ 1761343 1722958 1799090 1774312 1866927 1991272 1780480 1950727 2054853 1844576 1947610
4367A947610P7796j28492N093J07335p9386j49363j59976M5488J20025p8094O6193
$$ 1947610 2025406 1896914 1902007 2009342 1929956 1780593 1620617 1666105 1786130 1708036 1774229
4356A774229R1936m7206L504m0383M7486J30781J06536J57703J43502j529L899
$$ 1774229 1866165 1818959 1822463 1782080 1829566 1960347 2066883 2224586 2368088 2366559 2370458
4345B370458P4160J82373J154J3751j17388r7631K8601J13414Q396Q6182R751
$$ 2370458 2444618 2626991 2628145 2641896 2524508 2426877 2455478 2568892 2577288 2663470 2673221
4334B673221k3732j40306J47795R2439R2302K18106p8117J9746J80735J98063
$$ 2673221 2649489 2509183 2656978 2749417 2841719 3059825 2981708 3001454 3182189 3380252
4324C380252K76643L4894L819L9881J73407J39840Q0525o5879K03040J18040m6169
$$ 3380252 3656895 3691789 3695608 3735489 3908896 4048736 4129261 4063382 4266422 4384462 4338293
4313D338293N2996R9532J17690o6886J13637J32256N6266l046j57118Q5143o1229
$$ 4338293 4391289 4490821 4608511 4541625 4655262 4787518 4843784 4840738 4683620 4768763 4707534
4302D707534J65628J28561J46332J93974L60208L94639K00568J20350P6877N8776
$$ 4707534 4873162 5001723 5148055 5342029 5702237 6096876 6297444 6417794 6494671 6553447
4292F553447O0915J5265K13695P518J28547M78413M15979K04703J69363K94084
$$ 6553447 6614362 6629627 6843322 6850840 6979387 7457800 7873779 8078482 8247845 8541929
4282H541929L56317L05409L76508L60759K62693M33805L85953M03648L57256K33959
$$ 8541929 8898246 9203655 9580163 9940922 10203615 10637420 11023373 11427021 11784277 12018236
4272A2018236o6836L1230J20034M7225K79175K07136J90050K90528L46354K27760
$$ 12018236 11951400 11982630 12102664 12149889 12429064 12636200 12826250 13116778 13463132 13690892
4262A3690892K09144L83694K34224K26239K50310L31255L87937N68548L77654
$$ 13690892 13900036 14283730 14517954 14744193 14994503 15325758 15713695 16282243 16659897
4253A6659897M15452M94484M87071N15513M98993M15952N94663P18130Q05086
$$ 16659897 17075349 17569833 18056904 18572417 19071410 19487362 20082025 20800155 21605241
4244B1605241O89917Q49868J135218J211237J340912J379229J402806J471916
$$ 21605241 22295158 23145026 24280244 25491481 26832393 28211622 29614428 31086344
4236C1086344J486121J425064J249545J571011J631964J637429J717111J895125
$$ 31086344 32572465 33997529 35247074 36818085 38450049 40087478 41804589 43699714
4228D3699714J512850J419047J590099J851006K237106K238410K303777K438479
$$ 43699714 45212564 46631611 48221710 50072716 52309822 54548232 56852009 59290488
4220E9290488K286551K670984L204299M049015M897024O363849P220920Q118716
$$ 59290488 61577039 64248023 67452322 71501337 76398361 82762210 89983130 98101846
4212I8101846Q563943R406010J0393303J1772499J3128378J6536805K2230193
$$ 98101846 106665789 116071799 126465102 138237601 151365979 167902784 190132977
4205A90132977K9390064L6974371M4576125M9307374N0532691L5921432K1711914
$$ 190132977 219523041 256497412 301073537 350380911 400913602 436835034 458546948
4198D58546948j8741291o7300298p5046751o2982002m3919781l1570565k3494640
$$ 458546948 439805657 372505359 297458608 234476606 190556825 158986260 135491620
4191A35491620k0283521j7155053j4209276j0770461q291697n752876l983543
$$ 135491620 115208099 98053046 83843770 73073309 64781612 59028736 55045193
4184E5045193k684263k260573k188423k753538l100826l285516l094160k534452
$$ 55045193 52360930 50100357 47911934 45158396 42057570 38772054 35677894 33143442
4176C3143442k199746k268094j524083j407404j346420j225385j291504r35077
$$ 33143442 30943696 28675602 27151519 25744115 24397695 23172310 21880806 20945729
4168B0945729r12983p48255m91769o88307m47765l47143l09910l42387k56610
$$ 20945729 20032746 19284491 18792722 18104415 17656650 17309507 16999597 16657210 16400600
4159A6400600m18J09982j22679n8290j50227k66752j72304l14210j78534j19370
$$ 16400600 16400182 16510164 16387485 16329195 16178968 15912216 15739912 15425702 15247168 15127798
4149A5127798j93532r8699j36937k66168j69916L8946J15153L6696r7346j38039
$$ 15127798 14934266 14835567 14698630 14432462 14262546 14301492 14416645 14453341 14355995 14217956
4139A4217956O944q0667J00115L406L00873M59419N77743M44184M56601P22007
$$ 14217956 14224900 14144233 14244348 14247754 14548627 15008046 15585789 16029973 16486574 17208581
4129A7208581Q62624P29015J044037J341258J913334K768707L353022M241029
$$ 17208581 18071205 18800220 19844257 21185515 23098849 25867556 29220578 33461607
4121C3461607M806023M542625L697264J329024k117639n056189o853429n905888
$$ 33461607 38267630 42810255 46507519 47836543 45718904 40662715 33809286 27903398
4113B7903398m459613l128072k573858k164652j741133j490125j186554j128288
$$ 27903398 23443785 20315713 17741855 15577203 13836070 12345945 11159391 10031103
4105A0031103q11470o63548l78514k12924j85761l02349l13967l78598l36025
$$ 10031103 9219633 8556085 8177571 7964647 7778886 7476537 7162570 6783972 6447947
4096F447947k46760k39348l44097k30311j97690l33345j41454j45913m83518j38666
$$ 6447947 6201187 5961839 5617742 5387431 5189741 4856396 4714942 4569029 4085511 3946845
4086C946845q3903k33047j19041k6712j62149r8402O5905j5002M8328m7638j98879
$$ 3946845 3862942 3629895 3510854 3484142 3321993 3223591 3289496 3274494 3322822 3275184 3076305
4075C076305N7530K0883j1123O5631N5458n0915n8378j55517j26489p7L8297j06505
$$ 3076305 3133835 3154718 3143595 3209226 3264684 3213769 3155391 2999874 2873385 2873308 2911605 2805100
4063B805100q716k49j98315j65126j24791J690K4258j66713J54331o6499l2737
$$ 2805100 2796384 2796135 2597820 2432694 2307903 2309593 2333851 2167138 2321469 2254970 2222233
4052B222233M7271j58698M2686l9742J5362J0940l772M3318J1550j06999j67361
$$ 2222233 2269504 2110806 2153492 2113750 2129112 2140052 2136280 2179598 2191148 2084149 1916788
4041A916788j62342q524k9699N0584j22618k695J70180o8358j70703j63713j66471
$$ 1916788 1754446 1745922 1716223 1766807 1644189 1641494 1811674 1743316 1572613 1408900 1242429
4030A242429j73581N7419J49737j10530j48405M3352o6316k6706j4021J02741
$$ 1242429 1068848 1126267 1276004 1165474 1017069 1060421 994105 967399 953378 1056119
4020A056119l1571M1939q7107p5594j2187P6594m8139M6486q9283J8925p8030
$$ 1056119 1024548 1066487 979380 903786 891599 968193 920054 966540 877257 896182 818152
4009H18152j47864j6493N4672L1292o8798M9234K154J04025j3685k1740l6472
$$ 818152 670288 653795 708467 739759 670961 720195 722349 826374 812689 790949 754477
3998G54477o8096J2188q3761l8601j82729q0971K34633O139r2035P2784J03075
$$ 754477 686381 698569 614808 576207 393478 312507 547140 553279 461244 534028 637103
3987F37103k6938R8968k6966j75566O9335L6927m1102J06980O3545P5232o3028
$$ 637103 610165 709133 682167 506601 575936 612863 571761 678741 742286 817518 754490
3976G54490k29428o6859p135o1734Q1595J1093N1404j0421J3226R0062J20641
$$ 754490 525062 458203 451068 389334 470929 482022 533426 523005 536231 626293 746934
3965G46934k36514M6492Q1404j27527J33659J34549k5332k6250r1314j39987k15590
$$ 746934 510420 556912 638316 510789 644448 778997 753665 727415 636101 496114 280524
3954B80524R2335J3836O6596M7765j28160n481J06047k3804p573j8722j47872
$$ 280524 372859 386695 453291 501056 372896 367415 473462 449658 442085 423363 275491
3943B75491J59128P2980j75833K8475J02957J01316o0575k7826N9457o3064O2078
$$ 275491 434619 507599 331766 360241 463198 564514 503939 476113 535570 472506 534584
3932E34584J25670j6301k9801J12169J16224j6558J22630j3942j52645K8775J13215
$$ 534584 660254 643953 614152 726321 842545 825987 948617 934675 782030 810805 924020
3921I24020l8619L5249J04503m2396O8336K01685J31100r5669o490M1466J08918
$$ 924020 885401 920650 1025153 982757 1051093 1252778 1383878 1288209 1281719 1323185 1432103
3910A432103J53424J25591Q6503J65420L62709M77898K41471J36744p0635k50358
$$ 1432103 1585527 1711118 1797621 1963041 2325750 2803648 3045119 3181863 3111228 2860870
3900B860870n02153l50349l56578p3268l28187j59862m3884k58507l4097j02044
$$ 2860870 2358717 2008368 1651790 1578522 1250335 1090473 1046589 788082 753985 651941
3890F51941j0651n592j9506K2631K2835J9792j3026r6403q1718o9453M9112j7726
$$ 651941 641290 635698 616192 638823 661658 681450 668424 572021 490303 420850 469962 452236
3878D52236l2042q3431q8205n0220P8213K09473Q2854l7596p1741j3327n9469
$$ 452236 420194 336763 248558 198338 276551 486024 568878 531282 459541 446214 386745
3867C86745j1912l848q9616R7922L401J0729L6561K01325k01102k9624j41995
$$ 386745 374833 370985 281369 379291 382692 393421 429982 631307 430205 400581 258586
3856B58586j05921J32971L0316j0878j4269J35801j46632R4389l5971j96976N8996
$$ 258586 152665 285636 315952 305074 290805 426606 279974 374363 338392 141416 200412
3845B00412o9019k7604M8691L1206j67069P3186J8315N8338o0412j2999J94882
$$ 200412 131393 103789 152480 183686 16617 89803 108118 166456 106044 93045 287927
3834B87927j82447j22796J38204J86685j1945o3731o912J23813j42072J01054
$$ 287927 105480 -17316 120888 307573 295628 231897 224985 348798 206726 307780
3824C07780J35009j7801Q9992q1112P686O5062o5179j48661L2502J3223j26424
$$ 307780 442789 424988 514980 433868 441554 506616 441437 292776 325278 338501 212077
3813B12077N6342P4754m9393j8119M918J712o1035m7063O0496N8600J9090j70196
$$ 212077 268419 343173 293780 275661 280579 282291 221256 174193 234689 293289 312379 142183
3801A42183N0082R3288j01991j05680M9975j86790J10840R7978m4772k126J09369
$$ 142183 192265 285553 183562 77882 127857 -58933 51907 149885 105113 102987 212356
3790B12356p1414R688K582j71729K4394J44815O8107M3782o3435O0368l0801j36199
$$ 212356 140942 150630 153212 -18517 5877 150692 218799 262581 199146 259514 228713 92514
3778I2514o5509M8914J33157q890j11985Q2349J07530M2350k37940J3370O0125
$$ 92514 27005 75919 209076 200186 88201 170550 278080 320430 82490 95860 155985
3767A55985k01017J67681M5183k8645J26765N2071j87352q0077k4476j6630Q7413
$$ 155985 -45032 122649 167832 139187 265952 318023 130671 50594 26118 9488 96901
3756I6901N4042k4860J96984m9765n803m927j21199J7286J13892l620m4658O1459
$$ 96901 150943 126083 323067 273302 267499 262572 141373 158659 272551 268931 224273 285732
3744B85732m4536o1251l0884m8420j106R3465K5761l9706J35853j2585j27125
$$ 285732 241196 179945 149061 100641 99535 193000 218761 179055 314908 302323 175198
3733A75198Q0088O2902k940l3725K4746R0150p7877K5731P3392l3704q0397O0063
$$ 175198 255286 318188 315248 281523 306269 396419 318542 344273 417665 383961 303564 363627
3721C63627k3290L2295O085O9867J22285o9721J8661j1005m3064N286k1681j5521
$$ 363627 340337 372632 378717 448584 570869 501148 519809 508804 465740 471026 449345 433824
3709D33824k5040J34754k497L075L357J0111K3256m1942J6279j17090j62579J61362
$$ 433824 408784 543538 541041 544116 547473 557584 580840 538898 555177 438087 275508 436870
3697D36870K09701J01122O9876r1017j4758n7724J1698Q8008o979k2762j28078
$$ 436870 646571 747693 817569 726552 711794 654070 665768 753776 746797 724035 595957
3686E95957J78480Q3575N0402N6792j01580K0433M4399q713J24687J25054j07029
$$ 595957 774437 858012 908414 965206 863626 884059 928458 919745 1044432 1169486 1062457
3675A062457n0580J35379n7107J20045L4579Q0594R3376R5880n1194j13513k6029
$$ 1062457 1011877 1147256 1090149 1210194 1244773 1325367 1418743 1514623 1463429 1349916 1323887
3664A323887J02189J13465L9183M2871j63145P8302P5527L04913J7793n8518m229
$$ 1323887 1426076 1539541 1578724 1621595 1458450 1536752 1612279 1917192 1934985 1876467 1872238
3653A872238L6550K6825K9656J58945O3260R6608K44860P0502j354N7078J33748
$$ 1872238 1908788 1935613 1965269 2124214 2187474 2284082 2528942 2599444 2598090 2655168 2788916
3642B788916o1387l7786K76526P5072K2992J19123M7977N7237p2309J60907J85144
$$ 2788916 2727529 2689743 2966269 3041341 3064333 3183456 3231433 3288670 3216361 3377268 3562412
3631C562412Q0107J54636J65212K8085j44681K30364L13012Q7354P4109J25320
$$ 3562412 3642519 3797155 3962367 3990452 3845771 4076135 4389147 4476501 4550610 4675930
3621D675930J12689R5860J81606K67790R8965J65209q0965K07219J71378m8033
$$ 4675930 4788619 4884479 5066085 5333875 5432840 5598049 5517084 5724303 5895681 5847648
3611E847648N4691P1531J21333q2250m4465j44451l9527j53140q2251j51218p7164
$$ 5847648 5902339 5973870 6095203 6012953 5968488 5824037 5784510 5631370 5549119 5397901 5320737
3600E320737k37403k75792n1280p1886k49398j26801k71839j87543j71659k38150
$$ 5320737 5083334 4807542 4756262 4684376 4434978 4308177 4036338 3848795 3677136 3438986
3590C438986j03548o909j81478j54667j88571J2853j3894j10858j34812j55172
$$ 3438986 3335438 3328529 3147051 2992384 2803813 2816666 2802772 2691914 2557102 2401930
3580B401930j30437j72315J5174j82452l7880J3679K6865l6632k35747j83610
$$ 2401930 2271493 2099178 2114352 1931900 1894020 1907699 1934564 1897932 1662185 1478575
3570A478575M7463q3928j06765R352p8877k9123M7613L7887p2768r3926P996j49992
$$ 1478575 1526038 1442110 1335345 1344697 1265820 1236697 1284310 1322197 1249429 1155503 1163499 1013507
3558A013507j8963k2950r0534n5954l1337K6485j28464P0881Q346m2697N929j50231
$$ 1013507 994544 971594 881060 825106 793769 820254 691790 762671 771017 728320 734249 584018
3546E84018P3020q4920J49949j8755J3203m3669j03881J11095m6723k9717q6995
$$ 584018 657038 572118 722067 703312 716515 672846 568965 680060 633337 603620 516625
3535E16625n6934L0460p929K58537j18998j40741o7615o0514O5991Q775o2245
$$ 516625 459691 490151 482222 740759 621761 481020 413405 352891 418882 427657 365412
3524C65412q7530R7131k4364J88499j21896r5322Q6167j0990o7106j14428J6045
$$ 365412 277882 375013 350649 539148 417252 321930 408097 397107 330001 215573 231618
3513B31618K61K8682N7782R9051j1696j13713J2812n0660N2483o8481q2995J95368
$$ 231618 231879 260561 318343 417394 405698 291985 304797 254137 306620 238139 155144 350512
3501C50512q7425j31197Q1889M9032P2512j4534l0733q956p8359q5872J2517L9555
$$ 350512 263087 131890 213779 262811 335323 320789 290056 281100 202741 116869 129386 168941
3489A68941L7265P0502j15060j19680K1450R6678k3763Q4854Q5739j4948m7896
$$ 168941 206206 276708 161648 41968 63418 160096 136333 221187 306926 291978 244082
3478B44082o7809o4736K3590j5531j320l3266K3870l0179J81196q5835j14833
$$ 244082 176273 111537 135127 119596 118276 85010 108880 78701 259897 174062 59229
3467E9229L2221n2362N8971m8844J4765o0129K27428p0603J21530j69582j9875
$$ 59229 91450 39088 98059 49215 63980 3851 231279 160676 282206 112624 92749
3456I2749R8036L847p6935K6425O2607k48324M5409R2397J1056j40749M0874O1531
$$ 92749 190785 194632 117697 144122 206729 -41595 3814 96211 107267 -33482 7392 68923
3444F8923r2961J74452j9787k7417R4476l6477n9882j54529J10631K1130N0009
$$ 68923 -24038 150414 130627 103210 197686 161209 101327 -53202 57429 78559 128568
3433A28568l6947q5024j16809N9536K19112J6494q3962o7965k1198L6527J00911
$$ 128568 91621 6597 -110212 -50676 168436 184930 100968 33003 11805 48332 149243
3422A49243L8110j0777l4406j17856j8440P911k0607J8605J07249L4510n0023
$$ 149243 187353 176576 142170 24314 5874 13785 -6822 11783 119032 153542 103519
3411A03519r0391q4622j1051J6963P7589n9089l8275L2203k4424k4813J60199
$$ 103519 13128 -71494 -82545 -65582 12007 -47082 -85357 -53154 -77578 -102391 57808
3400E7808J4085n2859j2142j03407J07756m3493J5217N2535o3781J04836o6431
$$ 57808 71893 19034 6892 -96515 11241 -32252 -17035 35500 -28281 76555 10124
3389A0124p2900k0525Q0682J0823p8222J81025j2679k2610j2039k6315N9360n118
$$ 10124 -62776 -83301 -2619 8204 -70018 111007 98328 75718 63679 37364 96724 91606
3377I1606o0070O8492j7014O4290Q5223p6944k69781K6570Q5821M675j16102L90
$$ 91606 31536 100028 83014 147304 232527 155583 -114198 -87628 -1807 2868 -113234 -112844
3365a12844J41128L8454j11527j31071L5367j1385O4016N0488N7084l8285Q0723
$$ -112844 28284 66738 -44789 -175860 -140493 -151878 -87862 -37374 19710 -18575 62148
3354F2148r3943K8052N3452J0133j62588N1310J05492K48N2860P974K2705J16507
$$ 62148 -31795 -3743 49709 59842 -102746 -51436 54056 54304 107164 115138 137843 254350
3342B54350q9914j94017p1286P3840P4256o8094j39085k9736l3940J4627J12527
$$ 254350 164436 -29581 -100867 -27027 47229 -20865 -159950 -189686 -223626 -208999 -96472
3331i6472N9876J12043P4201L3159j09857o5648o418m7992J68522O6279M9072
$$ -96472 -36596 75447 149648 182807 72950 7302 884 -47108 121414 187693 236765
3320B36765j14597m9000L4955J17886o5095j36018J9328N6361J28780O3919l5101
$$ 236765 122168 73168 108123 226009 160914 24896 44224 100585 229365 293284 258183
3309B58183k269K0231k0135Q777m5419l1721N9071r239p9116m198Q5296K5664
$$ 258183 255914 276145 256010 264787 219368 187647 246718 237479 158363 154165 239461 265125
3297B65125l6548P2956K5719j35217P9318Q0029J5765n484m4534L3067N3337L1117
$$ 265125 228577 301533 327252 192035 271353 351382 367147 361663 317129 350196 403533 434650
3285D34650m7953m1580k8199N4244K1376K14621j02677J7607m9157J15425j1254
$$ 434650 386697 345117 316918 371162 392538 607159 504482 522089 472932 588357 577103
3274E77103Q4522N3616R5405n4975n9259J91103J21066K14223K06711K0043J78668
$$ 577103 661625 715241 810646 755671 696412 887515 1008581 1222804 1429515 1449558 1628226
3263A628226K42009q150l64272k89721O9978q9512j86673J45118q3941j11754
$$ 1628226 1870235 1862085 1497813 1208092 1278070 1188558 1001885 1147003 1063062 951308
3253I51308R2843m0199O8829J52980l0144J38225N6978j21949M99K6687J72834
$$ 951308 1044151 1003952 1072781 1225761 1195617 1333842 1390820 1268871 1269370 1296057 1468891
3242A468891J47316L43637j22409j46939j2634J50691K88986J32190J54306L04622
$$ 1468891 1616207 1959844 1837435 1690496 1677862 1828553 2117539 2249729 2404035 2708657
3232B708657R5868K8827j63466m13376m47164l94212k09417j63802n3631q172
$$ 2708657 2804525 2833352 2669886 2256510 1809346 1415134 1205717 1041915 988284 980112
3222I80112r4670k16677m2645r9710j9916k3788N298j38451R236J24569K8362
$$ 980112 885442 668765 626120 526410 506494 482706 488004 349553 358789 483358 511720
3211E11720J29428J1174m2387J9238m9914M0167J31189M2252P1281J03008J96325
$$ 511720 641148 652322 609935 629173 579259 619426 750615 792867 864148 967156 1163481
3200A163481J32530Q3997j16781j68248m28156j96179M5027j05149j14731r6257
$$ 1163481 1296011 1380008 1263227 1094979 666823 470644 515671 410522 295791 199534
3190A99534J11532n300j03891K162k06387J05689j29795l442J58015L878M6224
$$ 199534 311066 305766 201875 204037 -2350 103339 -26456 -29898 128117 131995 178219
3179A78219Q299n2997m352o630m8440q0617J41829P1516j55476k7883n3767N2609
$$ 178219 186518 133521 129169 122539 74099 -6518 135311 206827 51351 23468 -30299 22310
3167B2310r4m6123j7700j8211l5429K6542N4895j37413J08593p0085Q907Q0680
$$ 22310 22216 -23907 -41607 -59818 -95247 -68705 -13810 -151223 -42630 -112715 -103808 -23128
3155b3128P4285l9731M437n1514R898N6274j88349O0024M9135O2851n8570l8065
$$ -23128 51157 11426 15863 -35651 -25753 30521 -157828 -97804 -48669 14182 -44388 -82453
3143h2453L3294K5950p5508J75459N7362r3893r2242p1424k3132Q1766J089k1366
$$ -82453 -49159 -23209 -98717 76742 134104 40211 -52031 -123455 -146587 -64821 -63732 -85098
3131h5098m0832J01418m2511n3155L6432J6323O6043n9669j38385m0525J67243
$$ -85098 -125930 -24512 -67023 -120178 -83746 -67423 -1380 -61049 -199434 -239959 -72716
3120g2716q8769K025J02011k8770K3608m8281R1116J0553q9824j03895m2362J2578
$$ -72716 -161485 -159460 -57449 -86219 -62611 -110892 -19776 -9223 -99047 -202942 -245304 -232726
3108b32726M560L9777J26906K1739j19681N443J23265p0180m4268M254K6210K8578
$$ -232726 -228166 -188389 -61483 -39744 -159425 -153982 -30717 -100897 -145165 -140911 -114701 -86123
3096h6123J05523K9535J9049n4717q2172l5460o3846J2800K08502p61p0657P4367
$$ -86123 19400 48935 67984 13267 -68905 -104365 -168211 -155411 53091 52330 -18327 56040
3084E6040j18359j1261J34295p7241j56079Q13N3585J61497j48726N6034o0822
$$ 56040 -62319 -73580 60715 -16526 -172605 -171792 -118207 43290 -105436 -49402 -110224
3073a10224p2580M6049k668R5913q8093j7744m1321j6114J39922o4225m0219N4244
$$ -110224 -182804 -136755 -139423 -43510 -131603 -149347 -190668 -206782 -66860 -131085 -171304 -117060
3061a17060Q0727k5397j03868P5143Q9605r5086j37224J17296O1141n4354P5001
$$ -117060 -36333 -61730 -165598 -90455 -850 -95936 -233160 -115864 -54723 -109077 -34076
3050c4076o1604R391M1678L3448j58391Q721J98487p2796j42120o9609k550O6729
$$ -34076 -95680 -86289 -44611 -11163 -169554 -160833 37654 -35142 -177262 -246871 -249421 -182692
3038a82692K740L8009q0298l0521M6793Q2628P9887n6375p0531m979O9292j04848
$$ -182692 -179952 -141943 -222241 -252762 -205969 -123341 -43454 -99829 -170360 -175339 -106047 -210895
3026b10895k525P2742O1458J07728J23694m8814P8843q4852j46346n3245P9635
$$ -210895 -213420 -140678 -79220 28508 152202 103388 182231 97379 -48967 -102212 -22577
3015b2577m6382k7308j20606p677R5199Q2182M5046n6373K5117O4395N4864j78949
$$ -22577 -68959 -96267 -216873 -224550 -129351 -47169 -2123 -58496 -33379 31016 85880 -93069
3003i3069N7155J8649j11313q0808r291J40109R800P5913m3749l6182J12202k0385
$$ -93069 -35914 -17265 -128578 -209386 -218677 -78568 -68768 7145 -36604 -72786 39416 19031
2991A9031J1006p5423m6317J44348N0732j18585k7060R174J17572J1597l4376
$$ 19031 30037 -45386 -91703 52645 103377 -15208 -42268 -33094 84478 96075 61699
2980F1699J3L8092N7m0741j04181p2762P1249l4119l2092R1606J57491p36j47145
$$ 61699 61712 99804 99861 59120 -45061 -117823 -46574 -80693 -112785 -21179 136312 135576 -11569
2967a1569j9721K1477M6104m61j8527n8985r3069m0209J16417o050j00870o8505
$$ -11569 -31290 -9813 36291 35830 17303 -41682 -134751 -174960 -58543 -64593 -165463 -233968
2955b33968J08656R7166j02528J4141O6202K6307O2728L8976J4646L8289o9593
$$ -233968 -125312 -28146 -130674 -116533 -50331 -24024 38704 77680 92326 130615 61022
2944F1022j37591l9976K170J17397P0464r3337k8496R4029O0895L351j01703k2667
$$ 61022 -76569 -116545 -114375 3022 73486 -19851 -48347 45682 106577 109928 8225 -14442
2932a4442q178l9546J57723l4619l5520K8540p9304n7376J68732J5936n2783P6886
$$ -14442 -22620 -62166 95557 60938 25418 53958 -25346 -82722 86010 101946 49163 126049
2920A26049o5414j12598p473Q9343J5744N8344j41637j2839q0744O997m9510P164
$$ 126049 60635 -51963 -59436 29907 45651 103995 -37642 -50481 -131225 -124228 -173738 -166574
2908a66574J19229J5201P2738j84363J14963m5192l7777K58182J5434p1612l281
$$ -166574 -47345 -32144 40594 -143769 -28806 -73998 -111775 146407 161841 90229 86948
2897H6948P58L6414k8392J9988M626j1348j40479j1331Q2891N8554q5681j86335
$$ 86948 87706 124120 95728 115716 120342 108994 -31485 -42816 40075 98629 12948 -173387
2885a73387l4758O3575M9266O4973M8481J25628l6491j1691n195j41777o3528
$$ -173387 -208145 -144570 -95304 -30331 18150 143778 107287 95596 90401 -51376 -114904
2874a14904J12235n2429N9044O9706j08814J8013l5813J34631o4689m7414J09399
$$ -114904 -2669 -55098 3946 73652 -35162 -17149 -52962 81669 16980 -30434 78965
2863G8965q8795j5077O2557j82142J45319J01920j20638o5431j8903n3805O8040
$$ 78965 -9830 -24907 37650 -144492 827 102747 -17891 -83322 -102225 -156030 -87990
2852h7990N7034k9682P1326o7910k8913L9042M1562j03398j9450J71357R565j0635
$$ -87990 -30956 -60638 10688 -57222 -86135 -47093 -5531 -108929 -128379 42978 52543 41908
2840D1908N0623p4147o7505j19246J9641J44066K4380j27812M1667J43189p9291
$$ 41908 92531 18384 -49121 -168367 -148726 -4660 19720 -108092 -66425 76764 -2527
2829b527j40218j01543j1360J06535M7200L1334k2837l4720J3904k1391P224L2321
$$ -2527 -142745 -244288 -255648 -149113 -101913 -70579 -93416 -128136 -114232 -135623 -128399 -96078
2817i6078j176l308o3788Q9344q246n9020p761P025L5956q6535J31323o3811k2694
$$ -96078 -97254 -100562 -164350 -75006 -83252 -142272 -150033 -143008 -107052 -193587 -62264 -126075 -148769
2804a48769P552o3930k9452M7439J9310K8154l2605n022J22588O877j65179o8818
$$ -148769 -141217 -205147 -234599 -187160 -167850 -139696 -172301 -177323 -54735 -47858 -213037 -281855
2792b81855J2208M4552j3229r2840Q1367L3471J15355o3459L0682J16668K1840
$$ -281855 -269647 -225095 -238324 -331164 -249797 -216326 -100971 -164430 -133748 -17080 4760
2781D760M4767J6245L3899L0948o6573n7157M8522l3755n2231M0286n375j85170
$$ 4760 49527 65772 99671 130619 64046 6889 55411 21656 -30575 9711 4336 -180834
2769a80834M1136P3190j18741J07708J04060n7183q454o6186j6673K2126m9018
$$ -180834 -139698 -66508 -185249 -77541 26519 -30664 -39118 -105304 -121977 -99851 -148869
2758a48869K2003J08272K4815L0910j98622l2165J44388J79826j63771j44592
$$ -148869 -126866 -18594 6221 37131 -161491 -193656 -49268 130558 -33213 -177805
2748a77805O5348k0068m973j19416J59368J55990L7312p8162o5808Q969K5318
$$ -177805 -112457 -132525 -137498 -256914 -97546 58444 95756 17594 -48214 -39245 -13927
2737a3927n9975J33310j5723j60275l9027L9343K5798M4064N6068l5602P3255
$$ -13927 -73902 59408 43685 -116590 -155617 -116274 -90476 -46412 9656 -25946 47309
2726D7309N2703k13635r7990J59093O899k21862K7129J59922Q5813K8631j8213
$$ 47309 100012 -113623 -211613 -52520 -45621 -267483 -240354 -80432 5381 34012 15799
2715A5799j02076o369L2415k8584P6977k8749l8037q2125O0904p0794q6004Q1471
$$ 15799 -86277 -92646 -60231 -88815 -11838 -40587 -78624 -160749 -99845 -170639 -256643 -175172
2703a75172o6645J3066R9861P719J54518j43748J1178K7451J6463M209P5234o4048
$$ -175172 -241817 -228751 -128890 -121171 33347 -110401 -99223 -71772 -55309 -51100 24134 -39914
2691c9914K1461N5752j33724l8151L7985n6696k7283l2526J39072o8770l2371
$$ -39914 -18453 37299 -96425 -134576 -96591 -153287 -180570 -213096 -74024 -142794 -175165
2680a75165J08992o4793N0981J2954J5434o463p2754n2071Q1619k463L4978r289
$$ -175165 -66173 -130966 -79985 -67031 -51597 -58060 -130814 -182885 -101266 -103729 -68751 -78040
2668g8040j8033J1003P0383K5476M7707j42306l0171P6505j9008q6442J13921
$$ -78040 -96073 -85070 -14687 10789 58496 -83810 -113981 -37476 -56484 -142926 -29005
2657b9005m6671j02310o2714L6282P666M0706p1030K0066J73991P6744J0799n7714
$$ -29005 -75676 -177986 -240700 -204418 -196752 -156046 -227076 -207010 -33019 43725 54524 -3190
2645c190j20600J3639J8493K4683J05146o9830j02255J12499L1601k306j0576
$$ -3190 -123790 -110151 -91658 -66975 38171 -31659 -133914 -21415 10186 7880 -2696
2634b696k4298n6997j17800O3188J14147l6292n3940L3681l4544o763L6712J6802
$$ -2696 -26994 -83991 -201791 -138603 -24456 -60748 -114688 -81007 -115551 -122314 -85602 -68800
2622f8800q8807m4981m9058K051P7917J06299L7337j1382j92676q3755J82919
$$ -68800 -157607 -202588 -251646 -249595 -171678 -65379 -28042 -39424 -232100 -315855 -132936
2611a32936R0522p9581j8039J840l9183j2112p9561K06828j04159l6079o5886
$$ -132936 -42414 -121995 -140034 -138194 -177377 -189489 -269050 -62222 -166381 -202460 -268346
2600b68346P8668O5982J26654q836o481N8224J4754m7547J1134p240j1054O2564
$$ -268346 -189678 -123696 2958 -5878 -12359 45865 60619 13072 24206 16966 5912 68476
2588F8476j26692P7520M0864j54344j28329M6621J7133K4713m0101J07684J7465
$$ 68476 -58216 19304 60168 -94176 -222505 -175884 -158751 -134038 -174139 -66455 -48990
2577d8990L8110Q2669K0921r1298k54387j9804K65744J03051p7199j18492J21599
$$ -48990 -10880 71789 92710 1412 -252975 -272779 -7035 96016 18817 -99675 21924
2566B1924m5562n1883m2138J22016k02645p8181M3404J28169L1725j8695j1823
$$ 21924 -23638 -75521 -117659 4357 -198288 -276469 -233065 -104896 -73171 -91866 -103689
2555a03689j97972J08613P8046N2385N5858m3037K7643L1699J01440k26689r4472
$$ -103689 -301661 -193048 -115002 -62617 -6759 -49796 -22153 9546 110986 -115703 -210175
2544b10175j4077J12904R9274k9488O6041J6867q6434q9974j2369R8545J5591
$$ -210175 -224252 -111348 -12074 -41562 24479 41346 -45088 -135062 -147431 -48886 -33295
2533c3295j29752k0197J27227m2120L3506k6733K5507p833k3946J76896K585o9276
$$ -33295 -163047 -183244 -56017 -98137 -64631 -91364 -65857 -73690 -97636 79260 81845 12569
2521A2569j54827Q4109J02270j17879o5532n1153R8720O6097J0411j1391p7841
$$ 12569 -142258 -58149 44121 -73758 -139290 -190443 -91723 -25626 -15215 -26606 -104447
2510a04447R1358l4917j07337l5363J50618n5514R870Q5303j08150N8200O7599
$$ -104447 -13089 -48006 -155343 -190706 -40088 -95602 -85732 -429 -108579 -50379 17220
2499A7220k8605l9879m0535Q6781k8908M4712m1933n2802j73941O0070K15780
$$ 17220 -11385 -51264 -91799 -5018 -33926 10786 -31147 -83949 -257890 -197820 17960
2488A7960l2505J5933L0292l1656l8830N670m401K7792P9851q6585p044K5298
$$ 17960 -14545 1388 31680 24 -38806 -33136 -37537 -9745 70106 -16479 -23523 1775
2476A775n5000K070P6904l4212Q2606o203j69606j05284Q3432M9929N4257O7465
$$ 1775 -53225 -51155 25749 -8463 74143 67940 -101666 -206950 -123518 -73589 -19332 48133
2464D8133J2021j10635Q0530M9937m1937O890j81153L4106n0984P5048R0976j767
$$ 48133 60154 -50481 30049 79986 38049 44939 -136214 -102108 -153092 -78044 12932 11165
2452A1165p5934o32J38007J4076k3552K2338l9177j7028j7378l7560m9723j0580
$$ 11165 -64769 -65401 72606 86682 63130 85468 46291 29263 11885 -25675 -75398 -85978
2440h5978P350q8089k5544N9760Q1976m5025R2379N2952M8016j61084r6898L2629
$$ -85978 -78628 -166717 -192261 -132501 -50525 -95550 -3171 49781 97797 -63287 -160185 -127556
2428a27556Q6995O0870R0491j43632P1443m9415n6885P7077Q8422K7740j57270
$$ -127556 -40561 20309 110800 -32832 38611 -10804 -67689 9388 97810 125550 -31720
2417c1720O4817q8091q0944J18211R9084m4130J1061J911j17990N4068Q0808L977
$$ -31720 33097 -54994 -135938 -17727 81357 37227 48288 50199 -67791 -13723 67085 71062
2405G1062j9939J37900r370r0404q4472R8109L3047j0964n0881M8032R3459j54745
$$ 71062 51123 189023 179653 89249 4777 102886 135933 124969 74088 122120 215579 60834
2393F0834M7061l3958j5504L3103q094m7182N6599j19532J77225R1899o0088q7995
$$ 60834 107895 73937 58433 91536 83442 36260 92859 -26673 150552 242451 182363 94368
2381I4368N0722P3173j05405M5481J16833O4455K1130l5002K2108M7697J65054
$$ 94368 145090 218263 112858 158339 275172 339627 360757 325755 347863 395560 560614
2370E60614j00253K7846O4964M066j64405o9217M0744J6377p1056n54m6049n091
$$ 560614 460361 488207 553171 557237 392832 323615 364359 380736 309680 309126 263077 257986
2358B57986r6785J17912k0470p1442k3348J03699M8546j38671m1006r9662o692
$$ 257986 161201 279113 258643 187201 163853 267552 316098 177427 136421 36759 30067
2347C0067q3947J48138L3184m9433N9193j31149K569J46203J15474p4970j44323
$$ 30067 -53880 94258 127442 78009 137202 6053 8622 154825 270299 195329 51006
2336E1006M6231J8509M8208m9646o2213O1458P2847P544o3203K027L8545R9616
$$ 51006 97237 115746 163954 114308 52095 113553 186400 193944 130741 132768 171313 270929
2324B70929j07538r5960R5199P0171L2896M1985M9109q7394q2278o8482J01370
$$ 270929 163391 67431 162630 232801 265697 307682 356791 269397 187119 118637 220007
2313B20007j59623J53311J20181q6160j08808J41199P5673q5313J308K5347L0739
$$ 220007 60384 213695 333876 247716 138908 280107 355780 270467 271775 297122 327861
2302C27861j15516j31712m7081J01190L4807L4065j7835l5349l9244Q1111o546
$$ 327861 212345 80633 33552 134742 169549 203614 185779 150430 111186 192297 185751
2291A85751j22614M4220Q1793q2831n6219J10122L3790j17846N4250K4759p2677
$$ 185751 63137 107357 189150 106319 50100 160222 194012 76166 130416 155175 82498
2280H2498K0335R0439P9761O6209q07j4572k215m3743n1029j14660J18989O8926
$$ 82498 102833 193272 273033 339242 338435 323863 321648 277905 226876 112216 231205 300131
2268C00131P7505j42774j52401J05652K8512k3923J07901N6301r1595j33655j5824
$$ 300131 377636 234862 82461 188113 216625 192702 300603 356904 265309 131654 115830
2257A15830m2254J00066P9637Q8539Q1960o5409J6674l5615p17J50628J3835j42491
$$ 115830 73576 173642 253279 341818 423778 358369 375043 339428 338711 489339 503174 360683
2245C60683P3047J02105k9968m1489O1286l6350m6018j58252p8426J11702j5346
$$ 360683 433730 535835 505867 464378 525664 489314 443296 285044 206618 318320 302974
2234C02974J18522k8596M4270j12n9714J24598P2476L0960N2729O412R9659j735
$$ 302974 421496 392900 437170 437058 377344 501942 574418 605378 658107 664519 764178 762443
2222G62443O222k03212J54845N9246k2852K7811j06074P7656j20910K0993Q165
$$ 762443 768665 565453 720298 779544 756692 784503 678429 756085 635175 656168 664333
2211F64333J47263n7522m4195L7736m3083l0075R4091J14059P3093P3374m3899
$$ 664333 811596 754074 709879 747615 704532 674457 768548 882607 955700 1029074 985175
2200I85175l9669N2948P0503O7967K2718k683j33750J92339k4010o959K23559
$$ 985175 945506 998454 1068957 1136924 1159642 1156959 1023209 1215548 1191538 1184579 1408138
2189A408138L9003j33500L2031K00557J93165O4597M9347n1373o2351J39278O1263
$$ 1408138 1447141 1313641 1345672 1546229 1739394 1803991 1853338 1801965 1739614 1878892 1940155
2178A940155J46591L4858K7496n0667K8708p1727M5107j501M5138R0269K4768
$$ 1940155 2086746 2121604 2149100 2098433 2127141 2055414 2100521 2099020 2144158 2234427 2259195
2167B259195N4482R6335l6823P9744j11214J28750K03081O6414P7822L5495K15784
$$ 2259195 2313677 2410012 2373189 2452933 2341719 2470469 2673550 2739964 2817786 2853281 3069065
2156C069065J23394J3391j3806J02947K37955J1525M7295K40978P8437K11014
$$ 3069065 3192459 3205850 3192044 3294991 3532946 3544471 3591766 3832744 3911181 4122195
2146D122195J31325K41611K17426Q2007M10993L98525K03704L20712J74981K95525
$$ 4122195 4253520 4495131 4712557 4794564 5205557 5604082 5807786 6128498 6303479 6599004
2136F599004L36025L68904L76361K21097J82472M30663L85251L53221M78281K83374
$$ 6599004 6935029 7303933 7680294 7901391 8083863 8514526 8899777 9252998 9731279 10014653
2126A0014653M95785M07349N16545N85108N88335R53221J135229J323967J389135
$$ 10014653 10510438 10917787 11434332 12019440 12607775 13560996 14696225 16020192 17409327
2117A7409327J402031J126116J460432J575419J860947K187277K802861M044610
$$ 17409327 18811358 19937474 21397906 22973325 24834272 27021549 29824410 33869020
2109C3869020N370258O812232Q100787Q998991R346796N797972M334221m979225
$$ 33869020 39239278 46051510 54152297 63151288 72498084 78296056 82630277 77651052
2101G7651052j4286645j3925897j0839480o981288n314535l842638l423380k754469
$$ 77651052 63364407 49438510 38599030 31617742 26303207 22460569 19037189 16282720
2093A6282720k167552j501897j148193o40111m24264l02407o53355o96403q56263
$$ 16282720 14115168 12613271 11465078 10824967 10400703 10098296 9444941 8748538 7892275
2084G892275p59279o50334n70740n74137m79959m15786k27901k72715l00066k48669
$$ 7892275 7132996 6482662 5911922 5337785 4857826 4442040 4214139 3941424 3641358 3392689
2074C392689q3138p0504j68302q4581l1381q3900k34609j68328m2142k9904r5886
$$ 3392689 3309551 3239047 3070745 2986164 2954783 2870883 2636274 2467946 2425804 2395900 2300014
2063B300014N1462K0464k91574o0162o7038J36462o7778q6419j47865p9925l89
$$ 2300014 2351476 2371940 2080366 2020204 1953166 2089628 2021850 1935431 1787566 1707641 1707252
2052A707252M8860j46365j19055r5760q9949R1491j499m4436L2959p4337k1808
$$ 1707252 1756112 1609747 1490692 1394932 1304983 1396474 1394975 1350539 1383498 1309161 1287353
2041A287353q7853p2013q5527J82125q3020k11349r3133P5792j10662r8670Q0580
$$ 1287353 1199500 1127487 1041960 1224085 1141065 929716 836583 912375 801713 703043 783623
2030G83623j47567j0037j25895N6135P516j6035K669J2411K6023l160o9557Q1246
$$ 783623 636056 626019 500124 556259 563775 547740 550409 562820 588843 585683 516126 597372
2018E97372J66717k0392N486n6994l9115j15656k3714M6481Q325m3211o4743j36137
$$ 597372 764089 743697 749183 692189 653074 537418 513704 560185 568510 525299 460556 324419
2006C24419j27765J05419R3273K9399o9156k8428n6307L1040p8525P760N2910
$$ 324419 196654 302073 395346 424745 355589 327161 270854 301894 223369 231129 284039
1995B84039j7782p280J0657n2238J0808m8995M1351l7824p0373m561J14938k9991
$$ 284039 266257 258977 269634 217396 228204 179209 220560 182736 112363 107802 222740 192749
1983A92749j04322r071O1477r788k847r9218P4544O5469K0284j26730M380p4802
$$ 192749 88427 79356 140833 131045 128198 28980 103524 168993 189277 62547 66927 -7875
1971g875J84054J20642q8702J9323J31593j17978n6362l0881m8290L2626N8861
$$ -7875 176179 296821 208119 227442 359035 241057 184695 153814 105524 138150 197011
1960A97011m7747r5235j7113J24916p3639q1179J37409n7879M0832q1685l394
$$ 197011 149264 54029 36916 161832 88193 7014 144423 86544 127376 45691 42297
1949D2297J01310M0176P615p6572n2929P7227m726l9636R0770K1106r2956j4389
$$ 42297 143607 183783 191398 114826 61897 139124 134398 94762 185532 206638 113682 99293
1937I9293o9012M8394j0990K4380N5181j2499q8091M9455O5246k515k4850O8731
$$ 99293 30281 78675 67685 92065 147246 134747 46656 96111 161357 158842 133992 202723
1925B02723j7557j12466k6159l2674k4496k4637n344j43948k8312J55752J08175
$$ 202723 185166 72700 46541 13867 -10629 -35266 -40610 -184558 -212870 -57118 51057
1914E1057j50022n1733K87071j1333o8093j38396P3106k58385J13656K09532k6481
$$ 51057 -98965 -150698 136373 125040 56947 -81449 -8343 -266728 -153072 56460 29979
1903B9979N8546l9039j33157o8417L3446Q8640N5124n1002n4418K9908n155k1146
$$ 29979 88525 49486 -83671 -152088 -118642 -30002 25122 -25880 -80298 -50390 -55545 -76691
1891g6691N3656l4092m7579J09700p5584j8176Q4439N5344j31860l6778Q0510
$$ -76691 -23035 -57127 -104706 4994 -70590 -88766 -4327 51017 -80843 -117621 -37111
1880c7111j0191J00471P7122k12660n5856J90836J18925n1057k29134K3918N3355
$$ -37111 -47302 53169 130291 -82369 -138225 52611 171536 120479 -108655 -84737 -31382
1869c1382j08055K6189J53508p9546O6043O4232q9022r8990J8530l9320M2404
$$ -31382 -139437 -113248 40260 -39286 26757 90989 1967 -97023 -78493 -117813 -75409
1858g5409L3560m7746K3938M045N3478P1227j95678M2489J76311K370n1719o4608
$$ -75409 -41849 -89595 -65657 -61612 -8134 63093 -132585 -90096 86215 88585 36866 -27742
1846b7742L0415M0246R668O8920m4743Q7043j05160Q520J16604Q322N5847K06854
$$ -27742 2673 42919 52587 121507 76764 163807 58647 67167 183771 192093 247940 454794
1834D54794o2541l931j02246k7232l1186p2736J800k64145R4954Q8996j00139
$$ 454794 392253 388322 286076 258844 227658 154922 156722 -107423 -12469 76527 -23612
1823b3612m1524j07753J08605K7879j17343O2776p125j5801k2895Q3029j7696
$$ -23612 -65136 -172889 -64284 -36405 -153748 -90972 -98097 -113898 -136793 -53764 -71460
1812g1460j3379j16054k8906J27096L1119m966j10777R7412J7774l3872L3103
$$ -71460 -84839 -200893 -229799 -102703 -71584 -76550 -187327 -89915 -72141 -106013 -72910
1801g2910n0286r5960m0491r413K8723M1705J22116M771j61403k5242J56559l4920
$$ -72910 -123196 -219156 -259647 -269060 -240337 -198632 -76516 -71745 -233148 -258390 -101831 -136751
1789a36751p3898k654Q3006n02l1631N5374j80892J26647r84Q6624P9134L6170
$$ -136751 -210649 -213303 -130297 -130799 -162430 -107056 -287948 -161301 -162285 -75661 3473 39643
1777C9643K439q2424Q9497j1367q0762P6602K2748K1002p2916j89296r9811J05116
$$ 39643 42082 -40342 49155 37788 -42974 33628 56376 77378 4462 -184834 -284645 -179529
1765a79529O1121o693L6495M7321J5624q5158j45179R8546N7957j3265m6740J1805
$$ -179529 -118408 -125101 -88606 -41285 -25661 -110819 -255998 -157452 -99495 -112760 -159500 -147695
1753a47695O1774M825o5130J16855j30997Q6091J8557p6462J92516j96598j1185
$$ -147695 -85921 -81096 -146226 -29371 -160368 -74277 -55720 -132182 60334 -136264 -147449
1742a47449J48484q1065n7424k3433M0809N5635j54226M4285J21674o4557j06034
$$ -147449 1035 -80030 -137454 -160887 -120078 -64443 -218669 -174384 -52710 -117267 -223301
1731b23301M7099J17226K4748l2384K8429Q5375q00n1504r6047o9975n6246J35634
$$ -223301 -176202 -58976 -34228 -66612 -38183 47192 46392 -5112 -101159 -171134 -227380 -91746
1719i1746N3754o2905q9521J19280m7256k3319J42132n0085m1387m0263L8666
$$ -91746 -37992 -100897 -190418 -71138 -118394 -141713 419 -49666 -91053 -131316 -92650
1708i2650j5917N1213n7752L0251N0016N4743O3144M4083m6210j74297n5801Q2370
$$ -92650 -108567 -57354 -115106 -84855 -34839 19904 83048 127131 80921 -93376 -149177 -66807
1696f6807J02590o0730j01332J15699n9690J2986J9597R9642j25576Q8434O9312
$$ -66807 35783 -24947 -126279 -10580 -70270 -57284 -37687 61955 -63621 24813 94125
1685I4125j13594r1453n0831O7109J4910p7766p6931l5991K12382J35070l7665
$$ 94125 -19469 -110922 -161753 -94644 -79734 -157500 -234431 -270422 -58040 77030 39365
1674C9365j9100p0667q2982M1435M6879j20612P0889M2105n1475R5182r1527p8966
$$ 39365 20265 -50402 -133384 -91949 -45070 -165682 -94793 -52688 -104163 -8981 -100508 -179474
1662a79474N2048O3904K8409k609r0133o6427k2461M5000O0787J19685l5969p4615
$$ -179474 -127426 -63522 -35113 -37722 -127855 -194282 -216743 -171743 -110956 8729 -27240 -101855
1650a01855R7996Q209n8520j16948P2126j5283K8506J00285L2585j10076m5323
$$ -101855 -3859 4350 -54170 -171118 -98992 -114275 -85769 14516 47101 -62975 -108298
1639a08298R817j44135l5577J45978O9563L4561m1427O9307k6498K070o3945r051
$$ -108298 -98481 -242616 -278193 -132215 -62652 -28091 -69518 -211 -26709 -24639 -88584 -97635
1627i7635J8495O2198K1492p4442K4200k2778o0489j1896N3534n5878P8701M4585
$$ -97635 -79140 -16942 4550 -69892 -45692 -68470 -128959 -140855 -87321 -143199 -64498 -19913
1615a9913m8430j8047J8426O8604q2653j2152Q0445J859q0526J26973n8740m7685
$$ -19913 -68343 -86390 -67964 640 -82013 -94165 -13720 -11861 -92387 34586 -24154 -71839
1603g1839J61364r9309j7674J26354o7155n8935l7120j03793m0432J17206k7772
$$ -71839 89525 -9784 -27458 98896 31741 -27194 -64314 -168107 -208539 -91333 -119105
1592a19105p2768J10738m3370R8910J54310R207j67202n5881K2837L7110O4781
$$ -119105 -191873 -81135 -124505 -25595 128715 137922 -29280 -85161 -62324 -25214 39567
1581C9567p3804j89154P9746l2522j835P9746N3284K288j75881J07674N6841J6542
$$ 39567 -34237 -223391 -143645 -176167 -178002 -98256 -44972 -42684 -218565 -110891 -54050 -37508
1569c7508l6186o5010M5849k5864J49708N035j36201R1302K231R745P6069J6114
$$ -37508 -73694 -138704 -92855 -118719 30989 36024 -100177 -8875 -6644 3101 79170 95284
1557I5284j38520P607P7901k6255j59781Q9546P3578m1037K29314j11484p0343
$$ 95284 -43236 -35629 42272 16017 -143764 -54218 19360 -21677 207637 96153 25810
1546B5810q7513j17658O0085N7196P1944p9161N1524k7651k6919M6756J0242r326
$$ 25810 -61703 -179361 -119276 -62080 9864 -69297 -17773 -45424 -72343 -25587 -15345 -24671
1534b4671L7752j1501j86780j2175J35473O7293O0100j17201r1505m980J05447
$$ -24671 13081 1580 -185200 -197375 -61902 5391 65491 -51710 -143215 -148195 -42748
1523d2748J04552j04716n5838k1750R478Q9692r025j08388J9258N127o0270K04129
$$ -42748 61804 -42912 -98750 -120500 -111022 -21330 -30355 -138743 -119485 -114358 -174628 29501
1511B9501R0223n5782j28536j33453J15249O3710j72557Q295P9397j921K8712
$$ 29501 119724 63942 -64594 -198047 -82798 -19088 -191645 -183350 -103953 -105874 -77162
1500g7162P589K3969L3087q1745j08561j07941l709k5084J48234Q492L3670j1928
$$ -77162 -69573 -45604 -12517 -94262 -202823 -310764 -314473 -339557 -191323 -182831 -149161 -161089
1488a61089m5795J64913N6488J4232j83019J9080N9224o0792l3343L872q1426
$$ -161089 -206884 -41971 14517 28749 -154270 -135190 -75966 -136758 -170101 -166229 -247655
1477b47655M4495Q3309J7705q8716O4173m6215N994n780O8355J9587m5824J27200
$$ -247655 -203160 -119851 -102146 -190862 -126689 -172904 -166910 -172690 -104335 -84748 -130572 -3372
1465c372k4950j7032O5126j60928o3576O8398M4133M0898J3391q847m1719N5459
$$ -3372 -28322 -45354 19772 -141156 -204732 -136334 -92201 -51303 -37912 -46759 -88478 -33019
1453c3019P7689q1864O7466m8290j65582k2324K56047J95085j14207q6789j18619
$$ -33019 44670 -37194 30272 -18018 -183600 -205924 50123 245208 131001 44212 -74407
1442g4407k3882R9095P5612j33534j12942J8431k8672Q9174L9311o0362Q1405
$$ -74407 -98289 806 76418 -57116 -170058 -151627 -180299 -91125 -51814 -112176 -30771
1431c0771M336j61834k335n686K46510l3333r9309J27338m1519J5819q0496R6804
$$ -30771 -26435 -188269 -190604 -196290 50220 16887 -82422 44916 3397 19216 -61280 35524
1419C5524j36168P2307j6574n6951J05518j16876L5243N1076o1145o2023P1454
$$ 35524 -100644 -28337 -44911 -101862 3656 -113220 -77977 -26901 -88046 -150069 -78615
1408g8615J92561q6958J14464j7005j02066m3404o3967q8569J03122M0362P246
$$ -78615 113946 26988 141452 124447 22381 -21023 -84990 -173559 -70437 -30075 -22829
1397b2829Q6524J3798R989n061m9828P461k0490j57352L8987J9708J11628k1088
$$ -22829 63695 77493 87482 82421 32593 40054 19564 -137788 -98801 -79093 32535 11447
1385A1447l5276m5623N1057J06698j63535p5241J48014o6242k5529o9903R5524
$$ 11447 -23829 -69452 -18395 88303 -75232 -150473 -2459 -68701 -94230 -164133 -68609
1374f8609j7597N9421j038M0477j11731k5368L4208K6654q2142j11732J27160
$$ -68609 -86206 -26785 -27823 12654 -99077 -124445 -90237 -63583 -145725 -257457 -130297
1363a30297L1549J1631L6068J65988j17237l1425p2162n2357J55770R9405j6436
$$ -130297 -98748 -87117 -51049 114939 -2298 -33723 -105885 -158242 -2472 96933 80497
1352H0497q4325q3223L9965O6536l3392n8792N8748N3460O6539O0293k15371K647
$$ 80497 -3828 -87051 -47086 19450 -13942 -72734 -13986 39474 106013 166306 -49065 -46418
1340d6418J1796r350m3210n9794J39383n9465j6341N265P22o503P3116p17J8685
$$ -46418 -34622 -43972 -87182 -146976 -7593 -67058 -83399 -78134 -77412 -83915 -10799 -11516 7169
1327G169j4100P8572r7245P2794N6911r9210n8795l989n5653K7851J27190j30440
$$ 7169 -6931 71641 -25604 47190 104101 4891 -53904 -57893 -113546 -85695 41495 -88945
1315h8945n2407R8762J08107M9953j06720j33655l8667r1882K8128L3320o0562
$$ -88945 -141352 -42590 65517 115470 8750 -124905 -163572 -255454 -227326 -194006 -254568
1304b54568J61470J76164j31522N4401K8333l7762P0474q6160p1890m6299J19210
$$ -254568 -93098 83066 -48456 5945 34278 -3484 66990 -19170 -91060 -137359 -18149
1293a8149Q8797q4162k3546J32534m4772n0381K3924l8217n5976Q9021O5516o7564
$$ -18149 70648 -13514 -37060 95474 50702 321 24245 -13972 -69948 19073 84589 17025
1281A7025j36766j35727R9313J01098o1457O0417J28490m500j18678k3337K7465
$$ 17025 -119741 -255468 -156155 -55057 -116514 -56097 72393 67893 -50785 -74122 -46657
1270d6657R1190r4062r3029O1770J02040p2866J3230M6412J8712q9143K8523J45576
$$ -46657 44533 -49529 -142558 -80788 21252 -51614 -38384 8028 26740 -62403 -33880 111696
1258A11696O7338j35079j88939J10899q1370M4194L5638p119J30560q2774o6104
$$ 111696 179034 43955 -144984 -34085 -115455 -71261 -35623 -42742 87818 5044 -61060
1247f1060k7269K9041K5326j6584J62981j4519R157P2714M1099p6821j59601r8482
$$ -61060 -88329 -59288 -33962 -50546 112435 97916 107073 179787 220886 144065 -15536 -114018
1235a14018m1527k45P9929J99047O8412j09450j49282n4675J00573n2175J0455
$$ -114018 -155545 -155790 -75861 123186 191598 82148 -67134 -121809 -21236 -73411 -62956
1224f2956J9706K9491j16838N8491j235l9354J21074K7977j01962K9907p6287
$$ -62956 -43250 -13759 -130597 -72106 -73341 -112695 8379 36356 -65606 -35699 -111986
1213a11986l3976J02289J06393L374Q1240j25621r2502R1255J9087r9164J09473
$$ -111986 -145962 -43673 62720 66094 147334 21713 -70789 20466 39553 -59611 49862
1202D9862N3819o8020j03564L1296R518j1083k4973r3818o3957J33746N4600m0758
$$ 49862 103681 35661 -67903 -36607 -27089 -38172 -63145 -156963 -220920 -87174 -32574 -73332
1190g3332l5973M0825O3329o9448n3510J97896k05379J0547q974m761K45136j26604
$$ -73332 -109305 -68480 -5151 -74599 -128109 69787 -135592 -125045 -134019 -138780 106356 -20248
1178b0248j08719p1851J34538J23131L3138p1929K0926m0298K8398o5245L1029
$$ -20248 -128967 -200818 -66280 56851 89989 18060 38986 -1312 27086 -38159 -7130
1167g130J00N532o8926J18328k9440j36581L1720q0012p2592J56389K2842K6205
$$ -7130 -7030 -1498 -70424 47904 18464 -118117 -86397 -166409 -239001 -82612 -59770 -33565
1155c3565M2076O3759q9199n1988o7413n0675k0866J02370L9978K0837M8061k9483
$$ -33565 8511 72270 -16929 -68917 -136330 -187005 -207871 -105501 -65523 -44686 3375 -26108
1143b6108p6554Q4216j87718j34840K46075M1367Q5262O1943k3068m2776Q8470
$$ -26108 -102662 -18446 -206164 -341004 -94929 -53562 31700 93643 70575 27799 116269
1132A16269m1172J24387O4460n4562j15142l2132n3173r4432p5587Q4438L935
$$ 116269 75097 199484 263944 209382 94240 62108 8935 -85497 -161084 -76646 -72711
1121g2711K1817p950l9472Q5015o4535K7901q462M2012P677P1635q9640p458k0982
$$ -72711 -50894 -58844 -98316 -13301 -77836 -49935 -58397 -16385 -8708 62927 -26713 -34171 -55153
1108e5153M6528n3814J3482j82817J79646L5048p2105l1229Q1833k6532J3315
$$ -55153 -8625 -62439 -48957 -231774 -52128 -17080 -89185 -120414 -38581 -65113 -51798
1097e1798p0538k417P8685P2538K1807j97320J34110o173N9867n806j27957o2914
$$ -51798 -122336 -124753 -46068 26470 48277 -149043 -14933 -21106 38761 32955 -95002 -157916
1085a57916k3245J07737j1874J955M4189R4254P2488O5148p9280j42849o1807
$$ -157916 -181161 -73424 -85298 -83343 -39154 55100 127588 192736 113456 -29393 -91200
1074i1200J65784J8440j71381P2405N6460O7728J0662k7233j80331N4771n0577
$$ -91200 74584 93024 -78357 -5952 50508 118236 128898 101665 -78666 -23895 -74472
1063g4472o4610N8658Q2927L4101O5179n7970j4601n3016J17370o3571K6806N6731
$$ -74472 -139082 -80424 2503 36604 101783 43813 29212 -23804 93566 29995 56801 113532
1051A13532j17081j0965O1303j49070J2763J30116j01301j48746J45264J134m4600
$$ 113532 -3549 -14514 46789 -102281 -89518 40598 -60703 -209449 -64185 -63051 -107651
1040a07651Q9477Q1311P6124q5772j32470J88169j09162p7313P7705N4787j6960
$$ -107651 -18174 63137 139261 53489 -78981 109188 26 -77287 418 55205 38245
1029C8245j1106K2152p2697m1754J56742P8383o9755j73848o4635K0903Q1266
$$ 38245 27139 49291 -23406 -65160 91582 169965 100210 -73638 -138273 -117370 -36104
1018c6104J89223M0871j16241j14618J6661K4224q1894K0644m8455k2834n9234
$$ -36104 153119 193990 77749 -36869 -20208 4016 -77878 -57234 -105689 -128523 -187757
1007a87757P0113J36677k2159P8214q4149p120l859k0212O0420J41923q3012o0879
$$ -187757 -117644 19033 -3126 75088 -9061 -16181 -20040 -40252 20168 162091 79079 18200
995A8200l1737q395Q4687m2401l6191m2826K6012N1505o0984n4605j8433J16555
$$ 18200 -13537 -21932 62755 20354 -15837 -58663 -32651 18854 -42130 -96735 -115168 1387
983A387l4035m4937J35889j13455m3108K27313r3612L4053K3981l570j93044R346
$$ 1387 -32648 -77585 58304 -55151 -98259 129054 35442 69495 93476 89906 -103138 -93792
971i3792P0925L2632r8717o1755J41679J54051j00241m9290p0550n3995J28631
$$ -93792 -22867 9765 -88952 -150707 -9028 145023 44782 -4508 -75058 -129053 -422
960d22J32543j18358m2680J55805n4194N9056o7156o2674N5831k8698R5139k00228
$$ -422 132121 13763 -28917 126888 72694 131750 64594 1920 57751 29053 124192 -76036
948g6036Q0820K8074r2051J37002q4581o2195r0849J74957R4908j19471L9653
$$ -76036 4784 32858 -59193 77809 -6772 -68967 -159816 15141 110049 -9422 30231
937C0231l6250o755P0573j6811m430N9526J23153j21095M4034n7060j04800R1730
$$ 30231 -6019 -12774 57799 40988 36558 96084 219237 98142 142176 85116 -19684 72046
925G2046J0775k2444K9834l4945j4605P5216k0038p0934p4250P1419M9449j0270
$$ 72046 82821 60377 90211 55266 40661 115877 95839 24905 -49345 22074 71523 61253
913F1253r4110K4743J18558n1291r2613j724o902Q270k6490l4971k023P7792K9691
$$ 61253 -32857 -8114 110444 59153 -33460 -35184 -42086 -33816 -60306 -95277 -97300 -19508 10183
$$ [...]
##END NTUPLES=NMR SPECTRUM
##END=
