##TITLE=1H_CA-9085
 CDCl3
 8 sc, 
 15.11.2022
##JCAMPDX= 6.0         $$ Bruker NMR JCAMP-DX V2.0
##DATA TYPE= NMR SPECTRUM
##DATA CLASS= NTUPLES
##ORIGIN= UXNMR, Bruker Analytische Messtechnik GmbH
##OWNER= root
$$ XWIN-NMR		Version 3.5
$$ Tue Nov 15 16:02:17 2022 Russian Standard Time (UT+4h)  she@DPX200
##.OBSERVE FREQUENCY= 200.1313499994
##.OBSERVE NUCLEUS= ^1H
##.ACQUISITION MODE= SIMULTANEOUS
##.ACQUISITION SCHEME= undefined
##.AVERAGES= 8
##.DIGITISER RES= 18
##SPECTROMETER/DATA SYSTEM= spect
##.PULSE SEQUENCE= zg30
##.SOLVENT NAME= Acetone
##.SHIFT REFERENCE= (INTERNAL, Acetone, 0, 15.7943)
##AUDIT TRAIL= $$ (NUMBER, WHEN, WHO, WHERE, WHAT)
$$ ##TITLE= Audit trail, XWIN-NMR		Version 3.5
$$ ##JCAMPDX= 5.01
$$ ##ORIGIN= Bruker BioSpin GmbH
$$ ##OWNER= she
$$ F:/spectra/data/she/nmr/H-F/1/pdata/1/auditp.txt
$$ ##AUDIT TRAIL=  $$ (NUMBER, WHEN, WHO, WHERE, WHAT)
(   1,<2022-11-15 16:00:27.43 +0400>,<she>,<DPX200>,
      <created by zg, POWCHK disabled, PULCHK disabled
       configuration hash MD5:
       00 E9 B6 7A A2 85 ED C7 34 08 36 98 17 FE 4E 26
       data hash MD5: 16K
       87 97 88 62 D0 01 B4 4B 57 ED 11 5B 89 3B B6 5E>)
(   2,<2022-11-15 16:00:29.73 +0400>,<she>,<DPX200>,
      <Start of raw data processing
       efp BC_mod = 2 LB = 0.24 FT_mod = 6 PKNL = 1 PHC0 = -18042.61 PHC1 = 26.4007 SI = 16K 
       data hash MD5: 16K
       5A 2F 99 AE 4A 4A 4B DC D3 32 7D BE 6A AC 3D 6B>)
(   3,<2022-11-15 16:00:33.73 +0400>,<she>,<DPX200>,
      <abs ABSG = 5 
       data hash MD5: 16K
       08 0A FE 9F F3 CB 61 2E 4C E3 7A AD 7F 77 83 D1>)
(   4,<2022-11-15 16:00:57.20 +0400>,<she>,<DPX200>,
      <pk PHC0 = 12.53716 PHC1 = -17 
       data hash MD5: 16K
       DF 11 1B E0 7D 83 CA FF 84 78 DC 21 48 89 47 40>)
(   5,<2022-11-15 16:01:00.07 +0400>,<she>,<DPX200>,
      <abs ABSG = 5 
       data hash MD5: 16K
       0F BA DB 3E 32 5F B9 70 64 0B 3C B8 60 4F 9B 58>)
$$ ##END=
$$ 
$$ hash MD5
$$ 16 60 74 A6 5C 6E 23 2E 55 E1 D5 A5 37 AF 99 01
##$RELAX= 
##$RELAX= 
##$RELAX= 
##$RELAX= 
##$RELAX= 
##$RELAX= 
$$ Bruker specific parameters
$$ --------------------------
##$DU= <F:/spectra>
##$EXPNO= 1
##$NAME= <H-F>
##$PROCNO= 1
##$TYPE= <nmr>
##$USER= <she>
##$AMP= (0..31)
100 100 100 100 100 100 100 100 100 100 100 100 100 100 100 100 100 100 
100 100 100 100 100 100 100 100 100 100 100 100 100 100 
##$AQSEQ= 0
##$AQ_mod= 1
##$AUNM= <au_zg>
##$AUTOPOS= <>
##$BF1= 200.13
##$BF2= 200.13
##$BF3= 200.13
##$BF4= 200.13
##$BF5= 200.13
##$BF6= 200.13
##$BF7= 200.13
##$BF8= 200.13
##$BYTORDA= 1
##$CFDGTYP= 0
##$CFRGTYP= 5
##$CHEMSTR= <none>
##$CNST= (0..31)
1 1 145 1 1 1 1 1 1 1 1 1 1 1 1 1 1 1 1 1 1 1 1 1 1 1 1 1 1 1 1 1 
##$CPDPRG= <>
##$CPDPRG1= <>
##$CPDPRG2= <>
##$CPDPRG3= <>
##$CPDPRG4= <mlev>
##$CPDPRG5= <mlev>
##$CPDPRG6= <mlev>
##$CPDPRG7= <mlev>
##$CPDPRG8= <mlev>
##$CPDPRGB= <>
##$CPDPRGT= <>
##$D= (0..31)
0 1.2 0 0 0 0 0 0 0 0.06 0 0.03 0 0 0 0 0.0002 0 0 0 0 0 0 0 0 0 0 0 0 
0 0 0 
##$DATE= 1668513626
##$DBL= (0..7)
$$ [...]
##$SUBNAM3= <"">
##$SUBNAM4= <"">
##$SUBNAM5= <"">
##$SUBNAM6= <"">
##$SUBNAM7= <"">
##$SUBNAM8= <"">
##$SUBNAM9= <"">
##$SW= 18.0517283424941
##$SWIBOX= (0..15)
0 0 2 0 0 0 0 0 0 0 0 0 0 0 0 0 
##$SW_h= 3612.71676300578
##$TD= 16384
##$TD0= 1
##$TE= 0
##$TE2= 300
##$TE3= 300
##$TEG= 300
##$TL= (0..7)
0 120 120 120 120 120 120 120 
##$TP= (0..7)
150 150 150 150 150 150 150 150 
##$TP07= 0
##$TPNAME0= <>
##$TPNAME1= <>
##$TPNAME2= <>
##$TPNAME3= <>
##$TPNAME4= <>
##$TPNAME5= <>
##$TPNAME6= <>
##$TPNAME7= <>
##$TPOAL= (0..7)
0.5 0.5 0.5 0.5 0.5 0.5 0.5 0.5 
##$TPOFFS= (0..7)
0 0 0 0 0 0 0 0 
##$TUNHIN= 0
##$TUNHOUT= 0
##$TUNXOUT= 0
##$USERA1= <user>
##$USERA2= <user>
##$USERA3= <user>
##$USERA4= <user>
##$USERA5= <user>
##$V9= 5
##$VALIST= <valist>
##$VCLIST= <CCCCCCCCCCCCCCC>
##$VD= 0
##$VDLIST= <DDDDDDDDDDDDDDD>
##$VPLIST= <PPPPPPPPPPPPPPP>
##$VTLIST= <TTTTTTTTTTTTTTT>
##$WBST= 1024
##$WBSW= 4
##$XGAIN= (0..3)
0 0 0 0 
##$XL= 0
##$YL= 0
##$YMAX_a= 730977
##$YMIN_a= -1095319
##$ZGOPTNS= <>
##$ZL1= 120
##$ZL2= 120
##$ZL3= 120
##$ZL4= 120
##$ABSF1= 15.73257
##$ABSF2= -2.31928
##$ABSG= 5
##$ABSL= 3
##$ALPHA= 0
##$AQORDER= 0
##$ASSFAC= 0
##$ASSFACI= 0
##$ASSFACX= 0
##$ASSWID= 0
##$AUNMP= <proc_1d>
##$AZFE= 0.1
##$AZFW= 0.1
##$BCFW= 0
##$BC_mod= 2
##$BYTORDP= 0
##$COROFFS= 0
##$CY= -3
##$DATMOD= 1
##$DC= 0
##$DFILT= <>
##$DTYPP= 0
##$F1P= 0
##$F2P= 0
##$FCOR= 1
##$FTSIZE= 16384
##$FT_mod= 6
##$GAMMA= 0
##$GB= 0
##$INTBC= 1
##$INTSCL= 3.70164e-10
##$ISEN= 128
##$LB= 0.24
##$LEV0= 0
##$LPBIN= 0
##$MAXI= 10000
##$MC2= 0
##$MEAN= 0
##$ME_mod= 0
##$MI= 1.114404
##$NCOEF= 0
##$NC_proc= -6
##$NLEV= 6
##$NOISF1= 3.799351
##$NOISF2= 2.8
##$NSP= 0
##$NTH_PI= 0
##$NZP= 0
##$OFFSET= 15.79427
##$PC= 1
##$PHC0= -18030.07
##$PHC1= 9.4007
##$PH_mod= 1
##$PKNL= yes
##$PPARMOD= 0
##$PSCAL= 0
##$PSIGN= 0
##$REVERSE= no
##$SF= 200.129995451772
##$SI= 16384
##$SIGF1= 3
##$SIGF2= 2
##$SINO= 5.538805
##$SIOLD= 16384
##$SREGLST= <1H.CDCl3>
##$SSB= 0
##$STSI= 16384
##$STSR= 0
##$SW_p= 3612.71676300578
##$SYMM= 0
##$S_DEV= 0
##$TDeff= 16384
##$TDoff= 0
##$TI= <>
##$TILT= no
##$TM1= 0
##$TM2= 0
##$TOPLEV= 0
##$USERP1= <user>
##$USERP2= <user>
##$USERP3= <user>
##$USERP4= <user>
##$USERP5= <user>
##$WDW= 1
##$XDIM= 16384
##$YMAX_p= 457553040
##$YMIN_p= -947523
$$ End of Bruker specific parameters
$$ ---------------------------------
##NTUPLES= NMR SPECTRUM
##VAR_NAME=  FREQUENCY,     SPECTRUM/REAL,   SPECTRUM/IMAG
##SYMBOL=    X,             R,               I
##VAR_TYPE=  INDEPENDENT,   DEPENDENT,       DEPENDENT
##VAR_FORM=  AFFN,          ASDF,            ASDF
##VAR_DIM=   16384,         16384,           16384
##UNITS=     HZ,            ARBITRARY UNITS, ARBITRARY UNITS
##FACTOR=    0.220516191357247, 1,           1
##FIRST=     3160.90709556061, 0,            0
##LAST=      -451.809667445174, 0,           0
##MIN=       -451.809667445174, -947523,     0
##MAX=       3160.90709556061, 457553040,    0
$$ Real data points
##PAGE= N=1
##DATA TABLE= (X++(R..R)), XYDATA
$$ [...]
6126B719872L091K5873L7891l8800j7155R1003J10687J5926K0400Q5023Q0418
6115C134229J29962J7868K11822N9195P0296Q0028M5397R5583j5030l2860o3411
6104C733079r4474O8819m2705N065J27891j27393m4507L3066q9994O8542m2023
6093C595366j22114m2804P5592J13888l5182M450J6026o120K0775J71514J42425
6082C933816J68092J08487K21352J01704Q3700p5936n7095r9736l7592N749K820
6071D355361J00712J4988q206R55R277K1162j9700k2228J16756J26392K9957J947
6059D727373M4171J47841q1690k4802J28930o276J8597J59144J68440m2779J13341
6048E352290j1912L4354l8664j93260n0381L5001l8471j14633j2639k6515M8911
$$ y = [2719872, 2722963, 2748836, 2786727, 2747927, 2730772, 2821775, 2932462, 2948388, 2968788, 3053811, 3134229, 3264191, 3282059, 3493881, 3553076, 3623372, 3703400, 3748797, 3844380, 3829350, 3796490, 3733079, 3638605, 3707424, 3664719, 3669784, 3797675, 3670282, 3625775, 3658841, 3568847, 3637389, 3595366, 3473252, 3430448, 3506040, 3619928, 3584746, 3589196, 3605222, 3599102, 3619877, 3791391, 3933816, 4101908, 4210395, 4431747, 4533451, 4617151, 4541215, 4484120, 4384384, 4346792, 4352541, 4355361, 4456073, 4471061, 4462855, 4463810, 4473087, 4494249, 4474549, 4452321, 4569077, 4695469, 4725426, 4727373, 4771544, 4919385, 4837695, 4812893, 4941823, 4935547, 4954144, 5113288, 5281728, 5238949, 5352290, 5340378, 5374732, 5336068, 5142808, 5092427, 5127428, 5088957, 4974324, 4961685, 4935170, 4984081]
6037D984081k7645O1814j1044j29979j01031k2546k5740k10439l6030q2413j4308
6026D384720j15000j9550j7295j40776J2221N3128j41337j50859j18746J26425
6016C872931m5575q0727K3085K4362K4403Q9065J55673k7782M8061k9249m2037
6005D012210K3286J3638k7320n0985M686j17385k47404p0674R5233N9270j26306
5994C568249M7584j1617n1025P6960L187K1905M4839Q1078L4860K0631J23369
5983C960020J9252R9406J39569O5393R6137R6100O7595L7113P2503J09887J79592
5972D942567J63617Q7891K36643J19324K31106K36565J06004J09026J33647K18455
5962F584845P6774J5749m0878j18365q0433p8367j55602j62502k28312j10093
$$ y = [4984081, 4956436, 5018250, 5007206, 4877227, 4776196, 4753650, 4727910, 4517471, 4481441, 4399028, 4384720, 4269720, 4250170, 4232875, 4092099, 4104320, 4157448, 4016111, 3865252, 3746506, 3872931, 3827356, 3746629, 3769714, 3794076, 3818479, 3907544, 4063217, 4035435, 4083496, 4054247, 4012210, 4035496, 4049134, 4021814, 3970829, 3975515, 3858130, 3610726, 3540052, 3635285, 3694555, 3568249, 3615833, 3604216, 3553191, 3630151, 3633338, 3655243, 3700082, 3781160, 3816020, 3836651, 3960020, 3979272, 4078678, 4218247, 4283640, 4379777, 4475877, 4543472, 4580585, 4653088, 4762975, 4942567, 5106184, 5194075, 5430718, 5550042, 5781148, 6017713, 6123717, 6232743, 6366390, 6584845, 6661619, 6677368, 6636490, 6518125, 6437692, 6359325, 6203723, 6041221, 5812909, 5702816]
5952E702816j21209q5178j35540o9551q9610p8023m964O8150k4306J6415J32660
5941E311660p1918o5050R8274r243M2878p0777L5971Q4242p6016j7022L8958M3444
5929E345401P7707J90642J84781J08539L6046L5183L4403K5395J33194m9855k4496
5918F096940q4844o9141k30j1841Q4835P3849J65172J01957J42759J84881N5312
5907F739649M8869J40061L8632J00464p2J87519K30227K61420J92620L20334L40780
5896H600503M41364L63518L11633L05439J17415o3011k1812k95266j93637j68710
5886I397436p9454L4449q3179j24267L6729J75657J57220J62846J76005L03030
5876A0156472K93201N13933N17768O16737Q15479J039305J097007J193048J291491
$$ y = [5702816, 5581607, 5496429, 5360889, 5291338, 5201728, 5123705, 5118741, 5186891, 5162585, 5179000, 5311660, 5239742, 5174692, 5272966, 5263723, 5306601, 5235824, 5271795, 5356037, 5280021, 5262999, 5301957, 5345401, 5423108, 5613750, 5798531, 5907070, 5943116, 5978299, 6012702, 6038097, 6171291, 6121436, 6096940, 6012096, 5942955, 5942725, 5930884, 6015719, 6089568, 6254740, 6356697, 6499456, 6684337, 6739649, 6788518, 6928579, 6967211, 7067675, 7067603, 7255122, 7485349, 7746769, 7939389, 8259723, 8600503, 9041867, 9405385, 9717018, 10022457, 10139872, 10076861, 10055049, 9759783, 9566146, 9397436, 9317982, 9352431, 9269252, 9144985, 9181714, 9357371, 9514591, 9677437, 9853442, 10156472, 10449673, 10963606, 11481374, 12098111, 12913590, 13952895, 15049902, 16242950, 17534441]
5867A7534441J272168J221409N43532r5111o84764j049523j197848r03935p82250
5858A5858119o94915m70038m35392l10146p4151j4076J32K53672L70897L60949
5848A4845051M11042P16786Q86197R99809J278028J385588J598014J991130K179327
5839B6290972K103066J567256O47154n74353j520413j982982j905072j719066
5831B2906562j543359j183627r54815q28468o37510n66208l25017k91637k64306
5822A6311615j36166K596J36455K52962L57427N60403N70689Q03796R25199J253819
5812B1038795J384230J387518R77440K27597m93543j134339j344415j524939j417402
5803A9100942r76209r10720p70565o65965m49509m98854l63025l35908l31119
$$ y = [17534441, 18806609, 20028018, 20571550, 20476439, 19791675, 18742152, 17544304, 16640369, 15858119, 15163204, 14693166, 14257774, 13947628, 13873477, 13859401, 13859533, 14113205, 14484102, 14845051, 15256093, 15972879, 16859076, 17858885, 19136913, 20522501, 22120515, 24111645, 26290972, 28394038, 29961294, 30608448, 30034095, 28513682, 26530700, 24625628, 22906562, 21363203, 20179576, 19224761, 18396293, 17758783, 17192575, 16867558, 16575921, 16311615, 16175449, 16178045, 16314500, 16567462, 16924889, 17485292, 18055981, 18859777, 19784976, 21038795, 22423025, 23810543, 24787983, 25015580, 24522037, 23387698, 22043283, 20518344, 19100942, 18124733, 17214013, 16443448, 15777483, 15327974, 14829120, 14466095, 14130187, 13799068]
5794A3799068l72894l39542j71410k70586k42826j42886o305J33673J10268J96565
5784A2693125L11383L87864K82710J32025K5498j58998j87991k86488m31924n76162
5774A2191042n26036m64281m62316l80972k82492l32820j73751j94354j58746
5765I215274l19119k23188L1084p2661j00914J19263J92568J35899L28838J97905
5755I504949M16368O29882N52298P62663O45256M74473J28768k71566o24279p60359
5745A1458453n36436n87446n56444l73360l23926k88699k14242q8906m1057p5659
5735H372278J9190J08388R6590J37475K98376L09988M07021N78305N81103P56167
5725A1664881Q65256J053563J010914P06506p9163o64028r47903r65555j047131
$$ y = [13799068, 13426174, 13086632, 12915222, 12644636, 12401810, 12258924, 12252619, 12386292, 12496560, 12693125, 13004508, 13392372, 13675082, 13807107, 13832605, 13673607, 13485616, 13199128, 12767204, 12191042, 11665006, 11200725, 10738409, 10357437, 10074945, 9742125, 9568374, 9374020, 9215274, 8896155, 8672967, 8704051, 8631390, 8530476, 8649739, 8842307, 8978206, 9307044, 9504949, 9921317, 10551199, 11103497, 11866160, 12511416, 12985889, 13114657, 12843091, 12218812, 11458453, 10922017, 10334571, 9778127, 9404767, 9080841, 8792142, 8577900, 8488994, 8447937, 8372278, 8391468, 8499856, 8596446, 8733921, 9032297, 9342285, 9749306, 10327611, 10908714, 11664881, 12530137, 13583700, 14594614, 15301120, 15221957, 14557929, 13610026, 12644471, 11597340]
5716A1597340q64172o79505m62602n10205k88800j90007k23483j08242K3235P8160
5706H371719M8414m9394K27688K25904K59087L47068M09887M49955M83657O65443
5696A1439428O58209O84280L62955k52070n39759p82387q81331p66736n80145
5687I342444n62921k57463j67634k77419k29972j45072J04089J0492o8310M4689
5677G792923J10083N1945J49672J10169K74974J72417L65697L83309L43941L13096
5667A0068226K60052J29109q9146k65223l84636m35780k25999k38260k07948l21808
5657H288587k78681r4401l8358j58157p106q9048k8126M9909K0653j4308N223
5646G656187K3947J31525J84808J10366J81429K26257J73457M5189K07692J25947
$$ y = [11597340, 10733168, 10053663, 9591061, 9080856, 8792056, 8602049, 8378566, 8270324, 8293559, 8371719, 8420133, 8370739, 8598427, 8824331, 9083418, 9430486, 9840373, 10290328, 10773985, 11439428, 12097637, 12781917, 13144872, 12892802, 12353043, 11570656, 10689325, 9922589, 9342444, 8779523, 8522060, 8354426, 8077007, 7847035, 7701963, 7806052, 7816544, 7748234, 7792923, 7903006, 7954951, 8104623, 8214792, 8489766, 8662183, 9027880, 9411189, 9755130, 10068226, 10328278, 10457387, 10368241, 10103018, 9718382, 9282602, 9056603, 8818343, 8610395, 8288587, 8009906, 7915505, 7877147, 7718990, 7711884, 7622836, 7594710, 7644619, 7665272, 7650964, 7656187, 7680134, 7811659, 7996467, 8106833, 8288262, 8514519, 8687976, 8733165, 8940857, 9066804]
5636I066804n5906n6479r6954l3868j01144m5009j35618n1155j05350k58256n0062
5625H077003j81553j04664j71111n6796q8793p2786N67j27008p4784m583R105
5614G204597O8795p84q7246J4339K0209n5723J14350J46448K2307R8678N1457
5603G597427J8815m3653p5903l5862n4419j6772k9725J7850r1271j95598j35133
5592F955756q3985k03879j03779j06784j17563O9548j29737q0066j2432n0866
5582F136213p409n044p5643p5513L9341p4670j04346K6401l0113M4748R1481o5018
5570E900428o4999P8401o7559j2475J55243r615q5367m654L89n7796N7352j18254
5558E771094k1090q0803n0656P8006q0325N10p1143o975p8124j02570J70625o6780
$$ y = [9066804, 9010898, 8954419, 8857465, 8823597, 8722453, 8677444, 8541826, 8490671, 8385321, 8127065, 8077003, 7895450, 7790786, 7619675, 7562879, 7474086, 7401300, 7401867, 7274859, 7200075, 7195492, 7204597, 7273392, 7272608, 7185362, 7199701, 7219910, 7164187, 7278537, 7424985, 7447292, 7545970, 7597427, 7616242, 7572589, 7496686, 7460824, 7406405, 7389633, 7359908, 7377758, 7286487, 7090889, 6955756, 6871771, 6667892, 6564113, 6457329, 6339766, 6409314, 6279577, 6199511, 6187079, 6136213, 6128804, 6123760, 6048117, 5972604, 6011945, 5937275, 5832929, 5859330, 5829217, 5873965, 5965446, 5900428, 5835429, 5913830, 5846271, 5833796, 5989039, 5979424, 5894057, 5889403, 5889792, 5831996, 5889348, 5771094, 5750004, 5669201, 5618545, 5696551, 5616226, 5616736, 5545593, 5538618, 5460494, 5357924, 5528549, 5461769]
5546E461769m3668Q5637j46367q1401Q7359J30794P6345N8568N4993j1800j526
5535E670703J03582K9367N3742R5527q4674Q0999o4048l6642r3602P6269J9175
5524E850398n1807N9345J3988K0649q2579N0292m5022K4678n4260L4293L8655
5513E858630J33994L1218K0610K6351J34104J21598L5099J24524J29688M3984
5503F659800J43181l0o8841m514r1301R1552l8559M1028J47925j51427Q593M1703
5491F779110M3820J31766m1713N3219o1436M5850O1974J8507o0545J82603J67563
5480G320718Q0519K8241K34783K51611Q0058j9677R7954l389L9914j27583K0769
5469H003918Q2666n4129J19659J9403O1234N1770n5805r5966O9581m6103l1467
$$ y = [5461769, 5418101, 5503738, 5357371, 5275970, 5363329, 5494123, 5570468, 5629036, 5684029, 5672229, 5670703, 5774285, 5803652, 5857394, 5952921, 5868247, 5949246, 5885198, 5848556, 5754954, 5831223, 5850398, 5798591, 5857936, 5871924, 5892573, 5809994, 5860286, 5815264, 5839942, 5785682, 5819975, 5858630, 5992624, 6023842, 6044452, 6070803, 6204907, 6326505, 6361604, 6486128, 6615816, 6659800, 6802981, 6802951, 6734110, 6729596, 6638295, 6729847, 6691288, 6732316, 6880241, 6728814, 6737407, 6779110, 6822930, 6954696, 6912983, 6966202, 6904766, 6950616, 7012590, 7031097, 6970552, 7153155, 7320718, 7401237, 7429478, 7664261, 7915872, 7995930, 7976253, 8074207, 8070818, 8110732, 7983149, 8003918, 8086584, 8032455, 8152114, 8171517, 8232751, 8284521, 8228716, 8132750, 8202331, 8156228, 8124761]
5458H124761k173N9434k6856o3484Q9746J08228J03878J80845M8528K24533N9903
5447H907343j4030Q1796k918J8174J13809R6992R2010m1927J28210J27945O7621
5436I575025j47221o1594Q607j6840j9920J45452R2690k42346j0449R3985J21797
5425I539186j2760J5079J0594n2806P4636P3365R1319N058K8770L5841M443N8330
5413I871055R1335J56305J32186J09793l4020K9028M9950O6369M8496K6509q5450
5402A0461556j3965l0382j4579N5974J41153Q8590Q4485J7463P2204J15823l102
5391A0975220K28201K61365M4369J36412J90840K80949K98655K72821N7041K79287
5381A3025160M64734L85104M42542K92960L53736K12550N6108M7038k9397L1775
$$ y = [8124761, 8122588, 8182022, 8155166, 8091682, 8181428, 8289656, 8393534, 8574379, 8622907, 8847440, 8907343, 8893313, 8975109, 8972191, 8990365, 9104174, 9201166, 9293176, 9251249, 9379459, 9507404, 9575025, 9427804, 9366210, 9374817, 9357977, 9338057, 9483509, 9576199, 9333853, 9323404, 9417389, 9539186, 9526426, 9541505, 9552099, 9499293, 9573929, 9647294, 9738613, 9743671, 9772441, 9808282, 9812725, 9871055, 9962390, 10118695, 10250881, 10360674, 10326654, 10355682, 10405632, 10472001, 10520497, 10547006, 10461556, 10447591, 10417209, 10402630, 10458604, 10599757, 10688347, 10772832, 10790295, 10862499, 10978322, 10975220, 11203421, 11464786, 11509155, 11645567, 11836407, 12117356, 12416011, 12688832, 12745873, 13025160, 13489894, 13874998, 14317540, 14610500, 14964236, 15176786, 15232894, 15279932, 15250535, 15282310]
5371A5282310R1211M8936J07508P7264J60228J78009K64205K96532K98737L27485
5361A7132425M31780N95348M85994N63801O60109N28751O48053Q20579R37854
5352B2804694Q84576Q94860R63339P37181M24475j12720l11645k26801m07211
5343B5650748m91659m32042l01081m56466l22217k95563k96854j18513j33221
5334B2803132k1394M3821L25216L25234N08166O99389P01496R75589R39960J219210
5324B8519819J334657J501433J331532P81151m4800p46226j151112j257454j391304
5315B8877696j354934j056769q90847o67555o61615n15823k47989k8863N5728
5306B3509029J37063K34282K16889M35871O07279P29077O57474Q92756J286198
$$ y = [15282310, 15373521, 15422457, 15529965, 15607229, 15767457, 15945466, 16209671, 16506203, 16804940, 17132425, 17564205, 18159553, 18645547, 19209348, 19869457, 20398208, 21046261, 21866840, 22804694, 23689270, 24584130, 25547469, 26284650, 26709125, 26596405, 26284760, 26057959, 25650748, 25159089, 24727047, 24425966, 23969500, 23647283, 23351720, 23054866, 22936353, 22803132, 22781738, 22825559, 23150775, 23476009, 23984175, 24683564, 25385060, 26360649, 27300609, 28519819, 29854476, 31355909, 32687441, 33468592, 33423792, 32677566, 31526454, 30269000, 28877696, 27522762, 26465993, 25575146, 24907591, 24245976, 23730153, 23482164, 23453301, 23509029, 23646092, 23880374, 24097263, 24533134, 25140413, 25869490, 26526964, 27419720, 28705918]
5297B8705918J534181J697547J786637J799638R88936k53187j339751j838421
5289C3081498j968681j858756j630937j146798j070576q76232n50670l86104j92906
5280B3399838q1596L6131K19890M36059N73426P43797Q93448J039485J338506
5271B8598984J705558K069677K310829K551303K656284K203877R08591n31073
5263D2474030j638050k115491k063860j772238j628714j261143j030364r68346
5255B9995824r85260r27433p76225n76263l66357j26283J33751K42557N11900
5246B7126211P97741P77364J232368J511305J728590K065817K418825K655228
5238D0313449K395980J746348Q10632j6764o92634o93073n66895m14699j08966
$$ y = [28705918, 30240099, 31937646, 33724283, 35523921, 36512857, 36259670, 34919919, 33081498, 31112817, 29254061, 27623124, 26476326, 25405750, 24529518, 23978848, 23592744, 23399838, 23318242, 23354373, 23574263, 24010322, 24583748, 25327545, 26220993, 27260478, 28598984, 30304542, 32374219, 34685048, 37236351, 39892635, 42096512, 43005103, 42474030, 40835980, 38720489, 36656629, 34884391, 33255677, 31994534, 30964170, 29995824, 29010564, 28083131, 27306906, 26730643, 26364286, 26238003, 26371754, 26614311, 27126211, 27923952, 28701316, 29933684, 31444989, 33173579, 35239396, 37658221, 40313449, 42709429, 44455777, 45266409, 45249645, 44557011, 43863938, 43297043, 42882344, 42773378]
5229D2773378J55178N5105m11322j317829k069974k498607k495125k266430j889799
5220C0034575j534897j308396r91197p34472l42216j93325q2481K32139M48473
5211B5528203N61951P16284Q18585P63810P26874M24536L06637K42194L06361
5202C0395435M00030O62990N10463K61793m51025j145946j557125j900846j870275
5193B5305494j732425j452917j210021r71878q87975p30287o12554m93185k52859
5184A6961393j34085j95423j90912r8763L8669J7577K0342J18469J78287J72997
5174A6888551K45525K64189K19250J85397K57206K95475K52294K07771K64171
5165A9079829K26203K02755k8551N6916j22325J9682M7583N2829K8306J02887
$$ y = [42773378, 42928556, 42983661, 42572339, 41254510, 39184536, 36685929, 34190804, 31924374, 30034575, 28499678, 27191282, 26200085, 25465613, 25123397, 24930072, 24847591, 25079730, 25528203, 26090154, 26806438, 27625023, 28388833, 29115707, 29540243, 29846880, 30089074, 30395435, 30795465, 31458455, 31968918, 32230711, 31779686, 30633740, 29076615, 27175769, 25305494, 23573069, 22120152, 20910131, 19938253, 19050278, 18319991, 17707437, 17214252, 16961393, 16827308, 16631885, 16440973, 16342210, 16380879, 16398456, 16418798, 16537267, 16715554, 16888551, 17134076, 17398265, 17617515, 17802912, 18060118, 18355593, 18607887, 18815658, 19079829, 19306032, 19508787, 19480236, 19537152, 19414827, 19434509, 19482092, 19534921, 19563227, 19666114]
5155A9666114J39577J47067K62362J50650M51832L62895N28607N59536O90207
5146B2958847O23576O95908P36864P41424Q75644J122195J223010J210046J360936
5137C1548450J583613J632616J730629J787018J779831J707820J357612Q59610
5129D3987199N0319o84727q78081p81036n29119l41139j78872k01498m70584o36643
5119C9335819o85811p01144m10998k09298J62638O39418R37745J145768J407739
5110D1621876J939837K280979K744646L018983L348315L379569K938426K092083
5102F3364714Q21731N0527r7661J83675O90618O88980J82757r43648k220141k891295
5092E9830257l110480l083472k806438k259907j642885j234456n05787O9932M22156
$$ y = [19666114, 19805691, 19952758, 20215120, 20365770, 20817602, 21180497, 21709104, 22268640, 22958847, 23582423, 24278331, 25015195, 25756619, 26632263, 27754458, 28977468, 30187514, 31548450, 33132063, 34764679, 36495308, 38282326, 40062157, 41769977, 43127589, 43987199, 44037518, 43352791, 42474710, 41693674, 41164555, 40823416, 40644544, 40443046, 39972462, 39335819, 38650008, 37948864, 37537866, 37328568, 37491206, 38130624, 39068369, 40214137, 41621876, 43561713, 45842692, 48587338, 51606321, 54954636, 58334205, 61272631, 63364714, 64186445, 64236972, 64139311, 64322986, 65013604, 65702584, 65885341, 64941693, 62721552, 59830257, 56719777, 53636305, 50829867, 48569960, 46927075, 45692619, 45186832, 45256764, 45678920]
5083D5678920J000818J583779K141628K613827K776621K765497K094059J034527
5075F1689676J62869n27589l82603p2796K91908M10820J05351r15213k117555
5066E8644868k844629l036029k809703k643465k214533j631668j161374o15923
5058D1687544k83890O7448N99316R87563J261042J451287J532506J112182O28615
5049D9043613Q8276l52413o15531n27277m54242n43732n92893n62667p45452o38267
5039D4099415o16857q96407j216662j629526j795019j750734j743122j432803
5031C3018285j086008p54223o28163l30088j28899O1794K73063K78222L51043
5022C1055026N85865N63052M59583M32965J52185K86761K05357L74956L88049
$$ y = [45678920, 46679738, 48263517, 50405145, 53018972, 55795593, 58561090, 60655149, 61689676, 61852545, 61324956, 60942353, 60869557, 61161465, 61572285, 61677636, 60762423, 58644868, 55800239, 52764210, 49954507, 47311042, 45096509, 43464841, 42303467, 41687544, 41403654, 41471102, 42070418, 43057981, 44319023, 45770310, 47302816, 48414998, 49043613, 49131889, 48779476, 48163945, 47636668, 47182426, 46638694, 46045801, 45483134, 44737682, 44099415, 43482558, 42586151, 41369489, 39739963, 37944944, 36194210, 34451088, 33018285, 31932277, 31178054, 30549891, 30219803, 30090904, 30152698, 30425761, 30703983, 31055026, 31640891, 32203943, 32663526, 33096491, 33248676, 33535437, 33740794, 34115750, 34503799]
5013C4503799K44721m2474o21263j151924j362048j446166j368775j219239j020512
5004B6516119q28781o71867o29136o19678l78966l08887l40113k47274j58426
4995B2332991q9292J5320m6557k0394L1044K5832N8772K04864J70691J87829K62683
4984B3133783P6759P1194K55168J76429K57111J85059J05282R5084J0489J65069
4974B4531427N8222M9192m1821L6869K9641j3504J3412l231J13764O6351K09914
4963B5050236L37643K69246K94270M85313M81892L60202N09792M68935M46982
4954B8704511N59961P12359O69578P53603P66277P59528Q11601Q71012R90132
4945C5598562J143912J298937J474040J684357J825928K025593K160698K299310
$$ y = [34503799, 34748520, 34706046, 34084783, 32932859, 31570811, 30124645, 28755870, 27536631, 26516119, 25687338, 25015471, 24386335, 23766657, 23387691, 23078804, 22738691, 22491417, 22332991, 22243699, 22259019, 22212462, 22192068, 22223112, 22248944, 22307716, 22512580, 22683271, 22871100, 23133783, 23210542, 23281736, 23536904, 23713333, 23970444, 24155503, 24260785, 24355869, 24366358, 24531427, 24589649, 24638841, 24597020, 24633889, 24663530, 24650026, 24663438, 24660207, 24773971, 24840322, 25050236, 25387879, 25657125, 25951395, 26436708, 26918600, 27278802, 27788594, 28257529, 28704511, 29264472, 29976831, 30646409, 31400012, 32166289, 32925817, 33737418, 34608430, 35598562, 36742474, 38041411, 39515451, 41199808, 43025736, 45051329, 47212027, 49511337]
4937D9511337K430645K216240J414415K77398o89217j111408r85964p18845m37521
4928E1907080m04948k97698n13483p41964r41062q90216o64868n52496k92176
4919D6608169J30463N44502P31971J102556J576960J858326K060826K574108K672208
4910E9860089K752346K692518K288957J623325O57993k24615n19003o99363o91729
4901F7740518r66498j335606k105680k684331l136706l344884l170287k901834
4893D8094692k330697k093914j569179j182839j044195o25827l28578k09015J44773
4884C8855221L19665N40998O47742M36101K33069K03937R0840J53472K52093M01585
4874D2134723M24147J92280n03176j294635j771721j935025j972354j798123j487793
$$ y = [49511337, 51941982, 54158222, 55572637, 55850035, 55160818, 54049410, 53063446, 52344601, 51907080, 51502132, 51204434, 50690951, 49948987, 49007925, 48117709, 47452841, 46900345, 46608169, 46738632, 47283134, 48015105, 49117661, 50694621, 52552947, 54613773, 57187881, 59860089, 62612435, 65304953, 67593910, 69217235, 69875228, 69650613, 69131610, 68432247, 67740518, 66774020, 65438414, 63332734, 60648403, 57511697, 54166813, 50996526, 48094692, 45763995, 43670081, 42100902, 40918063, 39873868, 39248041, 38919463, 38710448, 38855221, 39174886, 39715884, 40363626, 40799727, 41032796, 41236733, 41327573, 41481045, 41733138, 42134723, 42558870, 42751150, 42247974, 40953339, 39181618, 37246593, 35274239, 33476116, 31988323]
4865C1988323j415469j181276q84015p69558o05916o48006m55254m08649l04585
4856B5315595j63112j22802j65806l7923o9082l0368J09427P1392J73037N5770
4846B5136128J28271K7788L68227K95440L75054L01054L23355L97081L96186M97884
4836B8246468M17443M58729N29260N41958O76670O26919P06096Q79413R40985
4827C4023941R46247R30417R81022J148452J270816J193445J461006J747272J707863
4818D5410481J924360K202627K486575K588443K657179K975841K958820K796024
4810F6000350K642143K284623K012576J534970J389032J215897J101557J142231
4802G9323379J156690J197319J238734J390718J195707J415588J474514J324273
$$ y = [31988323, 30572854, 29391578, 28507563, 27738005, 27132089, 26484083, 26028829, 25620180, 25315595, 25152483, 25029681, 24863875, 24825952, 24756870, 24726502, 24835929, 24907321, 25080358, 25136128, 25264399, 25292187, 25660414, 25955854, 26330908, 26631962, 26955317, 27352398, 27748584, 28246468, 28663911, 29122640, 29651900, 30193858, 30870528, 31497447, 32203543, 33082956, 34023941, 34970188, 35900605, 36881627, 38030079, 39300895, 40494340, 41955346, 43702618, 45410481, 47334841, 49537468, 52024043, 54612486, 57269665, 60245506, 63204326, 66000350, 68642493, 70927116, 72939692, 74474662, 75863694, 77079591, 78181148, 79323379, 80480069, 81677388, 82916122, 84306840, 85502547, 86918135, 88392649, 89716922]
4794H9716922J359009J411434J364163J630974J801359K062642K343569K607107
4786A04297179K840371L248909L467211L442597L347066L078035K426491J206407
4778A27354266r4462j303784k389749l115687l516595l699221l452427l094789
4770A06687552k977046k803367k606619k438938k121373j820754j796918j685917
4762H8436620j670308j671252j671259j651316j744345j727672j896102j872071
4754G4532295k006625k209829k341935k499555k446620k405379k508025k779094
4746E5335233k839077k946402k960767k812466k622743k389006k171860k014763
4738C4578149j707184j480430j223759j244607j262074r90790q85819j084941
$$ y = [89716922, 91075931, 92487365, 93851528, 95482502, 97283861, 99346503, 101690072, 104297179, 107137550, 110386459, 113853670, 117296267, 120643333, 123721368, 126147859, 127354266, 127259804, 125956020, 123566271, 120450584, 116933989, 113234768, 109782341, 106687552, 103710506, 100907139, 98300520, 95861582, 93740209, 91919455, 90122537, 88436620, 86766312, 85095060, 83423801, 81772485, 80028140, 78300468, 76404366, 74532295, 72525670, 70315841, 67973906, 65474351, 63027731, 60622352, 58114327, 55335233, 52496156, 49549754, 46588987, 43776521, 41153778, 38764772, 36592912, 34578149, 32870965, 31390535, 30166776, 28922169, 27660095, 26669305, 25783486, 24698545]
4730B4698545q82707q02049q08418o03719p78724o60119o14954n18289m53878
4721A8575688n71440m67885n02632n64130m76081k61377m17218l28981m13037
4712A4572907l56660j58340j72205k90256j84932j38434j72927j58331r6031M7886
4702A2892677j54309j62496j82239j30019p0369j42708k21113j91912k50636p8829
4692A1308047k22293l06284q8650p1204p4592k64381k17574j16243p5064j34311
4682I737451j35517k028L6494j29276L3189l4199r2120J33635J88071k6105n867
4671I703728J32981O0376J66938K13251J24688J02993P2161J597M2320q1685j62504
4660A0376844k46638l34128k47855k27096j19734k58477k78052k39165o8541j02054
$$ y = [24698545, 23815838, 23013789, 22205371, 21601652, 20822928, 20162809, 19547855, 19029566, 18575688, 18004248, 17536363, 17033731, 16469601, 15993520, 15732143, 15314925, 14985944, 14572907, 14216247, 14057907, 13885702, 13595446, 13410514, 13272080, 13099153, 12940822, 12844791, 12892677, 12738368, 12575872, 12393633, 12263614, 12193245, 12050537, 11829424, 11637512, 11386876, 11308047, 11085754, 10779470, 10690820, 10619616, 10545024, 10280643, 10063069, 9946826, 9871762, 9737451, 9601934, 9599906, 9636400, 9507124, 9540313, 9506114, 9413994, 9547629, 9735700, 9709595, 9703728, 9836709, 9897085, 10064023, 10277274, 10401962, 10504955, 10577116, 10578713, 10621033, 10539348, 10376844, 10130206, 9796078, 9548223, 9321127, 9201393, 8942916, 8664864, 8425699, 8357158, 8255104]
4650H255104j98001j24682L242m834k9600k1680j18496L8769O5755M3725l5699
4639G873603K2977M3726J07741q3523j5519l3969N5518L3630j98610j51301l2351
4628G621922j99123o9701j13924k48872j40987j78355r6874j36786j37066j35404
4618F164830r1823p2862Q5665m3587j21596M7949m9433p7954q6564l0469O7520
4607E791676l1477j17258m5818l2747N3130O921l6403J6630M6616j0771K5736
4596E666235O5962J06420j9083J35122M6453N20N057J3095J68174J9731Q3516
4585F291202N1473P5557J48171N91o9923j5541J36829j0701K3677n3549L8753
4574F616539J06980j39717n9791m6260K7010m5170k5772q1586L2159J26691K9167
$$ y = [8255104, 8057103, 7932421, 7935663, 7930829, 7901229, 7879549, 7761053, 7799822, 7865577, 7909302, 7873603, 7896580, 7940306, 8048047, 7964524, 7949005, 7915036, 7970554, 8004184, 7805574, 7654273, 7621922, 7422799, 7353098, 7239174, 6990302, 6849315, 6670960, 6574086, 6437300, 6300234, 6164830, 6073007, 6000145, 6085810, 6042223, 5920627, 5968576, 5919143, 5841189, 5754625, 5724156, 5791676, 5760199, 5642941, 5597123, 5564376, 5617506, 5624427, 5588024, 5604654, 5651270, 5640499, 5666235, 5732197, 5838617, 5819534, 5954656, 6001109, 6001629, 6006686, 6019781, 6187955, 6207686, 6291202, 6342675, 6418232, 6566403, 6566994, 6497071, 6481530, 6618359, 6607658, 6631335, 6577786, 6616539, 6723519, 6583802, 6524011, 6477751, 6504761, 6459591, 6433819, 6352233, 6384392, 6511083, 6540250]
4563F540250k9809P4166j0905M3146n7475m3410J6719K5937J03488L0076R2139
4552F784322N0328Q8800J18096M507J59098L6970J0509m4275M8895M2334M9472
4541G349056k942L2287p4924p4048N4841Q573L7866L7331J8626m3237P9702L2967
4529G456098M7389J13364K7807R9104K54773J52878N4862R4809J55052J29969
4519H586105P0261J30276J86397K09208J99805K70998J75019J57204L31215K90421
4509A0606909K09516K41461K34957L49908K70978K58517L91287L22132J45300
4500A3030965L65205L51645K47949K36786K22053L48246J50697K31100J71616
4491A5356262J13950J80060J57074R1306M7533J11945J21865L595M5471J40292
$$ y = [6540250, 6510441, 6584607, 6573702, 6616848, 6559373, 6515963, 6532682, 6558619, 6662107, 6692183, 6784322, 6834650, 6923450, 7041546, 7046053, 7205151, 7242121, 7252630, 7208355, 7257250, 7299584, 7349056, 7346114, 7378401, 7303477, 7229429, 7284270, 7292843, 7330709, 7368040, 7386666, 7343429, 7423131, 7456098, 7503487, 7616851, 7644658, 7743762, 7998535, 8151413, 8206275, 8301084, 8456136, 8586105, 8656366, 8786642, 8973039, 9182247, 9382052, 9653050, 9828069, 9985273, 10316488, 10606909, 10816425, 11057886, 11292843, 11642751, 11913729, 12172246, 12563533, 12885665, 13030965, 13396170, 13747815, 13995764, 14232550, 14454603, 14802849, 14953546, 15184646, 15356262, 15470212, 15650272, 15807346, 15898652, 15946185, 16058130, 16179995, 16183590, 16229061, 16369353]
4481A6369353M7842O1217N0981q6924Q6747o2333j56121k5487k0552M0091J078
4470A6305892p4243J40399j7655o9380k8860J07891N3304J4992Q7236Q9328R6436
4459A6705340J06778O7344N5229J12453N5403o9783J0586Q040k6103k19444l5902
4448A6769941r5280j23029k3047J0556J17760N6731M7783J0676J98627K34366
4438A7205084J03769J35727J70823K49819K87070K98853L88325L24156L71890
4429A9535516M10311M36800M62499M68401L32961L14378M57194M14206M33422
4420B3265688N41310M79310N50375N12593N50070O40945O51150P47938R12158
4411B8851537Q95035R94712J025179J051926J170116J329581J504981J502328
$$ y = [16369353, 16417195, 16478412, 16529393, 16442469, 16529216, 16466883, 16310762, 16285275, 16264723, 16304814, 16305892, 16231649, 16372048, 16354393, 16285013, 16256153, 16364044, 16417348, 16432340, 16519576, 16608904, 16705340, 16812118, 16879462, 16934691, 17047144, 17102547, 17032764, 17043350, 17051390, 17025287, 16805843, 16769941, 16674661, 16551632, 16528585, 16539141, 16656901, 16713632, 16761415, 16772091, 16970718, 17205084, 17308853, 17444580, 17615403, 17865222, 18152292, 18451145, 18839470, 19163626, 19535516, 19945827, 20382627, 20845126, 21313527, 21646488, 21960866, 22418060, 22832266, 23265688, 23806998, 24286308, 24836683, 25349276, 25899346, 26540291, 27191441, 27939379, 28851537, 29746572, 30741284, 31766463, 32818389, 33988505, 35318086, 36823067, 38325395]
4403C8325395J726672J852634K099321K257650K423929K649780K599310K594957
4395E6529648K516638K409523K335101K233734K021765J878933J712226J636822
4387G3274390J421787J492188J551969J566884J656302J717905J615558J774341
4379H6071324J837280J640034J728628J735969J690513J912276K253588K542705
4371A01412317K872658L155954L420103L790564L595687L220013K460772J083153
4363A25011221k62172j884870l063417l682858m099371m089453l885533l663578
4355A00379969l256201k757875k412135k089335j887163j791554j657340j861896
4347H2666470j858277j620446j604342j294864j076490q92043q32189r64181j020152
$$ y = [38325395, 40052067, 41904701, 44004022, 46261672, 48685601, 51335381, 53934691, 56529648, 59046286, 61455809, 63790910, 66024644, 68046409, 69925342, 71637568, 73274390, 74696177, 76188365, 77740334, 79307218, 80963520, 82681425, 84296983, 86071324, 87908604, 89548638, 91277266, 93013235, 94703748, 96616024, 98869612, 101412317, 104284975, 107440929, 110861032, 114651596, 118247283, 121467296, 123928068, 125011221, 124749049, 122864179, 119800762, 116117904, 112018533, 107929080, 104043547, 100379969, 97123768, 94365893, 91953758, 89864423, 87977260, 86185706, 84528366, 82666470, 80808193, 79187747, 77583405, 76288541, 75212051, 74320008, 73487819, 72523638, 71503486]
4338G1503486j043855j118020j228075j500137j995412k375344k687264l116147
4330E6439232l347144l330005l229078l005894k666166k496049k153996j930797
4322C4280103j841328j670303j437574j376917j328889j056209j103821j030569
4314B3434493q51917q79814r08724p68798o04921o16534o76370n05032n12177
4305A7110206o27798m68574n01719o08806m95860m84488m00033k79479k51399
4296A2992050m54860l90024l01709l01586l84784k32293k89218k53884k18886
4287A0164806l08247k80242k49775j34596k41036k58862j79545j65579j53103
4278H193821k02735j00364j74393j95730k8847m5733j93249r7385O190r0953j09220
$$ y = [71503486, 70459631, 69341611, 68113536, 66613399, 64617987, 62242643, 59555379, 56439232, 53092088, 49762083, 46533005, 43527111, 40860945, 38364896, 36210900, 34280103, 32438775, 30768472, 29330898, 27953981, 26625092, 25568883, 24465062, 23434493, 22582576, 21702762, 20794038, 20025240, 19420319, 18803785, 18127415, 17622383, 17110206, 16482408, 16013834, 15512115, 14903309, 14407449, 13922961, 13522928, 13243449, 12992050, 12537190, 12147166, 11845457, 11543871, 11159087, 10926794, 10637576, 10383692, 10164806, 9856559, 9576317, 9326542, 9191946, 8950910, 8692048, 8512503, 8346924, 8193821, 7991086, 7890722, 7716329, 7520599, 7491752, 7446019, 7252770, 7155385, 7161575, 7070622, 6961402]
4267F961402j25214n6382j17266j08571k7734j66764j21389m8656k9156n1784
4257F108486j40013o9273o8347m1353q5832m8661p3846k8310o0751l768J36404
4246E624736j15035j34175N9640k7725j06616Q2325L8749j11040k7686J1406r255
4235E285324J7656r4463p4924N0090m266o2078l9416n1846P2075l3858m6105m433
4223E013756m2375P6802l2029Q908l6288q8319Q2J6199m102R0824p955j08190
4211D887313L9033k5358j00470J961r2265k539P342K7982o9131k5464R0191k9207
4199D709388r8465M6476O1910n4777k908m0331k971j01924p3323l800k4661L4098
4187D448712J648j05732j3890L5910k3915l3540m4861m4482Q7040R1374j5451
$$ y = [6961402, 6836188, 6779806, 6662540, 6553969, 6526235, 6359471, 6238082, 6189426, 6160270, 6108486, 5968473, 5899200, 5830853, 5789500, 5703668, 5655007, 5581161, 5552851, 5492100, 5488332, 5624736, 5509701, 5375526, 5435166, 5407441, 5300825, 5383150, 5421899, 5310859, 5283173, 5294579, 5285324, 5302980, 5208517, 5133593, 5183683, 5179417, 5117339, 5077923, 5026077, 5098152, 5064294, 5018189, 5013756, 4971381, 5048183, 5016154, 5025062, 4988774, 4900455, 4900537, 4916736, 4912634, 5003458, 4995503, 4887313, 4926346, 4900988, 4800518, 4802479, 4710214, 4707675, 4715017, 4742999, 4673868, 4648404, 4738595, 4709388, 4610923, 4657399, 4719309, 4664532, 4661624, 4621293, 4618322, 4516398, 4443075, 4439275, 4414614, 4448712, 4450360, 4344628, 4330738, 4366648, 4342733, 4309193, 4264332, 4219850, 4306890, 4398264, 4382813]
4176D382813k2507J8936k6210l119m8406k9673k2271l9130j6281J0326M4159o9348
4164D179289j4367O3716N5200l5227j31986K4438J3110J20984j3799N0328M400
4153D316086p3839M059K6066Q2628N6353N6298p8981n3878m8059M6267P250M5719
4141D385969J00426Q5013L4803K4744j45427M2733J17880k1834L6664j1943P5969
4130D724997J72997l1907O185J60606j9535O4030K2509J41465L9552m8060M0191
4119E273030K4033L8536J45571O3373n9917J20430K56415J16252j3153J44692
4109F109262P4715J09340J37764Q3344J07080M8793R7809J81054J19797J11168
4099G180126P1947J86298L8494J35562K86899K04878J04167K37419J90540K86475
$$ y = [4382813, 4360306, 4379242, 4353032, 4349913, 4301507, 4271834, 4249563, 4210433, 4194152, 4204478, 4248637, 4179289, 4164922, 4228638, 4283838, 4248611, 4116625, 4141063, 4154173, 4275157, 4261358, 4311686, 4316086, 4242247, 4246306, 4272372, 4355000, 4411353, 4467651, 4388670, 4334792, 4286733, 4333000, 4340250, 4385969, 4486395, 4571408, 4606211, 4630955, 4485528, 4528261, 4646141, 4624307, 4660971, 4649028, 4724997, 4897994, 4866087, 4872272, 5032878, 5013343, 5077373, 5099882, 5241347, 5280899, 5232839, 5273030, 5297063, 5335599, 5481170, 5544543, 5484626, 5605056, 5861471, 5977723, 5964570, 6109262, 6183977, 6293317, 6431081, 6514425, 6621505, 6670298, 6768107, 6949161, 7068958, 7180126, 7252073, 7438371, 7476865, 7612427, 7899326, 8104204, 8208371, 8445790, 8636330, 8922805]
4089H922805L62043M02628K60794J39304l2717j86972k38783k99197k58492j45590
4079H925823r8798j02643j56178o9119r5846P903R4899l7869j6007n5198j2821
4068H384146k506n6052k0158J54246P4435N3994l0348J05464Q2015Q9775k9688
4057H805323M345Q0268O4031J61044Q7401P0513K8458J50127M6036J18187O7912
4046I683645L3177L8032P2357J40474J01134J02941n7207L323J70018K02651R9618
4035A0590163J40666J50312J43569R7701M9875Q5367J38261Q3546K28872J63157
4025A1871489J85995J31262K03469J75501J41174K34236J57935J82373J47802
4016A3431236R9553K47226K14141K38425K25627K56752K55107K70549K99199K61260
$$ y = [8922805, 9284848, 9687476, 9948270, 10087574, 10054857, 9867885, 9629102, 9329905, 9071413, 8925823, 8827025, 8724382, 8568204, 8499085, 8403239, 8411142, 8506041, 8468172, 8452165, 8396967, 8384146, 8381640, 8325588, 8305430, 8459676, 8534111, 8588105, 8557757, 8663221, 8745236, 8835011, 8805323, 8809668, 8889936, 8953967, 9115011, 9202412, 9272925, 9301383, 9451510, 9497546, 9615733, 9683645, 9716822, 9754854, 9827211, 9967685, 10068819, 10171760, 10114553, 10117876, 10287894, 10490545, 10590163, 10730829, 10881141, 11024710, 11122411, 11172286, 11257653, 11395914, 11479460, 11708332, 11871489, 12057484, 12188746, 12392215, 12567716, 12708890, 12943126, 13101061, 13283434, 13431236, 13530789, 13778015, 13992156, 14230581, 14456208, 14712960, 14968067, 15238616, 15537815, 15799075]
4006A5799075L16047K43493L25067L70142L74692K83770K82657M10484K88057
3997A8693484L65699L86555N10012N26512M87344M71392M20814M75479N25526
3988B2862817M61430N27569M99795O09405P10483Q06057P33408P64407Q38016
3979B8813387Q68765P93583R75039J003971R58626J008894J063628J240374J268543
3970C7994810J296816J387129J474576J590609J624687J680648J797385J809252
3962E0655912J945851J973100K211495K219321K417062K494495K521184K696753
3954F9135173K882185K933772L067474L049197L117638L318728L456087L498084
3946I4458338L512755L642900L732015L563348L621594L826570L874162L816118
$$ y = [15799075, 16115122, 16358615, 16683682, 17053824, 17428516, 17712286, 17994943, 18405427, 18693484, 19059183, 19445738, 19955750, 20482262, 20969606, 21440998, 21861812, 22337291, 22862817, 23324247, 23851816, 24351611, 24961016, 25671499, 26477556, 27210964, 27975371, 28813387, 29682152, 30475735, 31450774, 32454745, 33413371, 34422265, 35485893, 36726267, 37994810, 39291626, 40678755, 42153331, 43743940, 45368627, 47049275, 48846660, 50655912, 52601763, 54574863, 56786358, 59005679, 61422741, 63917236, 66438420, 69135173, 72017358, 74951130, 78018604, 81067801, 84185439, 87504167, 90960254, 94458338, 97971093, 101613993, 105346008, 108909356, 112530950, 116357520, 120231682, 124047800]
3938A24047800L937929L912853L831525L606166L620129L647534L486941L217392
3930A53308269L130449L013679K953216K722377K557230K482748K214390J894874
3922A74277232J774724J698432J279033Q99690O38572M66544K19360q2215l50318
3913A80821054o79066q67482r68243j162459j385726j519781j830277j920360
3905A70487660k099312k321870k472166k706533k871141l045602l034914l048141
3897A48887981l191547l190031l169962l220388l311591l261589l149731l266899
3889A23126243l339812l270967l173958l103397l239559l187789k991092l006925
3881I7812744k852532k791233k686941k624104k592529k506709k358821k252703
$$ y = [124047800, 127985729, 131898582, 135730107, 139336273, 142956402, 146603936, 150090877, 153308269, 156438718, 159452397, 162405613, 165127990, 167685220, 170167968, 172382358, 174277232, 176051956, 177750388, 179029421, 179929111, 180567683, 181034227, 181253587, 181171372, 180821054, 180141988, 179274506, 178306263, 177143804, 175758078, 174238297, 172408020, 170487660, 168388348, 166066478, 163594312, 160887779, 158016638, 154971036, 151936122, 148887981, 145696434, 142506403, 139336441, 136116053, 132804462, 129542873, 126393142, 123126243, 119786431, 116515464, 113341506, 110238109, 106998550, 103810761, 100819669, 97812744, 94960212, 92168979, 89482038, 86857934, 84265405, 81758696, 79399875, 77147172]
3873G7147172k226277k221025k050341k074302k057612j862918j777721j684756
3865F1192220j505562j456722j308758j262123j216440j209853j223535j074506
3857E0934721q61672p64927p72683o98104o59353n80614m81210l62417l12503
3848D5441238j83007j86041j07797P0318J5448K19605K07753K61204L66851K95766
3838D6401338L73931M09945M74016N24758P24908P78866P27380Q64259P94005
3829E2073406Q30557P43384O38709P61304R13917Q93813J041907J000937J135126
3820F0033060J322515J175307J250470J315436J342195J457608J486440J728833
3812G1111864J946937K087592K277920K671079K975347L345701L729328M064908
$$ y = [77147172, 74920895, 72699870, 70649529, 68575227, 66517615, 64654697, 62876976, 61192220, 59686658, 58229936, 56921178, 55659055, 54442615, 53232762, 52009227, 50934721, 50073049, 49308122, 48535439, 47837335, 47177982, 46597368, 46116158, 45753741, 45441238, 45258231, 45072190, 44964393, 45034711, 45050159, 45269764, 45477517, 45738721, 46105572, 46401338, 46775269, 47185214, 47659230, 48183988, 48908896, 49687762, 50415142, 51279401, 52073406, 52903963, 53647347, 54286056, 55047360, 55961277, 56855090, 57896997, 58897934, 60033060, 61355575, 62530882, 63781352, 65096788, 66438983, 67896591, 69383031, 71111864, 73058801, 75146393, 77424313, 80095392, 83070739, 86416440, 90145768, 94210676]
3804I4210676M531718M823341N268796N381400N518041N542755N207764M798991
3796A35283482M197294L735518L422089L269454L219583L314947L705239M120283
3788A64267889M734138N588013O269459O740066O822020O445585M969667L012543
3780B08849380J191366K27463k13727r7688O54447J701182L012386M288796N594253
3771B25207858O671596P385780P544253O623338M132343O08632l086684o079968
3763B49007148p916633q801777q665347p909416o817519n352579m093179k720740
3755A96729958j731166j036205r92364j554681k838833m391900n629675o361550
3747A72193584o775758o664351o376840n883311n174794m460177l789969l337688
$$ y = [94210676, 98742394, 103565735, 108834531, 114215931, 119733972, 125276727, 130484491, 135283482, 139480776, 143216294, 146638383, 149907837, 153127420, 156442367, 160147606, 164267889, 169002027, 174590040, 180859499, 187599565, 194421585, 200867170, 205836837, 208849380, 210040746, 210268209, 210054482, 209956794, 210611241, 212312423, 215324809, 219613605, 225207858, 231879454, 239265234, 246809487, 253432825, 257565168, 258173800, 255087116, 249007148, 241090515, 232288738, 223623391, 215713975, 208896456, 203543877, 199450698, 196729958, 194998792, 193962587, 192970223, 191415542, 188576709, 184184809, 178555134, 172193584, 165417826, 158753475, 152376635, 146493324, 141318530, 136858353, 133068384, 129730696]
3739A29730696l077154k915387l152147l508942m100013m825186n069741n288164
3731I7793962n309355n067079m707431m399985m015866l552433l185122k734236
3723F4822455k452317k117797j898269j732459j460581j434968j121360r50408
3715E1654296q99112r64066r45517r66129j075847j024198r57247r60889r33806
3706D2927485q32354q18133p99052r40594j074295j048014j027885r37493p64473
3697C4685192p85826p44865o23528o10700p11927m70458n39250n85940n65588
3688B9047110n41985n27369n50744k74889k92525m19642l87347k64056k47112
3679B5541441j93143k76736j55843j77769p7989r0027k37353J5104n6187l7729
$$ y = [129730696, 126653542, 123738155, 120586008, 117077066, 112977053, 108151867, 103082126, 97793962, 92484607, 87417528, 82710097, 78310112, 74294246, 70741813, 67556691, 64822455, 62370138, 60252341, 58354072, 56621613, 55161032, 53726064, 52604704, 51654296, 50755184, 49791118, 48845601, 47879472, 46803625, 45779427, 44822180, 43861291, 42927485, 42095131, 41276998, 40477946, 39537352, 38463057, 37415043, 36387158, 35449665, 34685192, 33899366, 33154501, 32530973, 31920273, 31208346, 30737888, 30198638, 29612698, 29047110, 28505125, 27977756, 27427012, 27152123, 26859598, 26439956, 26052609, 25788553, 25541441, 25348298, 25071562, 24915719, 24737950, 24659961, 24569934, 24332581, 24347685, 24291498, 24253769]
3669B4253769p7458j40031J14396J1578l4128O7047Q3892L8938O5172Q4779J41721
3658B4609675P0936J59714K11562Q8144J85144R6939J92488K31057K27435J92655
3648B6265749K34313L08771K48987K53726L94835K82377K63354M12040L26417
3639B8990569L76850M48013L59874M22003M18539N02350L84654M31777N14818
3630C2849447M70895O77455O54504N48580N92473O01941O16103O84794O48864
3621C8345056Q46445Q07272Q44136Q89993Q94238Q97669J021730R45129J140282
3612D6631950R90480J105922J301885J257884J317639J374715J414328J441706
3604E6836509J588140J603030J723563J655747J893474J929905J886301J904406
$$ y = [24253769, 24176311, 24036280, 24150676, 24162254, 24128126, 24195173, 24279065, 24318003, 24383175, 24467954, 24609675, 24680611, 24840325, 25051887, 25140031, 25325175, 25422114, 25614602, 25845659, 26073094, 26265749, 26500062, 26808833, 27057820, 27311546, 27706381, 27988758, 28252112, 28664152, 28990569, 29367419, 29815432, 30175306, 30597309, 31015848, 31518198, 31902852, 32334629, 32849447, 33320342, 33997797, 34652301, 35200881, 35793354, 36395295, 37011398, 37696192, 38345056, 39191501, 39998773, 40842909, 41732902, 42627140, 43524809, 44546539, 45491668, 46631950, 47622430, 48728352, 50030237, 51288121, 52605760, 53980475, 55394803, 56836509, 58424649, 60027679, 61751242, 63406989, 65300463, 67230368, 69116669, 71021075]
3596G1021075J937013J821667J818040J985939J932960J842830J812244J775468
3588H5947236J547982J703221J631165J604482J523094J527664J488994J358134
3580I8331972J400123J353579J182387J030475R79163Q06665R15029Q83699Q14162
3571A07697254P55793Q43799Q65812R34029R57714J106959J066415J084764J210399
3562A16522938J421232J397820J449739J575949J606292J932504K142638K344721
3554A30393833K413005K775913K987676L166551L446420L780601M087388M310344
3546A57361731M691826M890506N219446N517626N772252N986609O197555O275350
3538B01912901O245141O256816O169690O019638N878694N574623N530348N377846
$$ y = [71021075, 72958088, 74779755, 76597795, 78583734, 80516694, 82359524, 84171768, 85947236, 87495218, 89198439, 90829604, 92434086, 93957180, 95484844, 96973838, 98331972, 99732095, 101085674, 102268061, 103298536, 104277699, 105084364, 105999393, 106883092, 107697254, 108453047, 109296846, 110162658, 111096687, 112054401, 113161360, 114227775, 115312539, 116522938, 117944170, 119341990, 120791729, 122367678, 123973970, 125906474, 128049112, 130393833, 132806838, 135582751, 138570427, 141736978, 145183398, 148963999, 153051387, 157361731, 162053557, 166944063, 172163509, 177681135, 183453387, 189439996, 195637551, 201912901, 208158042, 214414858, 220584548, 226604186, 232482880, 238057503, 243587851, 248965697]
3530B48965697N164125N037831M863319M439782M148481L809175L309866K774604
3522B82512880K036253J651144J171648O31306J19026j6589l02278m36244m58984
3513B86908162o05346l81380k39067j39369J30044J37327M52406O42459P12129
3504B87617365R27406R76483J067906J351078J366037J564623J427987J580911
3496B97879796J760200J721021J940007K029259K169910K333085K264982K293512
3488C14391772J968406J866577J364028Q39995M09421j81212o85947j228734j723682
3479C17020624k346156k612753l070379l224571l374655l333164l227787k933414
3471B92897745k751695k450143k401864k313817k339246k427837k696178k792933
$$ y = [248965697, 254129822, 259167653, 264030972, 268470754, 272619235, 276428410, 279738276, 282512880, 284549133, 286200277, 287371925, 288003231, 288122257, 288105668, 287803390, 287367146, 286908162, 286302816, 285921436, 285682369, 285543000, 285673044, 285810371, 286262777, 286905236, 287617365, 288544771, 289521254, 290589160, 291940238, 293306275, 294870898, 296298885, 297879796, 299639996, 301361017, 303301024, 305330283, 307500193, 309833278, 312098260, 314391772, 316360178, 318226755, 319590783, 320430778, 320840199, 320658987, 319973040, 318744306, 317020624, 314674468, 312061715, 308991336, 305766765, 302392110, 299058946, 295831159, 292897745, 290146050, 287695907, 285294043, 282980226, 280640980, 278213143, 275516965, 272724032]
3463B72724032k942556l031616k906425k823291k643743k272442j910929j287055
3455B52905975p64151j59688M80435J012650J740474K419511L055342L638672
3447B64329220M252403M935997N861925O604974P516044Q633536R713663J0787254
3439C22635016J1545833J1979419J2020556J1635251J0774999R588772Q520361
3432C98700207P353764O485282N858829N793482N840028O012312O175006N689040
3424D47907950M902492L367695J374903j087915m165247o940752r631796j1814284
3416D23913046j3254992j4049114j4307836j4474826j4045751j3505566j3435806
3409C26839155j3242458j3356043j3734433j4225776j4579254j4738181j4902232
$$ y = [272724032, 269781476, 266749860, 263843435, 261020144, 258376401, 256103959, 254193030, 252905975, 252141824, 251982136, 252462571, 253475221, 255215695, 257635206, 260690548, 264329220, 268581623, 273517620, 279379545, 285984519, 293500563, 302134099, 311847762, 322635016, 334180849, 346160268, 358180824, 369816075, 380591074, 390179846, 398700207, 406053971, 412539253, 418398082, 424191564, 430031592, 436043904, 442218910, 447907950, 452810442, 456178137, 457553040, 456465125, 452299878, 445359126, 435727330, 423913046, 410658054, 396608940, 382301104, 367826278, 353780527, 340274961, 326839155, 313596697, 300240654, 286506221, 272280445, 257701191, 242963010, 228060778]
3402B28060778j4552162j3982110j3260967j2416263j1279887j0348653r371552
3395A42849184q584149p712259o986800o372961n777783n199678m784478m322975
3387I3108101l918941l682034l398380l094257l004262k694192k509766k318973
3379F8487296k088102k101669j949674j888421j822997j767869j428890j497440
3371E3942234j414558j297060j269896j190241j134967r97609r74173r93513j086871
3362D3583346r63543j022820j033600q81163q74579q47461q79547p41460o16721
3353C5722452p14548p64649o25896n87480m58668o01522n89761n34257m37853
3344C0407818k34652l26540l55839l39705m16092k84961k58310k41581l31977
$$ y = [228060778, 213508616, 199526506, 186265539, 173849276, 162569389, 152220736, 142849184, 134265035, 126552776, 119565976, 113193015, 107415232, 102215554, 97431076, 93108101, 89189160, 85507126, 82108746, 79014489, 76010227, 73316035, 70806269, 68487296, 66399194, 64297525, 62347851, 60459430, 58636433, 56868564, 55439674, 53942234, 52527676, 51230616, 49960720, 48770479, 47635512, 46637903, 45663730, 44670217, 43583346, 42619803, 41596983, 40563383, 39682220, 38807641, 37960180, 37080633, 36339173, 35722452, 35007904, 34243255, 33617359, 33029879, 32571211, 31969689, 31379928, 30845671, 30407818, 30173166, 29846626, 29490787, 29151082, 28734990, 28450029, 28191719, 27950138, 27618161]
3335B7618161l57976m38958n33328m71812k77296l52213l74403k45397j61939
3326B4404839k88627k08134k47594n5926Q5364q1099k26350j89608j27736k19556
3316B2845573j70373P7098K9150o9300j9736p136m9878n253k5695n1365R3111
3305B2646196L6563O2891J57343K7158J3011o920L0125J43927l455J02557K23023
3294B3432419M8009J97601J93594J17321R2798J31449J72699J59093J54991K78284
3284B4978258P7693R1714K48100L33133K73699L50387L94082K88963N03291M56698
3274B7996018N70524N42822N12762M82395O77818P45552P75586Q55706Q91345
3265C4050528Q74863R94032J007369J004601R72848J227062J245755J519942J570567
$$ y = [27618161, 27260185, 26821227, 26287899, 25816087, 25538791, 25186578, 24812175, 24566778, 24404839, 24116212, 23908078, 23660484, 23604558, 23689922, 23608823, 23382473, 23192865, 23065129, 22845573, 22675200, 22752298, 22781448, 22712148, 22692412, 22685276, 22635398, 22630145, 22604450, 22553085, 22646196, 22682759, 22745650, 22902993, 22930151, 22943162, 22936242, 22966367, 23110294, 23106839, 23209396, 23432419, 23480428, 23678029, 23871623, 23988944, 24081742, 24213191, 24385890, 24544983, 24699974, 24978258, 25055951, 25147665, 25395765, 25728898, 26002597, 26352984, 26747066, 27036029, 27539320, 27996018, 28566542, 29109364, 29622126, 30104521, 30782339, 31527891, 32303477, 33159183, 34050528, 34925391, 35919423, 36926792, 37931393, 38904241, 40131303, 41377058, 42897000, 44467567]
3256D4467567J718885J810636K134936K213153K540447K727495K922393L180702
3248F3716214L326636L485610L795046M117858M669764N269775N947386O579466
3240A00907755O959179P417619Q053292R445133J1039268J2571532J4741107J6318590
3232A87453475J3698736M562863o872293j3795721j6158888j5909784j3912530
3225A39065858j1108568q349238o275583m535714l044024j950521p66052j22628
3217A02913530O49897J625130K314994L178299M035596M717017N198918N980159
3209A30613540P025526Q586224J0265496J2229053J4182776J3747588P205342
3202B03855545m370132j3425121j7066606j7793888j6411960j3857585j1123809
$$ y = [44467567, 46186452, 47997088, 50132024, 52345177, 54885624, 57613119, 60535512, 63716214, 67042850, 70528460, 74323506, 78441364, 83111128, 88380903, 94328289, 100907755, 107866934, 115284553, 123337845, 132782978, 143822246, 156393778, 171134885, 187453475, 201152211, 205715074, 198842781, 185047060, 168888172, 152978388, 139065858, 127957290, 119608052, 113332469, 108796755, 105752731, 103802210, 103036158, 102913530, 103563427, 105188557, 107503551, 110681850, 114717446, 119434463, 124633381, 130613540, 137639066, 146225290, 156490786, 168719839, 182902615, 196650203, 203855545, 199485413, 186060292, 168993686, 151199798, 134787838, 120930253, 109806444]
3195A09806444q823848p161607n708338m592373l734424k913453k411902k171363
3187G2289136j897233j843212j680651j699125j665523j735114j445340j146251
3179E9176687r74655p47828l63158k46748P6979J27377M30105P42660R86822J257873
3169F0466114J745991K265949K591769L126489M077642N037390O426435P815105
3161I3552884R673464J1931672J1565015N464276l856576r355145j0813877j0735465
3153I7426248r490137p339086n269276l935552k971586j989781j461900p72571
3145F4196359j84435J78669P52754J224090J813025K248032K871067L587841M610119
3136H1297521N629945O677759Q032513R971269J1681186J0367436L307273n428163
$$ y = [109806444, 100982596, 93820989, 88112651, 83520278, 79785854, 76872401, 74460499, 72289136, 70391903, 68548691, 66868040, 65168915, 63503392, 61768278, 60322938, 59176687, 58202032, 57454204, 57091046, 56844298, 56921277, 57048654, 57478759, 58221419, 59208241, 60466114, 62212105, 64478054, 67069823, 70196312, 74273954, 79311344, 85737779, 93552884, 103226348, 115158020, 126723035, 132187311, 128330735, 118975590, 108161713, 97426248, 87936111, 80597025, 75327749, 71392197, 68420611, 66430830, 64968930, 64196359, 64011924, 64190593, 64943347, 66167437, 67980462, 70228494, 73099561, 76687402, 81297521, 86927466, 93605225, 101637738, 111609007, 123290193, 133657629, 136964902, 131536739]
3128A31536739r603045j0574642j0239938q921566p196450n668182m504538l758021
3120G1070357l235973k771484k324311j563838j405507j231834r14569q03831
3112E6819010l25288K9881M75149R45126J061875Q41933R14089R54912J069138
3103F2785825J547161J890210K155069K412075K517544K506983K550232K864841
3095H1229940L153026L471394M162952M793498N685082O620413P935177R853023
3087A26904505J2245579J5141309J8320391K1998142K3187126J6155322M07509
3080B34359883j4113759k0873406k2149694k0876658j7566468j3660922j0325068
3073A14793908p840731o084908m349357l123649k006751j095329J7481J016781
$$ y = [131536739, 121933694, 111359052, 101119114, 92197548, 85001098, 79332916, 74828378, 71070357, 67834384, 65062900, 62738589, 61174751, 59769244, 58537410, 57622841, 56819010, 56493722, 56523603, 56998752, 57943878, 59005753, 59847686, 60761775, 61716687, 62785825, 64332986, 66223196, 68378265, 70790340, 73307884, 75814867, 78365099, 81229940, 84382966, 87854360, 92017312, 96810810, 102495892, 109116305, 117051482, 126904505, 139150084, 154291393, 172611784, 194609926, 217797052, 233952374, 234359883, 220246124, 199372718, 177223024, 156346366, 138779898, 125118976, 114793908, 106953177, 100868269, 96518912, 93395263, 91388512, 90293183, 90310664, 91327445]
3065I1327445K143136L274655M149290N416347O890264R006851J1536277J4051375
3057A47795640J7241466K0736985K0867987J2709096l461574j6834647k2585457
3050A76469496k3494807k1728747j8326227j4655385j1840565r472737p774323
3043F9176705o480423n451829m615870l910074l318565k991140k706729k250491
3035C7451584j920816j799460j703830j355244j139002j193024j075365j073526
3027B6191317r91707p60649q11264p98242p65658q44916p21435p12632p72710
3018A9012104o60065o63451n44832m80127m60155m70917m69710m00202n10281
3009A4352364m83794l21299k95908l78635k78988l85434l53615m28999l58269
$$ y = [91327445, 93470581, 96745236, 100894526, 106310873, 113201137, 122207988, 133744265, 147795640, 165037106, 185774091, 206642078, 219351174, 215889600, 199054953, 176469496, 152974689, 131245942, 112919715, 98264330, 86423765, 76951028, 69176705, 62696282, 57244453, 52628583, 48718509, 45399944, 42408804, 39702075, 37451584, 35530768, 33731308, 32027478, 30672234, 29533232, 28340208, 27264843, 26191317, 25199610, 24438961, 23627697, 22829455, 22063797, 21218881, 20497446, 19784814, 19012104, 18352039, 17688588, 17143756, 16663629, 16203474, 15732557, 15262847, 14862645, 14352364, 13868570, 13547271, 13251363, 12872728, 12593740, 12208306, 11854691, 11425692, 11067423]
3000A1067423k44680k57441l50053k76117o6159k30061k24381k07116k34750j88284
2990H788381j48431j84780r7845j47330j37629k29235j11843j53667k23620j41658
2980G212343K5174j62487l16295o3047p7190j67367p5899j40601j73514j86091
2970E875026j38396o0891R850j00832L617L1025o8306j7237j62724k0218l7845
2959E313069j11077l9368R102n8039m1730n9280O5141r1115J68719N746j39918
2948E021250l0070J384N0328n331N9751Q9412j5908j44128o7198m6645j8060j42600
2936D752185j05765r1013k07764r1894l0160L4709j4137J20357K3089k3704l1214
2925D334689O2772M7774q063K1528n7277Q9713O0737j46133j995O6971J27843
$$ y = [11067423, 10822743, 10565302, 10215249, 9939132, 9872973, 9642912, 9418531, 9211415, 8976665, 8788381, 8639950, 8455170, 8357325, 8209995, 8072366, 7843131, 7731288, 7577621, 7354001, 7212343, 7237517, 7075030, 6758735, 6695688, 6618498, 6451131, 6375232, 6234631, 6061117, 5875026, 5736630, 5675739, 5685589, 5584757, 5588374, 5619399, 5551093, 5533856, 5371132, 5350914, 5313069, 5201992, 5162624, 5171726, 5113687, 5071957, 5012677, 5077818, 4986703, 5155422, 5161168, 5021250, 4991180, 4992564, 5042892, 5037561, 5097312, 5186724, 5170816, 5026688, 4959490, 4912845, 4894785, 4752185, 4646420, 4555407, 4347643, 4255749, 4225589, 4260298, 4246161, 4366518, 4389607, 4365903, 4334689, 4397461, 4445235, 4437172, 4458700, 4401423, 4491136, 4551873, 4405740, 4403745, 4470716, 4598559]
2914D598559L4265n8837j65736j22409j00362o7574j37351j26116j18710j58423
2904C577306r5123j5699m1465P934J03074j11061l1938k7713m0212p4694Q1783
2893C332192P5390m6409L7416L3275K7309L6069K1278Q0256J1669l324P2555O3727
2881C741403j4933K4868j6121p562p2821l126J28972R0427o4319L2278m2502l4197
2869C762367q4160k25951j51057l9140Q872k5121K1517n0456K1622k3003J4345
2858C229835O3506R5457K2956p1774J83969Q4426J27784j969L051J6618Q9915
2847C843774M5249j8526O8812r8246j26304k28531o0242o2406j11256j52309j94104
2836B905911M1366n495l2927m2997J06175J4021k71202n5383J03351J4939J1622
$$ y = [4598559, 4632824, 4573987, 4408251, 4285842, 4185480, 4117906, 3980555, 3854439, 3735729, 3577306, 3482183, 3466484, 3425019, 3432953, 3536027, 3424966, 3393028, 3365315, 3325103, 3250409, 3332192, 3407582, 3361173, 3398589, 3431864, 3459173, 3495242, 3516520, 3596776, 3608445, 3605121, 3677676, 3741403, 3726470, 3751338, 3735217, 3727655, 3654834, 3651708, 3780680, 3871107, 3806788, 3839066, 3796564, 3762367, 3678207, 3452256, 3301199, 3262059, 3270931, 3245810, 3267327, 3216871, 3238493, 3215490, 3229835, 3293341, 3388798, 3411754, 3339980, 3523949, 3608375, 3736159, 3734190, 3737241, 3753859, 3843774, 3889023, 3870497, 3939309, 3841063, 3714759, 3486228, 3425986, 3363580, 3252324, 3100015, 2905911, 2947277, 2941782, 2908855, 2865858, 2972033, 2986054, 2714852, 2659469, 2762820, 2777759, 2789381]
2825B789381K9368m8937O61J7776J5574J1078j33942m3264o2641O0990Q0359j37894
2813B578509m5230m7654r8362K4660M7784n7486p40K4054L1664j8126K4707L1195
2801B494975O973K5111K29313j5077n9943Q2877n8788K9461k9719j74320j72786
2790B358077k97190j21283m5019j57388o0412j84323p1352k7294O770q6591o7362
2779A246633J09300o2839N1199N2962q9200q475K6959J50684L932j7701J92073
2768A655527J3804p8158k6981j69317j17238k58191J7205j40285j01250Q9459
2758H84575j25504r4340r4373j05209o8118M9376l1198M3668n8188q1921q4303
2747B34465R3089M3548M53r579j11929l043k6537N5375n4286M6584o5700j40904
$$ y = [2789381, 2818749, 2769812, 2770473, 2788249, 2803823, 2814901, 2680959, 2637695, 2575054, 2636044, 2716403, 2578509, 2533279, 2485625, 2387263, 2411923, 2459707, 2402221, 2401481, 2425535, 2457199, 2439073, 2463780, 2494975, 2501948, 2527059, 2756372, 2741295, 2681352, 2764229, 2705441, 2734902, 2705183, 2530863, 2358077, 2060887, 1939604, 1894585, 1737197, 1676785, 1492462, 1421110, 1393816, 1400586, 1313995, 1246633, 1355933, 1293094, 1344293, 1397255, 1308055, 1299580, 1326539, 1477223, 1481155, 1463454, 1655527, 1669331, 1591173, 1564192, 1394875, 1277637, 1019446, 1036651, 896366, 795116, 884575, 759071, 664731, 570358, 465149, 397031, 446407, 415209, 458877, 400689, 318768, 234465, 327554, 371102, 371555, 361976, 250047, 247004, 220467, 275842, 221556, 268140, 202440, 61536]
2735F1536J15638l0052j9421J15030M9915n893r4515q2352K4104m6978N3186k6617
2723A13581J962q730m2915j7032Q9872l3345o8295q9010L1735Q0828j8528m5336
2711e213k100M4906o4203p994Q1557m6274m9799m414k4567R806K037j05535j2520
2698a84313J11090R426o8024m6807L2039Q0888N7031m3557q6640P7065r055n3134
2686a23991P5170k2847j19377j08137M9134O2189L2773K5283K3182q7064M5002
2675a48683j099p8319R5375P0054l0368n390k9964k0928m0654J6898K5413J35571
2663a2094P171q5198q6299P394Q6305l6850p9833m1173j8389P7403M2673L0442
2651a08448R517q2709J28018j1623n9954M5377j15909o6620k250k6186O5829J20547
$$ y = [61536, 177174, 147122, 127701, 242731, 292646, 286753, 192238, 109886, 133990, 87012, 140198, 113581, 115543, 106813, 63898, 46866, 136738, 103393, 35098, -53912, -22177, 58651, 40123, -5213, -7313, 37593, -26610, -34604, 46953, 679, -49120, -53534, -78101, -68295, -66258, -171793, -184313, -73223, -63797, -131821, -178628, -146589, -65701, -8670, -52227, -138867, -61802, -70857, -123991, -48821, -71668, -191045, -299182, -250048, -187859, -155086, -129803, -106621, -193685, -148683, -149782, -228101, -132726, -62672, -93040, -98430, -128394, -149322, -189976, -173078, -147665, -12094, -4923, -90121, -176420, -169026, -82721, -119571, -199404, -240577, -258966, -181563, -138890, -108448, -98931, -181640, -53622, -65245, -125199, -79822, -195731, -262351, -264601, -290787, -224958, -104411]
2639a04411l0043M7192Q2724r4543m3499m646L1343m8179o549p995M833J40338
2627c3435j05618j05304j005j1781N9160L6512P357k1305m7773L068O5607j11364
2615b65881j57981J46278J05514m8392L6578l94j17913M5069O4846k3371O3752
2604a51895o8510l4624Q5067K4504o5003r255r5918J17974R4216l0888Q7670J03010
2592E6348p2135r5078J7169j6371j7048j5172N8933p0444M1784P2315n2689n7135
2580a49523p7014J43409o204k4739r7838L8931j3128Q5143K5922j10299o5644
2569b50984J09408K2137m8782J25016k8736J29098J210N2150j01841J5481K6533
2558E0690m4889l0093J2300M2361r2933p279O9850K455J9702N3039O0672l3000
$$ y = [-104411, -134454, -87262, -4538, -99081, -142580, -147226, -115883, -164062, -170611, -178606, -173773, -33435, -139053, -244357, -245362, -257143, -197983, -161471, -154114, -175419, -223192, -220124, -154517, -265881, -423862, -277584, -172070, -220462, -183884, -184278, -302191, -257122, -192276, -215647, -151895, -220405, -255029, -169962, -145458, -210461, -219716, -315634, -197660, -103444, -134332, -46662, 56348, -15787, -110865, -93696, -110067, -127115, -142287, -83354, -153798, -112014, -39699, -92388, -149523, -226537, -83128, -89332, -114071, -211909, -172978, -186106, -100963, -75041, -185340, -250984, -141576, -119439, -168221, -43205, -71941, 57157, 58367, 110517, 8676, 24157, 50690, 5801, -24292, -11992, 30369, -62564, -69843, 7, 2462, 22164, 75203, 135875, 102875]
2546A02875K6745m0150j17343l4024J9765R8221k9732r3480n0009P270K3589j7694
2534a03967P5252j2267p5606q4541O7592M6483q254k2585N1199N3507k7899p5624
2522a16710M408l8069K3110R0654L8426o2991l6024P8443n0211m2867m0322L1915
2510a20238K6560J9841r1057K0614m1750O1376k0461p4013R5925n0218j60765
2499c34186R2759Q8177j22297L0642K6587L0221M6720m6129j6378N7856J2998
2488a33030N0198o6404j5129O578M9201l8114j10626o0242o1379M9144M8875L193
2476b77735j6756K7857j2783p5288j40968l364P5125N8201M8547P1213L1622l9697
2464b54026r701J6822M4621j13027l4898j3059k6117Q3746K2495j09509l6331
$$ y = [102875, 129620, 89470, -27873, -61897, -42132, 56089, 26357, -67123, -117132, -109862, -86273, -103967, -28715, -40982, -116588, -201129, -133537, -87054, -95308, -117893, -66694, -13187, -41086, -116710, -112302, -150371, -127261, -36607, 1819, -61172, -97196, -18753, -68964, -111831, -152153, -120238, -93678, -73837, -164894, -144280, -186030, -124654, -145115, -219128, -123203, -173421, -334186, -241427, -153250, -275547, -244905, -218318, -188097, -141377, -187506, -203884, -146028, -133030, -82832, -149236, -164365, -157787, -108586, -146700, -257326, -317568, -378947, -329803, -280928, -277735, -294491, -266634, -279417, -354705, -495673, -499037, -423912, -365711, -317164, -245951, -214329, -254026, -263727, -246905, -202284, -315311, -350209, -363268, -389385, -305639, -283144, -392653, -428984]
2453d28984O4889m0689J6360n4254N086J04587j0240K1513p977m8405N703J13801
2441b58610M7777j04713L1187q947O125l1805q0778K3894q408P3764j10129n1130
2429d71773J21525o5629L0566J05202r166n5844R0132j14042n9305j8945J3867
2418d33412J12897N7116j25727j9838Q2947N4960q3718j5772P2580N1727n0279
2407b96519q0684j2485J24522J852q2946R551O6440K346l1562P5850K7056k7021
2395b23600J8785l6992j46939J0599Q2348n9339k1945j7652l434l066O1475N8532
2383b81228p9977J4705l0266N2068p985O2420M9274l8977q963K7550j04009m4538
2371c89926K8783K8553N183j6350o799K0320K6558K3643q9824K7995N5540l9624
$$ y = [-428984, -364095, -404784, -388424, -442678, -437592, -333005, -343245, -321732, -329709, -378114, -372411, -258610, -210833, -315546, -284359, -293306, -287181, -318986, -399764, -375870, -384278, -310514, -420643, -471773, -350248, -415877, -385311, -280109, -289275, -345119, -254987, -369029, -428334, -447279, -433412, -320515, -263399, -389126, -408964, -326017, -271057, -354775, -370547, -297967, -246240, -296519, -377203, -389688, -265166, -263314, -346260, -336709, -270269, -267923, -299485, -223635, -196579, -223600, -204815, -241807, -388746, -378147, -295799, -355138, -377083, -394735, -398169, -401235, -339760, -281228, -361205, -346500, -376766, -324698, -332683, -270263, -220989, -259966, -268929, -241379, -345388, -389926, -361143, -332590, -327407, -343757, -350556, -330236, -303678, -280035, -369859, -341864, -286324, -325948]
2359c25948j563Q6326m7439J3276k4362l1687K2444q819k7824J0256J06413j17168
2347c46095O1906J14098P244M1916p3692l8734j0358k8495m8008J03117j05664
2336c22765o5581J23202K3686J7926L7048q7120p3205j440k6063N1821n0220J63837
2324b08874k0585j60363N3466N5815J17667N3857K973N558N0904j1604m458j45250
2312b10894l167J1472k8681K7806o9856M6323J17775j6366r668j73794p4656J62378
2300b21328P6844n0774m176m3926L137P332J884K2152r6896j1777K5629K4776
2288b67123K9239j54653N2313R8116o3887N109o9058J28899m0890K3653K9171
2277b29111N4964m279j8928r154N9148j0892j3535K8381o1570j4489L3240l5475
$$ y = [-325948, -327511, -241185, -288624, -275348, -299710, -331397, -308953, -317772, -345596, -335340, -228927, -346095, -284189, -170091, -162847, -120931, -194623, -233357, -243715, -272210, -320218, -217101, -322765, -388346, -265144, -241458, -223532, -186484, -273604, -346809, -348249, -374312, -322491, -372711, -208874, -229459, -389822, -336356, -280541, -162874, -109017, -106044, -100486, -49582, -61186, -65644, -210894, -214061, -202589, -231270, -203464, -273320, -226997, -109222, -125588, -135256, -309050, -383706, -221328, -144484, -195258, -199434, -243360, -240223, -232891, -231007, -208855, -305751, -317528, -291899, -267123, -237884, -392537, -340224, -242108, -305995, -300886, -369944, -241045, -281935, -258282, -229111, -174147, -178426, -197354, -206508, -147360, -158252, -171787, -143406, -204976, -219465, -186225, -221700]
2265b21700N4684j7580M0894J0450l7107K0446k4062O8900j27466K635N8379m6239
2253b17766k1224r6824P3567J14470k5711Q6127j08635p7660r636N264M5003j12902
2241c45927m321Q5292M1651k5411Q4856m0482n027O512l9278M2140L8928j552
2229a62619K2569j7370M4758n5064M4501L5626j11369o8858k2013R2906j3170
2218b10103q6819p9701J06869L3559M8082R9525L818n0843n4247K4617Q0210m8759
2206a33792k3336M8709j6596K239m8143K5732j6990N8481P9915J5119K3826o9039
2194e3875J0892j6292n0303R6871q375M5197Q3582j11297o910k0704O4777k4033
2182I530o0701M5608o7001N7062n275k9283N4804l7454j0063O3491L1607r1287
$$ y = [-221700, -167016, -184596, -143702, -133252, -170359, -149913, -173975, -105075, -232541, -229906, -171527, -217766, -238990, -335814, -262247, -147777, -173488, -87361, -195996, -273656, -283292, -278028, -233025, -345927, -350248, -264956, -223305, -248716, -163860, -204342, -209369, -202857, -242135, -199995, -161067, -162619, -140050, -157420, -112662, -167726, -123225, -87599, -198968, -267826, -289839, -196933, -210103, -296922, -376623, -269754, -236195, -188113, -88588, -84770, -135613, -189860, -165243, -85033, -133792, -157128, -108419, -125015, -122776, -170919, -145187, -162177, -103696, -23781, -8662, 15164, -53875, -42983, -59275, -109578, -12707, -21082, 24115, 107697, -3600, -10510, -31214, 33563, 9530, -51171, -5563, -72564, -15502, -20777, -50060, 4744, -32710, -42773, 20718, 52325, -38962]
2170c8962k7902j9701N8717J39150o4215j3094L2397K9011o7624l2417R1645R0081
2158A77086M6472l8888K6862K6919o7595O0097n698P6863j13875j5160L1275P6081
2146B80439M8049j29170Q8657R967j6239J03960N8579q5406o101N4215N1262O9573
2134E27785R1112j1176r3449N5983J06638j7007J05727j19313Q7246Q019q729
2123G32836L7609l9445N0416J8914O9591L3647n9219M5631m6821M0959m5980J9587
2111H57725O9035J16245M1295p821m6054M9687K02067J9011K400N9669M718L5727
2099A403704l2766m3692q671R6165J26862j3293J26851N7392k0384R9391Q9605
2088A881164K6783J18377J07611J20897J09843Q0834J44387J58405J27630J68072
$$ y = [-38962, -66864, -86565, -27848, 111302, 47087, 33993, 66390, 95401, 27777, -4640, 87005, 177086, 223558, 184670, 211532, 238451, 170856, 230953, 225255, 302118, 188243, 173083, 204358, 280439, 328488, 199318, 287975, 297942, 281703, 385663, 444242, 358836, 352735, 406950, 458212, 527785, 618897, 607721, 514272, 570255, 676893, 659886, 765613, 646300, 733546, 741565, 732836, 770445, 731000, 781416, 800330, 869921, 903568, 844349, 889980, 843159, 884118, 838138, 857725, 926760, 1043005, 1084300, 1076479, 1030425, 1080112, 1282179, 1301190, 1303590, 1363259, 1367977, 1403704, 1370938, 1327246, 1318575, 1414740, 1541602, 1528309, 1655160, 1712552, 1692168, 1791559, 1881164, 1907947, 2026324, 2133935, 2254832, 2364675, 2445509, 2589896, 2748301, 2875931, 3044003]
2078C044003R3407L10142K78280J34754K01330J83885K53430L82748L04794L47844
2068E534617M84241M10734N74297N66202M63450O23012N71338N88098Q81111R69815
2058A1666915J253728J535654J785383K185895K771855L500289M289691N279113
2050C4268523M807673R29359l206436m671761m933316m605391m010960k895914
2042A5681777k293190j805227j507017j234941q14827p06963n41874l72281m93435
2033E912022n00398l42398n47494l45529k83121k99269k32638q1972r3420k24854
2023B960929k02097r6473M4467j06985j34113j18544j07887k51135k12593j42711
2013A632858N5381m9415j22947l7784N7385j09947r5181q2243K8120l1900r7471
$$ y = [3044003, 3137410, 3447552, 3725832, 3860586, 4061916, 4245801, 4499231, 4881979, 5186773, 5534617, 6018858, 6429592, 7003889, 7570091, 8033541, 8656553, 9227891, 9815989, 10697100, 11666915, 12920643, 14456297, 16241680, 18427575, 21199430, 24699719, 28989410, 34268523, 39076196, 40005555, 36799119, 32127358, 27194042, 22588651, 18577691, 15681777, 13388587, 11583360, 10076343, 8841402, 8026575, 7319612, 6777738, 6405457, 5912022, 5411624, 5069226, 4521732, 4176203, 3893082, 3593813, 3361175, 3279203, 3185783, 2960929, 2758832, 2662359, 2706826, 2599841, 2465728, 2347184, 2239297, 1988162, 1775569, 1632858, 1688239, 1638824, 1515877, 1478093, 1535478, 1425531, 1330350, 1248107, 1276227, 1244327, 1146856]
2002A146856o3801p0578O7821j13506j0971m2226n9401J4959j5324j8326l4167
1991H01336p2551p4277n7505k9942j5268k5924j4930K7592m7866p8035J5595l2203
1979C96022J25186l9898j49110K685K8902m2067k2302l2428Q3885m3152p8367
1968B29356P7937L3702l836p6236l0199n5010J07750o37q9164O8054j08822j02991
1956D9904P7037O778M5899j0176J03899m9891n0670q569p7292K4208r519l9493
1944F2115M7484k7086M6845o3918N5576m7997q4250k773j54146O7178L9319N3236
1932h417J04407j4741m2770r645m753o363o4028k2002Q3266l2466N4959j21002
1920h3555M2910l3712o9717j189j4964K4138M1654L5678l6495M2076n1172q93
$$ y = [1146856, 1083055, 1012477, 1080298, 966792, 955821, 913595, 854194, 869153, 853829, 835503, 801336, 728785, 654508, 597003, 567061, 551793, 525869, 510939, 538531, 490665, 412630, 428225, 396022, 521208, 481310, 332200, 334885, 363787, 321720, 299418, 266990, 350875, 307723, 229356, 307293, 340995, 337159, 260923, 230724, 175714, 283464, 282827, 193663, 261717, 152895, 49904, 126941, 133719, 179618, 169442, 273341, 223450, 172780, 164211, 86919, 111127, 101608, 62115, 109599, 82513, 129358, 65440, 121016, 73019, -11231, -14004, -168150, -100972, -61653, -8417, 95990, 81249, 38479, 28834, 24081, 17718, -46310, -68312, 14954, -17512, 37447, -83555, -40645, -74357, -144074, -145263, -160227, -136089, -94435, -58757, -95252, -53176, -104348, -105241]
1908a05241J52432l0300o2048N7191n4210J8315l7753J2171p322K474o8127J07279
1896a5139J8057K6533p0118q8905N4477L553j3952J02587J132J5490l9352o7734
1884g3371L2711q4348P9994m515o3439m7075J02870K54j13411K6370J6613j13838
1872b41185J01135l0829j5040N7924P4325p5745N5885m8260q3142N1530n7885
1861b11287m1522P2592Q3968n2008L7990M2994P1310n6340p762O242J151L668
1849d9004j7989p5819L9968j9333l7141K08562o9545q6394N1969j11613j7255
1838a83594J01587O4951j5502k4960o8100R062L8253O2178r806o4735K0847K5109
1826d4710K2192K5371M6408J3815q3777l0491M7162r995m495q0117l465L4302
$$ y = [-105241, 47191, 16891, -45157, 12034, -42176, -23861, -61614, -49443, -56765, -54291, -122418, -15139, 2918, 29451, -40667, -129572, -75095, -71542, -85494, 17093, 18225, 33715, -5637, -73371, -40660, -125008, -45014, -49529, -112968, -160043, -57173, -56919, -170330, -143960, -127347, -241185, -140050, -170879, -185919, -127995, -53670, -129415, -73530, -121790, -204932, -153402, -211287, -252809, -180217, -96249, -148257, -110267, -67273, 4037, -52303, -60065, -53823, -52672, -49004, -66993, -142812, -102844, -122177, -159318, 49244, -20301, -106695, -54726, -166339, -183594, -82007, -17056, -32558, -57518, -125618, -116556, -78303, -16125, -25931, -90666, -69819, -44710, -22518, 2853, 49261, 63076, -20701, -51192, -4030, -14025, -18520, -98637, -102102, -67800]
1814f7800q4971m9167Q4689O8118l2198k9510n1271J07933J5404l2294m2226J9411
1802i3882m6415K4034N7360l4930k8269K6757O2750j3252j5255J2436l2126j6141
1790i6933K3841k8927L637N9497N7405J21361j3449p8721k8955k8740J10992L9335
1778A40343o9785J7893P0438p9626j53773n5924P5591K4490j29407m837M0884
1767a23713p3620P5001O1095n0806l3632j02765R2342j37719Q3647J02967K6174
1756h1029p30J3647k9759j2672j02997l4061K6751L1578o872L3381O3921J3785
1744h5057j00248k4670N3404M9782j5416j02205J18838l3739M7240l4140L9166
1733h7045n7947J4511o1634n8018N9358J00803j9535N3026q2696p2918P6511M6503
$$ y = [-67800, -152771, -201938, -117249, -49131, -81329, -110839, -162110, -54177, -38773, -71067, -113293, -93882, -140297, -116263, -58903, -93833, -122102, -95345, -32595, -45847, -61102, -48666, -80792, -96933, -73092, -102019, -98382, -38885, 18520, 139881, 126432, 47711, 18756, -9984, 101008, 140343, 70558, 88451, 158889, 79263, -74510, -130434, -54843, -30353, -159760, -164597, -123713, -197333, -122332, -61237, -112043, -145675, -248440, -156098, -293817, -210170, -107203, -81029, -81759, -68112, -97871, -110543, -213540, -247601, -220850, -189272, -196144, -162763, -98842, -85057, -185305, -209975, -156571, -106789, -122205, -224410, -105572, -139311, -92071, -126211, -87045, -144992, -130481, -192115, -250133, -190775, -89972, -109507, -56481, -139177, -212095, -135584, -89081]
1721h9081j5227l0430O0257J1528j30322N8594J66239j5798m9498K9433o1051
1710f5356m8579m5700J30057k7273q1964K360J19904r9283L692J51179j17702
1699g8665J552J36626j22090j7030L3692o6546J8851o378R435q3059q569J25810
1687e6371K1474Q016j20235j0395J15258K6517O791q5909l3881k8624M0148P0035
1675d7176j0777k2356p2735M980M7841k8950N4223j3053l8522M811J3013o5956
1663a74657O0932L1296O8502j4354j5015J0183M1921j8472p5799q4588R2590J25657
1651D8196n8373l4299l5433P1179j21602k851N4140j6122K6995o7173O5229o2386
1639a32500N5615P7180N333q0456K0755K3895q7069J3297P2240P2229m1467j66
$$ y = [-89081, -104308, -134738, -74481, -62953, -193275, -134681, 31558, 15760, -33738, -4305, -65356, -113935, -159635, -29578, -56851, -138815, -136455, -16551, -115834, -112142, 39037, -78665, -77113, 59513, -62577, -79607, -45915, -112461, -93610, -99988, -90553, -173612, -182181, -56371, -34897, -26881, -147116, -157511, -42253, -15736, -8945, -94854, -128735, -157359, -117211, -47176, -57953, -80309, -153044, -148064, -100223, -129173, -74950, -88003, -126525, -121714, -108701, -174657, -113725, -82429, -13927, -28281, -43296, -33113, 8808, -9664, -85463, -170051, -77461, 48196, -10177, -44476, -79909, -8730, -130332, -133183, -79043, -95165, -68170, -135343, -70114, -132500, -76885, 295, 5628, -74828, -54073, -30178, -117247, -103950, -31710, 40519, -948, -1114]
1627a114o5360o1637Q3525J4152n1179N4146o8241K8606J30862k3620J3651k8836
1615B4955m6620p9230M0740L1981l917j3529j7150r3763j6375m3182j8412R0586
1603a43916J5926J947R491K9531Q9277o175j24521n6906P3481O8753M892n1527
1591h9747k04P3148J1853L7806j1441m0914N0883l0704j01982J5976J84898p0231
1579B9341n0696K001k4479N402L9385j27625R5509J41273k2306l8235j15074M2804
1567b2700N83J5351n5318J3520r6869l5225J42743l1019m6243l0712P0685J01501
1555B6297r199M1518j22043N7803n3787K14r376P4062m813q3841q3885R6419m4442
1542a15073j06393J0904N7189J19391P4910J3198o0415L2652J7626m0999L5564
$$ y = [-1114, -66474, -128111, -44586, -30434, -81613, -27467, -95708, -67102, 63760, 40140, 53791, 24955, -21665, -100895, -60155, -28174, -32091, -45620, -62770, -156533, -172908, -216090, -234502, -143916, -127990, -126043, -116552, -87021, 2256, -3919, -128440, -185346, -111865, -43112, -38220, -89747, -89951, -16803, -4950, 32856, 21415, -19499, 31384, 680, -101302, -85326, 99572, 29341, -21355, -19354, -43833, -38431, 954, -126671, -31162, 110111, 87805, 49570, -65504, -22700, -22117, -6766, -62084, -48564, -145433, -180658, -37915, -68934, -115177, -145889, -75204, 26297, 17098, 58616, -63427, -5624, -59411, -59197, -68573, 5489, 676, -83165, -167050, -70631, -115073, -221466, -210562, -153373, -33982, 40928, 54126, -6289, 26363, 43989, 2990, 38554]
1531C8554M8494J7958p0479K1533q838p1327N8335p5491n3175l1843L4128N1883
1519d0268P8319P7885j9391n8167o4526K6104m3765j13538Q9466R3240L2505l9577
1507A8287L8042j04192q2614o9391J35182N4319n2885l9450Q9131J47009l3337
1496A00101j00542M046l3312k02871J27319J40348j5874n9669j0795o8374l3059
1485a52682J29900N0734M3010k0096n7531k4365l6873J010M8355K2808j4197J7429
1473G502o1779R8258K9325j04853k6727M7626J00565n425j4367n3580K8815K6559
1461G1919j16172J03750M5403j26328K6611l1855n0489K3889Q2565J2560r2176
1450e0323R4114j9101k5990r0383k4387J42646N2790J6384q2125o9786M8459r68
$$ y = [38554, 87048, 105006, 34527, 56060, 47222, -24105, 34230, -41261, -94436, -126279, -92151, -40268, 38051, 115936, 96545, 38378, -26148, -44, -43809, -157347, -67881, 25359, 57864, 18287, 56329, -47863, -130477, -199868, -64686, -10367, -63252, -102702, -13571, 133438, 100101, -441, 3605, -29707, -232578, -105259, 35089, 19215, -40454, -51249, -119623, -152682, -22782, 27952, 70962, 50866, -6665, -31030, -67903, -66893, -18538, 4270, -9927, 7502, -54277, 43981, 73306, -31547, -58274, -10648, 89917, 84492, 70125, 16545, 45360, 71919, -44253, 59497, 104900, -21428, 5183, -26672, -77161, -53272, 29293, 41853, -50323, 43791, 24690, -1300, -91683, -116070, 26576, 79366, 95750, 13625, -56161, -7702, -8670]
1438h670j25779M1317J8271o4030M2084J18084r667k0194j2864J08280Q2039j2150
1426A56721j15495r0373M6252m1906r174q9616P0601M2516q4828k8998N9106J8350
1414f6844m4915L5597Q3129m2809k0629J28128k3909o3224l0299o5871J09329
1403b317P1274n3302p2519k1034j1852o350J6462Q6027L6723K5097j3497j00746
1391d6034N4318O5632K5312r341m6611M860k8661m9139O6271J1370J040p0507
1379b1490j0408J9731O2594o0910p073m0687J7778M5231n0823L0780k5367J09762
1367F9118P7756k6915l5854m4169q800o3176l3900k2707Q260L6174L9765k4309
1355b8757k9468J6193J92978R9239n6212k6342p7829k6782n8428o409Q0710M1979
$$ y = [-8670, -134449, -93132, -74861, -138891, -96807, 21277, 11610, -8584, -21448, 86832, 168871, 156721, 41226, -49147, -2895, -44801, -53975, -143591, -72990, -30474, -115302, -144300, -85194, -66844, -111759, -76162, 6967, -35842, -56471, 71657, 47748, -15476, -45775, -111646, -2317, 68957, 15655, -56864, -77898, -89750, -96100, -79638, 6389, 43112, 68209, 54712, -46034, 8284, 73916, 99228, 89887, 43276, 48136, 19475, -29664, 36607, 47977, 49017, -21490, -31898, -12167, 50427, -10483, -17556, -58243, -40465, 4766, -46057, -15277, -40644, 69118, 146874, 119959, 84105, 39936, 31136, -32040, -65940, -88647, -80387, -44213, -4448, -28757, -58225, -42032, 150946, 250185, 193973, 167631, 89802, 63020, 4592, -1817, 78893, 120872]
1343A20872P7100j63911j0824m913j251L7138j19851j9420P5940K5381j37675
1332a21414J00672J431J6491L0754P6983n0802q570p8174K6263m212j7108o682
1320c4368J8767K8888k6330L5598p8974J30470j6043k9988K6568m3327r6092j0113
1308i4944N4959o1413O1931O5794j0423o1855J4236l631l4495J3908K2990p2945
1296a05888n7161N4947M3470R9796L8377O3917r5640l9273L105o5863k9344L568
1284h5989N8014l6777N5112O7544J01848j12854r6039J6073N4816J8352K7751
1273F7851m4168q5955L7053J9338J05334P1793r1727m1562J03351P5433j37002
1262G9739k3733K6170j27310J07207N3237o1602O1836l1757n9343O1670o6944
$$ y = [120872, 197972, 34061, 23237, 18324, 17073, 54211, -65640, -85060, -9120, 16261, -121414, -20742, -19311, -2820, 27934, 104917, 54115, 45545, -32629, -6366, -10578, -27686, -34368, -15601, 13287, -13043, 22555, -56419, 74051, 58008, 28020, 54588, 11261, -84831, -94944, -39985, -101398, -39467, 26327, 15904, -45951, -31715, -35346, -69841, -55933, -32943, -105888, -163049, -108102, -64632, 35164, 73541, 137458, 41818, 2545, 5650, -60213, -89557, -85989, -27975, -64752, -9640, 57904, 159752, 46898, -49141, -33068, 21748, 40100, 67851, 23683, -62272, -25219, -5881, 99453, 171246, 79519, 37957, 141308, 216741, 79739, 56006, 82176, -45134, 62073, 115310, 53708, 115544, 83787, 24444, 86114, 19170]
1251A9170n0015J1762M2141J7425K4957m2557J1422M9328R676o3018r7795Q9965
1239B2461P1369o0582j52j2834O1258O822o1317L8884n1302k1505J3138J1397
1227A7637K5173p5889N1424n9412P5196r02m1376M7970j6146L6813N2161j2525
1215A00124J0739K6453K9701j04377j09453J8764O1827N0823p8925j17982J1266
1204a01040j4591J69753J7461j72783Q5619M768k7503J05381n946n2220R2844
1193A01743p5888m5927P5899l5926p0097L0225K026M047K81j0752K1202p0811
1181g3978N8419P6951p7233Q050J3724N6330n6952l6373L5733K6319n2667N8764
1169C7087m9938L1904m6503k5307P2093R281n9844J6977N9380l1348j9003N9841
$$ y = [19170, -30845, -19083, 23058, 40483, 65440, 22883, 34305, 83633, 93309, 30291, -67504, 22461, 93830, 33248, 33096, 20262, 81520, 88342, 27025, 65909, 14607, -6898, 6240, 17637, 42810, -33079, 18345, -41067, 34129, 33227, -8149, 39821, 23675, 60488, 112649, 100124, 110863, 137316, 167017, 62640, -46813, -28049, 33778, 84601, 5676, -112306, -101040, -115631, 54122, 71583, -101200, -15581, -10813, -38316, 67065, 61119, 8899, 101743, 25855, -20072, 55827, 19901, -50196, -19971, -17945, -13898, -13617, -24369, -3167, -73978, -15559, 61392, -15841, -7791, 5933, 62263, 5311, -31062, 4671, 30990, -21677, 37087, -12851, 19053, -27450, -52757, 19336, 28617, -31227, -14250, 45130, 13782, -5221, 54620]
1157E4620L7860o2820K2960N3406q2351k7917M0845q4413m9577J24632n5801O1289
1145C2733k222q2952N2264K8365l9762j9840o8598j1381P5145M5849J7401o8690
1133d1688J85999j7818r7678k5149q2422O0784L9909K693L6454o0700Q6757p1171
1121A5970L0248N2131n1062n9005k9586J18829k0414K7241R7264L0122k14940
1110c202K0752J56592m1767k03503l7340Q0438j8628J10268K0465n3474j17657
1099h7056J1986P6618K4058o5405J3231Q5058r4388n0410J18052k0419j4640N7229
1087E3914O6340l7180o2395N4241M1474L6421Q0644r6959r7221J2969O927m7688
1075A1487K6646R2254m3017l6865O1210q3587q3936Q3445P3678p6627J6430L0493
$$ y = [54620, 92480, 29660, 52620, 106026, 23675, -4242, 36603, -47810, -97387, 27245, -28556, 32733, 30511, -52441, -177, 28188, -11574, -31414, -100012, -111393, -36248, 9601, 27002, -41688, 144311, 126493, 28815, 3666, -78756, -17972, 21937, 24630, 61084, 384, 87141, 15970, 46218, 98349, 47287, -11718, -41304, 77525, 57111, 84352, 181616, 211738, -3202, 17550, 174142, 132375, -71128, -108468, -28030, -46658, 63610, 84075, 30601, -87056, -75070, 1548, 25606, -39799, -26568, 58490, -35898, -86308, 31744, 11325, -3315, 53914, 120254, 83074, 20679, 74920, 116394, 152815, 233459, 136500, 39279, 52248, 59175, 11487, 38133, 130387, 87370, 50505, 111715, 28128, -55808, 27637, 101315, 24688, 41118, 71611]
1063G1611L8324r728m4470m4523r181O7621k0719o6930n490O6651M7565m3061
1051D7670J7391j903m3741L5854j2381J8667L885J594k5547q5659l1134R8748
1039B3444K7953J20754m0156l5744L7193J4126p7456j01222j396O8086m8440M7816
1027C4958O4276q00j2864l8590j21623q478J30618m048o1535m079J25452j3104
1015I0183p5356k1910k2300l5398L7105K0868J01766j5792p1227n6425M9775l3711
1003c2422M9069N0767K1873j2799k5209Q2820m9443L0002n5465j05505O9635O1043
991H4366P7453p693j18934K8766o486k1458m23O738P0716o989k9298l7860j4531
978B4367l9587l0975L7990k3718l806r806j2631R0156K2287N8356M5783k8245
$$ y = [71611, 109935, 100207, 55737, 11214, 2033, 69654, 48935, -17995, -23485, 43166, 90731, 47670, 65061, 63158, 19417, 55271, 42890, 61557, 65442, 67036, 41489, -44170, -75304, 23444, 51397, 172151, 131995, 96251, 133444, 147570, 70114, -31108, -32504, 35582, -12858, 34958, 99234, 98434, 85570, 46980, -74643, -83121, 47497, 43449, -18086, -22165, 103287, 90183, 14827, -7083, -29383, -64781, -27676, -6808, 94958, 79166, 7939, -48486, 1289, -32422, 16647, 67414, 89287, 76488, 51279, 134099, 84656, 114658, 59193, -46312, 23323, 84366, 161819, 154126, 35192, 63958, 57472, 36014, 35591, 42329, 113045, 106056, 76758, 38898, 24367, -15220, -46195, -8205, -31923, -35729, -45535, -58166, 31990, 54277, 112633, 158416, 130171]
966A30171q0455K5797q340q1328L7244p3818l0294P3177k0186p377P7450K2011
954F4052j8877N329o0261Q0944M2521J829l012j9177L2915j35103K0239m1773
942c0374O5201j9519J7447j7572R4687l370j43116J25931Q1213q8226p5213M4030
930E1119p9684K7396M2697r8102K7903r760o3191k7574O388M7052J48670p5120
918b206j4828K1830J10415M0243p7370n540r218L0712j791J6637j6412m1309q2621
905c1458M5573Q6942k6881j5214r974l8877J7921K3616o9468J6483R3452m1052
893E1063N2520J4841p1857j5430n127o1732K7014m4767R760O8092M0192N7069
881A21638l6986l2841J3248q4732J1701O2295l6798R3628L2590p5768K5118j4915
$$ y = [130171, 49716, 75513, 67173, -14155, 23089, -50729, -81023, -7846, -28032, -35409, 42041, 64052, 45175, 50504, -9757, 71187, 113708, 115537, 112525, 93348, 126263, -8840, 11399, -30374, 34827, 15308, 32755, 15183, 109870, 106500, -36616, 89315, 170528, 82302, 7089, 51119, -28565, -1169, 41528, -56574, -28671, -38431, -101622, -129196, -122808, -75756, 72914, -2206, -17034, 4796, 115211, 155454, 78084, 72544, 63326, 94038, 92247, 108884, 92472, 51163, -31458, 14115, 101057, 74176, 58962, 48988, 10111, 28032, 51648, -17820, -1337, 92115, 51063, 103583, 118424, 46567, 31137, 26010, -35722, -8708, -53475, -43715, 24377, 64569, 121638, 84652, 51811, 65059, -19673, -7972, 54323, 17525, 111153, 143743, 67975, 93093, 78178]
869G8178J030j3463n8688Q304j105K0867k2106l1194O0575r7559k8339M1377M3394
856A271K2976o4433J19611Q5719r2968R8375j7339k5260n1803k9860j0939n8250
844b2900L6278J8621L2691k3192l1091N7459L356j0220J6274k2987L3459J2178
832I9926q94m8251p9335j4619q4865J15117R4355J14193r5152o6943M3359M2106
820A18997k5115r9933M8882j32505K1130Q6751O8346n8591l166J43393n2667p4857
808D0665N0813n0719m7185p1746J9399m6947Q7602Q4042o0346k0194J48444K2553
796A56381j69500N2251J55651q7324j4767K1956j72028k2379J21365m5425q3418
785h7237J01726m365R590K7896L7319l6246n8353n4284o179K966J32708M1060
$$ y = [78178, 79208, 65745, 7057, 15361, 14256, 35123, 13017, -18177, 42398, -55161, -83500, -42123, 1271, 24247, -40186, 79425, 165144, 72176, 170551, 153212, 127952, 76149, 46289, 35350, -22900, 13378, 31999, 64690, 41498, 10407, 67866, 71222, 61002, 77276, 54289, 87748, 99926, 99032, 50781, -28554, -43173, -128038, -12921, 81434, 195627, 100475, 33532, 76891, 118997, 93882, -6051, 42831, -89674, -68544, 18207, 86553, 27962, 24796, 168189, 115522, 40665, 91478, 40759, -6426, -78172, -58773, -105720, -18118, 65924, 5578, -14616, 133828, 156381, -13119, 39132, 194783, 107459, 92692, 114648, -57380, -79759, 41606, -3819, -87237, 14489, 10124, 19714, 47610, 84929, 48683, -9670, -63954, -70133, -67167, 65541, 106601]
773A06601r7927Q538p8313o256J09625N2296m8041P757o607k2171M6995Q941o0273
760B1165n9158R806p3840N8447N5411J1967M9682k6465k8103K3594l5917q6453
748g9864J06918L0920p1283k257J8077N4606K0013k5719J7311R710L5686K1166
736A35284j22191M888M8238M6420l6785l456o0900N349R3753k8823n0494P8418
724A09701L5049n1117j46395L4105M1932l0173J2926l4360O9642R2813q513r1590
712C4020P614R26J77968o1867m4151j26711o0313m4115J10525L8992Q2378j5334
700I9932k8889K8275n033p3069Q3546O1747j09015n0843j7325L1287m2061M8Q441
687a2959L8189k737j5483o0672l2853P1377J07304q4451j7268J22440M031k4103
$$ y = [106601, 8674, 17212, -61101, -67357, 42268, 94564, 46523, 54280, 47673, 25502, 72497, 81438, 21165, -37993, -28187, -102027, -43580, 11831, 23798, 73480, 47015, 18912, 42506, 6589, -79864, 27054, 57974, -13309, -15566, 2511, 57117, 77130, 51411, 68722, 78432, 114118, 135284, 13093, 17981, 66219, 112639, 75854, 72398, 11498, 16847, 110600, 81777, 31283, 109701, 144750, 93633, -52762, -18657, 23275, -6898, 6028, -28332, 41310, 134123, 125610, 34020, 41634, 42560, 220528, 158661, 114510, -12201, -72514, -116629, -6104, 32888, 115266, 99932, 71043, 99318, 94285, 21216, 104762, 166509, 57494, 6651, -10674, 20613, -21448, -21400, -12959, 25230, 22493, 7010, -53662, -86515, -15138, 92166, 7715, -9553, 112887, 116918, 92815]
675I2815k4098J877P194r304K7692K2965n5929J184m9433J3148O4165M1600J3320
662A47196n2289j1963p7433M2304m2874r7605K3234K1715J17381J16391M11j05372
650H1096n9440k1420P2629n7805p2217M2579p3220l933K9488R4294p1820n8735
638i8504J09698n242N5115n7356n8422J21823J1450M9830m7253o0216o302J10317
626A24938k6206j33688K0778p1694K1040K44252q9310k4532n6836r5143M7867
615c8534Q1635k3820J1636o1375J47051q9181p8887j766P4251j4130n3029L1132
603a5017k2771O477j12939N7530o9640P5269J35030K3411j20380j3503J02969
592D6436l3109N9946k5276j10255K5584J6783j3212O2819m9748N9728K4610k7756
$$ y = [92815, 68717, 70594, 77788, 68484, 96176, 119141, 63212, 64396, 14963, 28111, 92276, 133876, 147196, 94907, 82944, 5511, 47815, 4941, -92664, -69430, -47715, 69666, 186057, 186468, 81096, 21656, 236, 72865, 15060, -57157, -14578, -87798, -91731, -62243, 32051, -39769, -98504, 11194, 5952, 61067, 3711, -54711, 67112, 78562, 128392, 81139, 20923, 14621, 124938, 98732, -34956, -14178, -85872, -64832, 179420, 90110, 65578, 8742, -86401, -38534, 43101, 19281, 30917, -30458, 116593, 27412, -51475, -53241, 21010, 6880, -46149, -15017, -37788, -31311, -144250, -86720, -156360, -81091, 53939, 77350, -43030, -56533, 46436, 13327, 73273, 47997, -62258, -36674, -19891, -33103, 29716, -20032, 39696, 64306, 36550]
580C6550n5055L1777J9621M1302L8291o8574j05270R0843L0250j37998J01379
569B3116J9129J6981K7135J6944K2999l6849j4446o6344k8951K9851j1318L4252
557C2499K5543r1251o6375J63396P5366m0838q839j8638j22767N4954N2469j3623
545D1896p3932m9627L0174L79N1176Q7636Q73J7565m3311J11276p9258k6607q4000
532a5760m1005Q5852Q6808l3370n4605m167Q6491o9681j06102J23744j7799K4755
520F5161m7819q0357p9145m1560J04750J7195j9163J12283M9458l3266k9963J2955
508C0529o0628J7587Q9293j50700L2132N3139j0925Q3979o5153l560N8141n9557
496A4277J3813p8527n1293J06901J07843n0402m9613P019K225j45036K6611Q7005
$$ y = [36550, -18505, 13272, 32893, 74195, 112486, 43912, -61358, 29485, 59735, -78263, 23116, 42245, 59226, 86361, 103305, 126304, 89455, 75009, 8665, -20286, 9565, -1753, 32499, 58042, -33209, -99584, 63812, 139178, 98340, 89501, 70863, -51904, 3050, 55519, 41896, -32036, -81663, -51489, -51110, 66, 87702, 88575, 106140, 62829, 174105, 94847, 68240, -15760, -56765, 29087, 115895, 82525, 27920, 23753, 110244, 40563, -65539, 58205, 40406, 65161, 17342, -63015, -142160, -183720, -78970, -61775, -80938, 31345, 80803, 47537, 17574, 30529, -30099, -12512, 76781, -73919, -41787, 11352, 427, 84406, 19253, 15693, 73834, 14277, 28090, -50437, -101730, 5171, 113014, 62612, 12999, 20018, 22243, -122793, -96182, -9177]
484i177j5250k4186m2494K9472L1111J8236k6145j9078n17K9152O1352L0085n2741
471I820p9849k4726P0756R7038l2092K6835j01567o2169O3260K6559j1257R0869
459G3477P4632j69079O6181P5149p0266m4701l5152n5349J60007O218R043l3192
447E6968M053k07824K4534Q3334q6602m2686Q4582L5902N0083Q947l5077J51810
435A28024j3081o4008q0516m6197r5901R8851N4136l2778j8410M4699N1977m1028
423a4232K3015M3766J6463k7360r9082L3111n1789K3387K1516m1535J72378j2786
411H6852l6249n7248j7691q8411k543J08333L5123m5885p6646J70650J3248k13241
399a23708O1582M1004J15504k6720m4494p8275n1054J06187M3891r9248N1665
$$ y = [-9177, -24427, -48613, -91107, -61635, -30524, -12288, -38433, -57511, -58028, -28876, 32476, 62561, 9820, -70029, -94755, -23999, 73039, 40947, 67782, -33785, -95954, -32694, -6135, -17392, 73477, 148109, -20970, 45211, 120360, 50094, 5393, -29759, -85108, 74899, 81117, 90160, 56968, 61021, -146803, -122269, -38935, -125537, -168223, -83641, -47739, 2344, 11291, -23786, 128024, 114943, 50935, -29581, -75778, -171679, -72828, -18692, -51470, -69880, -25181, 26796, -14232, 8783, 52549, 69012, 41652, -57430, -24319, -76108, -52721, -31205, -72740, 99638, 86852, 50603, -6645, -24336, -112747, -115290, -6957, 28166, -17719, -94365, 76285, 89533, -123708, -62126, -21122, 94382, 67662, 23168, -55107, -106161, 26, 43917, -55331, -3666]
388c666j0545K7970O366J315j9422j36348N8324J14462O9101j36775J3873P5810
376F0465L6429k1947k1640m899j52322k5812J24963J0265Q0671k1297o5251L7172
364C6797n9720L2485l0006M6962J8570j18921K9233O3845q9279K7534n5418P7343
352b0575Q4325J1097p5201p5787N1982j02417O7909O058k7579R4525Q0400j08001
340a3264o7792O7782o7673j2381J04801K9253k5236K1510j2881p5164J3395n5168
328i2818N6040l0224l877P1776k9862j7376O3601n5392l5757o7084P9645L886
316e7442q530P7901l8402p0986j7208P5905n9521j2596o6243J20961K0905n4829
304i0085P3806n5030J05577k0977J7389P6190j49004m7095J09920j06901Q1506
$$ y = [-3666, -14211, 13759, 20125, 21440, 2018, -134330, -76006, 38456, 107557, -29218, -15345, 60465, 96894, 74947, 53307, 48408, -103914, -129726, -4763, 5502, 86173, 64876, -375, 36797, -22923, 9562, -20444, 26518, 45088, -73833, -44600, 19245, -70034, -42500, -97918, -20575, 63750, 74847, -354, -76141, -24159, -126576, -58667, -52609, -80188, 14337, 94737, -13264, -81056, -13274, -80947, -93328, 11473, 40726, 15490, 37000, 24119, -51045, -37650, -92818, -36778, -67002, -70879, 897, -28965, -46341, 17260, -38132, -73889, -140973, -61328, -57442, -65972, 11929, -26473, -97459, -114667, -38762, -98283, -110879, -177122, -56161, -35256, -90085, -16279, -71309, 34268, 13291, 30680, 106870, -42134, -89229, 20691, -86210, -4704]
293d704l0877J3481N012N3965k3896l675k4798O8873j2999q4184M7724J2183o8332
280e2227J38729J2396r0503k4351M3422q1617l7169J04151n3201J04302j18744
269e4812q6393L5467J09101j4497J0506K5234J2668Q430m4855n8141o9000r134
257a35426N6980J05304j6391m2196l7874K9815N1508N2750n3519O1221l9834j55836
$$ y = [-4704, -35581, -22100, -17088, 36877, 12981, 9306, -15492, 53381, 40382, -43802, 3922, 16105, -52227, 86502, 98898, 8395, -15956, 27466, -54151, -91320, 12831, -40370, 63932, -54812, -141205, -105738, 3363, -11134, -628, 24606, 37274, 45704, 849, -57292, -126292, -135426, -78446, 26858, 10467, -31729, -69603, -39788, 11720, 64470, 10951, 72172, 32338, -123498]
$$ [...]
##END NTUPLES=NMR SPECTRUM
##END=
