##TITLE=1H_CA-9081-4
 CDCl3
 8 sc, 
 27.10.2022
##JCAMPDX= 6.0         $$ Bruker NMR JCAMP-DX V2.0
##DATA TYPE= NMR SPECTRUM
##DATA CLASS= NTUPLES
##ORIGIN= UXNMR, Bruker Analytische Messtechnik GmbH
##OWNER= root
$$ XWIN-NMR		Version 3.5
$$ Thu Oct 27 14:40:28 2022 Russian Standard Time (UT+4h)  she@DPX200
##.OBSERVE FREQUENCY= 200.1313499994
##.OBSERVE NUCLEUS= ^1H
##.ACQUISITION MODE= SIMULTANEOUS
##.ACQUISITION SCHEME= undefined
##.AVERAGES= 8
##.DIGITISER RES= 18
##SPECTROMETER/DATA SYSTEM= spect
##.PULSE SEQUENCE= zg30
##.SOLVENT NAME= CDCl3
##.SHIFT REFERENCE= (INTERNAL, CDCl3, 0, 15.7766)
##AUDIT TRAIL= $$ (NUMBER, WHEN, WHO, WHERE, WHAT)
$$ ##TITLE= Audit trail, XWIN-NMR		Version 3.5
$$ ##JCAMPDX= 5.01
$$ ##ORIGIN= Bruker BioSpin GmbH
$$ ##OWNER= she
$$ F:/spectra/data/she/nmr/H-F/1/pdata/1/auditp.txt
$$ ##AUDIT TRAIL=  $$ (NUMBER, WHEN, WHO, WHERE, WHAT)
(   1,<2022-10-27 14:39:21.82 +0400>,<she>,<DPX200>,
      <created by zg, POWCHK disabled, PULCHK disabled
       configuration hash MD5:
       00 E9 B6 7A A2 85 ED C7 34 08 36 98 17 FE 4E 26
       data hash MD5: 16K
       69 76 4A 44 E7 0D F3 D0 77 E5 E3 70 CA F3 C3 1A>)
(   2,<2022-10-27 14:39:24.42 +0400>,<she>,<DPX200>,
      <Start of raw data processing
       efp BC_mod = 2 LB = 0.24 FT_mod = 6 PKNL = 1 PHC0 = -18392.79 PHC1 = 8.200696 SI = 16K 
       data hash MD5: 16K
       02 78 5A E4 ED 42 BC 89 AC 9B 6F 30 86 96 A0 21>)
(   3,<2022-10-27 14:39:39.92 +0400>,<she>,<DPX200>,
      <pk PHC0 = 2.037705 PHC1 = 0 
       data hash MD5: 16K
       45 DD 73 32 D4 0B 60 11 3D 77 B3 5B 9A 63 1E AD>)
(   4,<2022-10-27 14:39:43.34 +0400>,<she>,<DPX200>,
      <abs ABSG = 5 
       data hash MD5: 16K
       A8 96 52 FA B4 08 CF DC EE 5E F9 08 60 1F 4E 24>)
$$ ##END=
$$ 
$$ hash MD5
$$ DC 2B 37 9B 2B A4 1F 5F EB 01 48 42 C8 71 E8 58
##$RELAX= 
##$RELAX= 
##$RELAX= 
##$RELAX= 
##$RELAX= 
##$RELAX= 
$$ Bruker specific parameters
$$ --------------------------
##$DU= <F:/spectra>
##$EXPNO= 1
##$NAME= <H-F>
##$PROCNO= 1
##$TYPE= <nmr>
##$USER= <she>
##$AMP= (0..31)
100 100 100 100 100 100 100 100 100 100 100 100 100 100 100 100 100 100 
100 100 100 100 100 100 100 100 100 100 100 100 100 100 
##$AQSEQ= 0
##$AQ_mod= 1
##$AUNM= <au_zg>
##$AUTOPOS= <>
##$BF1= 200.13
##$BF2= 200.13
##$BF3= 200.13
##$BF4= 200.13
##$BF5= 200.13
##$BF6= 200.13
##$BF7= 200.13
##$BF8= 200.13
##$BYTORDA= 1
##$CFDGTYP= 0
##$CFRGTYP= 5
##$CHEMSTR= <none>
##$CNST= (0..31)
1 1 145 1 1 1 1 1 1 1 1 1 1 1 1 1 1 1 1 1 1 1 1 1 1 1 1 1 1 1 1 1 
##$CPDPRG= <>
##$CPDPRG1= <>
##$CPDPRG2= <>
##$CPDPRG3= <>
##$CPDPRG4= <mlev>
##$CPDPRG5= <mlev>
##$CPDPRG6= <mlev>
##$CPDPRG7= <mlev>
##$CPDPRG8= <mlev>
##$CPDPRGB= <>
##$CPDPRGT= <>
##$D= (0..31)
0 1.2 0 0 0 0 0 0 0 0.06 0 0.03 0 0 0 0 0.0002 0 0 0 0 0 0 0 0 0 0 0 0 
0 0 0 
##$DATE= 1666867161
##$DBL= (0..7)
120 120 120 120 120 120 120 120 
##$DBP= (0..7)
150 150 150 150 150 150 150 150 
##$DBP07= 0
##$DBPNAM0= <>
##$DBPNAM1= <>
##$DBPNAM2= <>
##$DBPNAM3= <>
##$DBPNAM4= <>
$$ [...]
##$SUBNAM3= <"">
##$SUBNAM4= <"">
##$SUBNAM5= <"">
##$SUBNAM6= <"">
##$SUBNAM7= <"">
##$SUBNAM8= <"">
##$SUBNAM9= <"">
##$SW= 18.0517283424941
##$SWIBOX= (0..15)
0 0 2 0 0 0 0 0 0 0 0 0 0 0 0 0 
##$SW_h= 3612.71676300578
##$TD= 16384
##$TD0= 1
##$TE= 0
##$TE2= 300
##$TE3= 300
##$TEG= 300
##$TL= (0..7)
0 120 120 120 120 120 120 120 
##$TP= (0..7)
150 150 150 150 150 150 150 150 
##$TP07= 0
##$TPNAME0= <>
##$TPNAME1= <>
##$TPNAME2= <>
##$TPNAME3= <>
##$TPNAME4= <>
##$TPNAME5= <>
##$TPNAME6= <>
##$TPNAME7= <>
##$TPOAL= (0..7)
0.5 0.5 0.5 0.5 0.5 0.5 0.5 0.5 
##$TPOFFS= (0..7)
0 0 0 0 0 0 0 0 
##$TUNHIN= 0
##$TUNHOUT= 0
##$TUNXOUT= 0
##$USERA1= <user>
##$USERA2= <user>
##$USERA3= <user>
##$USERA4= <user>
##$USERA5= <user>
##$V9= 5
##$VALIST= <valist>
##$VCLIST= <CCCCCCCCCCCCCCC>
##$VD= 0
##$VDLIST= <DDDDDDDDDDDDDDD>
##$VPLIST= <PPPPPPPPPPPPPPP>
##$VTLIST= <TTTTTTTTTTTTTTT>
##$WBST= 1024
##$WBSW= 4
##$XGAIN= (0..3)
0 0 0 0 
##$XL= 0
##$YL= 0
##$YMAX_a= 615337
##$YMIN_a= -942498
##$ZGOPTNS= <>
##$ZL1= 120
##$ZL2= 120
##$ZL3= 120
##$ZL4= 120
##$ABSF1= 15.74028
##$ABSF2= -2.311569
##$ABSG= 5
##$ABSL= 3
##$ALPHA= 0
##$AQORDER= 0
##$ASSFAC= 0
##$ASSFACI= 0
##$ASSFACX= 0
##$ASSWID= 0
##$AUNMP= <proc_1d>
##$AZFE= 0.1
##$AZFW= 0.1
##$BCFW= 0
##$BC_mod= 2
##$BYTORDP= 0
##$COROFFS= 0
##$CY= -3
##$DATMOD= 1
##$DC= 0
##$DFILT= <>
##$DTYPP= 0
##$F1P= 0
##$F2P= 0
##$FCOR= 1
##$FTSIZE= 16384
##$FT_mod= 6
##$GAMMA= 0
##$GB= 0
##$INTBC= 1
##$INTSCL= 3.70164e-10
##$ISEN= 128
##$LB= 0.24
##$LEV0= 0
##$LPBIN= 0
##$MAXI= 10000
##$MC2= 0
##$MEAN= 0
##$ME_mod= 0
##$MI= 1.114404
##$NCOEF= 0
##$NC_proc= -6
##$NLEV= 6
##$NOISF1= 3.799351
##$NOISF2= 2.8
##$NSP= 0
##$NTH_PI= 0
##$NZP= 0
##$OFFSET= 15.77664
##$PC= 1
##$PHC0= -18390.75
##$PHC1= 8.200696
##$PH_mod= 1
##$PKNL= yes
##$PPARMOD= 0
##$PSCAL= 0
##$PSIGN= 0
##$REVERSE= no
##$SF= 200.129998979692
##$SI= 16384
##$SIGF1= 3
##$SIGF2= 2
##$SINO= 5.538805
##$SIOLD= 16384
##$SREGLST= <1H.CDCl3>
##$SSB= 0
##$STSI= 16384
##$STSR= 0
##$SW_p= 3612.71676300578
##$SYMM= 0
##$S_DEV= 0
##$TDeff= 16384
##$TDoff= 0
##$TI= <>
##$TILT= no
##$TM1= 0
##$TM2= 0
##$TOPLEV= 0
##$USERP1= <user>
##$USERP2= <user>
##$USERP3= <user>
##$USERP4= <user>
##$USERP5= <user>
##$WDW= 1
##$XDIM= 16384
##$YMAX_p= 427327687
##$YMIN_p= -322777
$$ End of Bruker specific parameters
$$ ---------------------------------
##NTUPLES= NMR SPECTRUM
##VAR_NAME=  FREQUENCY,     SPECTRUM/REAL,   SPECTRUM/IMAG
##SYMBOL=    X,             R,               I
##VAR_TYPE=  INDEPENDENT,   DEPENDENT,       DEPENDENT
##VAR_FORM=  AFFN,          ASDF,            ASDF
##VAR_DIM=   16384,         16384,           16384
##UNITS=     HZ,            ARBITRARY UNITS, ARBITRARY UNITS
##FACTOR=    0.220516191357247, 1,           1
##FIRST=     3157.37893476585, 0,            0
##LAST=      -455.337828239928, 0,           0
##MIN=       -455.337828239928, -322777,     0
##MAX=       3157.37893476585, 427327687,    0
$$ Real data points
##PAGE= N=1
##DATA TABLE= (X++(R..R)), XYDATA
$$ [...]
6436B3480729j603581j252008r71560q99273m11001j66059p3443K41725L64314
6427A8709843P04655Q53449R93537J314613J481460J697051K056327K528451K733435
6418C3072821K777744K609361K017497N78589q12202k286890l266260l280529
6410C1410131k931562k648088k168463j642567j383314r68955p08531n14739k16107
6401A8227805j26330J49110M34279M77382P55916Q45063R16007J302784J487626
6392B4469642J571833J544630J091207M34487n39940j512546k227850k536523
6384B2294940k394791k128036j787964j440934j231394r73691p83303o12513l82622
6375A0559692l51580l48869k22538j60462j50219n1224J68810M6675J83640K45643
$$ y = [23480729, 21877148, 20625140, 19653580, 18754307, 18343306, 18177247, 18103804, 18345529, 18709843, 19414498, 20267947, 21261484, 22576097, 24057557, 25754608, 27810935, 30339386, 33072821, 35850565, 38459926, 40477423, 41056012, 40243810, 37956920, 34690660, 31410131, 28478569, 25830481, 23662018, 22019451, 20636137, 19667182, 18958651, 18443912, 18227805, 18101475, 18250585, 18684864, 19162246, 19918162, 20763225, 21679232, 22982016, 24469642, 26041475, 27586105, 28677312, 29111799, 28571859, 27059313, 24831463, 22294940, 19900149, 17772113, 15984149, 14543215, 13311821, 12338130, 11554827, 10942314, 10559692, 10208112, 9859243, 9636705, 9476243, 9326024, 9274800, 9443610, 9490285, 9673925, 9919568]
6365I919568J89832J33649J4789k12882n48968q02887p46056n77481o07018n84896
6355F177650o55413l84692k57188k66361l10200j20983k6550k04410j83631j44400
6345C623822j53719j18418k09320j44642j74858p2833p0263j6262o4878p6622
6335B522007j15143q6642p3380n8221m1094o4822p5087o5560j8055j0866r434
6324A903703p8541L1788j04606o601l9529m4677j14485L8664m7006n3930L2837
6313A517617r3817l8317P914o392n1494j6022r9002m5237P4716J9249m1001l0022
6301A198192M5290q4612L709l7379m7384O1985l3448n9547j8863m1404j3506j6069
6289I56964j4380j38160K0618L2220m1965J58742p7302j33399J12915k8439j07092
$$ y = [9919568, 10109400, 10243049, 10257838, 10044956, 9495988, 8693101, 7947045, 7369564, 6762546, 6177650, 5522237, 5137545, 4880357, 4613996, 4303796, 4182813, 4156263, 3951853, 3768222, 3623822, 3470103, 3351685, 3142365, 2997723, 2822865, 2750032, 2679769, 2663507, 2598629, 2522007, 2406864, 2320222, 2246842, 2188621, 2147527, 2082705, 2007618, 1942058, 1924003, 1913137, 1903703, 1825162, 1856950, 1752344, 1745743, 1706214, 1661537, 1547052, 1585716, 1538710, 1484780, 1517617, 1423800, 1385483, 1393397, 1387005, 1335511, 1319489, 1220487, 1175250, 1249966, 1269215, 1228214, 1198192, 1243482, 1158870, 1162579, 1125200, 1077816, 1139801, 1106353, 1046806, 1027943, 986539, 973033, 956964, 942584, 804424, 825042, 857262, 815297, 974039, 896737, 763338, 876253, 847814, 740722]
6278G40722L4692k9051j18723M1916K628r6763M3693Q2445M1163N9110M2412p2504
6266G71740m64o3561J66244O9647q1803k9112J9478r5331l4031j48122l8076P0468
6254F07077O4511k1983Q175L3400m567K4105o3461o0547l3634M4750M2606O2195
6242G02627j12819o6795p6666O1741L2362J25m756k5613K3124O2652M9051j29592
6230E15441o5046J73131J03612p1371j07042K3242J02509p5460q957l984r1006
6219D95069M081P3045O1597k7960k1954o5302R175M3537M3303M8587l8350L2180
6207F57008O4510j23301j2121q713J681P9185j3740L7857N273J7326p1794j2931
6195F20240N0801N1186N2721J13756J50721L2214r1900l5049J14978L8234L8182
$$ y = [740722, 775414, 746363, 627640, 669556, 672184, 575421, 619114, 701559, 742722, 801832, 844244, 771740, 771276, 707715, 873959, 943606, 861803, 832691, 852169, 756838, 722807, 574685, 536609, 607077, 671588, 649605, 657780, 691180, 686613, 710718, 647257, 586710, 553076, 597826, 640432, 702627, 589808, 523013, 446347, 508088, 540450, 540575, 535819, 510206, 533330, 595982, 645033, 515441, 450395, 623526, 727138, 655767, 548725, 571967, 674476, 599016, 590059, 586075, 495069, 499150, 572195, 633792, 605832, 583878, 518576, 527751, 571288, 614591, 663178, 624828, 657008, 721518, 598217, 586096, 577383, 579064, 658249, 644509, 682366, 687639, 704965, 633171, 620240, 671041, 722227, 774948, 888704, 1039425, 1071639, 979739, 944690, 1059668, 1097902, 1136084]
6184A136084L4292N0267K05597P3172N6174N1605K4173J33989L7695L1036o2048
6173A772036l7496r666J452l4464L794j3480o1331p0515R3672O6126m3814o681
6161A659633J0303q3891Q6510L0542Q9898K15188R1918J67197n759K56977K00997
6150B719513J48361J53759L95166L82898J94365L54268K96062J89400O5778k0244
6140D879326j45126k30216k25755l09002k95758j86288j75383j13561o5031n4907
6130C078299j44604r910l1104n6807L5203Q3285L9491R6368M4609J74077K31402
6119C540309J51581K80006K65975K83750M65522L85759K90503N47256M32622K51111
6109F894394L02504J25925j42596l26592o10546n98938n08648m20150m47147l79173
$$ y = [1136084, 1170376, 1220643, 1426240, 1499412, 1555586, 1607191, 1631364, 1765353, 1803048, 1834084, 1772036, 1734540, 1724874, 1726326, 1691862, 1695656, 1682176, 1620845, 1550330, 1644002, 1710128, 1666314, 1659633, 1669936, 1586045, 1672555, 1703097, 1792995, 2008183, 2100101, 2267298, 2261539, 2518516, 2719513, 2867874, 3021633, 3416799, 3799697, 3994062, 4348330, 4644392, 4833792, 4899570, 4879326, 4734200, 4503984, 4278229, 3969227, 3673469, 3487181, 3311798, 3198237, 3133206, 3078299, 2933695, 2923785, 2892681, 2835874, 2871077, 2954362, 2993853, 3090221, 3134830, 3308907, 3540309, 3691890, 3971896, 4237871, 4521621, 4987143, 5372902, 5663405, 6210661, 6643283, 6894394, 7196898, 7322823, 7180227, 6853635, 6243089, 5644151, 5135503, 4715353, 4268206, 3889033]
6099C889033j52329j76589k45603p2324j45842r2784j8133q6521N1855j929L4533
6088B983367P9679k9501m0424J36658K87420K30083K48828K16030K70757L18992
6078D701889K92344J67206O5204j7357n4939k65322k74406l29981l88835l62054
6068C533749k56535l50629j45266j49153j76088p9020j63019j47086K177J3288
6058B082418J3269L902j18009k0685q575O4505j14686J0921R8953n8540L5327
6047A988800P3477M3983R0559L0985k7154K1497K3335p6381j2557r341k23490
6036A923713k25889p1755k1673j20406m8886j03524l0663N993j8275q1990m2752
6025A163893J08139n8446l511m9459o5743q810k8262m8168J2667k4434M9762l3886
$$ y = [3889033, 3736704, 3560115, 3314512, 3242188, 3096346, 3003562, 2985429, 2898908, 2950763, 2948834, 2983367, 3063046, 3033545, 2993121, 3129779, 3417199, 3647282, 3896110, 4112140, 4382897, 4701889, 4994233, 5161439, 5226643, 5209286, 5154347, 4889025, 4614619, 4284638, 3895803, 3533749, 3277214, 2926585, 2781319, 2632166, 2456078, 2377058, 2214039, 2066953, 2069130, 2082418, 2095687, 2099589, 1981580, 1960895, 1952320, 2016825, 1902139, 1913060, 2012013, 1953473, 1988800, 2062277, 2106260, 2196819, 2227804, 2200650, 2222147, 2245482, 2169101, 2156544, 2147203, 1923713, 1697824, 1626069, 1604396, 1483990, 1435104, 1331580, 1300917, 1306910, 1288635, 1206645, 1163893, 1272032, 1213586, 1210075, 1160616, 1094873, 1086063, 1057801, 1009633, 1022300, 997866, 1047628, 1013742]
6013A013742p352O8652L5965q127j37292j11599O9269N9428j5319O4193j7861
6002A013699r7264Q6571n2437r040M025k4094J11951r9580j078R798j14019Q6788
5990I15320M801o8804p36J5482n0228m8179j13796J27921K4317j16660j1573P2618
5978G50483n2107J2525M7923J5162k7820j0194L7092o1407m2277K7182K337l0417
5966F68482j23140J35586K1263O961p3759j0460r821L3694N0391J5853q3178M3097
5954F74969N7974J8007N8850q0381P1558j53445l7460N9914R7364o1975M7805
5943G53180j2591o4736K2004N1927j135J15366k5561p2658k4430j9952K3134M1014
5931G85562L457R4797k7583q1767k5936m4373J01929Q0589J7879N3135j17697
$$ y = [1013742, 1006390, 1075042, 1111007, 1102880, 965588, 853989, 923258, 982686, 967367, 1031560, 1013699, 916435, 1003006, 950569, 941529, 945554, 921460, 1033411, 933831, 932753, 942551, 828532, 915320, 920121, 851317, 850581, 866063, 815835, 767656, 653860, 781781, 806098, 689438, 677865, 750483, 698376, 710901, 758824, 773986, 746166, 735972, 773064, 711657, 669380, 696562, 698899, 668482, 545342, 680928, 702191, 709152, 635393, 624933, 615112, 648806, 699197, 715050, 631872, 674969, 732943, 750950, 809800, 729419, 800977, 647532, 610072, 669986, 767350, 705375, 753180, 740589, 675853, 697857, 749784, 748649, 864015, 838454, 765796, 741366, 721414, 744548, 785562, 789019, 883816, 856233, 774466, 748530, 704157, 806086, 886675, 904554, 957689, 839992]
5920H39992m759M2170N3508J7107r949J6264Q3188j4087M0r1593j2515n0190N1185
5907I20361J10005K8126N1572q293p7103o2036m011j7105O1369J42777p9871q2114
5895I83677O3213j19787M3320J00915j844n161k3521o4385N3211j2342K7995L6925
5883A082216q5472M1609M4347k6454L4215k1412m822L894m3850Q6199m6779m217
5871A059474k7300J0243Q751k2802n3144O3085n9320O0197M6237o0627J0760n0701
5859I84853k549M3480L5645k1995L4568m4469q985n6855r123m1670J00758J132
5847A014790n6605n555K8463j06575N0746R2449L3933j33789j6825L5062N3724
5836I89818Q9400j332n0352q1859r3335l5851N3246Q3502j2828m1412K6453R621
$$ y = [839992, 835233, 877403, 930911, 948018, 938069, 954333, 1037521, 1023434, 1023474, 931881, 919366, 869176, 920361, 1030366, 1058492, 1110064, 1101771, 1024668, 962632, 958621, 941516, 1002885, 1145662, 1065791, 983677, 1046890, 927103, 970423, 1071338, 1069494, 1064333, 1040812, 976427, 1029638, 1017296, 1045291, 1082216, 996744, 1038353, 1082700, 1056246, 1090461, 1069049, 1064227, 1068121, 1024271, 1110470, 1063691, 1059474, 1032174, 1042417, 1051168, 1028366, 975222, 1038307, 978987, 1039184, 1085421, 1024794, 1035554, 984853, 982304, 1025784, 1061429, 1039434, 1074002, 1029533, 1020548, 963693, 954570, 912900, 1013658, 1014790, 958185, 952630, 981093, 874518, 925264, 1017713, 1051646, 917857, 901032, 936094, 989818, 1079218, 1077886, 1027534, 945675, 852340, 816489, 869735, 953237, 940409, 898997, 925450, 935071]
5824I35071L4898k5994K8489j9449k8005L2971K7817k9395k8364M626L0739q6162
5812H77242o2032J16755J77080J1999N75n6930r4533J15720N6003p2647j0261
5801A058971K0346j8016M930p9483O786l3244j4406M9374J06540M7350K5949o9309
5789A105788M2624p209N798K8478m2779J48418Q07m1532N988Q6425K5162r18k1251
5776A335799K1492o6617n0146K7372N0919K3491J8330k6884l9637J9858n8653
5765A255324Q2721n1603l5477J10426P9926J2975m6942N7841k5498k7651P2029
5754A484071N2689N2962k1314J045n5929m7379k3511l9196R2833M09K8583J33646
5742A658909l0078K4899o421N6663k219k5138k2653J8711j4613l5595j0724j1845
$$ y = [935071, 969969, 943975, 972464, 953015, 925010, 957981, 985798, 956403, 928039, 932665, 963404, 877242, 815210, 931965, 1109045, 1121044, 1121619, 1064689, 970156, 1085876, 1141879, 1069232, 1058971, 1079317, 1061301, 1066231, 986748, 993534, 960290, 945884, 995258, 1101798, 1149148, 1175097, 1105788, 1148412, 1141203, 1147001, 1175479, 1132700, 1281118, 1281925, 1240393, 1246381, 1332806, 1357968, 1357050, 1335799, 1357291, 1290674, 1240528, 1267900, 1318819, 1342310, 1360640, 1333756, 1294119, 1313977, 1255324, 1338045, 1286442, 1250965, 1361391, 1441317, 1454292, 1407350, 1465191, 1439693, 1412042, 1484071, 1536760, 1589722, 1568408, 1569453, 1513524, 1466145, 1442634, 1403438, 1496271, 1496680, 1525263, 1658909, 1628831, 1653730, 1647309, 1703972, 1701753, 1676615, 1653962, 1672673, 1658060, 1622465, 1611741, 1599896]
5730A599896J47892j4012k1060R7401J04478r7548N4905j5475M2873K5921q1137
5719A844134J03176Q1497p0295J1491O6396n6753k3720M9682J10380O352N763
5708B128103j3499N9493j14615m535J66N8475j1883p343J22983o2327P8184P6799
5696B310001O5091l1127p1076M6989N0238N1692O43r065L473Q721J00707R7187
5684B623474l5712k6745P5310k8852M7686L7695J24822J9561P963j9556p8821
5673B746825K0864K39684Q8416O667q318K31548O9138l4458Q1187k8764Q3828
5662C496617R2072Q2552R4895J00944R2300j571M9990Q8762J34777K0905P8514
5651D330757L369J23820J12320J24920J62658R3492M4714O4603J44024J05645
$$ y = [1599896, 1747788, 1733776, 1712716, 1810117, 1914595, 1817047, 1871952, 1856477, 1899350, 1925271, 1844134, 1947310, 2028807, 1958512, 1970003, 2036399, 1979646, 1955926, 2005608, 2115988, 2122340, 2128103, 2114604, 2174097, 2059482, 2054947, 2055113, 2113588, 2101705, 2094362, 2217345, 2155018, 2233202, 2310001, 2375092, 2343965, 2272889, 2319878, 2370116, 2421808, 2422451, 2413386, 2416859, 2425580, 2526287, 2623474, 2587762, 2561017, 2636327, 2607475, 2655161, 2692856, 2817678, 2837239, 2845202, 2825646, 2746825, 2767689, 3007373, 3095789, 3102456, 3094138, 3325686, 3394824, 3360366, 3441553, 3412789, 3496617, 3588689, 3671241, 3766136, 3867080, 3959380, 3957809, 4007799, 4096561, 4231338, 4252243, 4330757, 4334126, 4457946, 4570266, 4695186, 4857844, 4951336, 4996050, 5060653, 5204677, 5310322]
5641E310322K22260J32165J88800J24702J20233P4365K12080K13331K27572J69736
5631F995566J75895K31695K13503J91997K93240K84917J74756L47864L37555K83885
5621I530873K91113M30922M45721M23689M24515M84600O49643N53547O68387Q83644
5611A4786654Q42710P31938R89284R85679R77660J049105J137574J175213J305556
5602B3981373J385230J421686J521403J635976J622455J480747R98361O59398
5594C4706629K81203J8160O3741j6859K09759M46598K49292L01692J55914l4177
5584C6381952J831J3758J85597M25171N87250Q84262J283819J484291J569922
5575D2817853J681333J930819J940131J968984J825515J707656J674399J691917
$$ y = [5310322, 5532582, 5664747, 5853547, 5978249, 6098482, 6172847, 6384927, 6598258, 6825830, 6995566, 7171461, 7403156, 7616659, 7808656, 8101896, 8386813, 8561569, 8909433, 9246988, 9530873, 9821986, 10252908, 10698629, 11122318, 11546833, 12031433, 12681076, 13234623, 13903010, 14786654, 15629364, 16361302, 17350586, 18336265, 19313925, 20363030, 21500604, 22675817, 23981373, 25366603, 26788289, 28309692, 29945668, 31568123, 33048870, 34047231, 34706629, 34987832, 35005992, 35069733, 35052874, 35262633, 35709231, 35958523, 36260215, 36416129, 36381952, 36383783, 36397541, 36583138, 37008309, 37595559, 38479821, 39763640, 41247931, 42817853, 44499186, 46430005, 48370136, 50339120, 52164635, 53872291, 55546690, 57238607]
5567E7238607J542529J162178P67913J81937l66870q89485j448145j807032j776581
5558E4605051j826036j760766j762481j799316j842547j804443j583831j515773
5550D0709858j227410q77701o79835m29692j58678R5720K35094J95095L2517o513
5540C7888455k65916m97913l55487k33208j42460K105j79973k76836p24181j342664
5530C3871922j665750j900021j960667j965304j772663j436575j364843j221543
5522B0584556j059324j096314j038259j031534q80518r16867q24552r40606o91660
5513A2104922m46825n93634n54880l33541m34266m00116l30751l10722j55741
5504H544446k17582k32753k33297k72523j88626j85743j75256j62334j71432k69032
$$ y = [57238607, 58781136, 59943314, 60711227, 60893164, 60526294, 59636809, 58188664, 56381632, 54605051, 52779015, 51018249, 49255768, 47456452, 45613905, 43809462, 42225631, 40709858, 39482448, 38604747, 37924912, 37495220, 37336542, 37432262, 37667356, 37862451, 37894968, 37888455, 37622539, 37124626, 36769139, 36535931, 36393471, 36395576, 36215603, 35938767, 35214586, 33871922, 32206172, 30306151, 28345484, 26380180, 24607517, 23170942, 21806099, 20584556, 19525232, 18428918, 17390659, 16359125, 15478607, 14561740, 13737188, 12796582, 12104922, 11658097, 11064463, 10509583, 10176042, 9741776, 9341660, 9010909, 8700187, 8544446, 8326864, 8094111, 7860814, 7588291, 7399665, 7213922, 7038666, 6876332, 6704900, 6435868]
5494F435868j75933p7202j19744n2930q5228j49808j65929k8691p0881q1495r9301
5483E328726j04527o272l7491q3232l5760r1988j20877j5368q9900r2517j12633
5472D538161l1066j46727J2722Q261j2304j15818K4537q8988K20J19880n3941
5461D254937N0197o9285o6921O5085P7079M8555q4679l8287J04568n3805K8208
5450D315652P5701q106o2498j8922o231n6864m4207o4094l5847P9885J17290R3876
5438D385635k2783o456j7137J42106n4432J8587q589K3757N9236O3315K6814J02827
5426D712880K3960j6773l9210O2171P1965j05839J96604Q8357O2237K2369N3673
5415E132394J79755J07260O6732L6074L1128J03164p25R6880K23171J36256K09435
$$ y = [6435868, 6259935, 6182733, 6062989, 6010059, 5924831, 5775023, 5609094, 5580403, 5509522, 5428027, 5328726, 5224199, 5217927, 5180436, 5097204, 5061444, 4969456, 4848579, 4833211, 4743311, 4650794, 4538161, 4507095, 4360368, 4373090, 4381351, 4369047, 4253229, 4277766, 4188778, 4188998, 4308878, 4254937, 4305134, 4235849, 4168928, 4234013, 4311092, 4359647, 4274968, 4236681, 4341249, 4287444, 4315652, 4391353, 4383247, 4320749, 4301827, 4295596, 4238732, 4194525, 4130431, 4094584, 4174469, 4291759, 4385635, 4362852, 4356396, 4339259, 4481365, 4426933, 4445520, 4436931, 4460688, 4519924, 4583239, 4610053, 4712880, 4736840, 4720067, 4680857, 4743028, 4814993, 4709154, 4905758, 4994115, 5056352, 5078721, 5132394, 5312149, 5419409, 5486141, 5522215, 5553343, 5656507, 5655782, 5752662, 5975833, 6112089, 6321524]
5404F321524O0420N9333J69853K08866J43795P0116J44389J72154K16303K02407
5394G769160K59244K13499J29237J98281L49744K93235L04770L10303L06473L84791
5384A0518737M43885L29839L56085M90163L50498L34149M77732N77339N77218
5375A4455645O34613N38793N85774Q42976Q50998J036867J164902J242418J496542
5366B2849528J611011J945933K263382K555351L017486L235963L375318L021954
5358D3875926K177210Q10166m23052j182268j515400j164191p19242n73856m93279
5349D0792014o61409r07319r60412j025593p62432m58162R116M83419Q26767R33790
5339C8269779J612779J962539K260390K944171L547048M240147M755240M864017
$$ y = [6321524, 6381944, 6441277, 6611130, 6819996, 6963791, 7033907, 7178296, 7350450, 7566753, 7769160, 8028404, 8241903, 8371140, 8569421, 8919165, 9212400, 9517170, 9827473, 10133946, 10518737, 10962622, 11292461, 11648546, 12138709, 12489207, 12823356, 13301088, 13878427, 14455645, 15090258, 15629051, 16214825, 17057801, 17908799, 18945666, 20110568, 21352986, 22849528, 24460539, 26406472, 28669854, 31225205, 34242691, 37478654, 40853972, 43875926, 46053136, 46863302, 46440250, 45257982, 43742582, 42578391, 41859149, 41285293, 40792014, 40130605, 39223286, 38262874, 37237281, 36474849, 36016687, 36025803, 36509222, 37335989, 38269779, 39882558, 41845097, 44105487, 47049658, 50596706, 54836853, 59592093, 64456110]
5331F4456110M490541L659379K378680R42019J76110k54751k74357M7424M95612
5322G6116767R20384P95370n2416j650737l504460n162652n851753n583420m746063
5313E1281020l770513k863901k100530j401635r94897m17959O9045M17101Q32753
5304D1050484J354155J719260J893450J853156J571169J050333P26194O70969
5296E1889170Q71762J210176J266683Q29726k66292j810055l459336m474903m738637
5287D1318294m381292l809899l190636k593577k179472j738346j570482j285252
5279B0569338j043059j036297q40767p36999o87119n62371m99569o61968m99268
5270A4001921m52135l11132j67859m44831k98825j61751k22414k57689k02968
$$ y = [64456110, 68946651, 72606030, 74984710, 75926729, 76102839, 75848088, 75573731, 75621155, 76116767, 77037151, 77832521, 77780105, 76129368, 72624908, 67462256, 61610503, 56027083, 51281020, 47510507, 44646606, 42546076, 41144441, 40149544, 39731585, 39800630, 40217731, 41050484, 42404639, 44123899, 46017349, 47870505, 49441674, 50492007, 51218201, 51889170, 52760932, 53971108, 55237791, 56067517, 55801225, 53991170, 50531834, 46056931, 41318294, 36937002, 33127103, 29936467, 27342890, 25163418, 23425072, 21854590, 20569338, 19526279, 18489982, 17649215, 16912216, 16225097, 15662726, 15163157, 14501189, 14001921, 13549786, 13238654, 13070795, 12625964, 12327139, 12165388, 11942974, 11685285, 11482317]
5261A1482317j55879k00733j57155j03275j62727j87482p5334k18844j53923m7503
5251A0019462p7100k45285j55067j27338r3858j96226k01298l2652j00120q4430
5241H706088l737j04224j14216R206P512M3256k3182J697k3200O3782R0340J805
5229H655127J7901Q1169n8842M6950O0222R4200M947L7484K0024N9701N8212J19849
5217I196944J14831Q0362N3617J36164J02881Q7659J05258K35918K52462J85621
5207A0551717J80143K13460J98963L25299L45781J90952K20928L52092M31031
5198A3010366L68050M04585L80231M11088M38476N32460M32782M92579O26552
5189A7097169O15268P28850P25505P95180R97208J090831J044808J403448J556346
$$ y = [11482317, 11326438, 11125705, 10968550, 10865275, 10702548, 10515066, 10439732, 10220888, 10066965, 10019462, 9942362, 9697077, 9542010, 9414672, 9320814, 9124588, 8923290, 8890638, 8790518, 8706088, 8702351, 8598127, 8483911, 8493117, 8500629, 8543885, 8520703, 8522400, 8499200, 8562982, 8653322, 8655127, 8673028, 8754197, 8695355, 8742305, 8802527, 8896727, 8901674, 8939158, 8959182, 9018883, 9077095, 9196944, 9311775, 9392137, 9445754, 9581918, 9684799, 9772458, 9877716, 10113634, 10366096, 10551717, 10731860, 10945320, 11144283, 11469582, 11815363, 12006315, 12227243, 12579335, 13010366, 13378416, 13783001, 14163232, 14574320, 15012796, 15545256, 15978038, 16470617, 17097169, 17712437, 18441287, 19166792, 19961972, 20959180, 22050011, 23094819, 24498267, 26054613]
5180B6054613J720135J980941K184621K578766K922235L511807L803100M241319
5172D8997537M353847M119238L173122J683680j73906j518913k151772k096286
5164E6386547j646306j074495j001085j117487j226327j406713j373219j174121
5156D6366794o30209o8354L18905R39451J428617K100662K583153L289020L914122
5147F0242161M140978M232970L733155K672775J413649J26410o74621q38500j020902
5138G4028075r74195j003924j264430j380692j412553j421218j437725j873930
5130F3259408k644028l481699m071811m212608l751888k991194k192993j645795
5122C8267392j283395o83122l00980M7573K98208N46716R36502Q32780P89116
$$ y = [26054613, 27774748, 29755689, 31940310, 34519076, 37441311, 40953118, 44756218, 48997537, 53351384, 57470622, 60643744, 62327424, 62153518, 60634605, 58482833, 56386547, 54740241, 53665746, 52664661, 51547174, 50320847, 48914134, 47540915, 46366794, 45736585, 45668231, 45987136, 46926587, 48355204, 50455866, 53039019, 56328039, 60242161, 64383139, 68616109, 72349264, 75022039, 76435688, 76562098, 75887477, 75048977, 74028075, 73053880, 72049956, 70785526, 69404834, 67992281, 66571063, 65133338, 63259408, 60615380, 57133681, 53061870, 48849262, 45097374, 42106180, 39913187, 38267392, 36983997, 36300875, 35999895, 36047468, 36345676, 36892392, 37828894, 38661674, 39450790]
5113C9450790N89556N91713N82482O17731P55485R10142P43048m2482j186506
5104D3011959k387119l268769l566848l436097l129430k426059k056959j647111
5096B1093567j281867j168587r76600r07494p56538p25357n50332n53148m92167
5087A3681477m62816m39592l44763l43566l17242k70385k50857j49410j19068
5078A0983778j08874j43740q9106p1316j62166j52923j97660j56421j10978k13477
5068I577117j50719j02933N8449k4341j32155n2609j19920k05187k75363n6784
5058H515555j06613j43197n6247j51317j4850o228J0824l528m4705Q826J1421
5047H019941N2800Q2230M6792L1949L3674O595M7471M2991r1323K2144J35950
$$ y = [39450790, 40040346, 40632059, 41214541, 41832272, 42587757, 43497899, 44240947, 44198465, 43011959, 40624840, 37356071, 33789223, 30353126, 27223696, 24797637, 22740678, 21093567, 19811700, 18643113, 17666513, 16759019, 16002481, 15277124, 14726792, 14173644, 13681477, 13218661, 12779069, 12434306, 12090740, 11773498, 11503113, 11252256, 11102846, 10983778, 10874904, 10731164, 10642058, 10570742, 10408576, 10255653, 10057993, 9901572, 9790594, 9577117, 9426398, 9323465, 9381914, 9357573, 9225418, 9172809, 9052889, 8847702, 8572339, 8515555, 8408942, 8265745, 8209498, 8058181, 8043331, 8037103, 8047927, 8044399, 7999694, 8008520, 8019941, 8072741, 8154971, 8201763, 8233712, 8267386, 8273981, 8321452, 8364443, 8273120, 8295264, 8431214]
5036H431214K3900j5993N1394M7908o1574q7631P0475P0723O0384o2375N7639
5025H586064K14232Q1721J33772L6071L8178J16598J39702J04766J42604R1704
5015I685412J26809K60247J88974R6209J17236J00897K17659K70729J96301J17919
5005A1378392J20368L25763K63375K45491L52805K56640L45803K35488M73445
4996A3997570M04150M48469N28408M00677N38597P45181P39576O71567P08902
4987A9183097Q35783P86312O37279M95740L43934K40967J92209K44607K67099
4978B3227027L82267L87860M13368M60151L92308L66933M27151O92709O49660
4969B7399434O00567Q47033J005621J122709J119921J301765J422269J501708
$$ y = [8431214, 8455114, 8439121, 8490515, 8538423, 8476849, 8389218, 8459693, 8530416, 8590800, 8528425, 8586064, 8800296, 8882017, 9015789, 9051860, 9090038, 9206636, 9346338, 9451104, 9593708, 9685412, 9812221, 10072468, 10261442, 10357651, 10474887, 10575784, 10793443, 11064172, 11260473, 11378392, 11498760, 11824523, 12087898, 12333389, 12686194, 12942834, 13288637, 13524125, 13997570, 14401720, 14850189, 15378597, 15779274, 16317871, 17063052, 17802628, 18474195, 19183097, 20018880, 20805192, 21442471, 21938211, 22282145, 22523112, 22715321, 22959928, 23227027, 23609294, 23997154, 24410522, 24870673, 25262981, 25629914, 26057065, 26749774, 27399434, 28000001, 28847034, 29852655, 30975364, 32095285, 33397050, 34819319, 36321027]
4961C6321027J616690J893824J735764J669173J760586J795131J871940J928207
4953E0592342J964900J975387J803356J385590Q79176M66621L08046K9901J3145
4944E9418464R9627P9518o9308j43606j21540j05839j70681k83861j53091j79310
4934E8370373k14918n9905q6374r1217L5778Q3907P4179L11661K67129K51636
4924E8942249M13837L16187K43079J58906J14099K00435K03499J00673l32828
4915F0360136n26317q93317j294857j489074j458744j325342j500849j331639
4907E0539997j443039j498342j374793j300474j134064j213281j287217j211142
4899D0077645j040666r23629q72617q93868q49557o41000m76668m33869l85228
$$ y = [36321027, 37937717, 39831541, 41567305, 43236478, 44997064, 46792195, 48664135, 50592342, 52557242, 54532629, 56335985, 57721575, 58600751, 59067372, 59375418, 59405319, 59418464, 59518091, 59597609, 59528301, 59384695, 59263155, 59157316, 58986635, 58702774, 58549683, 58370373, 58155455, 58095550, 58009176, 57917959, 57953737, 58037644, 58111823, 58423484, 58690613, 58942249, 59356086, 59672273, 59915352, 60074258, 60188357, 60388792, 60592291, 60692964, 60360136, 59833819, 58940502, 57645645, 56156571, 54697827, 53372485, 51871636, 50539997, 49096958, 47598616, 46223823, 44923349, 43789285, 42576004, 41288787, 40077645, 39036979, 38113350, 37240733, 36346865, 35497308, 34856308, 34379640, 33945771, 33560543]
4890C3560543l12370k95668k0569j6640J09582J30200K66020K70950L13602K01524
4880C4207174K52273L83089K23415J17256L44212L49289L03561K11269K46668
4871C6638206L34466L56543M97917L84343K69513J36661L9571l79942m32531l52638
4861C7492109j70685Q4327J01699J60039Q6075J18053L14862L18413K54702L16056
4851C9075650N17998M88255K71113M14765K82444K50236J07813Q9603J3491j12820
4841D1398548m8941j53558k67322k62381k14842j52823k46053k84524m52796r53797
4831C8361511j244141j437031j181724j141300r70641r92933r55387r16424q13671
4822B8708259p84666n64482n33170m54087n04742m74722m92062n42120m43994
$$ y = [33560543, 33248173, 32952505, 32931936, 32915296, 33024878, 33155078, 33421098, 33692048, 34005650, 34207174, 34459447, 34842536, 35065951, 35183207, 35527419, 35876708, 36180269, 36391538, 36638206, 36972672, 37329215, 37827132, 38211475, 38480988, 38617649, 38657220, 38277278, 37844747, 37492109, 37321424, 37405751, 37507450, 37667489, 37753564, 37871617, 38186479, 38504892, 38759594, 39075650, 39593648, 40081903, 40353016, 40767781, 41050225, 41300461, 41408274, 41497877, 41511368, 41398548, 41349607, 41196049, 40928727, 40666346, 40451504, 40298681, 40052628, 39768104, 39315308, 38361511, 37117370, 35680339, 34498615, 33357315, 32386674, 31393741, 30438354, 29521930, 28708259, 27923593, 27359111, 26825941, 26371854, 25867112, 25392390, 24900328, 24358208, 23914214]
4813B3914214n51014n18708n09542n30761m44838n86161p04696m97060n32994
4804A9038440p07052m13374k98096n86753m28046n10638p47545j004592r58655
4795A3383689q61199o04668n49257n42984n49434m73769m21432m29538l12170
4786H639238l69665k49333k35613j04197k50631k06058j51780k98447j97465j83623
4776F392426j46816j45584j86202j40921q7660r7613j62439k49833r8843m1390
4766E035125k9501o2202j04932j15591j93568k6364j28549k1937p4912r8110n6711
4755D122748l2620J8148j10917p710j22078j18954p2248j09371p1947o2683N601
4744C437969j6780m1722p033j3621j42198l5839Q104r5434j2850n7419N2192L4810
$$ y = [23914214, 23363200, 22844492, 22334950, 21804189, 21359351, 20773190, 20068494, 19571434, 19038440, 18331388, 17918014, 17619918, 17033165, 16605119, 16094481, 15346936, 14342344, 13383689, 12522490, 11917822, 11368565, 10825581, 10276147, 9802378, 9380946, 8951408, 8639238, 8269573, 8020240, 7784627, 7680430, 7429799, 7223741, 7071961, 6773514, 6576049, 6392426, 6245610, 6100026, 5913824, 5772903, 5685243, 5587630, 5425191, 5175358, 5076515, 5035125, 5005624, 4943422, 4838490, 4722899, 4529331, 4502967, 4374418, 4352481, 4277569, 4179459, 4122748, 4090128, 4108276, 3997359, 3989649, 3867571, 3748617, 3676369, 3566998, 3495051, 3432368, 3437969, 3421189, 3379467, 3372434, 3358813, 3216615, 3180776, 3188880, 3093446, 3080596, 3023177, 3075369, 3110179]
4732C110179m9386O4503p7093j78126j5085P1346l5161j8722n7532N8136K7756
4721B900815n6835M4508o8518j49427J30006J5916o6972q1907J9538j07343n6834
4710B522947n596j30440R0077m4550o0739m0991o313n841K643l2112K0141j1500
4698B297726O9805m9747n8919r7075M1590L8510k1710j0772O3361n8142j29004
4687B085623q4364J986m4608k6912J04072K0669o0235p6340N3756K1785l5478
4676A959954j3905j5957K7588l6367L2908l9944j34j0911Q3754L0555J5055m926
4664B027670l1826k1154l9075o4365p2287l3086j9086n0281L1709J68905o9662
4653A827462o7672n7681j5755l6918Q6086J6139o8674q0903j14087L305N2947
$$ y = [3110179, 3060793, 3125296, 3048203, 2870077, 2854992, 2926338, 2891177, 2872455, 2814923, 2873059, 2900815, 2843980, 2888488, 2819970, 2670543, 2800549, 2816465, 2749493, 2667586, 2687124, 2579781, 2522947, 2517351, 2386911, 2476988, 2432438, 2371699, 2330708, 2324395, 2318554, 2321197, 2289085, 2309226, 2297726, 2367531, 2317784, 2258865, 2161790, 2203380, 2241890, 2220180, 2209408, 2272769, 2214627, 2085623, 2001259, 2003245, 1958637, 1931725, 2035797, 2056466, 1996231, 1919891, 1973647, 1995432, 1959954, 1946049, 1930092, 1957680, 1921313, 1954221, 1914277, 1914143, 1903232, 1986986, 2017541, 2032596, 2027670, 1995844, 1974690, 1935615, 1871250, 1798963, 1765877, 1746791, 1696510, 1728219, 1897124, 1827462, 1759790, 1702109, 1686354, 1649436, 1735522, 1751661, 1682987, 1602084, 1487997, 1491302, 1544249]
4642A544249Q5972k6357N3323N8449m2907R713k4773L890n5268K5743M4481l726
4630A672789l4881K5262p0204J619m8050r4977o689K3728J4941K317K395m8358
4618A439892q0492O061J51482N2804L1180j42535j16724J87066L3826J0525K7831
4607A600916j25226N1060M6728l6144j3793Q8914r7290j00872L2599l087K4679
4596A468484P0563j303O8714q5534r8084K9021m3282P1741M1095o0311M5136P2833
4584A579073p5142j3805J6338k6740k610n646J4481r688q041K6838p5896K9442
4572A448604m0073p829q48l7464m9089R5763K3590M0841r4612J0745Q9146J7283
4560A496057o4186P8819p9364j22124N9460j8005N8979j4880o6054Q2808j0069
$$ y = [1544249, 1630221, 1603864, 1657187, 1715636, 1672729, 1682442, 1657669, 1661559, 1606291, 1632034, 1676515, 1672789, 1637908, 1663170, 1592966, 1594585, 1546535, 1451558, 1444869, 1468597, 1483538, 1485855, 1488250, 1439892, 1359400, 1365461, 1516943, 1569747, 1600927, 1458392, 1341668, 1528734, 1562560, 1573085, 1600916, 1475690, 1526750, 1573478, 1537334, 1523541, 1612455, 1515165, 1414293, 1446892, 1443805, 1468484, 1539047, 1537744, 1606458, 1520924, 1422840, 1451861, 1408579, 1480320, 1521415, 1461104, 1506240, 1579073, 1503931, 1490126, 1506464, 1479724, 1477114, 1471468, 1485949, 1476261, 1468220, 1495058, 1419162, 1448604, 1408531, 1400702, 1399854, 1362390, 1313301, 1409064, 1432654, 1473495, 1378883, 1389628, 1478774, 1496057, 1431871, 1510690, 1431326, 1309202, 1368662, 1350657, 1409636, 1394756, 1328702, 1411510, 1401441]
4549A401441o0667l0784q7808J0959J71915l9424j09459l2518Q7426p4010j37722
4538A099349R9705O7595Q720J7587K6930n6080L0882k3105O6584O7925l6551n2728
4526A316813n6804K9555P847p8562J257M7574P1497L9158j07933o1957J3434Q2651
4514A304530n2796n3969q6112J01154J4383j63782L3095Q3180K8681m4975r030
4503A154359J0747R5400o3959M4930p6042n2710Q7139r612l2812J5241j0852j8264
4491A143565j3638Q5592o7016m0596n8048J10445N255r6870n7802P445J3955N3965
4479A086252l4946o400l4583O015j3942M4351O2477k27K441N5744k4998n8211
4467A083973J9003L3590j4154L0308m8786M1383o277k0720l625m7723J8571j8949
$$ y = [1401441, 1340774, 1309990, 1222182, 1233141, 1405056, 1365632, 1256173, 1223655, 1311081, 1237071, 1099349, 1199054, 1266649, 1275369, 1292956, 1319886, 1263806, 1294688, 1271583, 1338167, 1406092, 1369541, 1316813, 1260009, 1289564, 1297411, 1218849, 1220106, 1267680, 1339177, 1378335, 1270402, 1208445, 1221879, 1304530, 1251734, 1197765, 1111653, 1212807, 1227190, 1063408, 1096503, 1179683, 1208364, 1163389, 1154359, 1165106, 1260506, 1196547, 1241477, 1165435, 1112725, 1199864, 1190252, 1157440, 1172681, 1161829, 1143565, 1129927, 1215519, 1148503, 1107907, 1049859, 1160304, 1165559, 1068689, 1010887, 1018332, 1032287, 1086252, 1051306, 1044906, 1010323, 1016338, 1002396, 1046747, 1109224, 1108997, 1111438, 1167182, 1142184, 1083973, 1102976, 1136566, 1122412, 1152720, 1103934, 1145317, 1139040, 1118320, 1114695, 1066972, 1085543, 1066594]
4455A066594J59335L0160j27863r9670J0312J3881O2744M889L771M4313j34486
4444A033980k3813P9067O7739M8613l0616q0620q7774J56578L3654M0322K6104
4433A263234L4254O8555L5325o7976j24085m0016l3663K6662J06490l8279j4870
4422A215631Q1814r2364N5621Q6533q7045j3172P9964L3464L8583Q7591j33794
4411A352826k2007L5404l1415O2865M8321j1302o0971L9746J14989J11725K0713
4400A660894K0691K8953P3532J7127j2672J64947M4576J28802J35197P1657K8859
4389B362563K37594K69299J20572J84209J33771j80894k15734k72437j07830q8196
4379B442917k98355j32064k0477j17274j03042l0609P612l5661r3323o1592m0704
$$ y = [1066594, 1225929, 1256089, 1128226, 1028556, 1038868, 1052749, 1115493, 1120382, 1124153, 1168466, 1033980, 1010167, 1089234, 1156973, 1205586, 1174970, 1094350, 1006576, 1163154, 1196808, 1237130, 1263234, 1297488, 1366043, 1401368, 1333392, 1209307, 1169291, 1135628, 1162290, 1268780, 1230501, 1215631, 1297445, 1205081, 1260702, 1347235, 1260190, 1247018, 1326982, 1360446, 1399029, 1486620, 1352826, 1330819, 1366223, 1334808, 1397673, 1445994, 1434692, 1373721, 1413467, 1528456, 1640181, 1660894, 1681585, 1710538, 1784070, 1801197, 1788525, 1953472, 1998048, 2126850, 2262047, 2333704, 2362563, 2600157, 2869456, 2990028, 3174237, 3308008, 3127114, 2911380, 2638943, 2531113, 2442917, 2144562, 2012498, 1992021, 1874747, 1771705, 1741096, 1748708, 1713047, 1619724, 1558132, 1517428]
4368A517428J0142L4750N2575j9431J9047P1754N0284L5259r441J812R4491K3849
4356A882519n8079O3234J05199K6459o1362k2356K8060M4402J4819O2618l0522
4345B054991N1952o3271N2083N7666M1005R725j06588J192J5701R9457L895n899
4333B211909M4869Q5225R6036L7426j8705j4391n932l5862N6190J168Q291N9068
4321B525292L385N4562l1888l0385N6433J3105m067N6997P5432J8918k2627o367
4309B708790O4037K1766M6692P5718k7475j3084j433K8129Q163n2521O6248R5643
4297C020673P7602Q199O1317L8428R7148L5248K3709J27487J83153K37845J18582
4286D029391K5813J35066Q2676m9795n8549j45629k23069r8030m8591j51796m7300
$$ y = [1517428, 1527570, 1562320, 1614895, 1595464, 1614511, 1686265, 1736549, 1771808, 1762367, 1764179, 1858670, 1882519, 1824440, 1887674, 1992873, 2019332, 1957970, 1935614, 1963674, 2008076, 2022895, 2085513, 2054991, 2106943, 2043672, 2095755, 2153421, 2194426, 2204151, 2097563, 2098755, 2114456, 2213913, 2217808, 2211909, 2256778, 2342003, 2438039, 2475465, 2456760, 2442369, 2436437, 2400575, 2456765, 2457933, 2466224, 2525292, 2528677, 2583239, 2551351, 2520966, 2577399, 2590504, 2586437, 2643434, 2718866, 2737784, 2715157, 2708790, 2772827, 2794593, 2841285, 2917003, 2889528, 2876444, 2875011, 2903140, 2911303, 2858782, 2925030, 3020673, 3098275, 3106474, 3167791, 3206219, 3303367, 3338615, 3362324, 3489811, 3672964, 3910809, 4029391, 4055204, 4190270, 4272946, 4223151, 4164602, 4018973, 3795904, 3697874, 3649283, 3497487, 3450187]
4275C450187k28560P067o9628R83j00390k4827q0808P4992K19832Q6232L8419
4264C373499K7387P9920R1281K1127O0566N059r997J02275J42214M2868j5943
4253C920256K958Q8652R0768k3874O8506K9519m8942L0550j0045Q4844o095r9651
4241D127446Q7644N9081q7283m8372R896O9720j18N7106j4151n329J6570N2646
4229D324856Q2365q247Q2925M8890N7311J30382K292k5246j2841J30950J25588
4218D939225J13431J46316Q8685k1005K463J30299J25624J31532J49438L2662
4208E838670J19761Q1382J48302R5943J00908J66487J39637J14245J56195R7241
4198G058771q6567M6184J41195J47204J48401K28698J19665P9288J70163K40601
$$ y = [3450187, 3221627, 3228694, 3159066, 3160049, 3059659, 3034832, 2954024, 3029016, 3248848, 3335080, 3373499, 3400886, 3480806, 3572087, 3593214, 3653780, 3658839, 3648842, 3751117, 3893331, 3936199, 3920256, 3923214, 4011866, 4102634, 4078760, 4147266, 4176785, 4127843, 4158393, 4148348, 4233192, 4227097, 4127446, 4215090, 4274171, 4186888, 4138516, 4148412, 4218132, 4218014, 4275120, 4260969, 4255640, 4272210, 4324856, 4407221, 4398974, 4481899, 4530789, 4588100, 4718482, 4720774, 4695528, 4682687, 4813637, 4939225, 5052656, 5198972, 5287657, 5266652, 5269115, 5399414, 5525038, 5656570, 5806008, 5838670, 5958431, 6039813, 6188115, 6284058, 6384966, 6551453, 6691090, 6805335, 6961530, 7058771, 6972204, 7018388, 7159583, 7306787, 7455188, 7683886, 7803551, 7882839, 8053002, 8293603]
4188H293603J44818K60317J49284K21901J55370L44636K09248J90135L05931M21886
4178A0697129K35901K72388K44382K42860K73038K01447J20788K55914J76963
4169A2720810K40872K49470J33479L20028L74780K97898L67984L21868M36998
4160A5464187M01260L49805M67417M99509M55108M71332L48232M94317N20355
4151A9471522L59346M37069M22188M33902L74417N06331M71144N12864O56550
4142B3645333O69687Q11031J028229J012105J114953J196362J224479J185133
4134C1887312J381966J416624J477860J532532J583688J731996J809421K071242
4126D4892641K112233K298638K367197K542676K616766K649591K848112K985523
$$ y = [8293603, 8438421, 8698738, 8848022, 9069923, 9225293, 9569929, 9779177, 9969312, 10275243, 10697129, 10933030, 11205418, 11449800, 11692660, 11965698, 12167145, 12287933, 12543847, 12720810, 12961682, 13211152, 13344631, 13664659, 14039439, 14337337, 14705321, 15027189, 15464187, 15865447, 16215252, 16682669, 17182178, 17637286, 18108618, 18456850, 18951167, 19471522, 19830868, 20267937, 20690125, 21124027, 21498444, 22004775, 22475919, 22988783, 23645333, 24315020, 25126051, 26154280, 27166385, 28281338, 29477700, 30702179, 31887312, 33269278, 34685902, 36163762, 37696294, 39279982, 41011978, 42821399, 44892641, 47004874, 49303512, 51670709, 54213385, 56830151, 59479742, 62327854, 65313377]
4118F5313377L152271L498563L997880M506681M820808N542963O429310P475925
4110A04737778Q443405R784359J0888745J1925873J3463658J5823715J9165510
4103A94233043K4132991L0285256L6749486L9489962L4675037J9480873n092443
4096C73954205k8670689m1524096m0421421l2369185k4925172k0290284j6694351
4089A69059007j4218353j3274546j3321228j2597152j0683357q579802o991094
4082H9393475n690305m954517m161440l657986l155692k753349k341519j938803
4074F0739864j757071j573655j278616j161079r43722q39044o84732m88380l32046
4065E1681519j50437j34261k7970J12010J84343L89920M92135P20484Q62036R04672
$$ y = [65313377, 68465648, 71964211, 75962091, 80468772, 85289580, 90832543, 97261853, 104737778, 113181183, 122965542, 133854287, 145780160, 159243818, 175067533, 194233043, 218366034, 248651290, 285400776, 324890738, 359565775, 379046648, 373954205, 345283516, 303759420, 263337999, 230968814, 206043642, 185753358, 169059007, 154840654, 141566108, 128244880, 115647728, 104964371, 96384569, 89393475, 83703170, 78748653, 74587213, 70929227, 67773535, 65020186, 62678667, 60739864, 58982793, 57409138, 56130522, 54969443, 54025721, 53186677, 52501945, 52013565, 51681519, 51531082, 51396821, 51368851, 51480861, 51665204, 52055124, 52547259, 53267743, 54129779, 55034451]
4055E5034451J097288J124272R45290J198507J306752J335665J563424J396982
4047F5002631J524283J597907J767392J876381J965260K156764K388564K527491
4039H0806673K760700K828807K960101L093562L227632L316817L299762L311530
4031A05605584L277784L449114L526541L501452L533916L496842L453566L619265
4023A33464064L567834L591780L421439L342366L226009L183699L316431L592556
4015A60706178L789761M249198M573848M913740N420355O078432P023709Q048021
4007B04803242R392265J0757388J2360702J4747942J7775705K2348272K6812724
4000C18998240K8870206K4652059J2309735p874464k9264407l8862241l6184724
$$ y = [55034451, 56131739, 57256011, 58201301, 59399808, 60706560, 62042225, 63605649, 65002631, 66526914, 68124821, 69892213, 71768594, 73733854, 75890618, 78279182, 80806673, 83567373, 86396180, 89356281, 92449843, 95677475, 98994292, 102294054, 105605584, 108883368, 112332482, 115859023, 119360475, 122894391, 126391233, 129844799, 133464064, 137031898, 140623678, 144045117, 147387483, 150613492, 153797191, 157113622, 160706178, 164495939, 168745137, 173318985, 178232725, 183653080, 189731512, 196755221, 204803242, 214195507, 224952895, 237313597, 252061539, 269837244, 292185516, 318998240, 347868446, 372520505, 384830240, 376955776, 347691369, 308829128, 272644404]
3993B72644404k8748171k1996341j6944080j3194953j0598915q556671o829461
3986A65775812n427188m150528l408958k720680k368145k100441j731125j273668
3978A42595079p77251n71099k62113J76403K07791L17347M34358N44981P25314
3969A43390810O66898O55804N91874M66384M82655L33633L89585M35302K62239
3960A47675184J6990N5260j07109k50320o59797r47160j258185j580629j759519
3951A41184715j777138j955913k045461k138724k308555k511081k518163k765145
3943A23164535k733537k956869l058636l122582l198115l126619l196643l273956
3935I8497578l106150k985627k983204k866467k684014k631007k445600k338359
$$ y = [272644404, 243896233, 221899892, 204955812, 191760859, 181161944, 172605273, 165775812, 160348624, 156198096, 152789138, 150068458, 147700313, 145599872, 143868747, 142595079, 141817828, 141246729, 140984616, 141161019, 141368810, 141686157, 142120515, 142665496, 143390810, 144057708, 144713512, 145305386, 145771770, 146254425, 146588058, 146977643, 147412945, 147675184, 147692174, 147747434, 147640325, 147390005, 146730208, 145783048, 144524863, 142944234, 141184715, 139407577, 137451664, 135406203, 133267479, 130958924, 128447843, 125929680, 123164535, 120430998, 117474129, 114415493, 111292911, 108094796, 104968177, 101771534, 98497578, 95391428, 92405801, 89422597, 86556130, 83872116, 81241109, 78795509, 76457150]
3927G6457150k618234k472187k348996k312330k054328j969860j926279j637397
3919E9117539j520303j316269j162651j079682j020923q81861p88380p38419o54449
3910D9954602n19210m54681m10501m56769l66269l39988k70752k73654k01845
3901D6660933k07831k83256k74102k55335k52717k09404k09670l10907k60474
3892D4397237k54396j61744l67687n16079m35154m21335n78907n63378n48351
3883D0550206o84737n80891n57296o55795o85494o07242q17257p19746q27388
3874C4414360q06546p51986q52201q24489q36673q74659r08341q73886p31880
3865B6953699p49674p03610p97178o54053p06727o42917o95667o32847n31655
$$ y = [76457150, 73838916, 71366729, 69017733, 66705403, 64651075, 62681215, 60754936, 59117539, 57597236, 56280967, 55118316, 54038634, 53017711, 52135850, 51347470, 50609051, 49954602, 49435392, 48980711, 48570210, 48113441, 47747172, 47407184, 47136432, 46862778, 46660933, 46453102, 46169846, 45895744, 45640409, 45387692, 45178288, 44968618, 44657711, 44397237, 44142841, 43981097, 43613410, 43097331, 42662177, 42240842, 41661935, 41098557, 40550206, 39865469, 39284578, 38727282, 38071487, 37385993, 36778751, 35961494, 35241748, 34414360, 33607814, 32855828, 32003627, 31179138, 30342465, 29467806, 28559465, 27685579, 26953699, 26204025, 25500415, 24703237, 24049184, 23342457, 22699540, 22003873, 21371026, 20839371]
3856B0839371n92266o23526m83552n44829n14567m52624m83826l20946m04746
3847A6418489l75428l11295k97022k87376k34589j47704j82619j95100k02311
3838A4185045j47389k57313k14825k26467j01577j33496l01898j69766j11784
3829A2520530j51418j45973n0903l9928k10888r0942j10617q9344j23051l3217
3819A1474249j53588j43310k5461L5467k930l1168m6038M51J34802J45065K42725
3808A1630264O1227j37278r2416k26278k59162k01879j48742k8599q5518l6306
3798A0475313k4564o717j02005N0623j28415q8021q8372P934j36475j89876j07035
3787I662390k9883j01960n3919j51197j01645m9128R2554n299q5478m9425J4176
$$ y = [20839371, 20247105, 19623579, 19140027, 18595198, 18080631, 17628007, 17144181, 16823235, 16418489, 16043061, 15731766, 15434744, 15147368, 14912779, 14765075, 14582456, 14387356, 14185045, 14037656, 13780343, 13565518, 13339051, 13237474, 13103978, 12802080, 12632314, 12520530, 12369112, 12223139, 12172236, 12132308, 11921420, 11830478, 11719861, 11630517, 11507466, 11474249, 11320661, 11177351, 11151890, 11187357, 11184427, 11153259, 11107221, 11107672, 11242474, 11387539, 11630264, 11691491, 11554213, 11461797, 11235519, 10976357, 10774478, 10625736, 10597137, 10511619, 10475313, 10450749, 10444032, 10342027, 10392650, 10264235, 10176214, 10087842, 10095776, 9959301, 9769425, 9662390, 9632507, 9530547, 9476628, 9325431, 9223786, 9174658, 9267212, 9261913, 9176435, 9127010, 9141186]
3776I141186l2243n4895l2670K2764J4606k9099r79M719J757n1315o2119L8891
3764H960603J61203J55565J33782J07351Q0553M9085R1864J80533J88423J50899
3754A0259861J54842J11606L2452K07079J97129J72613J78830K00422K69530Q1686
3744A1866050J46945K08685n258l7637N0854N4445J39224J97859L5807l7938J10399
3733A2729435O8149J02930J08753J44130J41592N8931J07240O2219J57483P4001
3723A3754863K8586N9586J93020K20777J37906K37625J28442L23935K03795K27460
3713A5515995K86981L58715L38023L09784K33863K26109J41245J2022Q5171J42359
3703A7650267K38033J50094K37165K24471M20265K64150K91049L40511L64403
$$ y = [9141186, 9108943, 9054048, 9021378, 9044142, 9058748, 9029649, 9028670, 9033389, 9035146, 8983831, 8921712, 8960603, 9121806, 9277371, 9411153, 9518504, 9599057, 9648142, 9740006, 9920539, 10108962, 10259861, 10414703, 10526309, 10558761, 10765840, 10962969, 11135582, 11314412, 11514834, 11784364, 11866050, 12012995, 12221680, 12216422, 12178785, 12229639, 12284084, 12423308, 12621167, 12656974, 12619036, 12729435, 12797584, 12900514, 13009267, 13153397, 13294989, 13353920, 13461160, 13523379, 13680862, 13754863, 13783449, 13843035, 14036055, 14256832, 14394738, 14632363, 14760805, 15084740, 15288535, 15515995, 15802976, 16161691, 16499714, 16809498, 17043361, 17269470, 17410715, 17422737, 17507908, 17650267, 17888300, 18038394, 18275559, 18500030, 18920295, 19184445, 19475494, 19816005, 20180408]
3694B0180408M35274L88826M51037M65727M63245N43379O17887N44322O61392
3685B4751497P76253O65779Q10383P22779P66786J034086R34033R44047J065450
3676C2471093J153702J235447J264685J277892J408451J389540J472266J442199
3668D3115275J668180J481066J512326J550080J519650J536052J534425J451647
3660E5368701J335352J379360J434918J522640J532465J510871J514238J349792
3652F6948337J156149J111048J154334J106562J029958R71529J006944R71874
3644G5456735J096108J231780J160234J395865J500527J514425J672768J916475
3636H6944917K030533K205164K431164K519802K600190K908485L155426L384464
$$ y = [20180408, 20615682, 21004508, 21455545, 21921272, 22384517, 22927896, 23545783, 24090105, 24751497, 25527750, 26193529, 27003912, 27726691, 28493477, 29527563, 30461596, 31405643, 32471093, 33624795, 34860242, 36124927, 37402819, 38811270, 40200810, 41673076, 43115275, 44783455, 46264521, 47776847, 49326927, 50846577, 52382629, 53917054, 55368701, 56704053, 58083413, 59518331, 61040971, 62573436, 64084307, 65598545, 66948337, 68104486, 69215534, 70369868, 71476430, 72506388, 73477917, 74484861, 75456735, 76552843, 77784623, 78944857, 80340722, 81841249, 83355674, 85028442, 86944917, 88975450, 91180614, 93611778, 96131580, 98731770, 101640255, 104795681, 108180145]
3628A08180145L598487L889592M014403M202585M526178M810798N123175N343892
3620A43689255N664281O102933O450655O977535P427483P885092Q476470R017758
3612B01691462R624526J0106164J0974930J1569758J2140710J2978349J3839202
3605B82925101J4525673J5440288J6131297J6517353J6241828J5537419J4330085
3598C91649044J2171845R751416P093307M442380J947029K72666j202728k052984
3590D24071975k427284k550905k433715k269769k381773k773254l316851m646594
3582D01271830o260839q170720j0141476j1819469j2549415j2436900j1557036
3575C28335975j0174154q449968o602421n149173l781889k516142j695492j097334
$$ y = [108180145, 111778632, 115668224, 119682627, 123885212, 128411390, 133222188, 138345363, 143689255, 149353536, 155456469, 161907124, 168884659, 176312142, 184197234, 192673704, 201691462, 211315988, 221422152, 232397082, 243966840, 256107550, 269085899, 282925101, 297450774, 312891062, 329022359, 345539712, 361781540, 377318959, 391649044, 403820889, 413572305, 420665612, 425107992, 427055021, 427327687, 426124959, 424071975, 421644691, 419093786, 416660071, 414390302, 412008529, 409235275, 405918424, 401271830, 395010991, 386840271, 376698795, 364879326, 352329911, 339893011, 328335975, 318161821, 309711853, 303109432, 297960259, 294178370, 291662228, 289966736, 288869402]
3567B88869402m08144p808L28643N94471P26860J039821J170727R74179Q91161
3558B94179312N37199Q9708p16040j398132k113172k903673l450833m026334m540161
3549B75657874m970148n138039n140932n385857n496978n465364n437353n346977
3541B33276226n085970n148343n001272m819483m676756m137674l906505l451495
3533A97048728k867702k322080j777734r92596k81537K14746O90333J126302J572582
3524A92411042J708746J937886K250268K332925K523147K655173K763540K865118
3516B11447845K749244K739296K757028K545168K185087J768976J426320R43870
3508B28562834L76159j58851n19967r94146j416398j913983k267859k441902k701156
$$ y = [288869402, 288461258, 288453450, 288782093, 289376564, 290103424, 291143245, 292313972, 293288151, 294179312, 294716511, 294806219, 294090179, 292692047, 290578875, 287675202, 284224369, 280198035, 275657874, 270687726, 265549687, 260408755, 255022898, 249525920, 244060556, 238623203, 233276226, 228190256, 223041913, 218040641, 213221158, 208544402, 204406728, 200500223, 197048728, 194181026, 191858946, 190081212, 189088616, 188807079, 189021825, 189712158, 190838460, 192411042, 194119788, 196057674, 198307942, 200640867, 203164014, 205819187, 208582727, 211447845, 214197089, 216936385, 219693413, 222238581, 224423668, 226192644, 227618964, 228562834, 228938993, 228780142, 228260175, 227266029, 225849631, 223935648, 221667789, 219225887, 216524731]
3499B16524731k937249l151742l327541l272627l321857l497693l475377l451692
3491A90088953l457490l456234l349870l133724k910379k465579k058844j655627
3483A67601206j007293n55561K8208O91342J438373K150483L070730L756263M756422
3474A81930173N812523O801017P846137Q899587J0122165J1463674J2754651J3991436
3466B59621363J5079196J6221237J6925842J6910919J6468897J5132843J3188734
3459C69549031J0558544P614736M780514K212177J76314j063792j919795k173797
3451C89733932k089871k155000k338772k919274m295031o032137q237199j0853382
3443C50813266j3441412j5852827j7538631j8569541j8864513j8369592j7471405
$$ y = [216524731, 213587482, 210435740, 207108199, 203835572, 200513715, 197016022, 193540645, 190088953, 186631463, 183175229, 179825359, 176691635, 173781256, 171315677, 169256833, 167601206, 166593913, 166038352, 166066560, 166757902, 168196275, 170346758, 173417488, 177173751, 181930173, 187742696, 194543713, 202389850, 211289437, 221411602, 232875276, 245629927, 259621363, 274700559, 290921796, 307847638, 324758557, 341227454, 356360297, 369549031, 380107575, 387722311, 392502825, 394715002, 394891316, 393827524, 391907729, 389733932, 387644061, 385489061, 383150289, 380231015, 375935984, 369903847, 361666648, 350813266, 337371854, 321519027, 303980396, 285410855, 266546342, 248176750, 230705345]
3436B30705345j6248803j4734593j3455644j2175993j0959594r884537q958204
3429A44287977q121033p364942o712816o221964n625970n181039m773795m285075
3421I6001343l941676l638888l503449l155561l006331k915311k673222k468206
3413G0698699k309020k085086k062598j887621j793240j699930j579473j496213
3405E5785518j373224j030365j123429j157956r91160r15524q21312q57621p49229
3396D6765698q77242p48993p09746o85428p58659p04140n61588o60039n55669
3387D0504194n66269m88326m89089o20299o72667n68517n80954n63326o72469
3378C5282278n83972n29800o24817o96524o34544o29075m96481o23149o12321
$$ y = [230705345, 214456542, 199721949, 186266305, 174090312, 163130718, 153246181, 144287977, 136166944, 128802002, 122089186, 115867222, 110241252, 105060213, 100286418, 96001343, 92059667, 88420779, 84917330, 81761769, 78755438, 75840127, 73166905, 70698699, 68389679, 66304593, 64241995, 62354374, 60561134, 58861204, 57281731, 55785518, 54412294, 53381929, 52258500, 51100544, 50109384, 49193860, 48372548, 47514927, 46765698, 45888456, 45139463, 44429717, 43744289, 42985630, 42281490, 41719902, 41059863, 40504194, 39937925, 39449599, 38960510, 38340211, 37667544, 37099027, 36518073, 35954747, 35282278, 34698306, 34168506, 33543689, 32847165, 32212621, 31583546, 31087065, 30463916, 29851595]
3369B9851595m56814m50887n42951n88518n00530n91009m80563n45954m15326
3360B5279043n18291m18817l28880k75979l72885m55999m03114k67855l46581
3351B1890642l54411l64409k26578k08863k69310k19334j71815j12301j10586
3342A9853035j47803k47016m8421k4674l6647m4615l9131j12063j02904K7846
3332A9077607J3939q660N5158P7393r4211K7895j05505Q4420R0384n9086J07507
3321A9266841k6900K6159L7458M3876J34603J02372l6623m3037L7063O2948O3174
3310A9667934O9619l1983J27156L3102Q5260O2279J08629J30639J60875K93072
3300B0706582L13025K70849K30681L70113L60484L40138N46151N67634N57130
$$ y = [29851595, 29394781, 28943894, 28400943, 27812425, 27311895, 26720886, 26240323, 25694369, 25279043, 24760752, 24341935, 24013055, 23737076, 23364191, 22908192, 22505078, 22237223, 21890642, 21536231, 21171822, 20945244, 20736381, 20467071, 20247737, 20075922, 19963621, 19853035, 19705232, 19458216, 19409795, 19385121, 19348474, 19303859, 19264728, 19152665, 19049761, 19077607, 19091546, 19082886, 19138044, 19215437, 19121226, 19149121, 19043616, 19128036, 19218420, 19159334, 19266841, 19239941, 19266100, 19303558, 19347434, 19482037, 19584409, 19547786, 19504749, 19541812, 19604760, 19667934, 19737553, 19705570, 19832726, 19865828, 19951088, 20013367, 20121996, 20252635, 20413510, 20706582, 21019607, 21290456, 21521137, 21891250, 22251734, 22591872, 23138023, 23705657, 24262787]
3291B4262787N73292P73604P62837P15800P80742R76257J153460J284423J347249
3282C2630451J528570J669915J828422K099842K310364K641718K745530L080117
3274E0534929L100454L270852L163507K821018K505162J987135J431973R08355
3266F9723385M46371R2492j93657l61437k80139k68630l00441l40927l16693m69860
3256F7730464q12148j223925j590600j919109k256349k720181l212758l401184
3248E0594210l751664l716987l419483l025138k645672k162480j821093j747652
3240B8304041j556022j255500r97027q43593q13824p74668n94583l45868m06537
3231B0716419l03518j65427m05014l39660k84639M1927J02398R1936K98008K51439
$$ y = [24262787, 24836079, 25609683, 26372520, 27088320, 27869062, 28845319, 29998779, 31283202, 32630451, 34159021, 35828936, 37657358, 39757200, 42067564, 44709282, 47454812, 50534929, 53635383, 56906235, 60069742, 62890760, 65395922, 67383057, 68815030, 69723385, 70169756, 70262248, 70068591, 69707154, 69427015, 69158385, 68857944, 68517017, 68200324, 67730464, 66918316, 65694391, 64103791, 62184682, 59928333, 57208152, 53995394, 50594210, 46842546, 43125559, 39706076, 36680938, 34035266, 31872786, 30051693, 28304041, 26748019, 25492519, 24495492, 23651899, 22838075, 22063407, 21468824, 21122956, 20716419, 20412901, 20247474, 19842460, 19502800, 19218161, 19260088, 19362486, 19454422, 19752430, 20003869]
3221B0003869P4534k92713n84093o72527n53928l39567j32597j48145j28138J03700
3211A7330395K38629J56909K05713K02904K45777Q1088Q8218p8805m48330o61205
3201A7361293p85411p74838p25577q45801p30049o32238m88969m80481m27575
3192A1470354l12006m02345k60771j98987k43261k96324j20889j14075j15441
3183I406255j87336j17390r7678j73444k13133j40362r0166n4349r5282q5027
3173H152088j36949o4815p1081j31940j17658j10282J0709q3233p3286l5487j36100
3162G201966j31483p5109r5424R073m4951j36029k05743r1358p2419k06138k02370
3151E950015k64293m2096j34947j21586j00799j91155j32628j30840j10229K9611
$$ y = [20003869, 20078403, 19785690, 19201597, 18529070, 17975142, 17635575, 17502978, 17354833, 17226695, 17330395, 17569024, 17725933, 17931646, 18134550, 18380327, 18461415, 18549633, 18470828, 18022498, 17361293, 16575882, 15801044, 15075467, 14229666, 13499617, 12867379, 12378410, 11897929, 11470354, 11158348, 10756003, 10495232, 10296245, 10052984, 9756660, 9635771, 9521696, 9406255, 9218919, 9101529, 9003851, 8830407, 8617274, 8476912, 8386746, 8332397, 8237115, 8152088, 8015139, 7950324, 7879243, 7747303, 7629645, 7519363, 7530072, 7446839, 7373553, 7338066, 7201966, 7070483, 6995374, 6899950, 6909023, 6864072, 6728043, 6522300, 6430942, 6358523, 6152385, 5950015, 5685722, 5643626, 5508679, 5387093, 5286294, 5095139, 4962511, 4831671, 4721442, 4751053]
3141D751053j38289l2958j8011p7292o5047M54j2319j25967j68334p2572l4550
3130D006168j41082q7878n375j09491m0513J8534n2626R1960j0936o2065n1996
3119C554700r1863L742K015o9129l7145l757K3370o5619M848L9585M1903l6534
3107C366116Q150R4424J17832P0016j16624n2648K0073J10097J36677M2220k739
3096C793594J51839P7526Q6395J96415K75241K86352K63340J35490j76423l87703
3086D702066l64310l23129k19022k07482r2942p4514j33733j13982q6795k5702
3076C060455j4138M0412j54271L4862O9237O2056k6677J16236J49260N565J09819
3065C452816K02584K47225K34114K02500J34381j35746m03408l57136k99778k99160
$$ y = [4751053, 4612764, 4579806, 4561795, 4484503, 4419456, 4419910, 4407591, 4281624, 4113290, 4040718, 4006168, 3865086, 3777208, 3771833, 3662342, 3621829, 3640363, 3587737, 3679697, 3668761, 3606696, 3554700, 3462837, 3466579, 3468594, 3399465, 3362320, 3358563, 3381933, 3316314, 3321162, 3360747, 3402650, 3366116, 3374266, 3468690, 3586522, 3656538, 3539914, 3487266, 3507339, 3617436, 3754113, 3796333, 3793594, 3945433, 4022959, 4109354, 4305769, 4581010, 4867362, 5130702, 5266192, 5089769, 4702066, 4337756, 4014627, 3795605, 3588123, 3495181, 3420667, 3286934, 3172952, 3086157, 3060455, 3046317, 3086729, 2932458, 2967320, 3036557, 3098613, 3071936, 3188172, 3337432, 3342997, 3452816, 3655400, 3902625, 4136739, 4339239, 4473620, 4337874, 3934466, 3577330, 3277552, 2978392]
3055B978392j27559k10068r6668p2395o0602j03795p2607m4133j30588j11819
3045A948158Q410n0969k5054n9857j6489L8777l7572o7542n9311n5067j5941l5692
3033A571851k6894m3753p33L6153n871L950n5440n5025l0516R778k081J1779M1592
3020A454790l2057j07966J1940l5188J3663k1977M2344m2361k4932j1508m2610
3009A204138m9245r540M9824q271L5165l9799p8650R6105R1015p6728m5273J34431
2997A303172j15227K8653P0868O5478L0474r1058L7302o3595j9842L0292k6501
2986A250016j0314K9041l4479O0213J40659m8724o8760J4275Q17K6955r6944o1814
2974A200941L5299Q0148o7948n0765J03968L8901R6890j07741j21572K9831J7752
$$ y = [2978392, 2850833, 2640765, 2544097, 2471702, 2411100, 2307305, 2234698, 2190565, 2059977, 1948158, 1956568, 1905599, 1880545, 1820688, 1804199, 1842976, 1805404, 1737862, 1678551, 1623484, 1607543, 1571851, 1544957, 1501204, 1500471, 1536624, 1530753, 1534703, 1479263, 1424238, 1393722, 1403500, 1401419, 1413198, 1454790, 1422733, 1314767, 1326707, 1291519, 1305182, 1283205, 1325549, 1283188, 1258256, 1246748, 1204138, 1154893, 1145353, 1195177, 1186906, 1222071, 1182272, 1103622, 1199727, 1290742, 1214014, 1168741, 1303172, 1187945, 1216598, 1287466, 1352944, 1383418, 1292360, 1329662, 1266067, 1246225, 1276517, 1250016, 1239702, 1268743, 1234264, 1294477, 1435136, 1386412, 1317652, 1331927, 1332744, 1359699, 1262755, 1200941, 1236240, 1316388, 1248440, 1197675, 1301643, 1340544, 1437434, 1329693, 1208121, 1237952, 1255704]
2963A255704O6557L4288r2684j06152M427j9145o5313n4064N4335P9029j02483
2952A054499p3429J17990O0465m7688J2999l8007M9981J0937K8893k0252n9386
2941A097002J5459J9764r8625J4623M7475R0512o0169k871K9533j75882L8910
2930A015731j8781K5614j8709J20956n712j21835K8872p8037k5021K6144L2001
2919I81223l2291P0582J0179j30819J06107J20957N5308q4973N783j09868L2309
2908A024497O2891J23487L1594K9330L0523j2108J15266p8435P781J31696p8754
2897A387768N7514L3243J2528J3638Q3015Q537N8592O7719J4217J09371J37783
2886A983925M7751Q3231Q9275J58874J92006K0382j66219j17084q5396j24184
$$ y = [1255704, 1322261, 1356549, 1263865, 1157713, 1162140, 1142995, 1077682, 1023618, 1077953, 1156982, 1054499, 981070, 1099060, 1159525, 1111837, 1124836, 1086829, 1136810, 1147747, 1176640, 1156388, 1097002, 1112461, 1132225, 1033600, 1048223, 1095698, 1186210, 1126041, 1123170, 1152703, 976821, 1015731, 996950, 1022564, 1003855, 1124811, 1119099, 997264, 1026136, 948099, 923078, 949222, 981223, 948932, 1019514, 1029693, 898874, 1004981, 1125938, 1181246, 1096273, 1102056, 992188, 1024497, 1087388, 1210875, 1242469, 1271799, 1302322, 1290214, 1405480, 1327045, 1334826, 1466522, 1387768, 1445282, 1478525, 1491053, 1504691, 1587706, 1596243, 1654835, 1722554, 1736771, 1846142, 1983925, 2031676, 2114907, 2204182, 2363056, 2555062, 2575444, 2409225, 2292141, 2206745, 2082561]
2876B082561j2979q1371o0803q2018m7006Q4433J79778K334P3671J7481N6376
2865B212457j07806J93380J24925m9142J6740k1070n2602n7274m0855O5342J4597
2854B298692J55365J0990N1883J2898m3683o3120k63242r2290p3472p2316N8759
2843A980464j55044j04862j9780n9070J5246O4766m6949L7385O2192r8129p2981
2832A603238m9523N16m0606j07463K7071k4898L6882l5259j29945O7055l8181
2821A308887K4579k2888J2142j2262o8251j9362j24665q562n5787J7158P3503
2810A124492r7107n3871l1999J2922j5851p3323k9323n7965j1330P889n1227j7858
2798G05449N6008P4932r8430o8510J6660n7473l9935M6639p4017p943M6467M08
$$ y = [2082561, 2069582, 1988211, 1927408, 1845390, 1798384, 1882817, 2062595, 2064929, 2138600, 2156081, 2212457, 2104651, 2298031, 2422956, 2373814, 2390554, 2369484, 2316882, 2259608, 2218753, 2284095, 2298692, 2454057, 2465047, 2516930, 2529828, 2486145, 2423025, 2159783, 2067493, 1994021, 1921705, 1980464, 1825420, 1720558, 1700778, 1641708, 1656954, 1721720, 1674771, 1712156, 1774348, 1676219, 1603238, 1553715, 1554231, 1513625, 1406162, 1433233, 1408335, 1445217, 1409958, 1280013, 1347068, 1308887, 1333466, 1310578, 1322720, 1310458, 1242207, 1222845, 1098180, 1089618, 1033831, 1050989, 1124492, 1027385, 973514, 941515, 954437, 938586, 865263, 835940, 777975, 766645, 774534, 723307, 705449, 761457, 836389, 737959, 669449, 686109, 628636, 588701, 635340, 561323, 553380, 599847, 600255]
2786F00255k3859r9419k0891J02873l4974n3658K6674J9538K631K0922m4791m6034
2774D49267j08087N1355q5743j807O2473J1735j80146n2664J13393R3143n74q4352
2762B67993O366O0803k0630n020p5835L6493l9013K6260o382L1779l721k6016
2750B53077j7647J1192k6766Q743L4850N7697j4702j58313L207l8717l6097k3138
2738E3386N0735o28o9897O0330N5054R1334J8590j7656o1097j08606J23455Q128
2726B03128r1539K6732J04265M3260r3090q0708j6936j08969J06357P5218L1426
2715A99144j00770m7287L6185l7598L098N9394K3738r0771K8750J3009m585J7243
2703I9550J819K0900m2079L0358k6465o5084M05N5621P2185n8364m9598j874L5366
$$ y = [600255, 576396, 476977, 456086, 558959, 523985, 470327, 497001, 516539, 519170, 540092, 495301, 449267, 341180, 392535, 306792, 304985, 367458, 379193, 199047, 146383, 259776, 352919, 352345, 267993, 274359, 335162, 314532, 309512, 233677, 270170, 231157, 257417, 251035, 282814, 279093, 253077, 235430, 246622, 219856, 228599, 263449, 321146, 306444, 148131, 151338, 112621, 76524, 53386, 104121, 103493, 33596, 93926, 148980, 240314, 258904, 241248, 180151, 71545, 195000, 203128, 111589, 138321, 242586, 285846, 192756, 112048, 95112, -13857, 92500, 167718, 199144, 98374, 51087, 87272, 49674, 52772, 112166, 135904, 45133, 73883, 86892, 82307, 99550, 101369, 122269, 80190, 110548, 84083, 18999, 19404, 75025, 147210, 88846, 39248, 37374, 72740]
2690G2740J03270j13313p6601O1684P8059q1822k0398P9251r774p5727J14612
2679A31981q251L0739j11069Q110l2341K3923J0709M0066p2770N2909j4615l3855
2667B5536P1536o0413J7211J8673J1907L692N9211j8370o8795O1219r1803o3500
2655c3896j03669Q3609N0588l9493m9844q93k098L359R6154O575O7771q6450j1065
2642a9352j12004R0708j563o9979j4384J15758J5344j9733O3525n2315K0062n6907
2630d0840j19475o7N7828m857L4422m1338K7108l6166l0660Q5984O7002J7473
2618A6414j15095k6965k2594Q3168k1976N5501N3198N4743n5747j24589l8798
2607a42740J41928N7811j11268M3122K7534m9938M8487o4143j15072O0671P7240
$$ y = [72740, 176010, 62697, -13904, 47780, 125839, 44017, 23619, 102870, 93096, 17369, 131981, 123730, 154469, 43400, 51510, 19169, 43092, 53801, 93867, 21097, 74006, 59391, 25536, 97072, 36659, 53870, 72543, 84450, 88142, 147353, 128983, 60188, 121407, 29604, -33896, -137565, -53956, -3368, -42861, -92705, -93598, -95696, -92337, 3817, 10392, 78163, -8287, -19352, -131356, -40648, -42211, -112190, -126574, -10816, 4528, -15205, 48320, -3995, 16067, -40840, -160315, -160382, -102554, -107411, -72989, -114327, -87219, -123385, -154045, -68061, -1059, 16414, -98681, -125646, -148240, -65072, -87048, -31547, 21651, 76394, 20647, -103942, -142740, -812, 56999, -54269, -11147, 16387, -33551, 14936, -49207, -164279, -103608, -26368]
2596b6368K1705j4461q2909M959O2696M2667l3043Q5048l8129j507J277p9394
2584e7459n2576L1178k1063j5271N445p4566N5738N4565j41068P6989M5446O3190
2572b9452L3193n4089K040N553k2509K2181Q888r5032o5579K7982O8560K2972
2560g5292q268K9719r5805K7045N9985R7463Q4159j4610q8765n0732p4007L4589
2548g4519q3646J8540L5258N2607o1488J3292L9721m1897N1867k8830R9342l3764
2536a3517J7228k7574m6181r9303J546r5631K11997l0662j0366P908L2691k8190
2524h0054l0589N4617L0090m2156K6828r3078o7655P6984l3167r2694J10181j19889
2512b60582M8929K09464m518j309m6721K6447j851m9240L0392l6071O72l9694
$$ y = [-26368, -4663, -19124, -102033, -97074, -34378, 8289, -24754, 60294, 22165, 20658, 21935, -57459, -110035, -78857, -99920, -115191, -109746, -184312, -128574, -74009, -215077, -138088, -92642, -29452, 3741, -50348, -48308, -42755, -65264, -43083, -34195, -129227, -194806, -166824, -98264, -75292, -83560, -53841, -149646, -122601, -62616, 34847, 119006, 104396, 15631, -35101, -109108, -74519, -158165, -139625, -104367, -51760, -113248, -99956, -60235, -102132, -50265, -79095, 20247, -13517, 3711, -23863, -70044, -169347, -167801, -263432, -51435, -82097, -92463, -84555, -51864, -80054, -110643, -56026, -25936, -68092, -41264, -134342, -201997, -125013, -158180, -250874, -140693, -260582, -211653, -2189, -6707, -8016, -54737, -28290, -30141, -79381, -48989, -85060, -84388, -124082]
2500a24082n8082k4600K1727q790k8658J25882j5986k86N9090P945p2806M6159
2488g2487R001l0223k8955o160Q3389M960q674k1363N3651j8464r0841P4453j01446
2475a53159k386Q2622n79r0136o1274Q6150R3098l5247M066j8293j692K865q6576
2462a80541N5458o1017n8622K0834R9069o282P2231Q0491j972p0937N2728J360
2450B800n1854l0005n6137J7887J037l1967n9323r919L1273O3960j58P5757m3628
2437i0277l8949l0208L0556J8316N8575P0514j03308O499M6612m7044K0936n0703
2425a08481j7256N21J4746j7220O518p2215P314J5072P4445q415n4232L3089M5930
2412h0184j8750o4282m651P9154o9024q9166J12301P8509m2131N7990n9811q1359
$$ y = [-124082, -182164, -206764, -185037, -193827, -222485, -96603, -112589, -112875, -53785, -45840, -118646, -72487, -63486, -93709, -122664, -128824, -45435, -40475, -49149, -70512, -16861, -35325, -126166, -51713, -153159, -155545, -72923, -73502, -163638, -224912, -138762, -45664, -80911, -76845, -95138, -96830, -93965, -180541, -125083, -186100, -244722, -223888, -124819, -131101, -58870, 21621, 19649, -51288, 1440, 2800, -49054, -79059, -135196, -117309, -116272, -148239, -207562, -217481, -186208, -122248, -122406, -46649, -90277, -129226, -159434, -128878, -110562, -51987, 18527, -84781, -78282, -31670, -78714, -57778, -108481, -125737, -125216, -110470, -127690, -121172, -193387, -186073, -171001, -96556, -104971, -159203, -126114, -80184, -98934, -163216, -167867, -88713, -157737, -246903, -134602, -56093, -98224, -40234, -100045, -181404]
2400a81404M1743N6340N5469j54075r098M7728N7278J0632m1975n3567O7439R3185
2388a0305J3587j9839k4950j20981M3156J3912p2822M0510J2765l1777O4195O8564
2376b3985L6504m1316j28064K0655O3660M0053n9456N086M1943j02514j1151M2299
2364a16286m8067n3241k907O6317k810K2337J6469K2388O5004R452n6660j982
2352g9986L8760N5785k1634o3038o064L7910o1283p9757J03513q5850Q9759P9115
2340G230n6183k3227O0083O4646j9571q5000O2204K3079l6081P2522J04368j43121
2328C0949m2582J9173q0446o7069j6098L7903K8272R6051n9103p1750r8675P6294
2316a47081k3660j1413l1723j721J43707K0712o2362k5991q3274J46520J6340
$$ y = [-181404, -139661, -83321, -27852, -181927, -191025, -143297, -86019, -75387, -117362, -170929, -103490, -10305, 3282, -16557, -41507, -162488, -119332, -105420, -178242, -137732, -124967, -156744, -92549, -23985, 12519, -28797, -156861, -136206, -72546, -32493, -91949, -86863, -44920, -147434, -158585, -116286, -164353, -217594, -220501, -154184, -156994, -134657, -118188, -95800, -30796, -21344, -78004, -79986, -41226, 14559, -7075, -70113, -76177, -38267, -99550, -179307, -75794, -161644, -71885, 7230, -48953, -72180, -12097, 52549, 32978, -52022, 10182, 33261, -2820, 69702, 174070, 30949, -11633, 7540, -72906, -139975, -156073, -118170, -89898, 6153, -52950, -124700, -223375, -147081, -170741, -182154, -213877, -215598, -71891, -51179, -113541, -139532, -222806, -76286, -59946]
2305e9946p3100K3790r1764p5635j9678P2049J23119O196p4428O821J5829N1414
2293i5333j8850L3458m3525N160L893K5655J05627j07950P44k5838K2266m6655
2281a41348N2465J100m6207l8231k5980n962J8163K3735M715M8573N7951q0545
2269a31571q1885J29328O3590m0032n6085k6363N932J5948L881J12409j6028q6932
2257a07808L7588Q2003N428l7650m710K0522n6952j0674L8811o9918P648j5098
2245a10810K3931n5058M7805N306k591O2033l1499j49030O5697J9263R015P6972
2233c8966j05902K3049o2277j5839J4401P2675R8007R8972p2826j4334j7879j4122
2221c5041r0162m38J5983L2166k0428Q7443l7275L0451O3171r317k8421N6658
$$ y = [-59946, -133046, -109256, -201020, -276655, -296333, -224284, -101165, -94969, -169397, -162576, -146747, -95333, -114183, -80725, -124250, -119090, -115197, -89542, 16085, -91865, -91121, -116959, -94693, -141348, -88883, -87783, -133990, -172221, -198201, -204163, -186000, -162265, -157550, -108977, -51026, -131571, -213456, -84128, -20538, -60570, -116655, -143018, -137086, -121138, -117257, -4848, -20876, -107808, -70220, 11783, 17211, -20439, -25149, -4627, -61579, -72253, -33442, -103360, -95712, -110810, -86879, -141937, -94132, -88826, -91417, -29384, -60883, -209913, -144216, -124953, -115938, -38966, -144868, -121819, -184096, -199935, -185534, -112859, -14852, 84120, 11294, -3040, -20919, -35041, -125203, -125641, -109658, -77492, -97920, -10477, -47752, -17301, 45870, 36553, 8132, 64790]
2209F4790j0310r6563j3033l2006P514M2312l6641Q3474M8509j12957j9198k0180
2197i4289j5527N365j0042R2064O305J100N6895L5638j02764o5377M0345k8481
2185g8768n548p930P9903n0323j12484J02938L3401m1072R8949j29237o4002J46184
2173b7989P5174m1736L4028N8553r8717K3852P5727j38236J9174R875r426L6429
2161A6708K5232l7038l7361j8985O6727M2437L9610o740P3192k656p6828J2208
2149I6506O6782r7899q0816R1255K6399J34227l022r7442k287J06806j8209l6118
2137A86182R9468k9383L4260L1451n3861k9221M336Q8318J5568J3987L0831K7627
2125D19563K3635k4338q1006M9273K9171J43531L4230p1223P2859m5101J7353
$$ y = [64790, 54480, -42083, -55116, -87122, -79608, -37296, -73937, 9537, 58046, -54911, -74109, -94289, -109816, -104451, -114493, -22429, -16124, -15024, 41871, 77509, -25255, -90632, -50287, -78768, -84316, -92246, -12343, -62666, -175150, -72212, -38811, -79883, 19066, -110171, -174173, -27989, 47185, 5449, 39477, 98030, -687, 23165, 98892, -39344, -20170, -10295, -19721, 16708, 41940, 4902, -32459, -51444, 15283, 57720, 97330, 90590, 163782, 161126, 84298, 96506, 163288, 65389, -15427, 75828, 102227, 236454, 233432, 135990, 133703, 240509, 222300, 186182, 285650, 256267, 290527, 321978, 268117, 238896, 243232, 331550, 347118, 361105, 391936, 419563, 443198, 418860, 337854, 387127, 416298, 559829, 594059, 522836, 595695, 550594, 567947]
2114E67947K1010m8918M9416k461Q0653J8289L2275K0313m2128J11819N1808K5993
2102H86016L8384J49654P0208J04068O443k5572O3661O8524J02482K7368J04802
2091A596038J07299M8425J28404O7592J68502n148J48191J64665J81513J56455
2081B761936K15078K49020K79043K11351L02576L84121M96203N86557P28231O25453
2071F839569Q54942J158634J472577J970525K663999K679967J993210L55961k746401
2062A7242983m051528l130647k070619j431668j004026p30388o22107m60508k73270
2053C468222l20712o7756k09377j59139j84520j94577k41420j40149k12658o3415
2043A674499j53233j09295q2472q6424n1552m4616L5712N138r5090r9972L6012
$$ y = [567947, 588957, 540039, 589455, 586994, 667647, 685936, 718211, 738524, 696396, 808215, 860023, 886016, 924400, 1074054, 1144262, 1248330, 1254773, 1229201, 1292862, 1361386, 1463868, 1491236, 1596038, 1703337, 1751762, 1880166, 1947758, 2116260, 2111112, 2259303, 2423968, 2605481, 2761936, 2977014, 3226034, 3505077, 3716428, 4019004, 4403125, 4899328, 5485885, 6214116, 6839569, 7694511, 8853145, 10325722, 12296247, 14960246, 17640213, 19633423, 19989384, 17242983, 13191455, 10060808, 7990189, 6558521, 5554495, 4824107, 4202000, 3741492, 3468222, 3147510, 3079754, 2870377, 2711238, 2526718, 2332141, 2090721, 1950572, 1737914, 1674499, 1521266, 1411971, 1329499, 1243075, 1191523, 1146907, 1182619, 1187757, 1092667, 992695, 1028707]
2032A028707j4172p7054j39907m8763N879p0193k7948L0680L6764o6394k4162
2021F33437O6022m5863q6184o1424N8650l1009r804P6541o3045j39774o671n6393
2009C34483n1371Q462l4280k836k7031Q5740k5489o4309j14015n5775Q7605J35916
1997B77100R4439o1225j19132O0387P259k6967m5863l7956J19290k142p3287p6830
1985A15073r277j9332K5358N9440J00157n9199L1041k9775j4672o7197j42255
1974a0638L2533L8515k1899J1612j8986K4089P8778K1647P0977j00242l8143m1851
1962D6392j7287J8519L1987m5917O6660n7790K7142k636r7466n0132N0324l0906
1950f1110K8693P3178n5540J64794p4181m3194Q8960j64878N0364k0591k4005
$$ y = [1028707, 1014535, 937481, 797574, 748811, 754690, 684497, 656549, 687229, 723993, 657599, 633437, 699459, 653596, 567412, 505988, 564638, 533629, 523825, 600366, 537321, 397547, 390876, 334483, 283112, 291574, 257294, 254458, 227427, 313167, 287678, 223369, 109354, 53579, 141184, 277100, 371539, 310314, 191182, 251569, 258828, 231861, 185998, 148042, 267332, 265190, 191903, 115073, 105796, 86464, 111822, 171262, 271419, 212220, 243261, 213486, 198814, 131617, -10638, 21895, 60410, 38511, 50123, 31137, 55226, 134004, 155651, 226628, 126386, 88243, 46392, 29105, 47624, 79611, 33694, 100354, 42564, 69706, 67070, -30396, -80528, -30204, -61110, -32417, 40761, -14779, 150015, 75834, 32640, 121600, -43278, 7086, -13505, -37510]
1939c7510k1260L8379M3655j09936P639l7467J00329R0223K02o6483j2977K4987
1927A9781j2121o8690Q6495R7380j13700k4701j36390M1512J38919n0259O6072
1916D4298k5931l962k9843m8332j5522N2183k2458J0390M932L334j0133J5188
1904b5856P920l1800N8896N6383k3675K247l774m0548j04731J3932P4506n6865
1892g3365O7078J12902L3365j20291j27570L4910R3456Q3998q7802k5989N7100
1881D7792p7070M0816N7913j35265j32908j2608J01676O075l655N8220N1734K7982
1869C0702Q833j10637J8151q2912J10642k7147j5613M8009k9676o2516p9871k7035
1857b19070M2444P485J06196K4718L0434m4020j05137M822K1960J45875j967o8998
$$ y = [-37510, -58770, -20391, 23264, -86672, -79033, -116500, -16171, 74052, 74254, 7771, -5206, 19781, 7660, -61030, 25465, 122845, 9145, -15556, -151946, -110434, 28485, -21774, 44298, 18367, 14405, -15438, -63770, -79292, -27109, -49567, -39177, -34245, -30911, -41044, -25856, -17936, -49736, 9160, 65543, 41868, 44115, 40341, -207, -104938, -91006, -16500, -73365, -6287, 106615, 139980, 19689, -107881, -72971, 20485, 104483, 16681, -9308, 47792, -29278, 11538, 69451, -65814, -198722, -211330, -109654, -103579, -107234, -49014, 2720, 30702, 39535, -71102, -52951, -135863, -25221, -52368, -67981, -19972, -49648, -112164, -192035, -219070, -176626, -169141, -62945, -38227, -7793, -51813, -156950, -152128, -130168, 15707, 13740, -55258]
1845e5258k369L4239m5820p6197L3571J26559j2302o333J2107p3521J33071q1067
1833a3320n4655K4430n2202L9684o899N0253O6187o6627o8243N3401m2906j5070
1821h5967m8086Q9902m6302j6147L7915K6088j2517J347O8993l4027j3129M1074
1809I144k7540j4655L238J08134o8341j7408Q6655p6779M3195R6100j32393n2267
1797d2917o1755K7767M6514O3334O835k0667p62R885K4113j24366n702R5984r9823
1784h1560j336O2737J13756o9063n105k9404m1034j01079o8591J26858J91919
1773I8098j11734p5746J10387k1497k2811L7673q3064l9959j4112J23094K0603
1762B0932j05704M0356N2394o8997l6252J36627l0131p8750M6290L3023m1411
$$ y = [-55258, -57627, -23388, -69208, -145405, -111834, 14725, 2423, -3910, 8197, -65324, 67747, -13320, -67975, -43545, -95747, -56063, -62962, -12709, 53478, -13149, -81392, -27991, -70897, -85967, -134053, -44151, -90453, -106600, -68685, -42597, -55114, -53767, 15226, -18801, -31930, 9144, -18396, -33051, -29813, 78321, 9980, -7428, 79227, 2448, 45643, 141743, 9350, -42917, -104672, -76905, -30391, 32943, 39778, 19111, 18349, 28234, 52347, -72019, -77721, 18263, -81560, -82896, -20159, 93597, 24534, 19429, -9975, -51009, -152088, -220679, -93821, 98098, -13636, -89382, 21005, -492, -23303, 14370, -68694, -108653, -122765, 329, 20932, -84772, -44416, 7978, -61019, -97271, 39356, 9225, -69525, -23235, 9788, -31623]
1751c1623j7910l0296n0322J15804L3467J13880m6285j21864k8409o1950o574
1740a32082j5275P9149r4266Q5840P059J11541L9748O311j23840j18735O2955
1729i1595J9545j6088J0701j83926P9699J41815l2553N154J7636Q870k4209J8431
1717d6520m8314j4882Q7306m482K0983K8056M6869j6869n5287r2617j6555K7371
1705h4941M9826L4520n5509J32520m2421j61779q684R0384m6619M225J6398k3977
1693i6057n8671P2605J18184q2900M5722l1209K3109j74476l5171P6919K6789
1682a15156J7212K5395N7139K7597j03643j8448O1166N8308p2286J0601L2249
1671a9866P074j7916l2273O3079j103m6173o5447p748l6840O7388m6382L5556
$$ y = [-31623, -49533, -79829, -130151, -14347, 19120, 133000, 86715, -35149, -63558, -125508, -132082, -147357, -68208, -162474, -76634, -69575, 41966, 81714, 88025, -35815, -154550, -91595, -72050, -88138, -77437, -261363, -181664, -39849, -72402, -67248, -49612, -40742, -64951, -46520, -94834, -109716, -22410, -26892, -5909, 22147, 69016, 52147, -3140, -95757, -112312, -84941, -35115, -595, -56104, 76416, 33995, -127784, -136468, -46084, -92703, -88478, -72080, -96057, -154728, -82123, 36061, -46839, -1117, -32326, -9217, -183693, -218864, -141945, -115156, -97944, -72549, -15410, 12187, -91456, -109904, -48738, 9570, -62716, -52115, -19866, -12792, -30708, -62981, 98, -1005, -47178, -112625, -120373, -157213, -89825, -136207, -100651]
1659a00651R3446l6536N8473k76k1364j43071J9743P8296N0435L284k9776k6430
1647e4427k2657L1860L2237L6923j02894R9019m2596j35005J1398p0980Q3781
1636a33341P0477l2008k2144n0712K7949R0135J04217o765p4683m9685K4050L0129
1624b2381p9287m4738M1331J1010n461O6871J0881R288j2707o5269k92J901J11079
1611B2226q5037O329j7536l1785q3325J67973N6854j24495o5961J0231o511J21453
1599b9584l0308j02781M133K4812J07985m4188J5516Q3974o4916K8289m4814r1123
1587a43005k4140J08977J05516k6061k5721o0422j0760l3239P5860q6659R8619
1576b1035l1003l5440K4921Q6460m5294r3691N7283j9756k261J33531L8033j48314
$$ y = [-100651, -7205, -43741, 14732, 14456, -6908, -149979, -130236, -51940, -1505, 1779, -27997, -54427, -77084, -45224, -12987, 23936, -78958, 20061, -22535, -157540, -146142, -217122, -133341, -62864, -94872, -117016, -167728, -139779, -49644, 54573, 47808, -26875, -76560, -52510, -22381, -101668, -146406, -105075, -94065, -99526, -32655, -21774, -12486, -25193, -90462, -90754, -88853, 22226, -62811, -56482, -74018, -105803, -189128, -21155, 35699, -88796, -154757, -144526, -151037, -29584, -59892, -162673, -158540, -133728, -25743, -69931, -54415, 29559, -35357, -7068, -51882, -143005, -167145, -58168, 47348, 21287, -4434, -64856, -75616, -108855, -32995, -119654, -21035, -52038, -87478, -62557, 23903, -21391, -115082, -57799, -77555, -79816, 53715, 91748, -56566]
1564e6566O0688k1473k2544m1309k0924L2617Q1002m6846m3428Q4742P9957j9620
1552F6296n2959J375o7979O0251O106r2758j6908j8757Q1277r2151J2728J8160
1540i5319m4162P705O1549P786M1426o473M5329J2407o9372K5564M1983O7947
1528I6370j50866q4034R7838K3319k1632n5826o2169N4448L8970J5874k0044N763
1516f1989O499O7239m7389L3797m1417l3662K6605M3259k2737l3821P730o4984
1504a20870K6629J12281J3255m7106r3429n7204J31475J9671Q0770p5401j81010
1493a90939M2521N9185M406Q336L3863J19864k3159m6132n0014m5249P5664M0801
1481B9147Q973l0628j4615l0853q57p5673r018K6399K3688m4688J2484j5347O1866
$$ y = [-56566, 4122, -17351, -39895, -81204, -102128, -69511, 11491, -35355, -78783, 5959, 85916, 66296, 13337, 14712, -53267, 6984, 13090, -79668, -96576, -115333, -34056, -126207, -113479, -95319, -139481, -131776, -70227, -62441, -21015, -27488, 17841, 30248, -39124, -13560, 28423, 96370, -54496, -138530, -40692, -17373, -39005, -94831, -157000, -102552, -63582, -47708, -67752, -61989, -55490, 11749, -35640, -1843, -43260, -76922, -50317, -7058, -29795, -63616, -55886, -120870, -94241, 18040, 31295, -15811, -109240, -166444, -34969, -15298, 65472, -9929, -190939, -148418, -89233, -84827, -76491, -42628, 77236, 54077, 7945, -42069, -87318, -11654, 29147, 38120, 7492, -7123, -37976, -38833, -114506, -123524, -97125, -73437, -118125, -105641, -120988, -59122]
1468e9122L7292k6572Q1873l7420n1127k0865N6775J213k3033K9373j03587J6192
1456i9008R9053J2342K3986L0197p2255n6174r3343J38610J6910j11778k4280
1445a35740R6960M3298r6736N3375J6047n7470O7118N2253k535p4216n0775m7403
1433a35824N2458o9492Q3439o2699l3853N0087J44133j2008j25506J60765q7783
1422c6283j1724N0893q5361L7059N4714o5665K6540K8164K4725n6157Q978K184
1410b1933L9026k1378L6109l8065R4932n7397j2781L7472p986r8963o5068O1492
1398e4540J02332p8847o4317N6741n3830k2762J13007l3645J9895J28803k6971
1387H5866j08030R698N933M2677P1366j6967r2100p6468l0502P783Q1573N7072
$$ y = [-59122, -21830, -48402, 33471, -3949, -55076, -75941, -19166, -17953, -40986, -11613, -115200, -99008, 45, 12387, 36373, 66570, -5685, -61859, -155202, -16592, 318, -111460, -135740, -38780, 4518, -92218, -38843, -22796, -80266, -13148, 39105, 36570, -37646, -88421, -135824, -83366, -152858, -69419, -132118, -165971, -115884, 28249, 16241, -109265, 51500, -36283, -48007, 2886, -82475, -45416, 9298, -56367, -29827, -1663, 23062, -33095, -24117, -21933, 17093, -4285, 31824, -6241, 88691, 31294, 18513, 55985, 47999, -50964, -116032, -54540, 47792, -31055, -95372, -38631, -92461, -115223, -2216, -35861, -15966, 112837, 85866, -22164, -12466, -6533, 36144, 107510, 90543, -1557, -78025, -108527, -100744, -19171, 37901]
1375C7901j0764j11312L5847K6482o1888K389J39694m5568o3084n0697L9222L9938
1363b1840k1607l2129J00101L2021o1067j9924K161R1477o0314m4496n7479M2576
1351e0520O572N4925l0859o2262R1840Q3665p8094j24722P7321L2002M3554K6461
1339F9883r0396o0202K0482k235k1221R9391L5501K1027k9185L3842O3531P8l1492
1326A09004p9965o2697k7791K2098q5939L4568P0669M1135J1407q7390j26207
1315a81108R081N3433P0889l4293j3212N0517K7437j1438l0978N5147l8143k0976
1303f3644K6393M1793l3325m1473k069Q8538k6480n4865O2077O4352L6073j5327
1291H2043n4545n8014j3378R8327r210m2125J0012m1582l2621n2572Q8508n733
$$ y = [37901, 27137, -84175, -48328, -21846, -83734, -81345, 58349, 12781, -50303, -101000, -61778, -21840, -43447, -75576, 24525, 56546, -4521, -24445, -22284, 69193, 8879, -35617, -93096, -50520, -43948, 10977, -19882, -82144, 9696, 93361, 15267, -109455, -32134, -132, 43422, 69883, -20513, -80715, -60233, -62468, -83689, 15702, 51203, 72230, 43045, 76887, 140418, 140496, 109004, 29039, -33658, -61449, -39351, -125290, -90722, -20053, 21082, 32489, -54901, -181108, -172027, -118594, -47705, -81998, -95210, -44693, -17256, -28694, -59672, -4525, -42668, -63644, -37251, 4542, -28783, -70256, -72325, 16213, -10267, -65132, -3055, 61297, 97370, 82043, 27498, -30516, -43894, 54433, 45223, 3098, 13110, -28472, -61093, -113665, -25157, -30890]
1279c0890l8963K060m591M8442k6523J16839l2490J9745j7731q4853o4060p8235
1267a91250J0899J03123O4629N3707J5763q5322M9311o4211o8510P1466N8817
1256A8422k9240M0809K6615L0942p5491n6274M376K0202Q3309k2509j09830j7873
1244h6542L0452N7302J8035O8649N5244r8020q4747J6698K6047Q6009l3199o2001
1232f073r0834J04267m1169O5121k4380O337L9591J7169r7061n4790j9954N8603
1220d3173j8977l0932M2385N741j14041N8721P4562j16553O373N1342R2185K4344
1208C1977n0483Q1210J0565m2734N8118j07873q6973L043J06814o6112N9711O759
1196D022m2632m088O4761n768K3400k0838K3219j19636Q2220N8265L654m3166
$$ y = [-30890, -69853, -67793, -72384, -23942, -50465, 66374, 33884, 53629, 35898, -48955, -113015, -191250, -180351, -77228, -12599, 41108, 56871, -28451, 20860, -43351, -111861, -40395, 18422, -10818, 29991, 56606, 87548, 12057, -44217, -39841, -19639, 63670, 41161, -68669, -86542, -56090, 1212, 19247, 87896, 143140, 45120, -39627, -22929, 3118, 89127, 55928, -6073, -96907, 7360, -33809, 31312, 6932, 13269, 52860, 70029, -27032, -81822, -101776, -43173, -62150, -93082, -50697, -44956, -158997, -100276, -25714, -142267, -135894, -84552, 7633, 31977, -18506, 62704, 73269, 30535, 88653, -19220, -106193, -103150, 3664, -62448, -2737, 4022, -38610, -42698, 22063, 16295, 39695, 18857, 42076, -77560, 4660, 62925, 66579, 23413]
1184B3413k4892K7658p6565J2982L2486j3108L3551j9440n8055n8414J30243m6047
1172c6188l7226O7819j1030j4412K1211K2391J3844o2262M7316J5642L8527J30808
1160A96440j39400j43663J61462m1742Q923J3096l0811O6839j5356L699n5949
1149B3538o2059j9337n4892J02894M9076j06288K4369L9296p8962m237K6606j01725
1137a61721J22278q204N4067m3042p846L4429K6020n1210l5334k9004J14902p4837
1125e9502j1556j8954M566j9455K342O9006M2471k3152o1006P7838L828K7356
1113C3782m3323O736N752j1238L443K9607j7063J8652N471M4767j6278O3382m0110
1100H3580q7001p4858L6021J65842q7053j02880o9982Q3296L5319L007l6950o2908
$$ y = [23413, -1479, 26179, -50386, -37404, -4918, -18026, 15525, -3915, -61970, -120384, 9859, -36188, -73414, -5595, -16625, -31037, -9826, 12565, 26409, -35853, 11463, 27105, 65632, 196440, 57040, -86623, 74839, 33097, 42020, 55116, 24305, 91144, 75788, 79487, 23538, -38521, -57858, -112750, -9856, 39220, -67068, -42699, -3403, -82365, -86602, -59996, -161721, -39443, -47647, 6420, -36622, -44468, -10039, 15981, -35229, -70563, -99567, 15335, -59502, -71058, -90012, -85446, -104901, -102559, -33553, 8918, -14234, -75240, 2598, 6426, 33782, -9541, -2805, 2947, -8291, -4848, 24759, 7696, 26348, 31819, 76586, 60308, 123690, 83580, -3421, -78279, -42258, 123584, 36531, -66349, -136331, -53035, -17716, -14709, -51659, -114567]
1088a14567K6436m3706Q7322L2217o2880k0009J44757L4977p9676O7746q2596
1077i979o8961P1129O1021O7327j4631r6552L5343p7021k1507N5484k7648N2271
1065B6276k8896L6782j049J3346N5518o4661p5178K7040o3752k4445M3836j5004
1053g0187P8119o08n2770q5939N9283J0110j6407Q4173Q4273k0356q2640K9765
1041A6816J59312r9398n415J2026p8797n2739k648j00211M1832J11770k6194J04540
1029H0894J2491J4344j09442j61822M9931Q9389l965L3397q5317M6942j9296K2674
1017b9780k3193o2787j1159K8173L0024p505P1737p339K1526O5756j0965K7717
1005I2205o5842p428K9351K7276j303J8802J014k1315n978m5582P0439j58507
$$ y = [-114567, -88131, -131837, -44515, -12298, -75178, -95187, 49570, 84547, 4871, 72617, -9979, -78940, -7811, 53210, 120537, 105906, 9354, 44697, -32324, -53831, 1653, -25995, 26276, -2620, 34162, 33113, 46459, 101977, 37316, -37862, -10822, -74574, -99019, -55183, -70187, 7932, 7324, -45446, -131385, -72102, -61992, -78399, 5774, 90047, 69691, -12949, 16816, 176128, 76730, 71315, 83341, 4544, -48195, -50843, -151054, -109222, 2548, -23646, 80894, 93385, 107729, -1713, -163535, -113604, -24215, -28180, 5217, -80100, -33158, -52454, -29780, -52973, -115760, -126919, -98746, -68722, -76227, -4490, -11829, 9697, 75453, 64488, 92205, 26363, 18935, 48286, 75562, 74259, 93061, 94075, 72760, 66782, 21200, 91639, -66868]
993f6868k5784M4596J3762p4581n3986P91O2255J00835K5882P613o3528M2717
981A3704o56j02546l7882Q5076O1601k9590q531j6177M4375K2477p3538L2807
969h880j8835J1348K0006R5646p0510q1517k0243R2856l2645O2281j8552K8101
957E9056n5314m984P129q994J3284m0109Q9312n5110R774j04271K1779P1809j7433
944a4072n8276O3192O701P0698n6349M0076K5095j5459k6305j2795o6665O0254
932A6095l13j0548o178k8775J46908j9227r4037J52140Q228n3244n3734q1911
920b4596K3657N3611J5535m6617P5314k3757k119m2486p280O3463M6852k331m5030
907H4216r240N4482J6997p1988K2604K6422j25470j0432M756R2119r577r1120
$$ y = [-66868, -92652, -48056, -34294, -108875, -162861, -162070, -99815, 1020, 26902, 34515, -29013, 13704, 13048, -89498, -127380, -42304, 19297, -10293, -18824, -35001, 9374, 31851, -41687, -8880, -27715, -16367, 3639, 99285, 28775, -52742, -72985, 19871, -12774, 49507, 30955, 59056, 3742, -1242, 5887, -3107, 10177, -29932, 59380, 4270, 14044, -90227, -68448, 3361, -14072, -72348, -9156, -2455, 68243, 11894, 51970, 77065, 61606, 35301, 22506, -44159, 16095, 15782, 5234, -944, -29719, 117189, 97962, 3925, 156065, 164293, 111049, 57315, -24596, -939, 52672, 68207, 21590, 96904, 73147, 71028, 28542, 21262, 84725, 131577, 129246, 84216, 74976, 129458, 146455, 74467, 97071, 123493, -1977, -12409, -7653, 84466, 74889, -16231]
895a6231M0679K9073n4937o7535P2570J6718Q7211O360p5955M0229P969M2377
883A28528p0413J5298m8600N4507N8111n5720j45676L9241J24221R4940p2411
872A22026r2704K3728q0163r167j5046Q0062n0342l6122j3211Q0232O2446o5222
860F517j20926L4549j8199o073Q3208J15731j02781q8720L7108M4116J6383M8637
848D9550j7242k8406K172m6492L199O744r7568K0748R4489O922P0343o2818n1130
835d9489k1800k6267k4353M3784j7342R3632n9857J4739N3982p2902L4273O1322
823B9722L195L8152M9k5691n2153m1759L4091N18l3005O2889k759Q097m5040J1245
809a2449j8389O0656J2189k7571J09421M5233m6054m8876j6342j31298N720M3799
$$ y = [-16231, 24448, 53521, -1416, -68951, 3619, 20337, 107548, 113908, 37953, 78182, 86151, 128528, 58115, 73413, 24813, 79320, 137431, 81711, -63965, -24724, 99497, 194437, 122026, 29322, 53050, -27113, -36280, -51326, 28736, -21606, -57728, -70939, 9293, 71739, 6517, -114409, -79860, -98059, -104132, -20924, 94807, -7974, -96694, -59586, -15470, 913, 49550, 32308, 3902, 6074, -40418, -37219, -30475, -128043, -107295, -12806, -5884, 64459, 1641, -49489, -71289, -97556, -121909, -78125, -95467, -1835, -61692, -46953, 7029, -65873, -31600, 29722, 32917, 71069, 71118, 45427, -6726, -48485, -14394, -13876, -46881, 16008, 13249, 21346, -23694, -12449, -30838, 29818, 42007, 14436, 123857, 169090, 123036, 74160, 57818, -73480, -67760, -23961]
797b3961M9354J9568k0235J371N6796o7460N4833J06032j00586j61644R0877Q7353
785I2298p8724o3109j4240N4440O3460N4444k5730q7591N7541N2902q6487l7203
773a7999J39033j7045q2862K565j9099O7720J7553k3590k696k7562m7086J9521
761H453P1442r391j2086m9373L6268K4016n3989m4789L7948N3354N704m6313l4404
748a3160n8528J2635J4588o4552R4472o0304N1131N0097k1826K7804J0897j8677
736B4577J06775j8100m9387n1242K2342j3919j5213J9473K1498P248n188R0296
724A39160j6611o9177o5305l1447l841J23925k6675o5615K5070O3674L3094l1884
712G4368k7265P1574o0131l4357p210k0327R6367O3845l7311j8557k631q6614
$$ y = [-23961, 25393, 44961, 24726, 26097, 82893, 15433, 70266, 176298, 75712, -85932, 4945, 92298, 13574, -49535, -63775, -9335, 54125, 108569, 82839, -4752, 52789, 105691, 19204, -17999, 121034, 103989, 21127, 23692, 4593, 72313, 89866, 66276, 63580, 36018, -11068, 8453, 79895, 70504, 58418, 9045, 45313, 69329, 15340, -29449, 8499, 61853, 67557, 21244, -13160, -71688, -59053, -44465, -109017, -14545, -74849, -23718, 26379, 4553, 32357, 43254, 24577, 131352, 113252, 63865, 12623, 34965, 21046, 5833, 25306, 46804, 54052, 48864, 139160, 122549, 53372, -11933, -43380, -47221, 76704, 50029, -15586, 9484, 73158, 106252, 74368, 47103, 118677, 58546, 24189, 16979, -3348, 93019, 156864, 119553, 100996, 98365, 11751]
700A1751l8480j6308j4702R2308l6093K8667n4342l1015P0459J12518R482p9716
688E4529n545n1582j79608J23000L4792o7026J50024k6487o0230j523J06242q3107
676f521o3151J17896N9229p3422n9178R6437M886k1171L5606q256O5797l7217
664A10935q4672l0546J34410M3599n4456L5424l9941o4148k8074M7010O812O880
652H3233l1818N352J9178j24885O4618k1059m2166n1069J06872R9429J3958o4146
640E7497L9794m6634j24529l6899O3044J37859l204n0081L068M8023k9115j6679
628D2144l2683L3042J6926j0129l1166m9298J1042R0285l8449N9514O9162j73505
616a3115N2755n1231O5283K3467J5493J2496k7701K4290o419r088M1839N1104
$$ y = [11751, -26729, -43037, -57739, 34569, -1524, 27143, -27199, -58214, 12245, 124763, 134245, 54529, 48984, -2598, -182206, -59206, -24414, -91440, 58584, 32097, -28133, -29656, 76586, -6521, -69672, 48224, 107453, 34031, -25147, 71290, 76176, 55005, 90611, 82355, 148152, 110935, 26263, -4283, 130127, 173726, 119270, 154694, 114753, 50605, 22531, 69541, 76353, 83233, 51415, 56767, 75945, -48940, 15678, -5381, -47547, -98616, 8256, 107685, 121643, 57497, 97291, 50657, -73872, -110771, -47727, 90132, 86928, 36847, 39915, 87938, 58823, 42144, 9461, 42503, 59429, 49300, 18134, -31164, -20122, 70163, 31714, 91228, 160390, -13115, 39640, -11591, 53692, 77159, 92652, 105148, 77447, 101737, 95318, 86230, 128069, 179173]
604A79173r8557J7110r6524J5478P0454p3761r1614n1126Q4196N5901j9655J8912
592I987l5446m0912R6234L9592K6913K2038j36815N4114k9441J1553M4757K4689
580H7263P0844Q5552j4917n1018m4848k2942k1390r9478o8715P2067M2869l6495
568a208M1319l755m8607L8642m2622L8758m5881O8537Q8264p3486m0441K0250
556C9770L2984Q405L2499p6461l5113N121j33739M1755R5467o624m917Q2417o8727
543A2837k2123Q9515j9275L205Q023k0273n1729N978l074O4930r591K2451j4635
530F6239p9972J767R2543q8118J5861O3970R1594K5086p3410p0320M7888J7090
518A10218n2964m4516K5593R0903k7055n2934K3785L4969j0114L4937l4345o0683
$$ y = [179173, 80616, 97726, 1202, 16680, 87134, 13373, -78241, -129367, -45171, 10730, -8925, 9987, -25459, -66371, 29863, 69455, 96368, 118406, -18409, 35705, 6264, 17817, 62574, 87263, 158107, 243659, 228742, 177724, 132876, 109934, 88544, -10934, -79649, -7582, 35287, -1208, 40111, 36356, -12251, 26391, -16231, 22527, -23354, 45183, 133447, 59961, 19520, 39770, 72754, 81159, 113658, 37197, 2084, 7205, -126534, -84779, 10688, 4064, -853, 81564, 12837, -9286, 80229, 60954, 64159, 72182, 51909, 180, 6158, 3084, 68014, 58423, 80874, 66239, -13733, -11966, 80577, -7541, 8320, 72290, 163884, 188970, 115560, 45240, 93128, 110218, 57254, 12738, 38331, 129234, 102179, 49245, 73030, 107999, 97885, 132822, 98477, 37794]
506C7794K9915K2071J3716p0353o0969O9440L4200J3017Q422p1123L5013j00108
494c8965M1813K7790K2365M1016K0882j4709l3187J1106k798l670L1153O028p596
481A01228J0138j11035j0188M5948M5152N2428J8213l968N0128k4206k9147m8638
469I6053j06496M2186j3276J8807R9760m7197m4105J5357l068p4599J2996K6032
457B2450P3820j6483J06663L116N9301j39637m5105J00249k8412j800k0573n3060
445F0529m9387J1592K7320M344j0717R046R8458J2799o0568M6390p4385l5360
433D0061O5809m897l0211K7659K6283m7391K1460n6186q831J7010K2657n6336
421A7087M6179p835N0374K3620p1866j4586O3735m8703k1415P1956p4315j7552
$$ y = [37794, 67709, 89780, 103496, 33143, -27826, 41614, 75814, 88831, 97253, 26130, 61143, -38965, 2848, 30638, 53003, 94019, 114901, 100192, 67005, 78111, 75313, 71643, 102796, 108824, 101228, 111366, 331, -9857, 36091, 81243, 133671, 151884, 147916, 198044, 173838, 144691, 96053, -10443, 31743, 18467, 37274, 137034, 89837, 45732, 61089, 58021, -16578, -3582, 22450, 96270, 79787, 186450, 189566, 248867, 109230, 64125, 164374, 135962, 134162, 113589, 60529, 11142, 22734, 50054, 54398, 43681, 52727, 151185, 163984, 103416, 149806, 75421, 40061, 105870, 100973, 70762, 98421, 124704, 77313, 98773, 42587, 33756, 50766, 73423, 17087, 63266, 55431, 105805, 129425, 57559, 42973, 106708, 58005, 36590, 108546, 34231, 16679]
409A6679j5872L2861P1848J3679m7445K7085J4818Q210o3625l9785j4953K7926
397C1426l2301p785Q0718J1296o2485p0518O4409L9902K9649l711N0296l3888
385I7008o754P7042j42438O4987L3378n1717o9311J23584j6716J853K8025Q008
$$ y = [16679, 807, 33668, 105516, 119195, 71750, 98835, 113653, 121863, 58238, 18453, 3500, 31426, -875, -8660, 72058, 83354, 20869, -49649, 14760, 54662, 84311, 80600, 130896, 97008, 90254, 167296, 24858, 89845, 123223, 71506, 2195, 125779, 109063, 110916, 138941, 146949]
$$ [...]
##END NTUPLES=NMR SPECTRUM
##END=
