##TITLE=1H_CA-9081-3
 CDCl3
 8 sc, 
 26.10.2022
##JCAMPDX= 6.0         $$ Bruker NMR JCAMP-DX V2.0
##DATA TYPE= NMR SPECTRUM
##DATA CLASS= NTUPLES
##ORIGIN= UXNMR, Bruker Analytische Messtechnik GmbH
##OWNER= root
$$ XWIN-NMR		Version 3.5
$$ Wed Oct 26 15:21:22 2022 Russian Standard Time (UT+4h)  she@DPX200
##.OBSERVE FREQUENCY= 200.1313499994
##.OBSERVE NUCLEUS= ^1H
##.ACQUISITION MODE= SIMULTANEOUS
##.ACQUISITION SCHEME= undefined
##.AVERAGES= 8
##.DIGITISER RES= 18
##SPECTROMETER/DATA SYSTEM= spect
##.PULSE SEQUENCE= zg30
##.SOLVENT NAME= CDCl3
##.SHIFT REFERENCE= (INTERNAL, CDCl3, 0, 15.7469)
##AUDIT TRAIL= $$ (NUMBER, WHEN, WHO, WHERE, WHAT)
$$ ##TITLE= Audit trail, XWIN-NMR		Version 3.5
$$ ##JCAMPDX= 5.01
$$ ##ORIGIN= Bruker BioSpin GmbH
$$ ##OWNER= she
$$ F:/spectra/data/she/nmr/H-F/1/pdata/1/auditp.txt
$$ ##AUDIT TRAIL=  $$ (NUMBER, WHEN, WHO, WHERE, WHAT)
(   1,<2022-10-26 15:19:10.78 +0400>,<she>,<DPX200>,
      <created by zg, POWCHK disabled, PULCHK disabled
       configuration hash MD5:
       00 E9 B6 7A A2 85 ED C7 34 08 36 98 17 FE 4E 26
       data hash MD5: 16K
       74 D5 3D 4E 5F E4 9D A7 B2 C4 45 84 46 4A 81 27>)
(   2,<2022-10-26 15:19:13.03 +0400>,<she>,<DPX200>,
      <Start of raw data processing
       efp BC_mod = 2 LB = 0.24 FT_mod = 6 PKNL = 1 PHC0 = -18399.64 PHC1 = 21.4007 SI = 16K 
       data hash MD5: 16K
       F3 19 D7 2F E4 67 3A 66 72 A8 00 F5 F3 B0 34 41>)
(   3,<2022-10-26 15:19:37.21 +0400>,<she>,<DPX200>,
      <pk PHC0 = 4.215247 PHC1 = -7.6 
       data hash MD5: 16K
       54 03 E6 F0 DD 06 64 31 F0 D6 45 31 81 97 52 22>)
(   4,<2022-10-26 15:19:40.65 +0400>,<she>,<DPX200>,
      <abs ABSG = 5 
       data hash MD5: 16K
       7E CC D0 FA D8 7E D1 6C 41 03 B8 E8 69 00 A8 9A>)
$$ ##END=
$$ 
$$ hash MD5
$$ 7F 0A 8F 64 B3 AB FB BD 10 4E D0 5F 85 31 88 74
##$RELAX= 
##$RELAX= 
##$RELAX= 
##$RELAX= 
##$RELAX= 
##$RELAX= 
$$ Bruker specific parameters
$$ --------------------------
##$DU= <F:/spectra>
##$EXPNO= 1
##$NAME= <H-F>
##$PROCNO= 1
##$TYPE= <nmr>
##$USER= <she>
##$AMP= (0..31)
100 100 100 100 100 100 100 100 100 100 100 100 100 100 100 100 100 100 
100 100 100 100 100 100 100 100 100 100 100 100 100 100 
##$AQSEQ= 0
##$AQ_mod= 1
##$AUNM= <au_zg>
##$AUTOPOS= <>
##$BF1= 200.13
##$BF2= 200.13
##$BF3= 200.13
##$BF4= 200.13
##$BF5= 200.13
##$BF6= 200.13
##$BF7= 200.13
##$BF8= 200.13
##$BYTORDA= 1
##$CFDGTYP= 0
##$CFRGTYP= 5
##$CHEMSTR= <none>
##$CNST= (0..31)
1 1 145 1 1 1 1 1 1 1 1 1 1 1 1 1 1 1 1 1 1 1 1 1 1 1 1 1 1 1 1 1 
##$CPDPRG= <>
##$CPDPRG1= <>
##$CPDPRG2= <>
##$CPDPRG3= <>
##$CPDPRG4= <mlev>
##$CPDPRG5= <mlev>
##$CPDPRG6= <mlev>
##$CPDPRG7= <mlev>
##$CPDPRG8= <mlev>
##$CPDPRGB= <>
##$CPDPRGT= <>
##$D= (0..31)
0 1.2 0 0 0 0 0 0 0 0.06 0 0.03 0 0 0 0 0.0002 0 0 0 0 0 0 0 0 0 0 0 0 
0 0 0 
##$DATE= 1666783150
##$DBL= (0..7)
120 120 120 120 120 120 120 120 
##$DBP= (0..7)
150 150 150 150 150 150 150 150 
##$DBP07= 0
##$DBPNAM0= <>
##$DBPNAM1= <>
##$DBPNAM2= <>
##$DBPNAM3= <>
##$DBPNAM4= <>
$$ [...]
##$SUBNAM3= <"">
##$SUBNAM4= <"">
##$SUBNAM5= <"">
##$SUBNAM6= <"">
##$SUBNAM7= <"">
##$SUBNAM8= <"">
##$SUBNAM9= <"">
##$SW= 18.0517283424941
##$SWIBOX= (0..15)
0 0 2 0 0 0 0 0 0 0 0 0 0 0 0 0 
##$SW_h= 3612.71676300578
##$TD= 16384
##$TD0= 1
##$TE= 0
##$TE2= 300
##$TE3= 300
##$TEG= 300
##$TL= (0..7)
0 120 120 120 120 120 120 120 
##$TP= (0..7)
150 150 150 150 150 150 150 150 
##$TP07= 0
##$TPNAME0= <>
##$TPNAME1= <>
##$TPNAME2= <>
##$TPNAME3= <>
##$TPNAME4= <>
##$TPNAME5= <>
##$TPNAME6= <>
##$TPNAME7= <>
##$TPOAL= (0..7)
0.5 0.5 0.5 0.5 0.5 0.5 0.5 0.5 
##$TPOFFS= (0..7)
0 0 0 0 0 0 0 0 
##$TUNHIN= 0
##$TUNHOUT= 0
##$TUNXOUT= 0
##$USERA1= <user>
##$USERA2= <user>
##$USERA3= <user>
##$USERA4= <user>
##$USERA5= <user>
##$V9= 5
##$VALIST= <valist>
##$VCLIST= <CCCCCCCCCCCCCCC>
##$VD= 0
##$VDLIST= <DDDDDDDDDDDDDDD>
##$VPLIST= <PPPPPPPPPPPPPPP>
##$VTLIST= <TTTTTTTTTTTTTTT>
##$WBST= 1024
##$WBSW= 4
##$XGAIN= (0..3)
0 0 0 0 
##$XL= 0
##$YL= 0
##$YMAX_a= 344338
##$YMIN_a= -533620
##$ZGOPTNS= <>
##$ZL1= 120
##$ZL2= 120
##$ZL3= 120
##$ZL4= 120
##$ABSF1= 15.74469
##$ABSF2= -2.307159
##$ABSG= 5
##$ABSL= 3
##$ALPHA= 0
##$AQORDER= 0
##$ASSFAC= 0
##$ASSFACI= 0
##$ASSFACX= 0
##$ASSWID= 0
##$AUNMP= <proc_1d>
##$AZFE= 0.1
##$AZFW= 0.1
##$BCFW= 0
##$BC_mod= 2
##$BYTORDP= 0
##$COROFFS= 0
##$CY= -3
##$DATMOD= 1
##$DC= 0
##$DFILT= <>
##$DTYPP= 0
##$F1P= 0
##$F2P= 0
##$FCOR= 1
##$FTSIZE= 16384
##$FT_mod= 6
##$GAMMA= 0
##$GB= 0
##$INTBC= 1
##$INTSCL= 3.70164e-10
##$ISEN= 128
##$LB= 0.24
##$LEV0= 0
##$LPBIN= 0
##$MAXI= 10000
##$MC2= 0
##$MEAN= 0
##$ME_mod= 0
##$MI= 1.114404
##$NCOEF= 0
##$NC_proc= -6
##$NLEV= 6
##$NOISF1= 3.799351
##$NOISF2= 2.8
##$NSP= 0
##$NTH_PI= 0
##$NZP= 0
##$OFFSET= 15.74689
##$PC= 1
##$PHC0= -18395.43
##$PHC1= 13.8007
##$PH_mod= 1
##$PKNL= yes
##$PPARMOD= 0
##$PSCAL= 0
##$PSIGN= 0
##$REVERSE= no
##$SF= 200.130004933139
##$SI= 16384
##$SIGF1= 3
##$SIGF2= 2
##$SINO= 5.538805
##$SIOLD= 16384
##$SREGLST= <1H.CDCl3>
##$SSB= 0
##$STSI= 16384
##$STSR= 0
##$SW_p= 3612.71676300578
##$SYMM= 0
##$S_DEV= 0
##$TDeff= 16384
##$TDoff= 0
##$TI= <>
##$TILT= no
##$TM1= 0
##$TM2= 0
##$TOPLEV= 0
##$USERP1= <user>
##$USERP2= <user>
##$USERP3= <user>
##$USERP4= <user>
##$USERP5= <user>
##$WDW= 1
##$XDIM= 16384
##$YMAX_p= 369919832
##$YMIN_p= -489484
$$ End of Bruker specific parameters
$$ ---------------------------------
##NTUPLES= NMR SPECTRUM
##VAR_NAME=  FREQUENCY,     SPECTRUM/REAL,   SPECTRUM/IMAG
##SYMBOL=    X,             R,               I
##VAR_TYPE=  INDEPENDENT,   DEPENDENT,       DEPENDENT
##VAR_FORM=  AFFN,          ASDF,            ASDF
##VAR_DIM=   16384,         16384,           16384
##UNITS=     HZ,            ARBITRARY UNITS, ARBITRARY UNITS
##FACTOR=    0.220516191357247, 1,           1
##FIRST=     3151.42518700128, 0,            0
##LAST=      -461.291576004496, 0,           0
##MIN=       -461.291576004496, -489484,     0
##MAX=       3151.42518700128, 369919832,    0
$$ Real data points
##PAGE= N=1
##DATA TABLE= (X++(R..R)), XYDATA
$$ [...]
6442B1035103r65274p38209m23420k16834j20114J40770N03131N31185N44991
6433B0291329P99760R92573J237203J520388J328030J223444J013142K61213m94268
6424B8172814j331596k050932k114753k191257k003696j793506j575407j143684
6416A3967983r57269r18821o04918m66532m03585k96656k72530k06530q5716J086
6406I756512O8448M4889K2108J02641M3440P2650J04942j76016m06365o85797
6396H947452o61008o88215n81188n31589m80615m42052l69226k57134l03896k46317
6386D386212j84519j86411k66021q9579q9415j75019j42157j36681j56513r0842
6376B869055r7748j50247r687p7569q2677K2694l970J2832p7021j69031k23009
$$ plain form
6442 21035103 20069829 19331620 18908200 18691366 18571252 18712022 19215153 19746338 20291329
6433 20291329 21091089 22083662 23320865 24841253 26169283 27392727 28405869 28667082 28172814
6424 28172814 26841218 24790286 22675533 20484276 18480580 16687074 15111667 13967983
6416 13967983 13010714 12091893 11486975 11020443 10616858 10320202 10047672 9841142 9755426 9756512
6406 9756512 9824960 9869849 9891957 9994598 10038038 10110688 10215630 10039614 9633249 8947452
6396 8947452 8286444 7598229 7017041 6485452 6004837 5562785 5193559 4936425 4632529 4386212
6386 4386212 4201693 4015282 3749261 3659682 3570267 3395248 3253091 3116410 2959897 2869055
6376 2869055 2771307 2621060 2611373 2533804 2451127 2473821 2469851 2482683 2405662 2236631 2013622
6365B013622n2123p297p6742R017N879j21996L9346r1832p3807r0044R6610M8180
6353A698813j8782j08918O06p8153n1876j21L5638l2784k0143k8087o1394Q9453
6341A424252R3626o2912p9309l1472J1987j5154j77255o2837m3882n8539j40598
6330H57907L886L9382J4477o5338o0582J11893M2042k7851p3634o6001m3442N682
6318G38421L5257k8564L5418n8323N7466j561k6042j16234l6208N0366l9202m8373
6306E62421M5690J41885m8708j0119L422L923j01261l896P1858p1996J324L5620
6294F30163L507m5262O789J26618m7740k2131R4180j32381l7783R9795P0325K8302
6282G74382j11014p6826J54096P1925k9383M4171j08844J9379K2677p8296p3803
$$ plain form
6365 2013622 1961499 1954202 1877460 1886477 1892356 1770360 1809706 1717874 1644067 1554023 1650633 1698813
6353 1698813 1680031 1571113 1571719 1493566 1441690 1441569 1477207 1444423 1424280 1396193 1334799 1424252
6341 1424252 1517878 1454966 1375657 1344185 1356172 1341018 1163763 1100926 1057044 998505 857907
6330 857907 861793 901175 915652 850314 789732 901625 943667 915816 842182 776181 732739 738421
6318 738421 773678 745114 780532 722209 779675 778114 752072 635838 599630 649996 610794 562421
6306 562421 608111 749996 701288 691169 694591 698514 597253 593357 665215 593219 594543 630163
6294 630163 633670 588408 595197 721815 674075 651944 746124 613743 575960 675755 746080 774382
6282 774382 663368 586542 740638 812563 783180 827351 718507 737886 760563 682267 608464
6271F08464o6204L6730j59494P2434J52771q8425R4790J28763o1285R1087n5122
6260G54509j5481m3667r5243K8385J31552l1463k31851j7503P6742j04506M3899
6249D95373N4957O1728j00013K0724Q7761j94109J13839L2091L789n5345r0916
6238D29879o2346O2743R5328k9269j5128J75919J3149j21007L2520J23421o8431
6227F36778l1129j02643j17690O5823l2212r705J02303K4827o025j05160L0277
6216D55444J02186l3076m3945n6172r567L0222R5819j03122o7498m8956M658K36778
6204E62771L4888r2413o0360l6162K1830m9854n2266N2389n4826n7153O0112o9249
6192B59707O3833N7140J2434j04977P8390R85j18893M9769J2438M8579k637m2062
$$ plain form
6271 608464 542260 578990 419496 491930 644701 556276 651066 779829 718544 809631 754509
6260 754509 739028 695361 600118 628503 760055 728592 496741 479238 555980 451474 495373
6249 495373 550330 612058 512045 532769 620530 426421 540260 572351 576140 520795 429879
6238 429879 367533 430276 525604 496335 481207 657126 670275 549268 581788 705209 636778
6227 636778 605649 503006 385316 451139 418927 409222 511525 536352 530327 425167 455444
6216 455444 557630 524554 480609 424437 414870 445092 540911 437789 370291 321335 325993 562771
6204 562771 597659 505246 444886 408724 430554 380700 328434 380823 325997 268844 328956 259707
6192 259707 323540 380680 393114 288137 366527 367512 248619 298388 310826 359405 356768 314706
6180C14706m3633K8489O2176l4610n2932M4675L6452q5832p3869J10727P2880
6169C79229q4125j1397n6194j2796O2496L6016p9290k077k2224M7290k7083J38318
6157C68163L097q9849K5614R856Q685j20112j1834q6697O9239O1906j935k1940
6145B14193j038Q04K2687O4073r544J1428j479l2394k9575Q1160O1403o0918n2167
6132B68633j05060Q0840N241K3634L9111n6090O5694M0983q2326o0899k666m2708
6120A74387K706n8917Q6689R6105n2291O5865q28p0157j40139o385J49225N7219
6108C03479K9401L0887l473j36948O6458O4901J6582Q0069j18919K8480k07N1136
6096D11846K2122K5671J5697j0713m445j29103k511P4272M4866j5148r3215p4793
$$ plain form
6180 314706 271073 299562 361738 327128 274196 318871 355323 269491 195622 306349 379229
6169 379229 295104 283707 227513 214717 277213 313229 233939 231862 209638 256928 229845 368163
6157 368163 371260 281411 307025 316881 325566 205454 193620 106923 176162 238068 236133 214193
6145 214193 213155 213959 236646 300719 291175 302603 301124 268730 239155 320315 381718 320800 268633
6132 268633 163573 244413 249654 273288 312399 256309 322003 362986 280660 219761 217095 174387
6120 174387 177093 118176 204865 300970 248679 314544 313716 243559 103420 97035 246260 303479
6108 303479 332880 363767 360294 223346 289804 354705 371287 451356 332437 360917 360710 411846
6096 411846 433968 459639 475336 464623 460178 331075 328564 402836 447702 432554 339339 264546
6084B64546l8905M5898o8858J18567j418J7477n9581j850J06890j5411k6438r102
6072C31815J35635k1326r2313j32663q368N9352l9918R2366k3169P8806o707j25334
6060B48176M0136N9745O0795r0720O6115q713j8640o7083l8907L3362K8850q5037
6048B28079N9710J96736l8787n8601k4556O2466J1553O0695k05J90Q1786q8239
6036D90827j39553k647O1576j8845K3614j0837Q6357m8753k9151p951j01889n7127
6024B45621L4522R4940m0132N4969n3717m8011J21195J09748o1798o3185M3809
6013D37961K3907j532n0510N2381L0453l9171j4053M786m267p4605M5113R998
6001D20461N4079P5777n3044j08286l6693j3056n2696J50074j06529M2457n1126
$$ plain form
6084 264546 225641 271539 202681 321248 319830 337307 277726 275876 382766 367355 340917 331815
6072 331815 467450 446124 353811 221148 212780 272132 232214 324580 301411 380217 373510 248176
6060 248176 288312 348057 408852 318132 384247 375534 356894 289811 250904 284266 313116 228079
6048 228079 287789 484525 445738 387137 362581 425047 436600 497295 497090 497280 579066 490827
6036 490827 351274 348627 410203 391358 414972 404135 490492 441739 412588 404637 302748 245621
6024 245621 280143 375083 334951 389920 336203 288192 409387 519135 457337 394152 437961
6013 437961 461868 460336 409826 462207 492660 453489 439436 444222 439955 365350 410463 420461
6001 420461 474540 550317 497273 388987 352294 339238 286542 436616 330087 372544 321418
5990C21418J3332O2492q7594J9603L0075J5136q979n0447o7860j7586J41319j9668
5978C51241R0897j324J27940R5735o3681k2335N0639p4000O7142Q4050n4308m3620
5966F08376P737J34631j67677r5717J4958J34485P8822K7551j25891M4187o4556
5955E96906n9640N6390K0909r8759J10904m4214l0022J8249P9n0572m3015J50957
5943F28172l6902j3586k9992J21573J6058M5963L1712Q1758M4184m2535O1226
5932I07631K5856p095K1770M245m9690r2606j23608M2863m3694M0640q1900n5543
5920E88869p0626J12175J54196q6664j07527m3520J33674J18840o9671k2525j9509
5909F87712N8242M5931L456j0720j80492J05399J05628R5927J15419n133n469
$$ plain form
5990 321418 334750 397242 309648 329251 359326 374462 365483 315036 247176 229590 370909 351241
5978 351241 442138 440814 568754 664489 600808 578473 629112 555112 622254 706304 651996 608376
5966 608376 616113 750744 583067 487350 502308 636793 715615 743166 617275 661462 596906
5955 596906 537266 593656 614565 515806 626710 582496 552474 570723 570802 520230 477215 628172
5943 628172 591270 577684 547692 669265 685323 731286 762998 844756 888940 846405 907631
5932 907631 933487 926392 948162 952407 902717 810111 686503 729366 685672 726312 644412 588869
5920 588869 518243 630418 784614 697950 590423 546903 680577 799417 729746 707221 687712
5909 687712 745954 791885 795341 784621 604129 709528 815156 911083 1026502 1021369 1015900
5898A015900k8753J2080J72103o0066j15110R8515J0698J44463o5148j27165M8034
5887A105551Q6857o984j78141L0461J297l3591l0439J06764r1440j78559M2634
5876H54410m693J1746L7157L5846Q6485j3225k5262M9676j01602M464J77289k2070
5864A090221J03314k581L5306Q9562N6554O2467N6367J62596J51095J37270m389
5853A937782j34763m4339j06309k17380j27702k14024j0420o4895M0783l0648
5843A028085j4169m7855k2574N2486k8694L4397k7168k9039l1705o7852J80507
5832A026419O3115L4582l7954K2983J44917k826J34432R8999K11594J7520j2974
5821A700807Q7023M7361p7152k19187j08332j28403q04k14980q4474L1646L0288
$$ plain form
5898 1015900 987147 999227 1171330 1111264 996154 1094669 1105367 1249830 1184682 1057517 1105551
5887 1105551 1192408 1185424 1007283 1037744 1039041 1005450 975011 1081775 990335 811776 854410
5876 854410 849717 861463 898620 934466 1020951 1007726 982464 1032140 930538 935002 1112291 1090221
5864 1090221 1193535 1190954 1226260 1315822 1372376 1434843 1491210 1653806 1804901 1942171 1937782
5853 1937782 1803019 1758680 1652371 1434991 1307289 1093265 1082845 1017950 1058733 1028085
5843 1028085 1013916 966061 943487 995973 967279 1001676 974508 945469 913764 845912 1026419
5832 1026419 1089534 1124116 1086162 1109145 1254062 1251236 1385668 1484667 1696261 1713781 1700807
5821 1700807 1787830 1835191 1758039 1538852 1430520 1302117 1301313 1086333 1001859 1033505 1063793
5810A063793r3781k0193j6751j33761J2849r606N588L5817L4666j0456k5354J04153
5798I46964O608j65525J33549l6946O6540O2432J6748R0858n5523l1364j16932
5787I17409l0847O9929o6694j30597K2599O338m7232K8452n0780k7321j33911
5776E57345j7343r4931Q0933P7518L8686Q8123n9241j13720l196O4033K175n1140
5764E69242K5834L624n4232J7765k559j11828n7260K0452J23328N0717m9567l2707
5752E02809j11331N9142l0157k9112J12543Q4549O9909j21959J9136n165r0774
5741D59590q88J01471J086Q597j60510J10648Q9906l2603K6013M9918n3064r4009
5729E06155J69001M7587r6686Q8920K7077n8672J7364r43M7265o2481o2185K4886
$$ plain form
5810 1063793 970012 949819 933068 799307 812156 802550 808138 843955 878621 868165 842811 946964
5798 946964 953572 788047 921596 884650 951190 1013622 1030370 1121228 1065705 1034341 917409
5787 917409 886562 956491 889797 759200 781799 788137 740905 769357 718577 691256 557345
5776 557345 540002 445071 526004 603522 642208 730331 671090 557370 554174 618207 620382 569242
5764 569242 595076 598700 544468 562233 559674 447846 390586 411038 534366 585083 535516 502809
5752 502809 391478 450620 420463 391351 503894 588443 658352 536393 555529 550364 459590
5741 459590 458702 560173 561259 569856 409346 519994 609900 577297 603310 653228 600164 506155
5729 506155 675156 722743 626057 714977 742054 683382 700746 699803 747068 684587 622402 647288
5717F47288l8263R9956m025j7555K8666j8532n6164o2144Q7277p8033J40519J2593
5705G41583N1567r7889J9664J6892N3445Q5067L7545j00207R961m6026R5500K5124
5693H92226k3528n6440L9371l069r0479Q0178N4172n2657j25253P342J7971J2587
5681G52421P8498R4474o5436K4115J5549j00247M5552k7619K9243m140j4037k1673
5669H06700M4910L3524l9375K68O3713n2530j25322n4887O9087l4561q7343k5910
5657E98274O8883J44760n7791m2363m266j7482m6189O9411m0310k600o7563N2308
5645F55072j28021j52767m3487J89681J97504o4259l8744m1808K8197J15589q0425
5634F36532k3783m2617n171J06165l8249m9109l0188J6466J12994M3294j1137
$$ plain form
5717 647288 609025 708981 704956 687401 716067 697535 641371 579227 666504 588471 728990 741583
5705 741583 793150 695261 714925 731817 785262 870329 907874 807667 817628 771602 867102 892226
5693 892226 868698 812258 851629 848560 758081 838259 892431 839774 714521 721863 739834 752421
5681 752421 830919 925393 859957 884072 899621 799374 844926 817307 846550 842410 828373 806700
5669 806700 851610 885134 845759 846027 909740 857210 731888 677001 746088 711527 624184 598274
5657 598274 667157 811917 754126 711763 707497 690015 643826 713237 672927 670327 602764 655072
5645 655072 527051 374284 330797 520478 717982 653723 614979 573171 601368 716957 636532
5634 636532 612749 570132 564961 671126 632877 583768 553580 570046 683040 726334 715197
5623G15197k275m2695M070N2165K4199L9293p1256j55445K8735K2685n1854L3234
5611E96053Q1263P4274Q233n7636r4701N3760J90655o6217j39662N9615o8163
5600F37474k4990P896O7909J03021p4776q1288n4731J07574N7969J4044K2793
5589G82895N378j31805M5954N1336j00446J30069R8775r120j3040k5771r0872
5578G43353O286j2271K7156J08653K7561j06052Q833J14404K2754q1959O779J11287
5566I76784P4750j32082M8394J33097k4699O639M5335n9137L0091L7221o5370
5555A071023j3790k532O2211K0930Q7565R4331m1761j7943j4904j9438L9246j38552
5543A126386k1404J54761R250j57621R2440J24294l0911J5824J38843J6867P4535
$$ plain form
5623 715197 712922 670227 674297 726462 750661 789954 718698 563253 591988 614673 562819 596053
5611 596053 677316 751590 759823 702187 607486 661246 851901 785684 646022 705637 637474
5600 637474 612484 620380 688289 791310 716534 635246 580515 688089 746058 760102 782895
5589 782895 788273 656468 702422 753758 653312 783381 882156 873036 859996 834225 743353
5578 743353 749639 737368 764524 873177 900738 794686 803519 917923 940677 858718 865497 976784
5566 976784 1051534 919452 967846 1100943 1076244 1082883 1128218 1069081 1099172 1136393 1071023
5555 1071023 1057233 1054701 1116912 1137842 1225407 1319738 1277977 1260034 1245130 1225692 1264938 1126386
5543 1126386 1104982 1259743 1268993 1111372 1203812 1328106 1297195 1313019 1451862 1468729 1543264
5532A543264R3295k0955j14860O6935K53729q616O7650p1566o406J22803J9339
5521A944612j5367n4310P2934j07651l4462Q2912N4000M0797l5122O3564m621
5510B007286P2513P9156o2321m4060J5948P747p9192J61970J19038Q4913l9543
5499B323455J187k7811J35220M6067j9260J29726L0003L2311p4421J14455M3917
5488B734849n3484K9761J33646J10884J9816j43810k3256Q0725J10263p2245o1386
5477B865763N7900R0941J65902N9093O1353P9991l8682j15267J15102J59515J77207
5466C678818j01900m1952K55785J1088P9868J17731M5401O8068L2462j1571Q2360
5455D216158J18950J50171N1252R4950J62291L4187k3176P3372J94952J15514
$$ plain form
5532 1543264 1636559 1615604 1500744 1567679 1821408 1812792 1880442 1808876 1802470 1925273 1944612
5521 1944612 1929245 1874935 1947869 1840218 1805756 1888668 1942668 1983465 1948343 2011907 2007286
5510 2007286 2079799 2158955 2096634 2052574 2068522 2076269 1997077 2159047 2278085 2362998 2323455
5499 2323455 2324642 2296831 2432051 2478118 2458858 2588584 2618587 2650898 2576477 2690932 2734849
5488 2734849 2681365 2711126 2844772 2955656 2975472 2831662 2808406 2889131 2999394 2927149 2865763
5477 2865763 2923663 3014604 3180506 3239599 3300952 3380943 3342261 3226994 3342096 3501611 3678818
5466 3678818 3576918 3534966 3790751 3801839 3881707 3999438 4044839 4112907 4145369 4133798 4216158
5455 4216158 4335108 4485279 4536531 4631481 4793772 4827959 4804783 4878155 5073107 5188621
5445E188621P9503R4479R0475K42668j3793J6131J76513K44044K32766J60934
5435F512341Q368K18631K70670K23575K85234J44706J52545K33093L57341J45787
5425H552291L50558K98134K84979L74924L16886L68645L63633N03700M50769K86312
5415A2150831L56964M79451O53984N85233N90968P24337Q54459R07515Q42720
5406A8146462R26985J244100J445172J693070J749248K024569K415979K664749
5398C2310334K834982K876716K665236K456013J578215M68874l65414j096097
5390D3728859j076776q21385o48831m33107m94581o14240p01351q30949p50911
5381C7356728n02689k56265J72726M48076Q44574J193618J703457K272227K507523
$$ plain form
5445 5188621 5268124 5362603 5453078 5695746 5681953 5698084 5874597 6118641 6351407 6512341
5435 6512341 6520709 6739340 7010010 7233585 7518819 7663525 7816070 8049163 8406504 8552291
5425 8552291 8902849 9200983 9485962 9860886 10177772 10546417 10910050 11413750 11864519 12150831
5415 12150831 12507795 12987246 13641230 14226463 14817431 15541768 16396227 17303742 18146462
5406 18146462 19073447 20317547 21762719 23455789 25205037 27229606 29645585 32310334
5398 32310334 35145316 38022032 40687268 43143281 44721496 45190370 44824956 43728859
5390 43728859 42652083 41830698 41181867 40748760 40254179 39639939 38938588 38107639 37356728
5381 37356728 36854039 36597774 36770500 37218576 38063150 39256768 40960225 43232452 45739975
5372D5739975L165028L635368L936157M182637M208554L698031K991211J835741
5364G3392702J049515M13683j6605J55199K42292M52818M32200K57569o64051
5355G5715322k171239l707214m855891n057609m635112m102436l342010k566050
5347D5277761k029360j534420r24546k27409R4285N88864R63021J243344J587429
5338D5038969J676891J701160J158620R33094P07917O05195R88517P60587P13562
5329E4284512K71449p20247k093470l307030m023959m108799l951809l398526
5321C2952121k848469k421220k245380j807039j561725j337919j190183j077327
5313A8462859q44777p51676o04769o86478o29094m83436m37376l89674m67034
$$ plain form
5372 45739975 48905003 52540371 56476528 60659165 64867719 68565750 71556961 73392702
5364 73392702 74442217 74855900 74839295 74994494 75236786 75689604 76121804 76379373 75715322
5355 75715322 73544083 69836869 64980978 59923369 55288257 51185821 47843811 45277761
5347 45277761 43248401 41713981 40789435 40562026 40656311 41245175 42208196 43451540 45038969
5338 45038969 46715860 48417020 49575640 50508734 51216651 51821846 52810363 53570950 54284512
5329 54284512 54555961 53835714 51742244 48435214 44411255 40302456 36350647 32952121
5321 32952121 30103652 27682432 25437052 23630013 22068288 20730369 19540186 18462859
5313 18462859 17618082 16866406 16261637 15575159 14946065 14462629 14025253 13635579 13168545
5304A3168545k63088k14766m02583j32691l84640j00227m5955j84471j12983j68990
5294A1158151k87788k65026p9706j74235j84590k9486j65482r6073r1666j64904
5284I619195l83240l00191r5893j48954j42427R680K1513j33684j7003J0675M6763
5273H486434l2270m5250Q9535o625n744N2857M4348R0817L782q330L5527J4582
5261H719663L3758Q2291r223P7128l754M7106K9957L0226J6212n7781k550J97320
5249I160353J56527k5633J88982N3766Q7844L18224K27196J71326J15656K01021
5239A0655262J76466L86249L25914J88819M25531L35841L10796M07608N30380
5230A3742866M21773L81198K95969N29318N82511N39612O25261Q19183R11454
$$ plain form
5304 13168545 12905457 12690691 12288108 12155417 11770777 11670550 11624595 11440124 11327141 11158151
5294 11158151 10870363 10605337 10525631 10351396 10166806 10137320 9971838 9875765 9784099 9619195
5284 9619195 9235955 8935764 8839871 8690917 8548490 8558170 8579683 8445999 8428996 8439671 8486434
5273 8486434 8454164 8408914 8498449 8491824 8486080 8538937 8583285 8674102 8677884 8669554 8705081 8719663
5261 8719663 8753421 8835712 8826489 8903617 8899863 8946969 8976926 9007152 9023364 8965583 8963033 9160353
5249 9160353 9316880 9291247 9480229 9533995 9621839 9940063 10167259 10338585 10454241 10655262
5239 10655262 10831728 11217977 11543891 11732710 12158241 12494082 12804878 13212486 13742866
5230 13742866 14164639 14545837 14841806 15371124 15953635 16493247 17118508 17937691 18849145
5221A8849145P52754J030833J024223J124828J449814J573757J800643J939219
5213B9545216K395635K577401K873772L261389L758181L760388L807780L522673
5205E5502435K651663J474179j39738j011125j730166j717923j353095j183576
5197E2492654r37131r33096j054693j199879j190527q80103o80509m2726M31668
5188D6005658Q96586J641834K069698K538495L057048L503004L691124L774975
5180F7178422L422658K504315J432959L95096l53791q18132r26890p52139r96560
5171G1085938j025122j212439j412592j601727j580594j954338k610891l214476
5163E6473759l818538l736124l328726k828701k351230j702594j276754q95902
$$ plain form
5221 18849145 19601899 20632732 21656955 22781783 24231597 25805354 27605997 29545216
5213 29545216 31940851 34518252 37392024 40653413 44411594 48171982 51979762 55502435
5205 55502435 58154098 59628277 59488539 58477414 56747248 55029325 53676230 52492654
5197 52492654 51555523 50622427 49567734 48367855 47177328 46297225 45616716 45573990 46005658
5188 46005658 46902244 48544078 50613776 53152271 56209319 59712323 63403447 67178422
5180 67178422 70601080 73105395 74538354 74933450 74579659 73761527 72834637 72082498 71085938
5171 71085938 70060816 68848377 67435785 65834058 64253464 62299126 59688235 56473759
5163 56473759 52655221 48919097 45590371 42761670 40410440 38707846 37431092 36535190
5155C6535190n07531m2089L20209M46190N09584P21721P73831O62815N34707N86963
5145D0541590M06865M88931L77962M03375l1999r14552j958419k757940l098173
5136C3457640k997590k777770k415389k046523j828669j498102j280254j073897
5128A7539446j099817p55110q49510o43689o51385m68684n90992n16518l02302
5119A1661439m83382m73575l82222k75838k28363k20194j29539j85790j00743
5110I181793p0463k50688j70141k95062j63187k16783j58098j40692n3229k09328
5100G454122k78985O4032o6960k37875j74168m04317k07777m9239k23126k78573
5090E597134j18260j6641j83756j05853j3439j39958n1762l7088J648m5346l2196
$$ plain form
5155 36535190 36027659 35985570 36305779 36751969 37261553 37983274 38757105 39419920 39954627 40541590
5145 40541590 40948455 41437386 41815348 42218723 42186724 41272172 39313753 36555813 33457640
5136 33457640 30460050 27682280 25266891 23220368 21391699 19893597 18613343 17539446
5128 17539446 16439629 15684519 14835009 14191320 13539935 13071251 12480259 11963741 11661439
5119 11661439 11178057 10704482 10322260 10046422 9818059 9597865 9468326 9282536 9181793
5110 9181793 9111330 8860642 8690501 8395439 8232252 8015469 7857371 7716679 7663450 7454122
5100 7454122 7175137 7239169 7172209 6934334 6760166 6355849 6148072 6098833 5875707 5597134
5090 5597134 5478874 5462233 5278477 5172624 5159185 5019227 4967465 4930377 4932025 4886679 4854483
5079D854483l0787r9338j36150j6168r6449k02317R9518L6498j83243J0636M82
5068D237165j31267j69011j60800p491J6400q9687n5935q8452j18107j0934M8917
5057C470798O9842L8366j23087j89996m7993K0009j49907j2636M715m211O7550
5046C143450j82889n1654l8502p892k4085o3r7280M3269r7700q7988M6120m2306
5034B602480Q7553J24202j1997J5389j6893j0523O1335J02177J33724m1099l9868
5023C006480j1886N9048J10293m3475p7977L5966L1621j35646j9473j8566q7668
5012B848717j12593O6596k1904j23520p488o3255N30p6807j44074l9444O3729
5001B390487Q6015m3962L2743O3860j9761L1659L9313j11621J7304M9984j724
$$ plain form
5079 4854483 4823696 4724358 4588208 4572040 4475591 4273274 4372792 4409290 4226047 4236683 4237165
5068 4237165 4105898 3936887 3776087 3768596 3784996 3695309 3639374 3550922 3432815 3421881 3470798
5057 3470798 3540640 3579006 3455919 3265923 3217930 3237939 3088032 3075396 3080111 3075900 3143450
5046 3143450 2960561 2908907 2870405 2862513 2838428 2838365 2741085 2784354 2686654 2598666 2644786 2602480
5034 2602480 2690033 2814235 2802238 2817627 2800734 2790211 2851546 2953723 3087447 3046348 3006480
5023 3006480 2994594 3053642 3163935 3120460 3042483 3078449 3110070 2974424 2954951 2936385 2848717
5012 2848717 2736124 2802720 2780816 2657296 2649808 2586553 2587083 2510276 2366202 2326758 2390487
5001 2390487 2476502 2432540 2465283 2529143 2509382 2541041 2580354 2468733 2486037 2536021 2534297
4990B534297P1886m4762k1642k4952r2632L1720N8855j47310j96382o5834o9555
4979B033689j23345L779k8806j03939r2980Q7859L9571o2767L9634r8880j1886
4968A681929J16125m5879r0285q9573N953l9771J19369n7661J73327k897j58593
4957A612044M0016j39401J8475M2609K5132K8769J60928k80929o1552Q4495P0024
4946A600610j212q9717j33037k0047N1981r8631J00267M8215J11620N447r9749
4935A475747q2282k4413J2087N3307l5842M1499n1414l8269M2377J39174p2778
4924A459193k10056J5022N6831N7223L0568K6086N5822p0066l5921M4450j26218
4913A302934J17538J27167o0531J5814m2557L7824J6968l8018n565q2644j22863
$$ plain form
4990 2534297 2606183 2561421 2539779 2514827 2422195 2453915 2512770 2365460 2169078 2103244 2033689
4979 2033689 1910344 1914123 1885317 1781378 1688398 1776257 1815828 1753061 1792695 1693815 1681929
4968 1681929 1798054 1752175 1661890 1572317 1578270 1538499 1657868 1600207 1773534 1770637 1612044
4957 1612044 1652060 1512659 1531134 1573743 1598875 1627644 1788572 1507643 1446091 1530586 1600610
4946 1600610 1599398 1509681 1376644 1356597 1408578 1309947 1410214 1458429 1570049 1575496 1475747
4935 1475747 1393465 1369052 1381139 1434446 1398604 1440103 1388689 1350420 1392797 1531971 1459193
4924 1459193 1249137 1264159 1320990 1378213 1408781 1434867 1490689 1420623 1384702 1429152 1302934
4913 1302934 1420472 1547639 1487108 1502922 1460365 1498189 1515157 1477139 1471574 1388930 1266067
4902A266067K7734K13616M0183m7273l7635J3807p0173K2374J41719P932n9306
4891A519045o3570l75N0363J25751q665j15300j4324J00358n7303O1434J31943
4880A729357N0032j58297o7422j09127N1452J96447m9517j50917J3680J31656
4870A637344l4315J9813O4877J02959R64j3230n8214k9495J10181m1479k9339
4859A730066O0473p2624K9325j87914K6723J01703J39419O6337j30003P5747m514
4848A834738J5726k256M3847o6091K4018R1966p4319P3395J86985K37046N1588
4837B416643j53367j26360j4007n997k53572j3853n4421J66984J07835j58967
4827A910918j70207n5166l5044j07309P7646L7876j05952j113r2j52971J73652
$$ plain form
4902 1266067 1293801 1507417 1547600 1500327 1462692 1476499 1406326 1428700 1570419 1578351 1519045
4891 1519045 1455475 1455100 1505463 1631214 1622549 1507249 1492925 1593283 1535980 1597414 1729357
4880 1729357 1779389 1621092 1553670 1444543 1495995 1692442 1642925 1492008 1505688 1637344
4870 1637344 1603029 1622842 1687719 1790678 1791642 1778412 1720198 1690703 1800884 1759405 1730066
4859 1730066 1790539 1717915 1747240 1559326 1586049 1687752 1827171 1893508 1763505 1839252 1834738
4848 1834738 1850464 1848208 1892055 1825964 1849982 1941948 1867629 1941024 2128009 2365055 2416643
4837 2416643 2263276 2136916 2122909 2116912 1863340 1849487 1795066 1962050 2069885 1910918
4827 1910918 1740711 1685545 1650501 1543192 1620838 1658714 1552762 1551649 1551557 1398586 1572238
4816A572238k6592j611p3221n4321K7202j7957J00131R0122L9346l3917j7608
4805A603812M1216p7091N7817L5768J2689o7506p1255N2646j5237j87476J00978
4794A486361Q8080q5299K3804P0753n6547j5962R4875R3136N9035J6983j2199
4783A763020m662L4204l8051P684o0578r4411j50425Q3340K32677M0420J00645
4772A913863j6682j11644J46988P3068N1118J8159J147M300K3364K42o7280k3265
4760B013378j72343J3191J1044K8992m2015l9648J19892J6361J3635j12115j0310
4749A840062m3241J9509J36081k8436n6947R685L7344K5778N1081Q1410o2217
4738B010109O710J22265q7503l2063M7663J54152P2392N0975k846k22926L3947
$$ plain form
4816 1572238 1545646 1544035 1470814 1416493 1443695 1425738 1525869 1615991 1655337 1621420 1603812
4805 1603812 1645028 1567937 1625754 1661522 1674211 1606705 1535450 1588096 1572859 1385383 1486361
4794 1486361 1574441 1489142 1512946 1583699 1527152 1511190 1606065 1699201 1758236 1775219 1763020
4783 1763020 1758358 1792562 1754511 1762195 1701617 1607206 1456781 1540121 1772798 1813218 1913863
4772 1913863 1897181 1785537 1932525 2005593 2056711 2074870 2076017 2080317 2103681 2103923 2036643 2013378
4760 2013378 1841035 1854226 1865270 1894262 1852247 1812599 1932491 1948852 1962487 1850372 1840062
4749 1840062 1796821 1816330 1952411 1923975 1867028 1876713 1914057 1939835 1990916 2072326 2010109
4738 2010109 2016819 2139084 2051581 2019518 2067181 2221333 2293725 2344700 2341854 2118928 2152875
4727B152875P5739j20469j07815Q1023q3465L0214n3064k6282q0000k2887L9685
4716A885554K9768P3635L5929j04235O6876J52423l0543j43194M8819O0059n7647
4705B017444n9116J09054P4596J8449j29148n192O9360o4825m6067L1738j10410
4694A905883k357J13371k9289J57273L8926n7727l4771J21578O9078j28651j30935
4683B022379O5023J01547q2984j57169K14607l7552j93492n939O4569o5998J30298
4672B055289Q9029j74577O2870N1710n6003k1249l458O0797q5709n8029N4166
4661A974836N610n952M7003q9935J39955L871Q2333K4028j03913m3569J01780
4650B136047k1625l3138J10363j23660J5781L032j01408Q8284q5657j7729p6367
$$ plain form
4727 2152875 2228614 2108145 2000330 2081353 1997888 2028102 1975038 1948756 1868756 1845869 1885554
4716 1885554 1915322 1988957 2024886 1920651 1987527 2139950 2109407 1966213 2015032 2075091 2017444
4705 2017444 1958328 2067382 2141978 2160427 2031279 2026087 2095447 2030622 1984555 2016293 1905883
4694 1905883 1903526 2016897 1987608 2144881 2183807 2126080 2091309 2212887 2281965 2153314 2022379
4683 2022379 2087402 2188949 2105965 1948796 2163403 2125851 1932359 1926420 1990989 1924991 2055289
4672 2055289 2144318 1969741 2032611 2084321 2028318 2007069 2003611 2064408 1978699 1920670 1974836
4661 1974836 1980446 1974494 2021497 1931562 2071517 2075388 2157721 2181749 2077836 2034267 2136047
4650 2136047 2114422 2081284 2191647 2067987 2083768 2086800 1985392 2073676 1988019 1970290 1893923
4639A893923j03530J35009r2036R8466m2652j07537N5992N536l0061j3132k6681
4628A773297L3881L6859k1706J5785R7175J6394j10232O762R3933n8637j5062
4617A868449j4905l2101M526L714N7671m0369r3125P4034N4185q0228k4392K1816
4605A799275O1197j48224k1833J15030o3570m578k3957N6835k12671j5024P6208
4594A618688j26418J2944J4119O5842k2520J8372R420k4471P6061k3904R5845
4583A713978j3166r927l3514j29253J37248R419j96576O9169J12420j30568P1941
4572A601171l0047j39019R4148o2746R3684R3159j8253p9217r5837k4183J22406
4561A555266M281m2695K2262j1299m7329n5924n4876M4897N8305Q9970Q06j31350
$$ plain form
4639 1893923 1790393 1925402 1833366 1931832 1889180 1781643 1837635 1843171 1813110 1799978 1773297
4628 1773297 1807178 1844037 1822331 1838116 1935291 1951685 1841453 1848215 1942148 1883511 1868449
4617 1868449 1853544 1821443 1825969 1829683 1887354 1846985 1753860 1827894 1882079 1801851 1777459 1799275
4605 1799275 1860472 1712248 1690415 1805445 1741875 1737297 1713340 1770175 1557504 1542480 1618688
4594 1618688 1492270 1505214 1519333 1585175 1562655 1581027 1590447 1565976 1642037 1618133 1713978
4583 1713978 1700812 1690885 1657371 1528118 1665366 1674785 1478209 1547378 1659798 1529230 1601171
4572 1601171 1571124 1432105 1526253 1463507 1557191 1650350 1632097 1552880 1457043 1432860 1555266
4561 1555266 1559547 1516852 1539114 1527815 1480486 1424562 1369686 1414583 1472888 1562858 1563664 1432314
4549A432314k5511l936J02031k5215j02808j47379N5600Q8613K726j01390p6764
4538A198281J04988P4612k7673N90j5877j1747J23462O0303m1269p2615K2177
4527A415232k0193p0727L92q6995N5566L2835Q6674Q0525o6298o0289o4237m3188
4515A259297J19110Q8431P6509j36947M3690o9513j60693Q7250k2640j4757j22502
4504A147235j7301J66076O0580R5345q7861M9305M9364O3995j27617r6283L2502
4493A335340j27890J00677M4187J16224n1711j3771k3014j3193J08877l8380j15827
4482A321519j7596K2782J5371o4258j9737J9568m7312K5298o8321J00759J62871
4471A450944l5432L0999k3273J7134l7086J6410j65176r0203N3106o7979M8183
$$ plain form
4549 1432314 1406803 1402867 1504898 1479683 1376875 1229496 1285096 1373709 1376435 1275045 1198281
4538 1198281 1303269 1377881 1350208 1350798 1334921 1323174 1446636 1506939 1465670 1393055 1415232
4527 1415232 1395039 1324312 1324704 1237709 1293275 1326110 1412784 1493309 1427011 1366722 1302485 1259297
4515 1259297 1378407 1466838 1543347 1406400 1450090 1380577 1219884 1307134 1284494 1269737 1147235
4504 1147235 1129934 1296010 1356590 1451935 1364074 1413379 1462743 1526738 1399121 1302838 1335340
4493 1335340 1207450 1308127 1352314 1468538 1416827 1403056 1380042 1366849 1475726 1437346 1321519
4482 1321519 1303923 1326705 1342076 1277818 1258081 1277649 1230337 1255635 1187314 1288073 1450944
4471 1450944 1415512 1446511 1423238 1440372 1403286 1419696 1254520 1164317 1217423 1149444 1197627
4460A197627M1130K4871m0577N3859Q568n5961J18696J39147l0774j1392p5734
4449A369460L199p8796q764J86244M6061J4239j46721J3058O6026N4037q5979
4438A432064o7075m5857P5447j4584K8447n2878J53986N0313J2607J22042L1933
4427A726445L5276L8196N153J50773R0572R6396K74495J68994J03895J89309J99153
4416C078657K4525j0783j73205k07168j86647l3600r4317j93113j80803l5041
4406A988505o5413l0481r3324n7484J8670j4027q4223M4615q9636o6890l1644
4395A518668l3017J718O1981j17904l2704P2499j5887J16782L1436R5452J8492
4384A717516O9540K12420l9598j34160P7082j7804L5137J04240M2124m269o6885
$$ plain form
4460 1197627 1238757 1263628 1223051 1276910 1285478 1229517 1348213 1487360 1456586 1445194 1369460
4449 1369460 1372659 1293863 1285099 1471343 1517404 1531643 1384922 1397980 1464006 1518043 1432064
4438 1432064 1364989 1319132 1394579 1379995 1408442 1355564 1509550 1559863 1572470 1694512 1726445
4427 1726445 1761721 1799917 1805070 1955843 2046415 2142811 2417306 2586300 2690195 2879504 3078657
4416 3078657 3103182 3092399 2919194 2712026 2525379 2491779 2397462 2204349 2023546 1988505
4406 1988505 1923092 1892611 1799287 1741803 1760473 1746446 1662223 1706838 1617202 1550312 1518668
4395 1518668 1485651 1487369 1549350 1431446 1398742 1471241 1455354 1572136 1603572 1699024 1717516
4384 1717516 1787056 1999476 1959878 1825718 1902800 1884996 1920133 2024373 2066497 2062228 1995343
4373A995343M1671j44285l3397J34937k3351q7163P7581R8726k5376K8996O6663
4362B130345K1004K2030J47676J29757j4570J19583K11923K4211J905J11410J23301
4351C028575n5107j61187J7576K7247j79537k71988p929j40468j56511P873M2036
4340B150580m0787j12352l887K67K1915k791J21431q3824p7721N0788q9510N7759
4328A991868L3512o913K0450M8798n5498p7909J03961J7377R0404K266J9717n4285
4316B133748k379J85987o0049k5994n8600r3785J10744J70278Q2781p6912R7852
4305B463671L1880N1268K41450J28379R2304L9103j08896J09915J62072l5453
4295C175693J8049O0154N5776L5009K4009m5529j05411P8401r625o0899j31319
$$ plain form
4373 1995343 2037014 1892729 1859332 1994269 1970918 1883755 1961336 2060062 2034686 2063682 2130345
4362 2130345 2151349 2173379 2321055 2450812 2436242 2555825 2767748 2791959 2793864 2905274 3028575
4351 3028575 2973468 2812281 2829857 2857104 2677567 2405579 2397650 2257182 2100671 2108544 2150580
4340 2150580 2109793 1997441 1993554 1993821 2015736 2012945 2134376 2050552 1972831 2023619 1934109 1991868
4328 1991868 2025380 2018467 2038917 2087715 2032217 1954308 2058269 2075646 2166050 2168316 2188033 2133748
4316 2133748 2131369 2317356 2257307 2231313 2172713 2078928 2189672 2359950 2442731 2365819 2463671
4305 2463671 2495551 2546819 2788269 2916648 3008952 3048055 2939159 3049074 3211146 3175693
4295 3175693 3193742 3253896 3309672 3344681 3368690 3323161 3217750 3296151 3286526 3225627 3094308
4284C094308O8780P2742l108O1575q205J18105K06567q2283L4987J30176J9879
4273C713523J17156m0285l1136n5433J33945L0553N3509l9829O7587J54208N5719
4262D159517P9202J18597k8739J964J61835K39769J6045m3038J18263J34166J61220
4251E118801K62037J78174J99041K33966K65164M71482L78772K90221R8945J3810
4241G510413j83815l14958l92888j66620k33889j23688j37012m3550p3160n8044
4231E782789o672Q7362l1152M651J29848R3995K1156J82856J72596J4703k9562
4220F422570N7152J76792J30526K65233J71417J99619J81207Q8091J73583K84386
4210H150576J47189J59294J83251L14015L30535L32613K11997K72596L47630J71537
$$ plain form
4284 3094308 3163088 3235830 3232722 3294297 3286092 3404197 3610764 3528481 3563468 3693644 3713523
4273 3713523 3830679 3790394 3759258 3703825 3837770 3868323 3921832 3882003 3949590 4103798 4159517
4262 4159517 4238719 4357316 4328577 4330541 4492376 4732145 4748190 4705152 4823415 4957581 5118801
4251 5118801 5380838 5559012 5758053 5992019 6257183 6728665 7107437 7397658 7496603 7510413
4241 7510413 7326598 7011640 6618752 6452132 6218243 6094555 5957543 5913993 5840833 5782789
4231 5782789 5776117 5863479 5832327 5836978 5966826 6060821 6081977 6264833 6437429 6452132 6422570
4220 6422570 6479722 6656514 6787040 7052273 7223690 7423309 7604516 7692607 7866190 8150576
4210 8150576 8297765 8457059 8640310 8954325 9284860 9617473 9829470 10102066 10449696 10621233
4200A0621233L43923L64590K74032M20845L16932L43264L69032L60212K81130
4191A3695193M19107M23874M04413K55502K04348K31342L06440K18205K49133
4182A6407557K47587L33453K81454L19148K65476M43225L87114L89658N77437
4173A9652109M90220N71708N06109N56584P74342R02090R27969J121816J154323
4164B6657270J166426J450162J671451J445531J552570J778577J894713J970597
4156C9587297J900921J844130J743195J841612J884872K274278K586825L148614
4148E6811744L805447M269959M800538N261782O124145O587567O807906P112722
4140A01581810P863666R078117J1252329J3521942J6157125J9282256K2636062
$$ plain form
4200 10621233 10965156 11329746 11603778 12024623 12341555 12684819 13053851 13414063 13695193
4191 13695193 14114300 14538174 14942587 15198089 15402437 15633779 15940219 16158424 16407557
4182 16407557 16655144 16988597 17270051 17589199 17854675 18297900 18685014 19074672 19652109
4173 19652109 20142329 20714037 21220146 21776730 22551072 23453162 24381131 25502947 26657270
4164 26657270 27823696 29273858 30945309 32390840 33943410 35721987 37616700 39587297
4156 39587297 41488218 43332348 45075543 46917155 48802027 51076305 53663130 56811744
4148 56811744 60617191 64887150 69687688 74949470 81073615 87661182 94469088 101581810
4140 101581810 109445476 118523593 129775922 143297864 159454989 178737245 201373307
4133B01373307K5835881K8151133K7468198K1547677P525603j1522673k8073036
4126B72306090l5937957l4865934k9346441k3914894j9444364j5583228j2826301
4119A00386971j0477100q487723o880514n646350m646945l948889l287417k871873
4111E4140160k833432k715461k323260k322107k224911k134812j911156j786737
4103C5888284j621386j343945j166049j008575j009259p03810n33632o50491m78411
4094B7372726o29208n48007l40123n17514m20746m48687j87390K2161j72673j44034
4084B3986505l8473o4136k2386j31821l67544o03677o93312m88470m38784m36072
4074B0701830l05058k26244k27419j94287o9591K7710k22523j31840m9481K9052
$$ plain form
4133 201373307 227209188 255360321 282828519 304376196 311901799 300379126 272306090
4126 272306090 236368133 201502199 172155758 148240864 128796500 113213272 100386971
4119 100386971 89909871 81422148 74541634 68895284 64248339 60299450 57012033 54140160
4111 54140160 51306728 48591267 46268007 43945900 41720989 39586177 37675021 35888284
4103 35888284 34266898 32922953 31756904 30748329 29739070 29035260 28501628 27851137 27372726
4094 27372726 26743518 26195511 25855388 25337874 24917128 24468441 24281051 24303212 24130539 23986505
4084 23986505 23948032 23883896 23861510 23729689 23362145 22758468 22065156 21576686 21137902 20701830
4074 20701830 20396772 20170528 19943109 19748822 19679231 19706941 19484418 19352578 19303097 19332149
4064A9332149M9668P8558O1989j8987K7219J50962J39257L26164J53046J52983
4054B0453008K53940J88155M16236L44722L31024L20498L32238L21050N49827
4045B3510698M99343N43807P56445O12478O99899Q34670R33932J007441J017086
4036C0415799J040624J159479J326551J391476J278480J375183J486736J554599
4028D1028927J656238J763266J926345J932409K166742K199428K157805K321701
4020E7152861K447887K551800K539699K616565K649032K800051K904526K979978
4012G8642399L069938K961811K940358L062608K850989K690645K491024K488321
4004A01198093K190890K067393K168899J772528J732051J518504J717135J512802
$$ plain form
4064 19332149 19381817 19460375 19522364 19503377 19530596 19681558 19820815 20146979 20300025 20453008
4054 20453008 20706948 20895103 21311339 21656061 21987085 22307583 22639821 22960871 23510698
4045 23510698 24010041 24553848 25310293 25922771 26622670 27457340 28391272 29398713 30415799
4036 30415799 31456423 32615902 33942453 35333929 36612409 37987592 39474328 41028927
4028 41028927 42685165 44448431 46374776 48307185 50473927 52673355 54831160 57152861
4020 57152861 59600748 62152548 64692247 67308812 69957844 72757895 75662421 78642399
4012 78642399 81712337 84674148 87614506 90677114 93528103 96218748 98709772 101198093
4004 101198093 103388983 105456376 107625275 109397803 111129854 112648358 114365493 115878295
3996A15878295J278742J087799R31243Q21470M52413J04814k24342n51931p27885
3987A19050618r75315j249671j220686j459317j516434j644001j884762j932143
3979A07168289k200226k359083k333680k613520k829020k848568l018423l049780
3971H5915989k968327k871436k968096k955097k918954k753253k761925k646755
3963F3072146k598550k580185k501122k397887k374511k441541k033407k003698
3955D4141245k059297j902097j731645j721217j631797j426394j381707j465003
3947C0822088j237093j151392j098182r93796j032742j060825r71621q73207p55235
3938B1647995o63734o83284p99957o11863l89071m72540m61034n37379m04402
$$ plain form
3996 115878295 117157037 118244836 119176079 119997549 120449962 120554776 120330434 119778503 119050618
3987 119050618 118075303 116825632 115604946 114145629 112629195 110985194 109100432 107168289
3979 107168289 104968063 102608980 100275300 97661780 94832760 91984192 88965769 85915989
3971 85915989 82947662 80076226 77108130 74153033 71234079 68480826 65718901 63072146
3963 63072146 60473596 57893411 55392289 52994402 50619891 48178350 46144943 44141245
3955 44141245 42081948 40179851 38448206 36726989 35095192 33668798 32287091 30822088
3947 30822088 29584995 28433603 27335421 26341625 25308883 24248058 23276437 22403230 21647995
3938 21647995 20984261 20300977 19501020 18889157 18500086 18027546 17566512 17029133 16624731
3929A6624731m46941m02646m64006l94982l94659k35118k42458m21777k51881
3920A3370263l28445k88841k84044k1687j97394k63071j97222j86511j53101j97868
3910A1252079k27344k03551j65429r9071l3375p8471k23823j30354j70081k24444
3900I696136j74647J1236m2695j13237j61203p8878k8456r250K9785j14490k5968
3889H988333r9559j2370r1026L3223r0130n7672J7738n8086L9264O0029n7924
3878H671820J72410J90489n4056q5484J02189j4839k18363k38171o8089k50866
3868H207040j58898O1528j09216j80509l24046p3241k1286o0285j59831n4954
3858G126302p2498k06278J4760k3908p0177K2606j12783k2609l1567q9871o5982
$$ plain form
3929 16624731 16177790 15775144 15311138 14916156 14521497 14286379 14043921 13622144 13370263
3920 13370263 13041818 12752977 12468933 12447246 12249852 11986781 11789559 11603048 11449947 11252079
3910 11252079 11024735 10821184 10655755 10556684 10523309 10444838 10221015 10090661 9920580 9696136
3900 9696136 9521489 9532725 9490030 9376793 9215590 9136712 9108256 9099006 9128791 9014301 8988333
3889 8988333 8888774 8876404 8785378 8818601 8728471 8670799 8688537 8630451 8669715 8729744 8671820
3878 8671820 8844230 9034719 8980663 8895179 8997368 8982529 8764166 8525995 8457906 8207040
3868 8207040 8048142 8109670 8000454 7819945 7495899 7422658 7401372 7341087 7181256 7126302
3858 7126302 7053804 6847526 6862286 6838378 6768201 6790807 6678024 6655415 6623848 6533977 6467995
3847F467995L5111J25863J84945J22142J3595R2004J81539J47333k1660J6723
3837G365590M0421k57626r3784j10897k69509k19971j66134m3750N2444r3016
3827F203768p0225l08910j10065l4474Q2072J3425j90733n7168q8228j2409j44533
3816E282520o1300l3083j1601k70526r3678J00438N8892o700m5629j14421R4830
3805D899742j50P271N380p7199k7718l0801p6409L9474M0070k9453m0206J3638
3793D723639K55472J02317P8050M1802J37727k6880n200P0525L908K53763J57900
3782E793023J01611M6420J45099R0788R0126J09614K3448j2556m3430o2503J12451
3771F394091j5797p6356J53422K5633o0400P4106K6192j25703O9071Q0174k5631
$$ plain form
3847 6467995 6503106 6628969 6813914 6936056 6949651 7041655 7223194 7370527 7348867 7365590
3837 7365590 7406011 7148385 7054601 6943704 6674195 6454224 6288090 6244340 6296784 6203768
3827 6203768 6133543 5824633 5714568 5680094 5762166 5775591 5584858 5527690 5439462 5427053 5282520
3816 5282520 5221220 5188137 5176536 4906010 4812332 4912770 4971662 4964962 4919333 4804912 4899742
3805 4899742 4899592 4906863 4912243 4835044 4807326 4776525 4700116 4739590 4779660 4750207 4710001 4723639
3793 4723639 4979111 5081428 5159478 5201280 5339007 5312127 5306927 5377452 5381360 5635123 5793023
3782 5793023 5894634 5941054 6086153 6176941 6267067 6376681 6400129 6387573 6344143 6281640 6394091
3771 6394091 6378294 6301938 6455360 6480993 6420593 6494699 6520891 6395188 6464259 6544433 6518802
3760F518802j40480l5539R5553K8407n7188j26208o3300q26O5499K035j7840l2644
3748F236271j6790O9988m566p6922J27309l3501k0558l561R1861J37481j7671
3737F489341O4012n7009N5903J56025J27667j3782J11932K18876N8486L4702J31114
3726G377267J19401J54567M9247p844J10484R6719K17145J31337j0744K14285
3716H451864r568J22236K05999K07601Q0622J59969K20021J04992J07388K73785
3706I924909J73274J77160P7690J49653J86615J75238L09915J73275J33574J80335
3696A1661638L31828K49926K34333J91832K91148M08654K74124L28780L03366
3687A4275629K76923L65155L93112M51843L82304L81140N23130N82520N72522
$$ plain form
3760 6518802 6378322 6342783 6438336 6466743 6409555 6283347 6220047 6219221 6284720 6286755 6268915 6236271
3748 6236271 6219481 6289469 6284903 6207981 6335290 6301789 6281231 6277670 6369531 6507012 6489341
3737 6489341 6553353 6496344 6552247 6708272 6835939 6822157 6934089 7152965 7211451 7246153 7377267
3726 7377267 7496668 7651235 7700482 7692638 7803122 7899841 8116986 8248323 8237579 8451864
3716 8451864 8442296 8564532 8770531 8978132 9058754 9218723 9438744 9543736 9651124 9924909
3706 9924909 10098183 10275343 10353033 10502686 10689301 10864539 11174454 11347729 11481303 11661638
3696 11661638 11993466 12243392 12477725 12669557 12960705 13369359 13643483 13972263 14275629
3687 14275629 14552552 14917707 15310819 15762662 16144966 16526106 17049236 17631756 18204278
3678A8204278N84730N44954O68093P71318P91987O98691R88195J007238R29288
3669B5188772J087041J236848J235049J304137J432967J398923J374020J420220
3661C5677977J467634J379589J434598J380721J320374J332206J197345J205674
3653D6396118J014391J159031J023710Q84027J011912P53735P00633P04559N59638
3644E4207754L21192K33842J95672j74055k40887k92067l49489k59796k73687
3635E3368479k74144j71598j95852p7232k19267q0623l8945J2726M5413J24565
3625E2493522K29149L83958M40603P28798J069696J113047J347352J487652J734167
3616F1027944J860884K203377K477033K665082K817228L192963L385794L535738
$$ plain form
3678 18204278 18789008 19333962 20002055 20773373 21565360 22264051 23252246 24259484 25188772
3669 25188772 26275813 27512661 28747710 30051847 31484814 32883737 34257757 35677977
3661 35677977 37145611 38525200 39959798 41340519 42660893 43993099 45190444 46396118
3653 46396118 47410509 48569540 49593250 50477277 51489189 52242924 52943557 53648116 54207754
3644 54207754 54528946 54762788 54958460 54784405 54543518 54251451 53901962 53642166 53368479
3635 53368479 53094335 52922737 52726885 52649653 52430386 52349763 52310818 52323544 52368957 52493522
3625 52493522 52722671 53106629 53547232 54276030 55345726 56458773 57806125 59293777 61027944
3616 61027944 62888828 65092205 67569238 70234320 73051548 76244511 79630305 83166043
3608H3166043L738182L793875L941704L968928L715606L659223L674374L500585
3600A13158520L322619L337628L192881K881739K788038K676546K639378K220881
3592A36218230J786628J552670J053763N21056J20425j59106q55065j087113j506860
3583A37644628j575451j792827j792477j754608j758497j885952j781149j687033
3575A23616634j835820j763785j560829j484202j286339r39369q96183l77625
3567A13472482k5376L31407P01654J149951J432522J710763K161159K371701K483533
3558A25789796K669332K625621K736409K581936K565993K491984K461068K482671
3550A46404810K300019K350455K415425K245103J890450J718969J346602Q65822
$$ plain form
3608 83166043 86904225 90698100 94639804 98608732 102324338 105983561 109657935 113158520
3600 113158520 116481139 119818767 123011648 125893387 128681425 131357971 133997349 136218230
3592 136218230 138004858 139557528 140611291 141132347 141252772 141093666 140238601 139151488 137644628
3583 137644628 136069177 134276350 132483873 130729265 128970768 127084816 125303667 123616634
3575 123616634 121780814 120017029 118456200 116971998 115685659 114746290 113850107 113472482
3567 113472482 113447106 113778513 114480167 115630118 117062640 118773403 120934562 123306263 125789796
3558 125789796 128459128 131084749 133821158 136403094 138969087 141461071 143922139 146404810
3550 146404810 148704829 151055284 153470709 155715812 157606262 159325231 160671833 161537655
3542A61537655N58116J71038l69026p69030j106253j326961j664427k007657k099588
3533A52923867k364429k444659k372749k245739k132868k042126k039041j828875
3525A35453381j877644j757341j551851j391150j269844j086422p27076l93252
3517A25398801J38251P83936J103213J714163K504051L248902M134149M566580
3509A43592046N586540O451048P314444Q367761R343150J0466683J1550919J2687190
3501B15359781J3851307J4873557J5807207J6392545J6626735J6147143J5274581
3494C24332856J3607356J1460023Q783926O217514L727197J718462P2498j133385
3486C68786447j545158j736971k045997k434959k844261l959959n310691p245673
$$ plain form
3542 161537655 162095771 162266809 161897783 161128753 160022500 158695539 157031112 155023455 152923867
3533 152923867 150559438 148114779 145742030 143496291 141363423 139321297 137282256 135453381
3525 135453381 133575737 131818396 130266545 128875395 127605551 126519129 125792053 125398801
3517 125398801 125537052 126320988 127424201 129138364 131642415 134891317 139025466 143592046
3509 143592046 149178586 155629634 162944078 171311839 180654989 191121672 202672591 215359781
3501 215359781 229211088 244084645 259891852 276284397 292911132 309058275 324332856
3494 324332856 337940212 349400235 358184161 364401675 368128872 369847334 369919832 368786447
3486 368786447 367241289 365504318 363458321 361023362 358179101 354219142 348908451 341662778
3478C41662778r672003j1839469j3934694j5942840j7125996j7797064j7809110
3471B37541602j7312077j6214969j5185356j3883827j2595160j1259261j0278081
3464A40812871r240254q324936p487670o732903o272377n724938n043654m562503
3456H7423636m241000l940136l661872l370534l038999k734115k634089k477267
3448F1325624k211959k108698k037495j869194j630583j644123j474681j431687
3440D6917204j381684j141732j180508j208574j107107r38762r90013r13202r16400
3431C7139222p61385p64289p54901n83186o51074o51358m42164n02861n00444
3422C1527560o18327m87225m07906m16032p02405m69582n81112o98714m34229
$$ plain form
3478 341662778 331990775 320151306 306216612 290273772 273147776 255350712 237541602
3471 237541602 220229525 204014556 188829200 174945373 162350213 151090952 140812871
3464 140812871 131572617 123247681 115760011 109027108 102754731 97029793 91986139 87423636
3456 87423636 83182636 79242500 75580628 72210094 69171095 66436980 63802891 61325624
3448 61325624 59113665 57004967 54967472 53098278 51467695 49823572 48348891 46917204
3440 46917204 45535520 44393788 43213280 42004706 40897599 39958837 38968824 38055622 37139222
3431 37139222 36377837 35613548 34858647 34275461 33624387 32973029 32530865 32028004 31527560
3422 31527560 30909233 30422008 30014102 29598070 28895665 28426083 27844971 27146257 26712028
3413B6712028n07056l60862m03964n18156l61898m72213n47953l42104k81756
3404B2916066k45621l26384k90406l08080j47748k42808k94788j95841l38374
3395B0526016j29620k1849k05375k9903K1427M5215j5614k80446n50229m67374
3385A8892248n99972o50507l55678m00343m29500l80437k24765k30018l48048
3376A5272980j64486j50154k87976k54843l92430k5445L1736j43062p6849r1756
3366A3717715l8391O1976L7540K0649N4468J93076R9409J5644l2418J3729j7144
3355A4126253j55962k59389j91054k5310k31869j25099m4352P459o3031j36996
3345A2900650j23111k7743K5219n4985o7795q2136k36858l7481j50389k09755
$$ plain form
3413 26712028 26204972 25844110 25440146 24921990 24560092 24087879 23539926 23197822 22916066
3404 22916066 22670445 22344061 22053655 21745575 21597827 21355019 21060231 20864390 20526016
3395 20526016 20396396 20374547 20169172 20139269 20160696 20205911 20190297 19909851 19359622 18892248
3385 18892248 18292276 17641769 17286091 16885748 16456248 16075811 15851046 15621028 15272980
3376 15272980 15108494 14958340 14670364 14415521 14023091 13997646 14029382 13886320 13809471 13717715
3366 13717715 13679324 13741300 13778840 13799489 13853957 14047033 14146442 14162086 14129668 14143397 14126253
3355 14126253 13970291 13710902 13519848 13494538 13262669 13137570 13093218 13100677 13037646 12900650
3345 12900650 12777539 12749796 12775015 12720030 12652235 12570099 12333241 12295760 12145371 11935616
3335A1935616j49153k25950k15512j98082m5272N3829j2790k62070K7632Q0084
3325A0988332p9195m166k2414J1862O6160p1835N9931R8120l3907m917n8215J12016
3313A1061772O6151J30794K3985K66745K95551J20890J35634J67336P1395K2272
3303A2362525L7075j39036N6614Q3932O3332K1200J06878J74213J43876K05511
3293A3116120K85692M36784K52164J68633L64420L31395M40685M07917M70991
3284A6274801M15029N60233L60739K7321k31516n26967m63063m50288k97773k36958
3274A5431558j50281K4578j6794O1136J35809K38708K58104L41919L50318M27076
3264A7102131M40941M71181P42052O46315N58511O21200N83759M62612N29201
$$ plain form
3335 11935616 11786463 11560513 11345001 11146919 11101647 11155476 11142686 10880616 10908248 10988332
3325 10988332 10909137 10904971 10882557 10894419 10960579 10888744 10948675 11046795 11012888 11007971 10949756 11061772
3313 11061772 11127923 11258717 11282702 11549447 11844998 11965888 12101522 12268858 12340253 12362525
3303 12362525 12399600 12260564 12317178 12401110 12464442 12485642 12592520 12766733 12910609 13116120
3293 13116120 13401812 13838596 14090760 14259393 14623813 14955208 15395893 15803810 16274801
3284 16274801 16689830 17250063 17610802 17638123 17406607 16879640 16416577 15966289 15668516 15431558
3274 15431558 15281277 15305855 15289061 15350197 15486006 15724714 15982818 16324737 16675055 17102131
3264 17102131 17543072 18014253 18756305 19402620 19961131 20582331 21166090 21628702 22157903
3255B2157903M96493M93558K04268O1848l20856l44865j68729O4336J55069J25718
3245B2924743M49196N09273P34305P72363P63122J108029R81565J065568J268425
3236C0576589J381827J414648J078133J013467O42197J83013k43903q44395j415763
3227C3785813j680179k010447j904009j780613j597121j403552j179369j192055
3219B1038468q32663q78816r17417n63985o45668p15376n94185l86387m34947
3210A5069024m23505l37467k00153l04586k84724l37285j80639l02357l08033
3201A2390275k28895j63319l14228j54930q6846k18648j63857k56478j92733k48892
3191A0361449k07272r8375j30843l97488k86768j11345k28236k07114j81545k09678
$$ plain form
3255 22157903 22654396 23147954 23352222 23414070 23093214 22748349 22579620 22643956 22799025 22924743
3245 22924743 23373939 23883212 24617517 25389880 26153002 27261031 28242596 29308164 30576589
3236 30576589 31958416 33373064 34451197 35464664 36106861 36289874 36045971 35201576 33785813
3227 33785813 32105634 30095187 28191178 26410565 24813444 23409892 22230523 21038468
3219 21038468 20205805 19326989 18409572 17845587 17199919 16484543 15890358 15503971 15069024
3210 15069024 14645519 14308052 14107899 13803313 13518589 13181304 13000665 12698308 12390275
3201 12390275 12161380 11998061 11683833 11528903 11442057 11223409 11059552 10803074 10610341 10361449
3191 10361449 10154177 10055802 9924959 9527471 9240703 9129358 8901122 8694008 8512463 8302785
3181H302785l55885j89555j83146r8169m0578l13422k60417J7589j40433j23413
3171F615356l130j28202p1774j14946q9993j21273o3193m5810j74005k02555M8269
3160E648744n0329k67136m7048k0683j05895j37907L1112r7892J4158n0456j6351
3149D900317j90188l8981M9399j24898k5676l5204q4160q2305o4857m5385q2783
3138D175279r5276Q2753m0392r094j82576m015j41521m3887J20711m5509n9823
3127C756650n2447j07663M0084j6450M4011j29997l3587O1377N017o9051N3924
3116C551868q1854k1777j9460L6949m1304m3516q9125n1645n7072j14448P4765
3105C143381L6657q227j1976m5361p2197j10874L2322N8269o5531k8716l8592
$$ plain form
3181 8302785 7946900 7757345 7574199 7476030 7435452 7122030 6861613 6879202 6738769 6615356
3171 6615356 6612226 6484024 6412250 6297304 6207311 6086038 6022845 5977035 5803030 5600475 5648744
3160 5648744 5598415 5331279 5284231 5263548 5157653 5019746 5050858 4952966 4967124 4916668 4900317
3149 4900317 4710129 4671148 4720547 4595649 4569973 4534769 4450609 4368304 4303447 4258062 4175279
3138 4175279 4080003 4162756 4122364 4113270 3930694 3926679 3785158 3741271 3861982 3816473 3756650
3127 3756650 3704203 3596540 3636624 3620174 3664185 3534188 3500601 3561978 3566995 3497944 3551868
3116 3551868 3470014 3448237 3428777 3465726 3424422 3380906 3291781 3240136 3183064 3068616 3143381
3105 3143381 3180038 3171811 3159835 3114474 3042277 2931403 2963725 3021994 2956463 2927747 2889155
3094B889155P5424k0960n3490j4175J2123j6463L1715J0367j08799q566m0277
3083B756054j86402J70977L9414N2200n9635k413n4107M870r735j1839R7212j6309
3071B780287j19251P5993J21940j37867k57343J69647J12296q5183r9281L0303
3061B591541J17894q2579p3418o6565J37679j1657j46352p0115J32993O4436Q866
3050B602723L6051r3259M8659n9505N9753m5957r8570n3625k4896L6309j9104
3039B388579q0833R6481k6295k6307K3981l8987L969m6253l7374L076n5482p9670
3027B124885J16074P7253P1695j00930l2340K9891L8749J4289j10336O3746p1118
3016B221858L9620J6998j48138Q0146l6980q939N4125J17971O3751K518M071m9751
$$ plain form
3094 2889155 2964579 2943619 2890129 2875954 2888077 2871614 2903329 2913696 2804897 2796331 2756054
3083 2756054 2569652 2740629 2780043 2832243 2772608 2770195 2716088 2720958 2711223 2699384 2796596 2780287
3071 2780287 2661036 2737029 2858969 2721102 2463759 2633406 2745702 2660519 2561238 2591541
3061 2591541 2709435 2626856 2553438 2486873 2624552 2612895 2466543 2396428 2529421 2593857 2602723
3050 2602723 2638774 2545515 2594174 2534669 2594422 2548465 2449895 2396270 2371374 2407683 2388579
3039 2388579 2307746 2404227 2377932 2351625 2375606 2336619 2340588 2294335 2256961 2260037 2204555 2124885
3027 2124885 2240959 2318212 2389907 2288977 2256637 2286528 2325277 2339566 2229230 2292976 2221858
3016 2221858 2261478 2278476 2130338 2210484 2173504 2164565 2218690 2336661 2400412 2402930 2407001 2357250
3004B357250K232M7142m2851O6230J22875p3330j83549J66736J92910k2367N8257
2993B691535N13n8539r0646p0209J12629P309J16522j29270m7945J1897L9165
2982B582961K1590j58646J9496L652K5497M488P3500P1867n6822p543J90118L2315
2970B802473q7253O9779L5835n0186J56131J66651R5103k0496p595M5500Q0634
2959C286576p9331K5379Q1973j94242P7647N9009j81551n0627O6787K2385r344
2948C104661K269O7564p190M2060q483Q1302p1979O846M3145M732O4826L5305
2936C365058J11002L8864Q9366J05625J01745O0790j14700L6992J15825Q0012
2926C990579J8166K8423O4839J57137J7731J9718J85105L4862j9485J12142p3428
$$ plain form
3004 2357250 2359482 2406624 2363773 2430003 2552878 2479548 2295999 2462735 2655645 2633278 2691535
2993 2691535 2692048 2633509 2542863 2472654 2585283 2592592 2709114 2579844 2531899 2543796 2582961
2982 2582961 2604551 2445905 2465401 2469053 2494550 2499038 2572538 2644405 2587583 2580040 2770158 2802473
2970 2802473 2715220 2784999 2820834 2770648 2926779 3093430 3188533 3168037 3160442 3205942 3286576
2959 3286576 3207245 3232624 3314597 3120355 3198002 3257011 3075460 3024833 3091620 3114005 3104661
2948 3104661 3106930 3174494 3167304 3209364 3200881 3282183 3210204 3217050 3260195 3264927 3329753 3365058
2936 3365058 3476060 3514924 3604290 3709915 3811660 3872450 3757750 3794742 3910567 3990579
2926 3990579 4008745 4037168 4102007 4259144 4276875 4296593 4481698 4516560 4497075 4609217 4535789
2915D535789n7210K1080M8796O7343J08927j4412q7276J05540J0412P6137Q6583
2904D901709L5919M3223J75836J5679J54233J33702J19127L6907J06266J64610
2894E887211J44799K04616Q8005K2159J8376K4555l9839j26551j52705l25756
2884E744870r2425k01649l2990m7254k8677N4886Q2086q9143j10029J1229M643
2873E295547P4400M7777P1211L2742m4580N916J01413m5462Q5761O3278L6519
2862E724522j64665M566m6644K9996j29843o6963j20820k73173p3612j41203j78396
2851D563765m5044l8627k5745p0080j66448J61434n9758m9578l5366q0302l1652
2840D122599j04365j34882l9053j09479j39396J168j21576j78339l6815j8469
$$ plain form
2915 4535789 4478579 4499659 4548455 4615798 4724725 4710313 4623037 4728577 4738989 4815126 4901709
2904 4901709 4937628 4980851 5156687 5172366 5326599 5460301 5579428 5616335 5722601 5887211
2894 5887211 6032010 6236626 6324631 6346790 6365166 6389721 6349882 6223331 6070626 5744870
2884 5744870 5652445 5450796 5417806 5370552 5341875 5396761 5478847 5389704 5279675 5290904 5295547
2873 5295547 5369947 5417724 5488935 5521677 5477097 5483013 5584426 5538964 5624725 5688003 5724522
2862 5724522 5559857 5564423 5517779 5547775 5417932 5350969 5230149 4956976 4883364 4742161 4563765
2851 4563765 4518721 4480094 4454349 4384269 4217821 4379255 4319497 4269919 4234553 4154251 4122599
2840 4122599 4018234 3883352 3844299 3734820 3595424 3596592 3475016 3296677 3259862 3241393
2830C241393j19853j56895k12864p3746M3042j24790o9224K637j450j69788p6414
2819B282048K2025j03673p4626P9921j51519q5409J9831l4074Q1242K6910P9847
2808B142523j37989j58633l5719k6482k2899R123N8538L5459j32136j95076K4550
2797A561259K3190n9602m7006j24495q0738K3904j9163l708k9524Q2473n990j11081
2785A209519M9714K1954P6239o0913o0911j01587J03197j8291n4766J8393P1610
2774A254158p8884q0344k9301q7222J3310J28982p6935k877Q2687K3079q8302
2763A058351R175m7959M5401O1108j11380j49140n2037K0291R2484p527o31J1411
2751I29547M2452L1838j56294j5741l1712P8445o8224j44588M8517O0675P3422
$$ plain form
2830 3241393 3121540 2964645 2751781 2678035 2721077 2596287 2527063 2529700 2528250 2358462 2282048
2819 2282048 2304073 2200400 2125774 2205695 2054176 1968767 1988598 1954524 2035766 2062676 2142523
2808 2142523 2004534 1845901 1810182 1783700 1760801 1769924 1828462 1863921 1731785 1536709 1561259
2797 1561259 1584449 1524847 1477841 1353346 1272608 1296512 1277349 1273641 1244117 1326590 1320600 1209519
2785 1209519 1259233 1281187 1357426 1296513 1235602 1134015 1237212 1218921 1164155 1182548 1254158
2774 1254158 1175274 1094930 1065629 978407 991717 1120699 1043764 1040887 1123574 1146653 1058351
2763 1058351 1067526 1019567 1064968 1126076 1014696 865556 813519 833810 926294 918767 918136 929547
2751 929547 971999 1003837 847543 831802 800090 878535 810311 665723 714240 774915 848337
2740H48337N4595j21925q4476J24806J7644j10286R658n717k6253P3335k9282
2729G50436q1049J9772j6436J5428J01894O0667r4283K1779m9286O0094n6903
2718G32113j8435l1439o701k1316N7834j15565M8017O0689K6439r1372N1942k5398
2706F66808j4986j8509j28606J74169M9913l2300K3814o5372l1846L1741j9611
2695F35215l6498L2729R366M8087K4905p8659j10787k5322J77655O2531l4291
2684G04931o5131K2293j18549N578j3788M9936O8785L0935p0305j83503J07804
2673E38986O2529J0310q3687k0368J33497j9250n9728q0483n1343J04608L9816
2662E74887l8675O8422j50508k2339L3698L6408n9601R3175K2488q2109L5921
$$ plain form
2740 848337 902932 781007 696531 821337 838981 728695 738353 732636 706383 779718 750436
2729 750436 669387 689159 672723 688151 790045 850712 756429 778208 728922 789016 732113
2718 732113 713678 682239 675538 654222 712056 596491 644508 705197 731636 640264 692206 666808
2706 666808 651822 633313 504707 678876 728789 696489 720303 654931 623085 654826 635215
2695 635215 598717 631446 640812 688899 713804 635145 524358 499036 676691 739222 704931
2684 704931 639800 662093 543544 549122 535334 585270 654055 684990 614685 431182 538986
2673 538986 601515 611825 528138 507770 641267 622017 562289 481806 430463 535071 574887
2662 574887 536212 604634 454126 431787 465485 501893 442292 535467 557955 475846 511767
2651E11767J10887q6776K8919Q1177k8856n4477j15752J03846J3103l6306m7124
2640D80408K8092J20213k3227l1503Q4029O648n9843o9011N2628J2001L8052j7760
2628F20727k4597Q6303q2889j32255Q370n7942N0235J71295O6537j35340k386
2617E68058R5194n1327M5868k2471q5703l212J8175J38680r8779l9625J71724
2606G36582N1370j51167j5101K0795N184R7096q255M0585l1051j62736j08179
2595D75123J1192O6949J6086Q8125Q1994j65430K4772j6727L2104K4259R5485
2584G33932j055l6036m1047Q1952j3369K290o9936j2872l6826l0438N5354P825
2572F39774M6234M6216Q013p7190j2816j47913k6184J00995N7869k1868R3207
$$ plain form
2651 511767 622654 535878 564797 645974 617118 562641 446889 550735 563838 527532 480408
2640 480408 508500 628713 605486 573983 658012 664660 604817 535806 588434 600435 638487 620727
2628 620727 596130 682433 599544 467289 475659 417717 467952 639247 705784 570444 568058
2617 568058 663252 611925 657793 635322 549619 546407 564582 703262 604483 564858 736582
2606 736582 787952 636785 621684 642479 647663 744759 736504 777089 746038 583302 475123
2595 475123 486315 553264 569350 657475 739469 574039 598811 582084 614188 638447 733932
2584 733932 732877 696841 655794 737746 724377 726667 656731 643859 607033 576595 631949 639774
2572 639774 686008 732224 740237 663047 650231 502318 476134 577129 634998 613130 706337
2561G06337k02008Q0336l3303p4253M4418R4522J2384l2219j9522j5134o9257
2550D92301k0239P9979n2664K5487P1121R2597n0429j02618j5791J6219m4292
2539D91671M5204J17081j36541j4064o1118l0983Q6790j17741M4287K0321L40
2528D45247m3222K4833k9839j3088Q8092m2643j7197l4034p5840m1887j7324J07825
2516C50923M0349k053n1560p7874j0470M3941O0033N5838j14520O9904m6318j00328
2504B17865K0932M3972J65822j16010m1760J10269o1549L2120n892l9257j450
2493C25062J3064O3709j54534Q1109L4984r6997Q1167k8379R8147m5394P4998
2482D46936n5015l4091l0884N2813n4632p654M9776n0919N7331o1582j06915j15766
$$ plain form
2561 706337 504329 584665 551362 477109 521527 616049 628433 596214 576692 561558 492301
2550 492301 472062 552041 499377 524864 595985 688582 638153 535535 519744 535963 491671
2539 491671 536875 653956 517415 503351 442233 411250 498040 380299 424586 444907 445247
2528 445247 402025 426858 397019 383931 472023 429380 412183 378149 302309 260422 243098 350923
2516 350923 391272 389219 337659 259785 249315 293256 353289 409127 294607 364511 318193 217865
2504 217865 238797 282769 448591 332581 290821 401090 339541 371661 365769 326512 325062
2493 325062 338126 401835 247301 328410 363394 266397 347564 319185 417332 371938 446936
2482 446936 391921 357830 326946 379759 325127 317473 367249 316330 373661 312079 205164 89398
2470H9398N3483m12k7343j0919J05916J2179k8788N3500M7084L0055m323K8704
2458C48534l0104r5902k5547j07352J34485l3103N8092k0627Q2664L1356K5731
2447C68227k2958l8979J5342N774j09521M6127P8278j27297L5754J8943j30722
2436A38968n8949J05190K7282J2605L1391j7454r4357R0413m0126N3850M5859
2425B94672q4709M4037Q1247j09167j18567R4219R5616N1228j26487j13527K6929
2414A35491P9474j50068m679J00914n1848J02300J59713p9488j22830k4455m2706
2403A01818k5394K9495J08809k04L1618o1618j1459L0924Q1231j0269r320N1414
2391C17045K5844m8127L3727o4105o2514P3239L9414m8768j53902n801P5427J25856
$$ plain form
2470 89398 142881 142469 115126 104207 210123 222302 193514 247014 294098 324153 319830 348534
2458 348534 318430 222528 196981 89629 224114 191011 249103 228476 311140 342496 368227
2447 368227 345269 306290 321632 327406 217885 264012 342290 214993 250747 269690 138968
2436 138968 80019 185209 212491 225096 256487 239033 144676 235089 194963 248813 294672
2425 294672 209963 254000 335247 226080 107513 201732 297348 348576 222089 108562 135491
2414 135491 214965 64897 60218 161132 109284 211584 371297 291809 168979 144524 101818
2403 101818 76424 105919 214728 214524 246142 184524 173065 203989 285220 274951 265631 317045
2391 317045 342889 294762 328489 264384 201870 275109 314523 265755 111853 106052 181479 307335
2379C07335N1013j7029m8074r289j10298Q0384L980p9452j8374o8784R2617J63003
2367C47032K9205n6993m5430p8977M4153j18849J04126M9388l5340n2448R858
2356A95725k6239j8162O0178j4826q5702N5463j8367r2326n3372k6614R4807K7312
2344I7877N3339m3577j25279J25498K6132J24408n1546k2495K0458o5161M0040
2333A79694p8985l608J02171o4082K6983P2554j41373q3381J28675Q9442N2226
2322B80316J7816j91612J15577L9341J17466m8000j2307m9019j04750l4844J8328
2311A48312O0601l7724r8143j9768J4138N4986M4210o6944M4569M4783k614o5030
2299A21376q4613O5040J45813K7443K6051j6049j6833j7851r5150M3675q3453
$$ plain form
2379 307335 358348 341319 293245 283956 173658 254042 258022 178570 160196 91412 184029 347032
2367 347032 376237 319244 273814 194837 238990 120141 224267 273655 238315 185867 195725
2356 195725 169486 151324 211502 196676 110974 166437 148070 55744 2372 -24242 70565 97877
2344 97877 151216 107639 -17640 107858 133990 258398 206852 184357 204815 139654 179694
2333 179694 100709 97101 199272 135190 162173 234727 93354 9973 138648 228090 280316
2322 280316 298132 106520 222097 261438 378904 330904 318597 269578 164828 129984 148312
2311 148312 208913 171189 73046 53278 67416 122402 166612 99668 144237 189020 186406 121376
2299 121376 36763 101803 247616 275059 301110 285061 268228 250377 155227 198902 115449
2288A15449R3026l5106k4081O169o2552R760j444J7564K0025M3046R5254K6688
2276C03798k07912M8519N1864J0953O4646k993J1693j63489j7259O6316p833q958
2264A49345M2176J9063P7845o9868r604J48175j7204j00253q3735Q5197L5033
2253B76170o7323n9878m3110Q3973N0026pR34r917O7377o4043Q3387L7811r8144
2240B57256p522k6781o28p92L9651O8991q4771n161P6811Q370k4030J12733L5164
2227D49291o7584r2671M940J00826M5559j26893k2676J68364j18894q2711M0450
2216B98001k9122M0417P483l5066p1658r1517O6343P0019j10277L0846j7933Q6522
2204B44058j1930l7569N1977n3513J1137N4899P5033q6738k0614j3526J41868
$$ plain form
2288 115449 208475 173369 149288 155457 92905 102665 101221 118785 138810 181856 277110 303798
2276 303798 95886 144405 196269 207222 271868 268875 280568 117079 99820 166136 158303 149345
2264 149345 191521 210584 288429 218561 208957 357132 339928 239675 155940 241137 276170
2253 276170 208847 148969 105859 189832 239858 239851 240785 230868 298245 234202 317589 355400 257256
2240 257256 249734 222953 222325 221533 261184 330175 245404 240243 317054 325424 301394 414127 449291
2227 449291 381707 289036 293976 394802 440361 313468 290792 459156 340262 257551 298001
2216 298001 268879 309296 316779 281713 210055 118538 184881 254900 144623 175469 157536 244058
2204 244058 232128 194559 246536 193023 204160 259059 334092 247354 226740 213214 355082
2193C55082K9735L6361P0277k12051j05847N0523J11727q1203Q5395J1516m0305
2182C11210J94767m4892q5246R0119o9087L6494M4333J4228p1593r9967J54147
2171D74513J808o9120P3050O0955J73479N2610q8185j7174M7564M2271o6309J36950
2159H22412n7920P346N3714o6329l535M910J45789r5100q143J01978o414J1777
2147I10485l976O1712J9304J2528k2113O3622K0112J5676K2447k8157P7164N9705
2135A208509l0439M1121O303Q3899J14187Q6910q3191L9460J19843J45826P5790
2124A808218J38969R6664R8441J55387J35598L8869J80959J88610k0973R1291
2114B912033K02141J26491J95925L15083J97409L73713K84218M22939L21379M28252
$$ plain form
2193 355082 384817 421178 491455 279404 173557 224080 335807 254604 339999 351515 311210
2182 311210 505977 461085 375839 465958 396871 433365 477698 491926 420333 320366 474513
2171 474513 476321 407201 480251 541206 714685 767295 679110 661936 709500 751771 685462 822412
2159 822412 764492 771838 825552 759223 755688 760598 906387 811287 803144 905122 898708 910485
2147 910485 906509 968221 987525 1000053 977940 1041562 1061674 1077350 1099797 1071640 1148804 1208509
2135 1208509 1178070 1219191 1225494 1309393 1423580 1510490 1427299 1466759 1586602 1732428 1808218
2124 1808218 1947187 2043851 2142292 2297679 2433277 2472146 2653105 2841715 2820742 2912033
2114 2912033 3114174 3240665 3436590 3751673 3949082 4322795 4607013 5029952 5351331 5779583
2104E779583M57804M66765P46148P00014R09522J206694J448901J713504J811831
2095A5240766K354584K597322K388328J679075o22089l088504l478166k951998
2087A4119318k266960j700841j361313j068841j014440p43260o01861l92514k28592
2078D740696k40320j66569k07488k62887k25671k31995l56477j43183j57758k36306
2068B512042r6216k20507j46754j46660n7237J10399n9771r8062k60831j43468
2058A392935M9793j944l8209L2450k9242k1410q410n2560j34715n0133k0228L7737
2046A156064q6195j10886j16190m4723L9283j2112J77423R7631j01202p320j0504
2035I81269j63381r7375J6297R6463o6152j0978j00015J8847l6894J0406M3290
$$ plain form
2104 5779583 6237387 6704152 7450300 8150314 9059836 10266530 11715431 13428935 15240766
2095 15240766 17595350 20192672 22581000 24260075 23637986 20549482 17071316 14119318
2087 14119318 11852358 10151517 8790204 7721363 6706923 5963663 5361802 4969288 4740696
2078 4740696 4500376 4333807 4126319 3863432 3637761 3405766 3049289 2906106 2748348 2512042
2068 2512042 2415826 2195319 2048565 1901905 1844668 1955067 1895296 1797234 1536403 1392935
2058 1392935 1442728 1440784 1402575 1435025 1405783 1384373 1375963 1323403 1188688 1138555 1118327 1156064
2046 1156064 1069869 958983 842793 798070 837353 825241 1002664 1100295 999093 991773 981269
2035 981269 817888 720513 736810 833273 767121 756143 656128 674975 638081 648487 691777
2024F91777k2205O1450k8165r3731o9298k7517J27487J4196n3659o8558J52636
2013F84413j57368K0293M4252j52623L9463k2739J1635k9310l5571O67n2071L2251
2001C83292R1283K1594j99854R378J3571p0981J33769m2114p2599R9061L2502
1990C98902j05046j22937J32146K5998L5668L6896p3214K3529l2402L833j4202
1979C09171o077L7507o4603N2573O7254r0343j469r8282L1847m1173j5769r7487
1967H3149J21332j5641K8580M1413n9699M9819O434j18675J8580p7279J09498
1956A87511K9033p1750J19084N4123r6934O8220J0635M2300L1436j61917p0098
1945A41643o7685J58780l472l6603j10192R5532L261k0157Q0858j04838k8954
$$ plain form
2024 691777 669572 731022 702857 609126 539828 512311 639798 653994 600335 531777 684413
2013 684413 527045 547338 591590 438967 478430 455691 467326 438016 402445 403112 351041 383292
2001 383292 474575 496169 296315 305693 319264 248283 382052 339938 267339 366400 398902
1990 398902 293856 170919 303065 329063 364731 401627 328413 351942 319540 323373 309171
1979 309171 303094 340601 275998 328571 395825 305482 304013 205731 237578 196405 180636 83149
1967 83149 204481 188840 217420 258833 199134 248953 255387 136712 155292 78013 187511
1956 187511 216544 144794 263878 318001 221067 289287 299922 342222 373658 211741 141643
1945 141643 73958 232738 229266 192663 82471 178003 181264 161107 241965 137127 108173
1934A08173j7889M0098k6188K7123O3086j30645P3686L6828O3891L0720L5880
1923C04763j1142q0424j1591j16631Q1970J9630j2593K8725q9500k8241P3816
1912A58782j26494R0351q9511k1868J12480j0718n7115j75O2463r4486j3083Q8478
1900I9104J09391m4195O6454p1372k3618J63286m3108q1009j2965n8357P5235
1889A78846l3214n3760q7612Q1520K0278O3750j27417j5169J91154m6326m4908
1878A27142k3694J04361K1121p0164m5409R3021M1062m1310l2098j9554m2928
1867A11550P7004m6201L3020j1728n0424L3182P1659N3701k3737p0688q4587j5183
1855G7568n182m4819M7437J8168j24161M3198J0939K0479J02443j7945j25140
$$ plain form
1934 108173 90284 130382 104194 131317 194403 63758 137444 174272 238163 268883 304763
1923 304763 293621 213197 201606 84975 166945 186575 173982 202707 113207 84966 158782
1912 158782 32288 122639 33128 11260 123740 113022 55907 55732 118195 23709 10626 99104
1900 99104 208495 164300 230754 159382 135764 299050 255942 174933 161968 103611 178846
1889 178846 145632 91872 4260 85780 106058 169808 42391 27222 218376 172050 127142
1878 127142 103448 207809 228930 158766 113357 206378 247440 206130 174032 154478 111550
1867 111550 188554 142353 175373 163645 113221 146403 218062 271763 248026 177338 92751 77568
1855 77568 72386 27567 75004 93172 -30989 12209 23148 43627 146070 128125 2985
1844B985l5985O2708J7899N2197k2925j1869N6773k6810j43233K9356K30391o7565
1832A43922m1252q0352J33023J27163j42092l7769j6549Q7402O5297l4024r1050
1821A13719N4781l3746L8173O2210p3213L9921j00126o6148J12762M622j00662
1810E2293K0199m0336q3408m5733Q8738O7765n4661K4420M9349m6455j25J17502
1798A49548o178r817P0185j04377p9099O6769L2139k3028j9896n3409N2519j00970
1786b5614N4717J08016q654K2087P5083o5901j16334Q2797O7155j16699o2242
1775A4411j1859O5359Q3219l7272n3129m1732J19115J7548n382j05663J07402
1764A52017Q383M5325r5920m9580M6059J00339k2578j1870q650o6127p2547l6542
$$ plain form
1844 2985 -33000 29708 47607 99804 76879 65010 121783 94973 -48260 -18904 211487 143922
1832 143922 102670 22318 155341 282504 140412 102643 86094 173496 238793 204769 113719
1821 113719 168500 134754 172927 235137 161924 201845 101719 35571 148333 152955 52293
1810 52293 72492 32156 -51252 -96985 -8247 59518 4857 29277 78626 32171 32046 149548
1798 149548 143370 133553 203738 99361 20262 87031 119170 96142 76246 22837 75356 -25614
1786 -25614 29103 137119 128465 150552 225635 159734 43400 126197 193352 76653 14411
1775 14411 2552 67911 151130 113858 60729 18997 138112 155660 150278 44615 152017
1764 152017 160400 205725 109805 60225 106284 206623 184045 172175 163525 97398 24851 -11691
1752a1691J39689J06266J121j18250p5994l5439R656p9009P5352O4443O2693l6919
1740A01918K8344J2129o6880l5691l202j18577M2502K2853Q1957j68k2248m3770
1728h33N9259o710R8976J67p5491K8890r2232J3478k3147Q0949L7332q7582R4385
1715A27441Q2569q7339O2601l6191k4333L5283j9941J8195M9139o5617n824L947
1703A39930K1657o7279k7766q8697k8149K23840L3827r7582O1968k6418K9316
1692A74647l5732q7596l6356O8655l7019j8771j64O7804q460l7698j24339R9227
1680B4198L0682j9966N8573M6936R210n9020M4021J8607n7640o2972L0311M9126
1668A12066J14622m1250k3465n1080j11607r7630J57559J47400j38938P053J33219
$$ plain form
1752 -11691 127998 234264 235385 117135 41141 5702 15358 -63651 11701 76144 138837 101918
1740 101918 130262 142391 75511 39820 36618 -81959 -39457 -16604 65353 65185 42937 -833
1728 -833 58426 51716 150692 150859 75368 104258 12026 25504 2357 83306 120638 33056 127441
1715 127441 210010 122671 185272 149081 124748 160031 140090 158285 207424 141807 135983 139930
1703 139930 161587 94308 66542 -22155 -50304 173536 207363 109781 171749 145331 174647
1692 174647 138915 51319 14963 83618 46599 27828 27664 95468 87008 49310 -75029 24198
1680 24198 54880 34914 93487 140423 149633 90613 134634 153241 95601 32629 62940 112066
1668 112066 226688 185438 161973 110893 -714 -98344 59215 206615 67677 74730 207949
1657B07949J996j44636k2211r4384J43989O1340r6354R707q0610P39n580J9649
1645A594J9832K4083K6628j6607j8691n8586m4943L0881o6704N4741J00426R7250
1633A49904q6219p440K6586k6845O9925k5204q48m0511J2705P7287l6758n3972
1621E8610k2107P2678q9730j6044O601N8772o7338R7913j77070m2052K9756p391
1609i7402O6615L3771J69384r2652p9643J6507N3390J38830o6784p9755R604o8366
1597C499o0227R7028N8631j27650m4370P6045P807Q910M2886N1702k1514r1833
1585I14N9473q2105M3724P739J6620n3763N0650k4322j31216N40O3840J14854
1573F6948n4691L6539j3753J3156j3990P894M2148k633q3150j10807J18594j5134
$$ plain form
1657 207949 209945 65309 43098 -51286 92703 154043 57689 67396 -13214 -12475 -18055 1594
1645 1594 21426 45509 72137 55530 36839 -21747 -66690 -35809 -102513 -47772 52654 149904
1633 149904 63685 56245 82831 55986 125911 100707 99859 59348 72053 149340 112582 58610
1621 58610 36503 109181 19451 3407 10008 68780 1442 99355 -77715 -119767 -90011 -97402
1609 -97402 -30787 2984 172368 79716 73 16580 69970 208800 142016 62261 71865 3499
1597 3499 -56728 40300 98931 -28719 -73089 2956 10763 19673 62559 114261 92747 914
1585 914 60387 -21718 22006 29745 46365 -7398 43252 18930 -112286 -111746 -47906 66948
1573 66948 12257 48796 35043 48199 34209 42103 84251 81618 -1532 -112339 6255 -8879
1561h879O6030R517m4310J4065O5687N266o1693J1845j38826N7617J39713Q5766
1549B01798j48675j17132k7166K4328O8729p5224Q1577l4919M7203q637K9283
1538D1165Q5180j8023M617r2194j8367J07291p2773j58702K4117Q4718K9460o4915
1526d8426Q3377k0836q984N3711o938N2508j8497n3616J0258q2217J11912Q1651
1514A53903k8020r1847l9375N1912R8377l9792K8206L0637j84413M5208J9417
1503D4213m5334j31284J89171N3551p4385J123l7243K0976R31P8005p76q3999
1491A4949n27j1870j13645M171J61002O6722r902l9806L2391j22522J0616O4414
1479E5993L410m4055J01672L4292n7669l532o5272N8561Q0481j9978j37886m7503
$$ plain form
1561 -8879 57151 66668 22358 36423 102110 107376 45683 57528 -81298 -23681 116032 201798
1549 201798 53123 -64009 -91175 -66847 1882 -73342 8235 -26684 20519 11882 41165
1538 41165 126345 108322 112939 20745 2378 109669 36896 -121806 -97689 -12971 16489 -48426
1526 -48426 34951 14115 5131 58842 51904 104412 85915 32299 42557 -39660 72252 153903
1514 153903 125883 34036 -5339 46573 144950 105158 133364 164001 -20412 24796 44213
1503 44213 -1121 -132405 56766 110317 35932 37055 -188 20788 21719 99724 98948 14949
1491 14949 14422 2552 -111093 -106922 54080 120802 110900 71094 103485 -19037 -8421 55993
1479 55993 59403 15348 117020 151312 93643 90111 24839 83400 163881 143903 6017 -41486
1467d1486J4950j28977Q2968J13062m3324J2582O3971r4456M1186k5678O8324
1456F3122M1503j367j51841n8991K7906r7819O5787n6236j3068J24059O2407j8671
1444a3209j10361N796J30341O9375n7386M6301N1113K3645J59978p4377j43157
1433H8059o9835Q2237Q5990K3851j85851m9839r4082N0118J00954O4958k9813
1422F6747m8282N5847P5530k1897p7283M0676K4532J2796m5485m6102L5697r0020
1410a7244l8372L0136N7182q684J7859P105Q1731j3707J12056m8595m0305j33733
1398E429q8119J64364L698P4260l4423j44353m9557J5849Q8382K38L6095L7267
1386A09130q1595N3779M5428m103l4813n5780p0504n1267J33688P7233o0140k3738
$$ plain form
1467 -41486 -26536 -155513 -72545 40517 -2807 9775 73746 -20710 20476 -5202 63122
1456 63122 104625 103258 -48583 -107574 -79668 -177487 -111700 -167936 -181004 -56945 5462 -13209
1444 -13209 -123570 -117774 12567 81942 24556 70857 121970 145615 305593 231216 88059
1433 88059 18224 100461 186451 210302 24451 -25388 -119470 -69352 31602 96560 66747
1422 66747 18465 74312 149842 127945 50662 91338 115870 128666 83181 37079 72776 -17244
1410 -17244 -55616 -25480 31702 23018 40877 47982 129713 116006 228062 179467 139162 5429
1398 5429 -82690 81674 85372 159632 125209 -19144 -68701 -52852 35530 35768 71863 109130
1386 109130 27535 81314 126742 122639 87826 32046 -38458 -89725 43963 121196 61056 37318
1374C7318j8855l4656j5625m1586O10J8277M713O5985L6505p1525O3805P2266
1362A17232j04184K2757Q873L6711o5946m4460J2045K7707L1032O7371M6551j2880
1350A42809j36598O2214L5280j21807N7687j03995n0493O2784K2168O3381J2113
1339D5543l0138r0851L2479J25089j3509o2425P489M784O5439l2557j33712L2033
1327e0336n6976J07167L6881j19356J11049N2725n240J36057j22024j31643M162
1316c7534J18919J8387l8350n5315o7809k770j3219K85O0795J38566j77974K5254
1304c0765l1813m9333n815J05396R1834P9238o1989l424m8571q4981L8786p4542
1292g5979o0738O0404N3203L4782j04047j4935L3408k576J28577o6619j570n2780
$$ plain form
1374 37318 18463 -16193 -31818 -73404 -72794 -54517 -49804 16181 52686 -18839 44966 117232
1362 117232 13048 35805 44678 81389 15443 -29017 -16972 10735 41767 109138 155689 142809
1350 142809 6211 68425 103705 -18102 39585 -64410 -114903 -52119 -29951 33430 45543
1339 45543 15405 -75446 -42967 82122 68613 6188 13677 18461 83900 51343 -82369 -50336
1327 -50336 -107312 -145 36736 -82620 28429 81154 75914 211971 89947 -41696 -37534
1316 -37534 81385 99772 61422 6107 -61702 -64472 -77691 -77406 -16611 121955 -56019 -30765
1304 -30765 -62578 -111911 -117726 -12330 79504 158742 96753 93329 44758 -40223 -1437 -75979
1292 -75979 -136717 -76313 -23110 11672 -92375 -107310 -73902 -76478 52099 -14520 -16090 -68870
1280f8870Q4401K7340j7896o5971R6288q1952n0082M8558l7078J41567J4816O0419
1268A51540q5298q0670N3530l7587L9393J7053q4455K1157l0283l918j18706J03016
1256e5228J78164K7107n6485l7103j8192m0649m5415K181j54070J06390k3991
1245a17291p1145J42532N9257j09343J7476j258J02920r6043L6323K2288M8373
1234C4089O4143j11451Q4266J1485L7214q4882j3848j17694N9060j1464O1017
1223A1935L0942P1193p70M2312q2029j36320m8895N6140M5591o9926J20989J22135
1211A63297o1726p3028o3299J16293k7573p3453R3593P7018k3398j53759o8713
1200i4748n318M149J8702J07108P0024l554p8415j3557N4513k9130P463m2891
$$ plain form
1280 -68870 15531 42871 24975 -40996 55292 -26660 -76742 -28184 -65262 76305 91121 151540
1268 151540 66242 -14428 39102 1515 40908 57961 -26494 -5337 -35620 -39538 -158244 -55228
1256 -55228 122936 150043 93558 56455 38263 -2386 -47801 -45620 -199690 -93300 -117291
1245 -117291 -188436 -45904 13353 -95990 -78514 -79772 23148 -72895 -36572 -14284 34089
1234 34089 98232 -13219 71047 82532 119746 34864 21016 -96678 -37618 -49082 11935
1223 11935 42877 114070 113300 155612 73583 -62737 -111632 -55492 -9901 -79827 41162 163297
1211 163297 101571 28543 -34756 81537 53964 -19489 74104 151122 127724 -26035 -94748
1200 -94748 -100066 -95917 -77215 29893 99917 96363 17948 4391 58904 29774 37237 -5654
1188e654J3319k3771Q4627j3711p6284r4993n7665K1664M1430O8598O0077j3154
1176D483m9148O297O5422n3273o7717P1216Q7580j32243o5582j0067J04685J06353
1164F8006J3535m0730P1871o2673l9620o2937l0982P2427m3670J11103n9547n6438
1152e9655M3978R4494q9630o3962Q5353J6092J02045k1308o0435L0709K6872p3265
1140C1288j98019Q3261O0285l7108l1920p727M942Q6210m7697k2708N3367L5507
1128I681o6596j63839K6420P8361q173M1004l9929Q9262M4116j05147O2062N1076
1116A8298K4368j031l2033L1068q2206k8923j1197P3269k1348R339j7377n1225
1104h8998Q0520j13128Q6848M9016j3606q4616j39826P7438l240J43309j1776
$$ plain form
1188 -5654 7665 -16106 68521 54810 -21474 -116467 -174132 -152468 -111038 -42440 17637 4483
1176 4483 -44665 -38368 27054 -26219 -93936 -22720 64860 -67383 -132965 -143032 -38347 68006
1164 68006 81541 40811 112682 50009 10389 -52548 -83530 -11103 -54773 56330 -3217 -59655
1152 -59655 -15677 78817 -10813 -74775 10578 26670 128715 107407 46972 77681 104553 31288
1140 31288 -166731 -83470 -23185 -60293 -92213 -99940 -94998 -8788 -56485 -79193 -25826 9681
1128 9681 -56915 -220754 -194334 -115973 -124146 -83142 -123071 -33809 10307 -94840 -32778 18298
1116 18298 42666 41635 9602 40670 -41536 -70459 -81656 -8387 -29735 -20396 -37773 -88998
1104 -88998 -8478 -121606 -34758 14258 652 -83964 -223790 -146352 -149592 -6283 -18059
1093a8059k5218K0919K1378j7856k5382N9898L7369Q5188n6742j34322O6580Q2090
1081I5843k7149l5766n623K1953o1308M7177r8008m1238J29985p3056K4174l8262
1069f1278Q9324J3237O4894M4661r5138K917r0044m7653O7134o1194o0369J09318
1057b4191k8640L9733n0769P1854O4573o9938n2666j07579Q7967M0786l8313j3079
1045h0262k5830N0220j4122J08634k012L0347K4425n69j16067j0375J0056K6670
1033A115L7608o3447O1087r4146j01115j1239R1985P2795J24465L3988k7080k27663
1021a01647J2937J17026q5165J42597k5351n5852m7879j0177J4662J1406J62344
1010A34901q2072o6132Q0328o5227l4217n3776P209J39542j09089P615K2012K6586
$$ plain form
1093 -18059 -43277 -22358 -980 -18836 -44218 15680 53049 138237 81495 -52827 13753 95843
1081 95843 68694 32928 27305 49258 -12050 35127 -62881 -104119 25866 -47190 -23016 -61278
1069 -61278 28046 41283 106177 150838 55700 58617 -31427 -79080 -11946 -73140 -133509 -24191
1057 -24191 -52831 -13098 -63867 7987 72560 2622 -50044 -157623 -69656 -28870 -67183 -80262
1045 -80262 -106092 -55872 -69994 38640 36628 66975 91400 90831 -25236 -35611 -25555 1115
1033 1115 38723 -24724 36363 -57783 -158898 -170137 -78152 -5357 119108 153096 126016 -101647
1021 -101647 -88710 28316 -56849 85748 60397 4545 -43334 -53511 -38849 -27443 134901
1010 134901 52829 -13303 67025 1798 -32419 -86195 -78986 60556 -48533 -40918 -18906 7680
998G680o3750J1176O0524k2424J17129n1946q0349Q5311N318k7365K1436R7337
986A60077m7446p2224Q8657K0857J9845J5180n0372p0995K7867n1221p505j9577
974A3143N8308r3032N5743J8624m2389O4221n6231q0306j4441O3P7509o0445l3248
961i2481J05255r0630l5808L9155N3169L5443o0708l8001n4669M3786J22745k6164
949A092p2305N7586N5595j10814N9575o663r9332n6426J32086J36749M5381M2231
937A84755p3900J2806j83004o9470J4882Q7031P7934m8278l1941N5416j9599j65139
925a58507m8246N9508J33842J35666n4594k0989j58961r5879O4793Q3206j00520
914a60681R5410Q6342p0789O8984k5123j07073N1414R6978j22288p6319R5469
$$ plain form
998 7680 -56070 -44894 15630 -6794 110335 58389 -21960 63351 68669 41304 62740 160077
986 160077 112631 40407 129064 149921 169766 184946 134574 63579 91446 40225 32720 13143
974 13143 71451 -21581 34162 52786 10397 74618 18387 -61919 -76360 -76297 1212 -59233 -92481
961 -92481 12774 -77856 -113664 -74509 -21340 14103 -46605 -84606 -139275 -95489 27256 1092
949 1092 -71213 -13627 41968 -68846 -9271 -15934 -115266 -171692 -39606 97143 142524 184755
937 184755 110855 123661 -59343 -128813 -113931 -26900 51034 2756 -29185 26231 6632 -158507
925 -158507 -206753 -147245 -13403 122263 67669 46680 -112281 -208160 -143367 -60161 -160681
914 -160681 -65271 21071 -49718 19266 -5857 -112930 -61516 35462 -86826 -163145 -67676
903f7676j7869Q540J3373N8111P2409L564O9556j36890l4732m4506O683P2135
891B698Q249j32069L8364J642l7960k3213k6073P5100Q0458j4367O967m1168L9819
878b1553j20464j09858P3806J01034P6331j1218j62935K0329N8552R8403Q9804
867I2231n422K9764n7152M9196L0785N0404j804k7510p8753r0938K3151J12206
855A26158j8193p1177J24050r577m1455j15323n3127J54111m2611j41082n4805
844a43031J02883Q1602L807J5739o3364j15332J18067N0070k6811l6155l7504
833e0029P1479o7127n2999j74775J31974J37997r5768n3800O2552P9374n897k0692
821c7711j8476n4719L1523q454N1486M9926K1310o2782o3292O3357P1807q6625
$$ plain form
903 -67676 -85545 -77005 -63632 -5521 66888 70452 140008 3118 -31614 -76120 -69437 2698
891 2698 10947 -121122 -82758 -81116 -119076 -142289 -168362 -93262 -12804 -27171 -20204 -61372 -21553
878 -21553 -142017 -251875 -178069 -77035 -704 -11922 -174857 -154528 -95976 2427 92231
867 92231 86809 116573 59421 108617 139402 189806 188002 160492 81739 -9199 13952 126158
855 126158 107965 36788 160838 151261 109806 -5517 -58644 95467 52856 -88226 -143031
844 -143031 -40148 41454 45261 61000 -2364 -117696 371 50441 23630 -12525 -50029
833 -50029 21450 -45677 -98676 -273451 -141477 -3480 -99248 -153048 -90496 -11122 -17019 -37711
821 -37711 -56187 -110906 -79383 -87837 -36351 13575 34885 -27897 -91189 -27832 43975 -42650
809d2650N1024J4726p5518n2315m0593j2465Q0648L0830l1141O9379j8317J04221
797G7829j87474J20848m732k2018J04089j01661R5157n3889j51442J96563p516
786F5754j29102p908k033M1317J25021j00854M039J7829j0243N8751j16205m8504
774a02138l1190R8027p110n3418r366Q1237Q1762j52354m5752L6488J4304m6681
762a36191M0719m4013L2228m0307J6146K1461Q1064M2121j2134O3257L9300J20773
750B24424p6469M1141j39202k7760m6741M9841k1002j46942J059N4288N2712M273
738c0378Q4943K7554j12538j17447P6408J0824L9401L5889J04400N7373j34378
727D2051M7115m605p2717P1468N390p9951N6219l3198K6940P2219j04079k1488
$$ plain form
809 -42650 8374 23100 -52418 -104733 -145326 -157791 -77143 -46313 -77454 -8075 -26392 77829
797 77829 -109645 11203 6471 -15547 88542 -13119 82038 28149 -123293 73270 65754
786 65754 -63348 -71256 -73289 -31972 93049 -7805 -3766 14063 3820 62571 -53634 -102138
774 -102138 -133328 -35301 -42411 -95829 -105195 -23958 57804 -94550 -140302 -103814 -89510 -136191
762 -136191 -95472 -139485 -107257 -147564 -131418 -109957 -28893 13228 1094 64351 103651 224424
750 224424 147955 189096 49894 22134 -24607 25234 4232 -142710 -141651 -87363 -34651 -30378
738 -30378 54565 82119 -30419 -147866 -71458 -60634 -21233 14656 119056 176429 42051
727 42051 89166 84561 11844 83312 88702 8751 64970 31772 58712 130931 26852 5364
715E364o937j18224j27002Q1940j1601Q1100K8150J08835k0998j8815m3091L1377
703i902j77039j7376P3592m9613K1843l0907L1341P3934J20320L94L3603o360
691F3830r5395m6715L3293J4830n9351J4995J72220o6556M0991j74234j47758
680b49850J35888J20844N9370l7923j39195j5002J50529n6916r9361k4483R1863
669f4236R4000j13086k1260L7982m4740O5917K287J3216l5368k1763J773q0847
657a66125J9554l1071Q5594q834K2015N437K5088L568J06221q807l2035n4096
645c3491N6784p5599j08964Q3028n7267P2811J16453k1352j57981m9955R1423
634h4110O9576J19512r2797r8139J7504M7329r0040j4699K0206N1524O1178P025
$$ plain form
715 5364 -1573 -119797 -246799 -164859 -176460 -95360 -67210 41625 20627 1812 -41279 -9902
703 -9902 -186941 -204317 -130725 -180338 -158495 -189402 -158061 -84127 36193 36587 70190 63830
691 63830 -31565 -78280 -44987 -30157 -89508 -74513 97707 31151 72142 -102092 -249850
680 -249850 -113962 6882 66252 28329 -110866 -125868 24661 -32255 -131616 -156099 -64236
669 -64236 29764 -83322 -104582 -66600 -111340 -45423 -43136 -29920 -65288 -87051 -85278 -166125
657 -166125 -146571 -177642 -92048 -100882 -78867 -73430 -48342 -44774 61447 52640 20605 -33491
645 -33491 23293 -52306 -161270 -78242 -135509 -62698 53755 32403 -125578 -175533 -84110
634 -84110 -14534 104978 12181 -85958 -68454 -21125 -111165 -125864 -105658 -54134 7044 14069
622A4069M6482j3612j07688N6741J67136k00859j06890J32905O5918k3814P2305
611A02693p0091j08502Q1954K9581j1365m0995j01714n110j0465k9242J46935
600a6321j20892j04245P3523J9615R1379O1415p6227j5947J13398M2862r5841
589b7281j31240n2078J09806K2425n7276P2097m0584J09750m033J9049J23362
578A43997m2085p9427j02n0793j9531L2881j10214o8904J31491J11537q2525l9488
566g3163O2174J4472o2312R1108n4825j18294J05278k5693R686j00168J17867
555c3870J8899o9161k7222P9108K0602M3341J55405M362r2568o118p5533n7023
543c9778O2442j286k7162n061J0770L1090o4198q3767M9967J49054n6086P440
$$ plain form
622 14069 60551 46939 -60749 -4008 163128 -37731 -144621 -11716 54202 30388 102693
611 102693 32602 -75900 6054 35635 24270 -16725 -118439 -123549 -134014 -163256 -16321
600 -16321 -137213 -241458 -167935 -148320 -56941 4474 -71753 -87700 25698 68560 -27281
589 -27281 -158521 -210599 -100793 -78368 -135644 -63547 -104131 5619 1586 20635 143997
578 143997 101912 22485 22383 -28410 -47941 -15060 -125274 -194178 -62687 48850 -33675 -73163
566 -73163 -10989 3483 -58829 32279 -22546 -140840 -35562 -61255 -51569 -151737 -33870
555 -33870 -14971 -84132 -111354 -32246 -11644 31697 187102 191464 98896 92778 17245 -39778
543 -39778 22664 21378 -5784 -10845 -75 31015 -33183 -116950 -66983 82071 25985 33425
531C3425p3074l1402L2558K5091L7972j10760R0334r3378J5998J25631m5666n1398
519d4669r6704O8866L8325K8244j07768J2582J16751r0374n6914R114L1215L7146
507e4186M8725J5351K7436p3679m8892p113P4589R158O211l4105o7309L0469j8585
494i1930J6895l4049K567M8129P2538J7374l0120O0627n7537M8282p9796J4825
482a2195J1792R7442q9908l3370k5348K4538N5767L9195k8652O065j40825K0686
470g4813J3869L5561J1310p9807N5869k3338J26630M8038q0216m4098l4626j37652
458a83273P7956J52984L0808J3223n6196j15420Q5537n6043M5427J4730N6924
447F6657p3523o073M9535j57149L070K35961k1266j99870l7234J01380l616j11923
$$ plain form
531 33425 -39649 -71051 -38493 -13402 24570 -86190 4144 -89234 -73236 52395 6729 -44669
519 -44669 -141373 -72507 -34182 -5938 -113706 -101124 15627 -74747 -131661 -122547 -91332 -54186
507 -54186 -5461 9890 37326 -36353 -85245 -92358 -17769 -8611 -2400 -36505 -103814 -73345 -91930
494 -91930 -75035 -109084 -106517 -58388 14150 31524 1404 62031 4494 52776 -27020 -12195
482 -12195 -403 97039 7131 -26239 -51587 -27049 28718 67913 39261 45326 -95499 -74813
470 -74813 -60944 -25383 -14073 -93880 -38011 -61349 65281 113319 33103 -10995 -45621 -183273
458 -183273 -105317 47667 78475 91698 35502 -79918 5619 -50424 -4997 9733 66657
447 66657 -6866 -12939 36596 -120553 -117483 118478 97212 -102658 -139892 -38512 -42128 -154051
435a54051O059k4163N8967j1821J3275q3954J51543P9283j44708J11464m1260
424c9366l1900p8722M9255Q7497m0865m1883P6140O5078j08873m1836P7092p4368
412a02751M1911J05096m7462l4667k387L9457j0449L7350R7873j23809o7981k83
400f8102J0005J0225J1351O3924O1654j05623j22213j6518m986R5686k6282o7403
388a58282m4425K4131O8329o901k7462J4669R7114R962q630l4393q0726J96352
376D9738k3991J059m0745j08925K2111n473M2949K1121n5143K6544J4712l7229
364i3272L4011m9574j1652J852J3118M2370j9380M3362j56554J4361N3405J9970
352a07983K0802N3737K2048M7474l3639L104J561j5006k7544k159N9661j09362
$$ plain form
435 -154051 -147992 -172155 -113188 -125009 -111734 -195688 -44145 35138 -109570 1894 -39366
424 -39366 -71266 -149988 -100733 -13236 -54101 -95984 -19844 45234 -63639 -105475 -28383 -102751
412 -102751 -60840 44256 -3206 -37873 -40260 -803 -11252 26098 123971 162 -67819 -68102
400 -68102 -58097 -47872 -36521 27403 89057 -16566 -138779 -155297 -160283 -64597 -90879 -158282
388 -158282 -202707 -178576 -110247 -117148 -144610 -129941 -32827 -22865 -31495 -65888 -146614 49738
376 49738 25747 26806 -13939 -122864 -100753 -106226 -63277 -42156 -97299 -70755 -56043 -93272
364 -93272 -59261 -108835 -120487 -118635 -105517 -63147 -82527 -39165 -195719 -181358 -127953 -107983
352 -107983 -87181 -33444 -11396 36078 2439 5543 7104 -7902 -35446 -37605 22056 -87306
340h7306r6455m0402J12544J99506p1602J9297J3696n9916l4950O1976L8514j5957
328C8945L4025n002J65208k25943m6569L9064j4017k4337j6077j7814n7164n4017
316a83698K7853L1216O9806N7748l2740k7248l270M3853l6612r0098r852K7495
304a25547J36321L8460p6539l0093l1087N9650J31122J4230m1527m2834j99827
293a67671j7876O2134O9448q9818N6064J69336j07740R0653k2319L552j2101K1596
281E5258j43505K3025j5830l0488O1746m9342m2459N2446r845n6400k1672j1151
269a88217P5552Q9698m0251O6776M1629m4620l4747k7571o54j81779O5527L9026
$$ plain form
340 -87306 -183761 -224163 -111619 87887 16285 35582 49278 -10638 -45588 16388 54902 38945
328 38945 72970 67968 233176 7233 -39336 -272 -14289 -38626 -54703 -72517 -129681 -183698
316 -183698 -155845 -124629 -54823 2925 -29815 -57063 -60333 -16480 -53092 -143190 -153042 -125547
304 -125547 10774 49234 -27305 -57398 -88485 -28835 102287 116517 74990 32156 -167671
293 -167671 -185547 -123413 -53965 -143783 -87719 81617 -26123 64530 42211 45763 33662 55258
281 55258 -88247 -65222 -81052 -111540 -49794 -99136 -141595 -89149 -98994 -155394 -177066 -188217
269 -188217 -112665 -22967 -63218 3558 45187 567 -34180 -61751 -62405 -244184 -178657 -139631
$$ [...]
##END NTUPLES=NMR SPECTRUM
##END=
