##TITLE=1H_CA-9081-1
 CDCl3
 8 sc, 
 25.10.2022
##JCAMPDX= 6.0         $$ Bruker NMR JCAMP-DX V2.0
##DATA TYPE= NMR SPECTRUM
##DATA CLASS= NTUPLES
##ORIGIN= UXNMR, Bruker Analytische Messtechnik GmbH
##OWNER= root
$$ XWIN-NMR		Version 3.5
$$ Tue Oct 25 13:52:07 2022 Russian Standard Time (UT+4h)  she@DPX200
##.OBSERVE FREQUENCY= 200.1313499994
##.OBSERVE NUCLEUS= ^1H
##.ACQUISITION MODE= SIMULTANEOUS
##.ACQUISITION SCHEME= undefined
##.AVERAGES= 8
##.DIGITISER RES= 18
##SPECTROMETER/DATA SYSTEM= spect
##.PULSE SEQUENCE= zg30
##.SOLVENT NAME= CDCl3
##.SHIFT REFERENCE= (INTERNAL, CDCl3, 0, 15.7943)
##AUDIT TRAIL= $$ (NUMBER, WHEN, WHO, WHERE, WHAT)
$$ ##TITLE= Audit trail, XWIN-NMR		Version 3.5
$$ ##JCAMPDX= 5.01
$$ ##ORIGIN= Bruker BioSpin GmbH
$$ ##OWNER= she
$$ F:/spectra/data/she/nmr/H-F/1/pdata/1/auditp.txt
$$ ##AUDIT TRAIL=  $$ (NUMBER, WHEN, WHO, WHERE, WHAT)
(   1,<2022-10-25 13:50:56.68 +0400>,<she>,<DPX200>,
      <created by zg, POWCHK disabled, PULCHK disabled
       configuration hash MD5:
       00 E9 B6 7A A2 85 ED C7 34 08 36 98 17 FE 4E 26
       data hash MD5: 16K
       7C CB 41 C0 EB FF 1D 3E 02 2B 51 6A 11 24 E2 E8>)
(   2,<2022-10-25 13:50:59.10 +0400>,<she>,<DPX200>,
      <Start of raw data processing
       efp BC_mod = 2 LB = 0.24 FT_mod = 6 PKNL = 1 PHC0 = -18034.23 PHC1 = 11.2007 SI = 16K 
       data hash MD5: 16K
       06 BF D6 8B 61 1A 10 F4 DE 9E 27 24 5E 11 DE 58>)
(   3,<2022-10-25 13:51:19.92 +0400>,<she>,<DPX200>,
      <pk PHC0 = -157.0264 PHC1 = -1.8 
       data hash MD5: 16K
       43 0E 8D 4E E9 42 87 C6 FF FA 65 63 8A 29 54 3F>)
(   4,<2022-10-25 13:51:23.15 +0400>,<she>,<DPX200>,
      <abs ABSG = 5 
       data hash MD5: 16K
       E0 47 76 2C 55 DE A8 84 0D 54 FA 5D 07 02 83 BC>)
(   5,<2022-10-25 13:51:40.46 +0400>,<she>,<DPX200>,
      <abs ABSG = 5 
       data hash MD5: 16K
       CC B9 99 11 04 D0 47 65 84 1A 0D 61 97 EC 5C B3>)
$$ ##END=
$$ 
$$ hash MD5
$$ 87 C0 B4 F7 AF 66 EA 99 83 11 18 AD A9 FB 07 91
##$RELAX= 
##$RELAX= 
##$RELAX= 
##$RELAX= 
##$RELAX= 
##$RELAX= 
$$ Bruker specific parameters
$$ --------------------------
##$DU= <F:/spectra>
##$EXPNO= 1
##$NAME= <H-F>
##$PROCNO= 1
##$TYPE= <nmr>
##$USER= <she>
##$AMP= (0..31)
100 100 100 100 100 100 100 100 100 100 100 100 100 100 100 100 100 100 
100 100 100 100 100 100 100 100 100 100 100 100 100 100 
##$AQSEQ= 0
##$AQ_mod= 1
##$AUNM= <au_zg>
##$AUTOPOS= <>
##$BF1= 200.13
##$BF2= 200.13
##$BF3= 200.13
##$BF4= 200.13
##$BF5= 200.13
##$BF6= 200.13
##$BF7= 200.13
##$BF8= 200.13
##$BYTORDA= 1
##$CFDGTYP= 0
##$CFRGTYP= 5
##$CHEMSTR= <none>
##$CNST= (0..31)
1 1 145 1 1 1 1 1 1 1 1 1 1 1 1 1 1 1 1 1 1 1 1 1 1 1 1 1 1 1 1 1 
##$CPDPRG= <>
##$CPDPRG1= <>
##$CPDPRG2= <>
##$CPDPRG3= <>
##$CPDPRG4= <mlev>
##$CPDPRG5= <mlev>
##$CPDPRG6= <mlev>
##$CPDPRG7= <mlev>
##$CPDPRG8= <mlev>
##$CPDPRGB= <>
##$CPDPRGT= <>
##$D= (0..31)
0 1.2 0 0 0 0 0 0 0 0.06 0 0.03 0 0 0 0 0.0002 0 0 0 0 0 0 0 0 0 0 0 0 
0 0 0 
##$DATE= 1666691455
##$DBL= (0..7)
$$ [...]
##$SUBNAM3= <"">
##$SUBNAM4= <"">
##$SUBNAM5= <"">
##$SUBNAM6= <"">
##$SUBNAM7= <"">
##$SUBNAM8= <"">
##$SUBNAM9= <"">
##$SW= 18.0517283424941
##$SWIBOX= (0..15)
0 0 2 0 0 0 0 0 0 0 0 0 0 0 0 0 
##$SW_h= 3612.71676300578
##$TD= 16384
##$TD0= 1
##$TE= 0
##$TE2= 300
##$TE3= 300
##$TEG= 300
##$TL= (0..7)
0 120 120 120 120 120 120 120 
##$TP= (0..7)
150 150 150 150 150 150 150 150 
##$TP07= 0
##$TPNAME0= <>
##$TPNAME1= <>
##$TPNAME2= <>
##$TPNAME3= <>
##$TPNAME4= <>
##$TPNAME5= <>
##$TPNAME6= <>
##$TPNAME7= <>
##$TPOAL= (0..7)
0.5 0.5 0.5 0.5 0.5 0.5 0.5 0.5 
##$TPOFFS= (0..7)
0 0 0 0 0 0 0 0 
##$TUNHIN= 0
##$TUNHOUT= 0
##$TUNXOUT= 0
##$USERA1= <user>
##$USERA2= <user>
##$USERA3= <user>
##$USERA4= <user>
##$USERA5= <user>
##$V9= 5
##$VALIST= <valist>
##$VCLIST= <CCCCCCCCCCCCCCC>
##$VD= 0
##$VDLIST= <DDDDDDDDDDDDDDD>
##$VPLIST= <PPPPPPPPPPPPPPP>
##$VTLIST= <TTTTTTTTTTTTTTT>
##$WBST= 1024
##$WBSW= 4
##$XGAIN= (0..3)
0 0 0 0 
##$XL= 0
##$YL= 0
##$YMAX_a= 369186
##$YMIN_a= -295563
##$ZGOPTNS= <>
##$ZL1= 120
##$ZL2= 120
##$ZL3= 120
##$ZL4= 120
##$ABSF1= 15.79427
##$ABSF2= -2.257582
##$ABSG= 5
##$ABSL= 3
##$ALPHA= 0
##$AQORDER= 0
##$ASSFAC= 0
##$ASSFACI= 0
##$ASSFACX= 0
##$ASSWID= 0
##$AUNMP= <proc_1d>
##$AZFE= 0.1
##$AZFW= 0.1
##$BCFW= 0
##$BC_mod= 2
##$BYTORDP= 0
##$COROFFS= 0
##$CY= -3
##$DATMOD= 1
##$DC= 0
##$DFILT= <>
##$DTYPP= 0
##$F1P= 0
##$F2P= 0
##$FCOR= 1
##$FTSIZE= 16384
##$FT_mod= 6
##$GAMMA= 0
##$GB= 0
##$INTBC= 1
##$INTSCL= 3.70164e-10
##$ISEN= 128
##$LB= 0.24
##$LEV0= 0
##$LPBIN= 0
##$MAXI= 10000
##$MC2= 0
##$MEAN= 0
##$ME_mod= 0
##$MI= 1.114404
##$NCOEF= 0
##$NC_proc= -7
##$NLEV= 6
##$NOISF1= 3.799351
##$NOISF2= 2.8
##$NSP= 0
##$NTH_PI= 0
##$NZP= 0
##$OFFSET= 15.79427
##$PC= 1
##$PHC0= -18191.26
##$PHC1= 9.4007
##$PH_mod= 1
##$PKNL= yes
##$PPARMOD= 0
##$PSCAL= 0
##$PSIGN= 0
##$REVERSE= no
##$SF= 200.129995450172
##$SI= 16384
##$SIGF1= 3
##$SIGF2= 2
##$SINO= 5.538805
##$SIOLD= 16384
##$SREGLST= <1H.CDCl3>
##$SSB= 0
##$STSI= 16384
##$STSR= 0
##$SW_p= 3612.71676300578
##$SYMM= 0
##$S_DEV= 0
##$TDeff= 16384
##$TDoff= 0
##$TI= <>
##$TILT= no
##$TM1= 0
##$TM2= 0
##$TOPLEV= 0
##$USERP1= <user>
##$USERP2= <user>
##$USERP3= <user>
##$USERP4= <user>
##$USERP5= <user>
##$WDW= 1
##$XDIM= 16384
##$YMAX_p= 339663286
##$YMIN_p= -216260
$$ End of Bruker specific parameters
$$ ---------------------------------
##NTUPLES= NMR SPECTRUM
##VAR_NAME=  FREQUENCY,     SPECTRUM/REAL,   SPECTRUM/IMAG
##SYMBOL=    X,             R,               I
##VAR_TYPE=  INDEPENDENT,   DEPENDENT,       DEPENDENT
##VAR_FORM=  AFFN,          ASDF,            ASDF
##VAR_DIM=   16384,         16384,           16384
##UNITS=     HZ,            ARBITRARY UNITS, ARBITRARY UNITS
##FACTOR=    0.220516191357247, 1,           1
##FIRST=     3160.90709553534, 0,            0
##LAST=      -451.809667470445, 0,           0
##MIN=       -451.809667470445, -216260,     0
##MAX=       3160.90709553534, 339663286,    0
$$ Real data points
##PAGE= N=1
##DATA TABLE= (X++(R..R)), XYDATA
$$ [...]
6315B029961r1928q1444j7447o4525p3660O1080p5295l3586r3024r1197J3668
$$ 2029961 1938033 1856589 1839142 1774617 1700957 1762037 1686742 1653156 1560132 1468935 1482603
6304A482603o508l120k7884r1472k617n9422o4367k3503o480o3148L741O013q1752
$$ 1482603 1476095 1472975 1445091 1353619 1351002 1291580 1227213 1203710 1197230 1134082 1137823 1143836 1062084
6291A062084O0858r2036o5341L9565M154L8494j06133j08875o2526J02087P435
$$ 1062084 1122942 1030906 965565 1005130 1009284 1047778 941645 832770 770244 872331 879766
6280H79766n7852j1654l7066n1427N7409j1260p548K2159k9258k1321l1170j9998
$$ 879766 821914 810260 773194 721767 779176 767916 760368 782527 753269 731948 700778 680780
6268F80780j7355Q6967J912m5171p8279k355o7530r558p065N0426j6294K6291
$$ 680780 663425 750392 752304 707133 628854 626499 558969 549411 542346 592772 576478 602769
6256F02769j6686l0028J6519P7860o1892p0135J7689n8687m0175M0582N9989J2159
$$ 602769 586083 556055 572574 650434 588542 518407 536096 477409 437234 477816 537805 549964
6244E49964k9119K6535m5593K882r7277m839M4702O921q398M0830k046p6859J2703
$$ 549964 520845 547380 501787 504669 407392 402553 447255 454176 445778 486608 484562 407703 420406
6231D20406M6430j6127p3225q729j4536j6848k6862K3296K9027O2862j3870K0757
$$ 420406 466836 450709 377484 368755 354219 337371 310509 333805 362832 425694 411824 432581
6219D32581l7457M9206k8893k062J8593J4595r491l6141Q385l1663j9941J00790
$$ 432581 395124 444330 415437 413375 431968 446563 437072 400931 409316 377653 357712 458502
6207D58502K3817j11460M0863l359k9125K3045N5572j4650l8447L3313Q583j574
$$ 458502 482319 370859 411722 408363 379238 402283 457855 443205 404758 438071 446654 445080
6195D45080K0389K3214m6819j1414l3084K9059M5183l431R578j1449J9523m7934
$$ 445080 465469 488683 441864 430450 397366 426425 471608 468177 477755 466306 485829 437895
6183D37895P4457L4737m0424J5650m0071L2619N7839n284k5275q76J8394L7398
$$ 437895 512352 547089 506665 522315 482244 514863 572702 567418 542143 541267 559661 597059
6171E97059K0351n0142l2122J01403L8240O204k1066J06551N7014L5107N5472
$$ 597059 617410 567268 535146 636549 674789 680993 659927 766478 823492 858599 914071
6160I14071j6034J22821Q4276P6267R329J1543N9384L5088k1808j05154j01274
$$ 914071 898037 1020858 1105134 1181401 1190730 1202273 1261657 1296745 1274937 1169783 1068509
6149A068509k9447K4547n144Q057O9391J6939j919L0952Q5594M7799J3470N2895
$$ 1068509 1039062 1063609 1058465 1066522 1135913 1152852 1150933 1181885 1267479 1315278 1328748 1381643
6137A381643M6877p267Q1229P2977J00258J06844Q0402J39938J42004J54788J38274
$$ 1381643 1428520 1421253 1502482 1575459 1675717 1782561 1862963 2002901 2144905 2299693 2437967
6126B437967Q6278J92339K83793J75786J73647J01247J379l6545m8338p1539j96116
$$ 2437967 2524245 2716584 3000377 3176163 3349810 3451057 3452436 3415891 3367553 3296014 3099898
6115C099898j37365p5343j09014l4340j6872l4392r588L6611l5665Q0520J1512
$$ 3099898 2962533 2887190 2778176 2743836 2726964 2692572 2682984 2719595 2683930 2764450 2775962
6104B775962o638O6889J42896J30877J37958R0034J73418J97907J29708K12469
$$ 2775962 2769324 2836213 2979109 3109986 3247944 3337978 3511396 3709303 3839011 4051480
6094D051480K59279K91827L39559K72838K95964J63410J14518Q2181j03144j77043
$$ 4051480 4310759 4602586 4942145 5214983 5510947 5674357 5788875 5871056 5767912 5590869
6084E590869j48340j83945j97782k64491l07958j38089j74968k19782j35709k1644
$$ 5590869 5442529 5258584 5060802 4796311 4488353 4350264 4175296 3955514 3819805 3798161
6074C798161l3328m9055M8650L6297J06697Q3794M5398J61926J29346O7767N5831
$$ 3798161 3764833 3715778 3764428 3800725 3907422 3991216 4036614 4198540 4327886 4395653 4451484
6063D451484J91061J45711J85468J13666J92274J83869K25215J13139K9614j12448
$$ 4451484 4642545 4788256 4973724 5087390 5279664 5463533 5688748 5801887 5831501 5719053
6053E719053j96404k36029l61620l05167l46748k22416k59703k72505j17582m3413
$$ 5719053 5522649 5286620 4925000 4619833 4273085 4050669 3790966 3518461 3400879 3357466
6043C357466o0657l9803n6841l7324O2475r050N463N3586K2245k3093K2918j6588
$$ 3357466 3296809 3257006 3200165 3162841 3225316 3216266 3221729 3275315 3297560 3274467 3297385 3280797
6031C280797P425l1953o1620m5197j2176j04336j71465r1240p8181j08110n372
$$ 3280797 3288222 3256269 3194649 3149452 3137276 3032940 2861475 2770235 2692054 2583944 2578572
6020B578572r2359q8323o1528r5243q0300q2713j06511r5963n4794l8693J0988
$$ 2578572 2486213 2397890 2336362 2241119 2160819 2078106 1971595 1875632 1820838 1782145 1793133
6009A793133o1304j0975q2252n3237m2773j6482M7835j1003r1760n7463m0004
$$ 1793133 1731829 1720854 1638602 1585365 1542592 1526110 1573945 1562942 1471182 1413719 1373715
5998A373715j2776l8656l0741q5582q3732m7810l9277o5984q256P996n8280J0538
$$ 1373715 1360939 1322283 1291542 1205960 1122228 1074418 1035141 969157 960901 968897 910617 921155
5986I21155j086n610p5645n3196m0461k4578J05973m3448l9094K3142l0219n5504
$$ 921155 920069 914459 838814 785618 745157 720579 826552 783104 744010 767152 736933 681429
5974F81429j3106j1270L5567L8093k594L5104k0749k7576P431n693o470J1207
$$ 681429 668323 657053 692620 730713 728119 763223 742474 714898 722329 716636 710166 721373
5962G21373Q23K0270k4156o062k8921J297k4218k5483j8578O0303J0030n9979
$$ 721373 722196 742466 718310 712248 683327 684624 660406 634923 616345 676648 686678 626699
5950F26699N0414K9314o3095J4242m3866k2898j6339Q4644k2384o1231L8020l9479
$$ 626699 677113 706427 643332 657574 613708 590810 574471 659115 636731 575500 613520 574041
5938E74041J3221K7046R5138j9937L1954j20542j9651N2719Q74L47l4741l0804
$$ 574041 587262 614308 709446 689509 721463 600921 581270 633989 634863 635210 600469 569665
5926E69665L5695J9458k4483O7442l8543k6862M7257P47L4824k4666L6530k9642
$$ 569665 605360 624818 600335 667777 629234 602372 649629 650376 685200 660534 697064 667422
5914F67422P1431j6066J7847k3319o7418R1286j066J2582l5425j229J1444N5682
$$ 667422 738853 722787 740634 717315 649897 741183 740117 752699 717274 716045 727489 783171
5902G83171M9484j4458o2751p968N1800K8947K7115j5958K9372Q2554j869m599
$$ 783171 832655 818197 755446 747478 799278 828225 855340 839382 868754 951308 949439 944840
5890I44840K2649M8788m34M9377M5600J2340N3074O0566j12860M6334L8326j8279
$$ 944840 967489 1016277 1015843 1065220 1110820 1123160 1176234 1236800 1123940 1170274 1208600 1190321
5878A190321M4556l5597j4472M9782j1968M5459P7375L3844Q6719j0836L0356
$$ 1190321 1234877 1199280 1184808 1234590 1222622 1268081 1345456 1379300 1466019 1455183 1485539
5867A485539O0322J357J0344L8100L9081L4650j2039K0344m0098p3339k6654N0331
$$ 1485539 1545861 1547218 1557562 1595662 1634743 1669393 1657354 1677698 1637600 1564261 1537607 1587938
5855A587938M3304m308O49M0138J7478N4658m1349l0192P6309N8710J6385R361
$$ 1587938 1631242 1626934 1627583 1667721 1685199 1739857 1698508 1668316 1744625 1803335 1819720 1829081
5843A829081J7647L5396p327L8050R0437K8949N9746J3161L5269j547k5394q8779
$$ 1829081 1846728 1882124 1874797 1912847 2003284 2032233 2091979 2105140 2140409 2138862 2113468 2024689
5831B024689p2071l5726j6987p178K6474l1400n3772k6149n8967l7215l5791k8753
$$ 2024689 1952618 1916892 1899905 1892727 1919201 1887801 1834029 1807880 1748913 1711698 1675907 1647154
5819A647154K8472n8353J0622Q925m344M4113J6531L5462M5299l3183m752Q300
$$ 1647154 1675626 1617273 1627895 1636820 1632476 1676589 1693120 1728582 1773881 1740698 1735946 1744246
5807A744246k7315k0927J1204L0229r8579J7538J7088j1804j1010j3835m7332
$$ 1744246 1716931 1696004 1707208 1737437 1638858 1656396 1673484 1661680 1650670 1636835 1589503
5796A589503N0457J16614m3381k474k9091n9718j7835o1772o3472j06500K7934
$$ 1589503 1639960 1756574 1713193 1710719 1681628 1621910 1604075 1542303 1478831 1372331 1400265
5785A400265J8903q8575J7139K2843k2420o3668j340J9535M123n86j9211J8264
$$ 1400265 1419168 1330593 1347732 1370575 1348155 1284487 1283147 1302682 1306805 1306219 1287008 1305272
5773A305272J7597J3916j2113J7854l8651M655O2981J15478k9010j5316J6959
$$ 1305272 1322869 1336785 1324672 1342526 1303875 1308530 1371511 1486989 1457979 1442663 1459622
5762A459622M5058k127o7795k46p8457m6450l7994j0023o0578p741J1414J6993
$$ 1459622 1504680 1502553 1434758 1434512 1356055 1309605 1271611 1261588 1201010 1193269 1204683 1221676
5750A221676J0635J8713M0924k999n9219p3221M4589O5691m5554L8058M3379r194
$$ 1221676 1232311 1251024 1291948 1288949 1229730 1156509 1201098 1266789 1221235 1259293 1302672 1293478
5738A293478L0286N193K0115O7810k6336n5039K6729L2294M2871P202J735o338
$$ 1293478 1323764 1328957 1349072 1416882 1390546 1335507 1362236 1394530 1437401 1444603 1446338 1440000
5726A440000j12841N941j8042k1516k0503Q927K3621q166M8189J1930M0535K8893
$$ 1440000 1327159 1333100 1315058 1293542 1273039 1281966 1305587 1297421 1345610 1357540 1398075 1426968
5714A426968L1470o6150O130Q3419m1158p7380O6069M5957J7173O9635M6289O8302
$$ 1426968 1458438 1392288 1398418 1481837 1440679 1363299 1429368 1475325 1492498 1562133 1608422 1676724
5702A676724M788n1643o5354p1393l1796O4124l0269R262p425L1163o91K1734
$$ 1676724 1681512 1629869 1564515 1493122 1461326 1525450 1495181 1504443 1497018 1528181 1527490 1549224
5690A549224j642n5237J00733J5657j1435J27073N958N1031Q8206L0910N2040
$$ 1549224 1547582 1492345 1593078 1608735 1597300 1724373 1730331 1781362 1869568 1900478 1952518
5679A952518N6347J21424J91097J27710j7187O0306j27095p6581n0106n5658k1456
$$ 1952518 2008865 2130289 2321386 2449096 2431909 2492215 2365120 2288539 2238433 2182775 2161319
5668B161319k1697M0366o4186m0268L2871Q6507l1345q47N4768J4639Q5763L3853
$$ 2161319 2139622 2179988 2115802 2075534 2108405 2194912 2163567 2162720 2217488 2232127 2317890 2351743
5656B351743O3163K1077J8552M4108J45336O8718J89344J47013Q7526N5856o2682
$$ 2351743 2414906 2435983 2454535 2498643 2643979 2712697 2902041 3049054 3136580 3192436 3129754
5645C129754q706l2853j13880j00304n8681L2105O53n5319M2314P2479J4856K0863
$$ 3129754 3121048 3088195 2974315 2874011 2815330 2847435 2848088 2792769 2835083 2907562 2922418 2943281
5633B943281O5796n5180Q255J53302J1172M6613Q9028J47765O4803K8605J17539
$$ 2943281 3009077 2953897 2962152 3115454 3126626 3173239 3262267 3410032 3474835 3503440 3620979
5622C620979J90019J14936J41724P8242K341O5959k985n8663o2091L5042P0219
$$ 3620979 3810998 3925934 4067658 4145900 4148241 4214200 4211215 4152552 4090461 4125503 4195722
5611D195722J3057P9595P6517J92801J18954J9273J41584J16093J80568J19178
$$ 4195722 4208779 4288374 4364891 4557692 4676646 4695919 4837503 4953596 5134164 5253342
5601E253342K18839K39424K30150J63451K19676J94290K73645L50954L88293L27913
$$ 5253342 5472181 5711605 5941755 6105206 6324882 6519172 6792817 7143771 7532064 7859977
5591G859977L52333M22949M33399M06373M73429N56558N47050N79367O06911O30842
$$ 7859977 8212310 8635259 9068658 9475031 9948460 10505018 11052068 11631435 12238346 12869188
5581A2869188P30092P71534Q24320Q11855Q66974P69633O51096M85106L45035
$$ 12869188 13599280 14370814 15195134 16006989 16873963 17643596 18294692 18779798 19124833
5572A9124833K58232R3978N1763J35470J13828J86507J82098J08521Q0829O6524
$$ 19124833 19383065 19477043 19528806 19664276 19778104 19964611 20146709 20255230 20336059 20402583
5562B0402583Q7215Q7126J12073L02231M07050N51304O73451Q76887R64204R50427
$$ 20402583 20489798 20576924 20688997 20991228 21398278 21949582 22623033 23499920 24464124 25414551
5552B5414551J044679J053892J014395R72511J004560R13553Q39065Q23397O53764
$$ 25414551 26459230 27513122 28527517 29500028 30504588 31418141 32257206 33080603 33734367
5543C3734367L39976P1776l25503n47281p05333r13788r37009r54071r84264r36765
$$ 33734367 34074343 34146119 33820616 33273335 32568002 31654214 30717205 29763134 28778870 27842105
5533B7842105q98423r89641r89743p91235o29561n19553m55568l67707k02605
$$ 27842105 26943682 25954041 24964298 24173063 23543502 23023949 22568381 22200674 21998069
5524B1998069k4462J9670J05721M7769M4245n4713j35406k10337o3132j13153
$$ 21998069 21973607 21993277 22098998 22146767 22191012 22136299 22000893 21790556 21727424 21614271
5514B1614271k1672m1975k75402l01710m89405p83680q66685r94253r93467q75772
$$ 21614271 21592599 21550624 21275222 20973512 20484107 19700427 18833742 17839489 16846022 15970250
5504A5970250q63017p58796p21231o25786n66723n57529n31800m85835n02340
$$ 15970250 15107233 14348437 13627206 13001420 12434697 11877168 11345368 10859533 10357193
5495A0357193m48730l59623l78719l75049k87835l03476j75419k29234k13613
$$ 10357193 9908463 9548840 9170121 8795072 8507237 8203761 8028342 7799108 7585495
5486G585495j45500k20749j68164j47296j03364j10880J7336m2997r3032n2198
$$ 7585495 7439995 7219246 7051082 6903786 6800422 6689542 6706878 6663881 6570849 6518651
5476F518651j8863J1556p811M27l6701M2968j545N4219L4530l8567M3880k2811
$$ 6518651 6499788 6511344 6503533 6503960 6467259 6510227 6508682 6562901 6597431 6558864 6602744 6579933
5464F579933o39J3650l4210r2780j5661k9520k6308q5866p9821q9941p5488p0180
$$ 6579933 6579294 6592944 6558734 6465954 6450293 6420773 6394465 6308599 6228778 6138837 6063349 5993169
5452E993169j6132o305l2153N1354m6834K6272M5525J15383J05760J10178J37181
$$ 5993169 5977037 5970732 5938579 5989933 5943099 5969371 6014896 6130279 6236039 6346217 6483398
5441F483398J15005J47561Q1180M0281O4778J09462J03806j1265K6195j24324
$$ 6483398 6598403 6745964 6827144 6867425 6932203 7041665 7145471 7134206 7160401 7036077
5431G036077q8663l2064j25657j28795j00637l3782q9300n288P2525l2930m2355
$$ 7036077 6947414 6915350 6789693 6660898 6560261 6526479 6437179 6431891 6504416 6471486 6429131
5420F429131K6065M93l0050J3677m76L9010l425m0373R7042M0273N2797O6491
$$ 6429131 6455196 6455689 6425639 6439316 6438840 6477850 6474425 6434052 6531094 6571367 6624164 6690655
5408F690655L8471Q5681m3312k0834L8061L5688J026K115J6575J4678M5939K3902
$$ 6690655 6729126 6814807 6771495 6750661 6788722 6824410 6825436 6827551 6844126 6858804 6904743 6928645
5396F928645M3755P7806P2285J16542J22788P0948J40941J39543P9900M879O6937
$$ 6928645 6972400 7050206 7122491 7239033 7361821 7432769 7573710 7713253 7793153 7798032 7864969
5385G864969p641n249J2055l5266o6695m6927m1524L3750n0417M250N1461J6337
$$ 7864969 7857328 7852079 7864134 7828868 7762173 7715246 7673722 7707472 7657055 7661305 7712766 7729103
5373G729103J05984J07220J13707J87759J55707J57357K34589J99982K44595K04248
$$ 7729103 7835087 7942307 8056014 8243773 8399480 8556837 8791426 8991408 9236003 9440251
5363I440251K70736K96129K89909K40938K92887K90632L41708K37595K79985L36835
$$ 9440251 9710987 10007116 10297025 10537963 10830850 11121482 11463190 11700785 11980770 12317605
5353A2317605K91935L86157M44623M83266M94718O57401Q37128Q58319R52817
$$ 12317605 12609540 12995697 13440320 13923586 14418304 15075705 15912833 16771152 17723969
5344A7723969J056478J334392J524042J648646J841726K061677K329443K293930
$$ 17723969 18780447 20114839 21638881 23287527 25129253 27190930 29520373 31814303
5336C1814303K138170J652844Q15199O3204n51331q88616p70312n74806n54548
$$ 31814303 33952473 35605317 36420516 36483720 35932389 35043773 34273461 33698655 33144107
5327C3144107m36067n31788n65173n66911n49140n41837k95296J8418K90672O62195
$$ 33144107 32708040 32176252 31611079 31044168 30495028 29953191 29657895 29676313 29966985 30629180
5317C0629180Q72077J230729J541261J874660K258076K662577K982587L306133
$$ 30629180 31501257 32731986 34273247 36147907 38405983 41068560 44051147 47357280
5309D7357280L481111L327307K866330K058450J262568P62642L64562K76003L94053
$$ 47357280 50838391 54165698 57032028 59090478 60353046 61115688 61480250 61756253 62150306
5300F2150306N36319O08447M54227o0742r73304k080553l179284l702430l595574
$$ 62150306 62686625 63295072 63749299 63688557 62715253 60634700 57455416 53752986 50157412
5291E0157412l292792k804241k236927j768184j333487r64894n58918j96214P4660
$$ 50157412 46864620 44060379 41823452 40055268 38721781 37756887 37197969 37001755 37076415
5282C7076415M07280P38966R90564J206968J367381J179655J018942P84782P19269
$$ 37076415 37483695 38222661 39213225 40420193 41787574 42967229 43986171 44770953 45490222
5273D5490222O34398P52797O47647J99963l87172j336205k330560l047861l265658
$$ 45490222 46124620 46877417 47525064 47725027 47337855 46001650 43671090 40623229 37357571
5264C7357571l236237k919063k526961k175376j903638j587009j379782j222637
$$ 37357571 34121334 31202271 28675310 26499934 24596296 23009287 21629505 20406868
5256B0406868j021834r13573p97249o78302n89488n26400m64180l84617k85250
$$ 20406868 19385034 18471461 17674212 16995910 16406422 15880022 15415842 15031225 14745975
5247A4745975l24678k79926j66440k36689k22996k23731j26930j39540j56480
$$ 14745975 14421297 14141371 13974931 13738242 13515246 13291515 13164585 13025045 12868565
5238A2868565k06805j61089j17608j94609j53718j44447p3868j74710j50469j73603
$$ 12868565 12661760 12500671 12383063 12188454 12034736 11890289 11816421 11641711 11491242 11317639
5228A1317639j35228j92164j98623j57752j57690l8333M1024k6526m1435m0891
$$ 11317639 11182411 10990247 10791624 10633872 10476182 10437849 10478873 10452347 10410912 10370021
5218A0370021k4831J3631K5712L9047P490j4256N92L5416N0378P2670N4192J33069
$$ 10370021 10345190 10358821 10384533 10423580 10431070 10416814 10417406 10452822 10503200 10575870 10630062 10763131
5206A0763131O2295Q5091Q0559J64948J11264O7148N9622Q1361M8915J15789Q0188
$$ 10763131 10825426 10910517 10991076 11156024 11267288 11334436 11394058 11475419 11524334 11640123 11720311
5195A1720311J52506J83775O0690K4010L3511J04223L1289R225J9909N6490L7784
$$ 11720311 11872817 12056592 12117282 12141292 12174803 12279026 12310315 12319540 12339449 12395939 12433723
5184A2433723J11318O0936J13482J42534K07995K41105K27663K06607L09597L04595
$$ 12433723 12545041 12605977 12719459 12861993 13069988 13311093 13538756 13745363 14054960 14359555
5174A4359555L10859M37719L59101L57477L93698N48275M80493N63970O32750
$$ 14359555 14670414 15108133 15467234 15824711 16218409 16766684 17247177 17811147 18443897
5165A8443897O84976Q48735R33459J052616J231256J391937J625452J823095J989978
$$ 18443897 19128873 19977608 20911067 21963683 23194939 24586876 26212328 28035423 30025401
5156C0025401K316242K604631K828991L017974K965657K613879J951041R94900
$$ 30025401 32341643 34946274 37775265 40793239 43758896 46372775 48323816 49318716
5148D9318716L8458p76818j212719j330274j202156j046709r76365r38918r68069
$$ 49318716 49357174 48580356 47367637 46037363 44835207 43788498 42812133 41873215 40905146
5139D0905146j038706r10288p73785l90426j4975L66888Q26309J243109J715898
$$ 40905146 39866440 38956152 38182367 37791941 37776966 38143854 38970163 40213272 41929170
5130D1929170K120487K458633K826880K996204K876674K583243J862855J041503
$$ 41929170 44049657 46508290 49335170 52331374 55208048 57791291 59654146 60695649
5122F0695649L46871k52803n42847o82039p35715q68981r08036j037568j167961
$$ 60695649 61042520 60789717 60246870 59564831 58829116 57960135 57052099 56014531 54846570
5113E4846570j219397j408752j690782k186428k633765k906183k873685k554243
$$ 54846570 53627173 52218421 50527639 48341211 45707446 42801263 39927578 37373335
5105C7373335k149152j731565j249561r08847o55636k78076q7617K37644M85876
$$ 37373335 35224183 33492618 32243057 31334210 30678574 30400498 30312881 30550525 31036401
5096C1036401M43042O05958O03352N35001N92443O06696N36487N04468M29959
$$ 31036401 31479443 32085401 32688753 33223754 33816197 34422893 34959380 35463848 35893807
5087C5893807K08628k54346r46565j678926k250432k519153k311306k131742j900252
$$ 35893807 36102435 35848089 34901524 33222598 30972166 28453013 26141707 24009965 22109713
5078B2109713j628583j388381j155309j007244r63425o90579n84540o51591n32782
$$ 22109713 20481130 19092749 17937440 16930196 15966771 15276192 14691652 14040061 13507279
5069A3507279n04735m06695k92053l16746k66885k09151j65591j34893j35969
$$ 13507279 13002544 12595849 12303796 11987050 11720165 11511014 11345423 11210530 11074561
5060A1074561l1911o7555m9425j1785K2884R4873m6044m2798K4571m2583j09163
$$ 11074561 11042650 10975095 10925670 10913885 10936769 11031642 10985598 10942800 10967371 10924788 10815625
5049A0815625k9282j02393j55022j51302j25088j42008k09495j89838j47034j82843
$$ 10815625 10786343 10683950 10528928 10377626 10252538 10110530 9901035 9711197 9564163 9381320
5039I381320j43621j55523j93906j50645j80769k21940n1035m6481j00428p7879
$$ 9381320 9237699 9082176 8888270 8737625 8556856 8334916 8283881 8237400 8136972 8059093
5029H059093k4577o1943K7499N5139o4383O4559K0166K0703k550J32718J09659
$$ 8059093 8034516 7972573 8000072 8055211 7990828 8055387 8075553 8096256 8093706 8226424 8336083
5018H336083P5804K055N7827O3886Q118j5424K513K8984N7243J5603R2836Q9941
$$ 8336083 8411887 8413942 8471769 8535655 8543773 8528349 8530862 8559846 8617089 8632692 8725528 8815469
5006H815469O4894j159j3323j34850k2962n8536j40166p8114r5176k5496m2972
$$ 8815469 8880363 8879204 8865881 8731031 8708069 8649533 8509367 8431253 8336077 8310581 8267609
4995H267609p2801R263L9060J9975j7369K8245L1821J50694J61820M7552L4960
$$ 8267609 8194808 8204071 8243131 8263106 8245737 8273982 8305803 8456497 8618317 8665869 8700829
4984H700829Q7214K39679J41350J45224K07201J81147K45046L53250L35598L44531
$$ 8700829 8788043 9027722 9169072 9314296 9521497 9702644 9947690 10300940 10636538 10981069
4974A0981069L21231M07267L82894L75047L78511M30998M73169L58618M53550
$$ 10981069 11302300 11709567 12092461 12467508 12846019 13277017 13750186 14108804 14562354
4965A4562354M25479L21105K64912K31649J96564K90920L26779L02705M11743
$$ 14562354 14987833 15308938 15573850 15805499 16002063 16292983 16619762 16922467 17334210
4956A7334210M04893N36516N08510O25868P19512Q31054Q81866Q00108Q34037
$$ 17334210 17739103 18275619 18784129 19409997 20129509 20960563 21842429 22642537 23476574
4947B3476574P31415N12857L34996P4753J1548J40005K99910M36041N64390P28831
$$ 23476574 24207989 24720846 25055842 25130595 25142143 25282148 25582058 26018099 26582489 27311320
4937B7311320Q33477R21070R79699J160075J310173J329559J417953J291088J244153
$$ 27311320 28144797 29065867 30045566 31205641 32515814 33845373 35263326 36554414 37798567
4928C7798567J220142J182091J163268J277466J355476J375072J330777J152957
$$ 37798567 39018709 40200800 41364068 42641534 43997010 45372082 46702859 47855816
4920D7855816R07759N75885K83124j27475k64162m05090n97232o81219n89157
$$ 47855816 48763575 49339460 49622584 49495109 49230947 48825857 48228625 47547406 46958249
4911D6958249o20199o32827n10955m99044l21023l26087k67560j71409j34416
$$ 46958249 46338050 45705223 45194268 44695224 44374201 44048114 43780554 43609145 43474729
4902D3474729r5037j04155O2421J49286J46699K28257J60580J02149j9059l4834
$$ 43474729 43379692 43275537 43337958 43487244 43633943 43862200 44022780 44124929 44105870 44071036
4892D4071036k45761l10905l49657n33192n81872o63455p90563p89677q48409
$$ 44071036 43825275 43514370 43164713 42631521 42049649 41386194 40595631 39805954 38957545
4883C8957545r75998j062254j073277j102329j401735j434317j299699j241317
$$ 38957545 37981547 36919293 35846016 34743687 33341952 31907635 30607936 29366619
4875B9366619j153681j047582r01031q65074q08434o84313o27202m82389n44842
$$ 29366619 28212938 27165356 26264325 25399251 24590817 23906504 23279302 22796913 22252071
4866B2252071l69021l59282k16476q1401P395N7891K29835L68642L06134L43365
$$ 22252071 21883050 21523768 21307292 21225891 21233286 21291177 21521012 21889654 22195788 22539153
4856B2539153M70041M90037M23958M04272M19051M68648L80636K74159K19955
$$ 22539153 23009194 23499231 23923189 24327461 24746512 25215160 25595796 25869955 26089910
4847B6089910J71454J23782N1352j08282k03136m21909n60986n51526m95380m04291
$$ 26089910 26261364 26385146 26436498 26328216 26125080 25703171 25142185 24590659 24095279 23690988
4837B3690988k91270j34266o9013R236J1526O6985K78726L94282M65771N54887
$$ 23690988 23399718 23265452 23196439 23205675 23217201 23284186 23562912 23957194 24422965 24977852
4827B4977852O57330O91568N25721O25913O23125N07124M72819L16364K42526
$$ 24977852 25635182 26326750 26852471 27478384 28101509 28608633 29081452 29397816 29640342
4818B9640342L657j81499k44289l90086l99921m40173n39375n92014o59731r13454
$$ 29640342 29643999 29462500 29218211 28828125 28428204 27988031 27448656 26856642 26196911 25283457
4808B5283457r08950r84121r61061p41889p40480p07644n64248m13082m31183
$$ 25283457 24374507 23390386 22429325 21687436 20946956 20239312 19675064 19261982 18830799
4799A8830799k52118j46580j28704r3976m9318j96599j07702n5572j01793j47869
$$ 18830799 18578681 18432101 18303397 18209421 18160103 17963504 17855802 17800230 17698437 17550568
4789A7550568j44182k69004m14427m48162l89485m84147n64907n76788m36142
$$ 17550568 17406386 17137382 16722955 16274793 15885308 15401161 14836254 14259466 13823324
4780A3823324m53416m43025n05347m86570n05774o04262n19647n96240n22100
$$ 13823324 13369908 12926883 12421536 11934966 11429192 10824930 10305283 9709043 9186943
4771I186943n13628m18356m13544k92054k84584j60545k36358k32068j37437k10783
$$ 9186943 8673315 8254959 7841415 7549361 7264777 7104232 6867874 6635806 6498369 6287586
4761F287586j63649j89833o2224j2622j17305j09830j34259j79332n1264r3323
$$ 6287586 6123937 5934104 5871880 5859258 5741953 5632123 5497864 5318532 5267268 5173945
4751E173945q8659n0106j94003j08740j33583p0893O736j06085q1697j1602j11566
$$ 5173945 5085286 5035180 4841177 4732437 4598854 4527961 4534697 4428612 4346915 4335313 4223747
4740D223747k2432J852j204p7305r5148p0034N022l1569p1891k2196n9102j09228
$$ 4223747 4201315 4203167 4201963 4124658 4029510 3959476 3964498 3932929 3861038 3838842 3779740 3670512
4728C670512O192m2230r8004L128l7647n3680p407K4768j8377m0239J702N6579
$$ 3670512 3676704 3634474 3536470 3539598 3501951 3448271 3440864 3465632 3447255 3407016 3408718 3465297
4716C465297L5256Q9654o1119J15282Q2685O87M8399O4050J0904O8628P4132P7975
$$ 3465297 3500553 3590207 3529088 3644370 3727055 3727742 3776141 3840191 3851095 3919723 3993855 4071830
4704D071830N4536P0624L9177L4139N6122J13713N2286P401K116n1416j796J4085
$$ 4071830 4126366 4196990 4236167 4270306 4326428 4440141 4492427 4499828 4501944 4450528 4448732 4462817
4692D462817N519l1544q823J4749K6425m5930p7739O99k7140p723o7665j20770
$$ 4462817 4468336 4436792 4427969 4442718 4469143 4423213 4345474 4346173 4319033 4311310 4243645 4122875
4680D122875n5806o2384l3798o4248j48649j04581p4439r5790o2883K57O3175
$$ 4122875 4067069 4004685 3970887 3906639 3757990 3653409 3578970 3483180 3420297 3420554 3483729
4669C483729M4395j4753l9638j2376j48336n3408o9185q6072r6901r9666m5934
$$ 3483729 3528124 3513371 3473733 3461357 3313021 3259613 3190428 3104356 3007455 2907789 2861855
4658B861855r1919j69282k9549l1566j39165o7948k3876n3895m7884j9280n9135
$$ 2861855 2769936 2600654 2571105 2539539 2400374 2332426 2308550 2254655 2206771 2187491 2128356
4647B128356o1398J6045m5845m3935m7596l4257j966l6879n4470k302J8812K5008
$$ 2128356 2066958 2083003 2037158 1993223 1945627 1911370 1909404 1872525 1818055 1815753 1834565 1859573
4635A859573M2770p5795m2714O002q748O4735l9321j0069n792M0081p5733n7765
$$ 1859573 1902343 1826548 1783834 1789836 1781088 1845823 1806502 1796433 1790641 1830722 1754989 1697224
4623A697224n2202j6364q821l9366o671J7304K127l5611o1583j5928l7502m0110
$$ 1697224 1645022 1628658 1619837 1580471 1573800 1591104 1593231 1557620 1496037 1480109 1442607 1402497
4611A402497M6405k5205L9628n9092L0460m4944K3893K4912r4172N4070j7029
$$ 1402497 1448902 1423697 1463325 1404233 1434693 1389749 1413642 1438554 1344382 1398452 1381423
4600A381423J2336M4470n6356K9418Q092L4186l0434J6095L4873j1270m8560M551
$$ 1381423 1393759 1438229 1381873 1411291 1419383 1453569 1423135 1439230 1474103 1462833 1414273 1418824
4588A418824n1080k1467L578P387n1698Q202l984j5862N3945K935L0408L3495
$$ 1418824 1367744 1346277 1349855 1357242 1305544 1313746 1309762 1293900 1347845 1350780 1381188 1414683
4576A414683p3332k6944j1397r51m0895o2831L1658N7221j3360k6381J2150L5455
$$ 1414683 1341351 1314407 1303010 1302059 1261164 1198333 1229991 1287212 1273852 1247471 1259621 1295076
4564A295076l634n5109j2729l0095O5611R053n7757j527J7799l8393k6355J4674
$$ 1295076 1291442 1236333 1223604 1193509 1259120 1268173 1210416 1208889 1226688 1188295 1161940 1176614
4552A176614N7072n083m7698j879J1702O839j9105J6025L4347j123k834K5038
$$ 1176614 1233686 1228603 1180905 1179026 1190728 1197567 1178462 1194487 1228834 1227711 1224877 1249915
4540A249915L692j0524k1412l1856j8164J441R6628l4957L1493M6460r7859j9287
$$ 1249915 1253607 1243083 1221671 1189815 1171651 1173092 1269720 1234763 1266256 1312716 1214857 1195570
4528A195570L0323K7290l0212n5926k5886M9864K5987j07818K0460L9803K3651
$$ 1195570 1225893 1253183 1222971 1167045 1141159 1191023 1217010 1109192 1129652 1169455 1193106
4517A193106K563o9136K1292K7598m6191J420r730J5506K2461L1606K1821m3861
$$ 1193106 1195669 1126533 1147825 1175423 1129232 1130652 1120922 1136428 1158889 1190495 1212316 1168455
4505A168455k1772p783L0195k2652k0793M4756N4064k7998l4767N2599M0030l4358
$$ 1168455 1146683 1138900 1169095 1146443 1125650 1170406 1224470 1196472 1161705 1214304 1254334 1219976
4493A219976R544P5582L3314J4377q7310J6795K5225M6918N2862k4949k2433Q5876
$$ 1219976 1229520 1305102 1338416 1352793 1265483 1282278 1307503 1354421 1407283 1382334 1359901 1445777
4481A445777M8213k2788k8719K4345R795K0091L1572J7352k8663k8170N0618K2126
$$ 1445777 1493990 1471202 1442483 1466828 1476623 1496714 1528286 1545638 1516975 1488805 1539423 1561549
4469A561549K4559K4602Q198k4818K3885m1540P5794J3636K1663J14169K8218
$$ 1561549 1586108 1610710 1618908 1594090 1617975 1576435 1652229 1665865 1687528 1801697 1829915
4458A829915P5639N2973R8733j0848l453J75635J58653j7433K294O2785k9717
$$ 1829915 1905554 1958527 2057260 2046412 2042959 2218594 2377247 2359814 2362108 2424893 2395176
4447B395176k0894p0475K5706r4002K3684l1432j7292j08045o8230P2741l8383
$$ 2395176 2374282 2303807 2329513 2235511 2259195 2227763 2210471 2102426 2034196 2106937 2068554
4436B068554L6579o738L235k0084m666K7625R3708L6889L4623O3758J27873O1127
$$ 2068554 2105133 2098395 2101630 2081546 2076880 2104505 2198213 2235102 2269725 2333483 2461356 2522483
4424B522483Q912P7454L5417K2675M2811J08278P919l4628l0275l7942L2399j874
$$ 2522483 2531395 2608849 2644266 2666941 2709752 2818030 2825949 2791321 2761046 2723104 2755503 2753629
4412B753629l7681J606o3146q6306l6879p7223j22737q5094j7919l596n4636p6392
$$ 2753629 2715948 2717554 2654408 2568102 2531223 2454000 2331263 2246169 2228250 2224654 2170018 2093626
4400B093626L8104M655J3561j349J0376O2285O8134M3092N5321J9673m2678N5778
$$ 2093626 2131730 2136385 2149946 2148597 2158973 2221258 2289392 2332484 2387805 2407478 2364800 2420578
4388B420578M1682O6521j0494j4866M6023J0839j4390o6824j4898j6369j7533
$$ 2420578 2462260 2528781 2518287 2503421 2549444 2560283 2545893 2479069 2464171 2447802 2430269
4377B430269L8824J6855K4126J9368K7782R3876J15396Q3120O2428J53553R9695
$$ 2430269 2469093 2485948 2510074 2529442 2557224 2651100 2766496 2849616 2912044 3065597 3165292
4366C165292o2098p5942j09990j21654j57128j65441r0256n4592Q922r1880j34538
$$ 3165292 3103194 3027252 2917262 2795608 2638480 2473039 2382783 2328191 2337113 2245233 2110695
4355B110695l1481p4033K3362m1086j01348k1613K7815k5042m0718k9904o8998
$$ 2110695 2079214 2005181 2028543 1987457 1886109 1864496 1892311 1867269 1826551 1796647 1727649
4344A727649M2453k1151Q008q266k2686P4562J9422M5953L2062N2855O23N2318
$$ 1727649 1770102 1748951 1756959 1748693 1726007 1800569 1819991 1865944 1898006 1950861 1951484 2003802
4332B003802M327L872J8088n4785j8266o7150O9L6541O3795J8270k2377l6197
$$ 2003802 2008129 2012001 2030089 1975304 1957038 1889888 1889957 1926498 1990293 2008563 1986186 1949989
4320A949989k0759J02316P0682N0756N7467l6302J6548R271P05J3947p729p6266
$$ 1949989 1929230 2031546 2102228 2152984 2210451 2174149 2190697 2199968 2200673 2214620 2206891 2130625
4308B130625O5236m8600p3983L959p7042O5720L108m703j9557L369n9823k4152
$$ 2130625 2195861 2147261 2073278 2077237 2000195 2065915 2069023 2064320 2044763 2048132 1988309 1964157
4296A964157K629L248L4223M313k5615k9611J38785N752J3759J6620O6040P5700
$$ 1964157 1966786 1970034 2004257 2008570 1982955 1953344 2092129 2097881 2111640 2128260 2194300 2270000
4284B270000R382N7021M095k7677M6256J7212r524J5043L6089P9961m873M8828
$$ 2270000 2279382 2336403 2340498 2312821 2359077 2376289 2366765 2381808 2417897 2497858 2492985 2541813
4272B541813M5133n0260Q7641K9357P3201J07987Q8552O8195M0471L3215n4399
$$ 2541813 2586946 2536686 2624327 2653684 2726885 2834872 2923424 2991619 3032090 3065305 3010906
4261C010906m2526r0378p5886l8033N2311j6836r0704p0104m034O3017j965j0451
$$ 3010906 2968380 2878002 2802116 2764083 2816394 2799558 2708854 2638750 2634716 2697733 2695768 2685317
4249B685317L1304K3537J7281Q0372P7013n2459J3957P2058P3951r6585M1061
$$ 2685317 2716621 2740158 2757439 2837811 2914824 2862365 2876322 2948380 3022331 2925746 2966807
4238B966807O3570K6767O8013j916K440R3652R0856M4787J10718K853K6978L6050
$$ 2966807 3030377 3057144 3125157 3123241 3125681 3219333 3310189 3354976 3465694 3468547 3495525 3531575
4226C531575M6020P9554J02228Q4455J2088K7269Q4567N7840R5143J9761Q876
$$ 3531575 3577595 3657149 3759377 3843832 3855920 3883189 3967756 4025596 4120739 4140500 4149376
4215D149376M1960N5876L3969J966Q3326Q3668l3752M3682K8632M8373N0046J32040
$$ 4149376 4191336 4247212 4281181 4283147 4366473 4450141 4416389 4460071 4488703 4537076 4587122 4719162
4203D719162P6606J12832J18438O9356M3059k7051q471J9332O1020M707P7638
$$ 4719162 4795768 4908600 5027038 5096394 5139453 5112402 5103931 5123263 5184283 5188990 5266628
4192E266628j5317L6301J2341N0950j5062L6594M6271J7712N6606K8876O3734
$$ 5266628 5251311 5287612 5299953 5350903 5335841 5372435 5418706 5436418 5493024 5521900 5585634
4181E585634K5115P9773J22373J60260Q3549J46198J35887O4167J21737Q3999
$$ 5585634 5610749 5690522 5812895 5973155 6056704 6202902 6338789 6402956 6524693 6608692
4171F608692Q1544P2883J08088J12211O2167J45947J21123p653R4011K16137J36268
$$ 6608692 6690236 6763119 6871207 6983418 7045585 7191532 7312655 7305002 7399013 7615150 7751418
4160G751418J76366J23282J72250J74495J65985J71714J32306K50466K76531L08097
$$ 7751418 7927784 8051066 8223316 8397811 8563796 8735510 8867816 9118282 9394813 9702910
4150I702910K64514L34830L05143L60610L77512L65319L98070L27370K66553K40657
$$ 9702910 9967424 10302254 10607397 10968007 11345519 11710838 12108908 12436278 12702831 12943488
4140A2943488L26859L93651L43304M92013M77257M64640N28999N31178N73720
$$ 12943488 13270347 13663998 14007302 14499315 14976572 15441212 15970211 16501389 17075109
4131A7075109N25231M95813P26696P22900Q24284R52047R73733J065675J065901
$$ 17075109 17600340 18096153 18822849 19545749 20370033 21322080 22295813 23361488 24427389
4122B4427389J108459J259221J334514J489363J668108J718050J712586J347694
$$ 24427389 25535848 26795069 28129583 29618946 31287054 33005104 34717690 36065384
4114C6065384Q81600K59658j25158k33664o9811K24678N00180P28346J061740
$$ 36065384 36946984 37206642 37081484 36847820 36778009 37002687 37502867 38231213 39292953
4105C9292953J190992J330034J599540J816895J992538K192698K506638K717558
$$ 39292953 40483945 41813979 43413519 45230414 47222952 49415650 51922288 54639846
4097E4639846L159761L634266M071144M552392N240947O006655O965340P863340
$$ 54639846 57799607 61433873 65505017 70057409 75298356 81305011 88270351 96133691
4089I6133691Q716148R750625J1493212J3964481J7264543K0619686K3618439
$$ 96133691 104849839 114600464 126093676 140058157 157322700 177942386 201560825
4082B01560825K5124554K3643950J6334577K541564j2888662k4601091k8148536
$$ 201560825 226685379 250329329 266663906 269205470 256316808 231715717 203567181
4075B03567181k5891094k0541182j5216669j1435403r084954q030551p166986
$$ 203567181 177676087 157134905 141918236 130482833 121397879 113367328 106200342
4068A06200342o532397o300379o393545o589982o279678n728114m917350m051746
$$ 106200342 99667945 93367566 86974021 80384039 74104361 68376247 63458897 59407151
4060E9407151l428421k831621k515803k159680j832821j605956j444615j268498
$$ 59407151 55978730 53147109 50631306 48471626 46638805 45032849 43588234 42319736
4052D2319736j064664q66789o63993o95848n55504m24526l61156m23016l98319
$$ 42319736 41255072 40388283 39724290 39028442 38472938 38048412 37687256 37264240 36865921
4043C6865921k93321l06816q5633q81J31880J48812K34802M22060M96912O08780
$$ 36865921 36572600 36265784 36180151 36179270 36311150 36459962 36694764 37116824 37613736 38222516
4033C8222516P08671P20640P18830Q12474Q81003Q69812J010086J205699J268694
$$ 38222516 38931187 39651827 40370657 41183131 42064134 42933946 43944032 45149731 46418425
4024D6418425J435944J455596J501810J672223J581366J771686J876529J921306
$$ 46418425 47854369 49309965 50811775 52483998 54065364 55837050 57713579 59634885
4016E9634885J993995K170426K224536K249508K162430J931940J676486J515811
$$ 59634885 61628880 63799306 66023842 68273350 70435780 72367720 74044206 75560017
4008G5560017J464140J369747J415706J570710J496600J582733J583773J577514
$$ 75560017 77024157 78393904 79809610 81380320 82876920 84459653 86043426 87620940
4000H7620940J794532J843689J874685J973309K124251K351276K420638K683983
$$ 87620940 89415472 91259161 93133846 95107155 97231406 99582682 102003320 104687303
3992A04687303K985972L234960L817469M357186N051202N916301O924423Q251513
$$ 104687303 107673275 110908235 114725704 119082890 124134092 130050393 136974816 145226329
3984A45226329R897385J1893777J3725319J4875012J4589806J1592319M089502
$$ 145226329 155123714 167017491 180742810 195617822 210207628 221799947 225889449
3977B25889449p150166j4801357j7720566j6817966j3807715j0890056q658813
$$ 225889449 218739283 203937926 186217360 169399394 155591679 144701623 136042810
3970A36042810p087343n602366m302497l225064k415034j771942j290956r09144
$$ 136042810 128955467 123353101 119050604 115825540 113410506 111638564 110347608 109438464
3962A09438464n67221k41566j9884L74581N30750P04253Q38576R69788J055892
$$ 109438464 108871243 108629677 108609793 108984374 109515124 110219377 111057953 112027741 113083633
3953A13083633J232737J174818J156290J124611J106735J056400J093537R83168
$$ 113083633 114316370 115491188 116647478 117772089 118878824 119935224 121028761 122011929
3945A22011929Q60957Q34241P70559O47474N59906M87688L01134J40522L6433
$$ 122011929 122872886 123707127 124477686 125125160 125685066 126172754 126473888 126614410 126650843
3936A26650843k29698m65627n94471p20280q59072r33239j035120j174039j201283
$$ 126650843 126421145 125955518 125361047 124640767 123781695 122848456 121813336 120639297 119438014
3927A19438014j401727j533982j605531j732301j816504j924605j988130k069112
$$ 119438014 118036287 116502305 114896774 113164473 111347969 109423364 107435234 105366122
3919A05366122k199861k297966k260194k226439k172977k148702k118357k015913
$$ 105366122 103166261 100868295 98608101 96381662 94208685 92059983 89941626 87925713
3911H7925713k122832k066266j965425j983346j908946j911448j905285j924055
$$ 87925713 85802881 83736615 81771190 79787844 77878898 75967450 74062165 72138110
3903G2138110j754604j674652j633541j512711j442578j266299j239067j299398
$$ 72138110 70383506 68708854 67075313 65562602 64120024 62853725 61614658 60315260
3895F0315260j101534j118365j036969r47201q91953q63629q74936p71912o98393
$$ 60315260 59213726 58095361 57058392 56111191 55219238 54355609 53480673 52708761 52010368
3886E2010368n99367o65761o64555o69431o70134n85982o05776n35594o12960
$$ 52010368 51411001 50745240 50080685 49411254 48741120 48155138 47549362 47013768 46400808
3877D6400808n62949n12160o05253n93609n55671m72256o48246o36955p50551
$$ 46400808 45837859 45325699 44720446 44126837 43571166 43098910 42450664 41813709 41063158
3868D1063158n89571n54545o49959p24627o55837o44233p40960o74244n87540
$$ 41063158 40473587 39919042 39269083 38544456 37888619 37244386 36503426 35829182 35241642
3859C5241642n91514o07216o55666n56408o38052o91545o16124n99348o38225
$$ 35241642 34650128 34042912 33387246 32830838 32192786 31501241 30885117 30285769 29647544
3850B9647544o19632n67912m40914l44249m52616l78736l05873k05870j42614
$$ 29647544 29027912 28460000 28019086 27674837 27222221 26843485 26537612 26331742 26189128
3841B6189128j08519M3830J64982L30390M80296N75453P77793R34109J050487
$$ 26189128 26080609 26124439 26289421 26619811 27100107 27675560 28453353 29387462 30437949
3832C0437949J138348J145733Q18242K48330n54278j372760j855945k027504k008021
$$ 30437949 31576297 32722030 33540272 33788602 33234324 31861564 30005619 27978115 25970094
3823B5970094j755117j473929j248717j182570r37331q74552q40079o31297n16634
$$ 25970094 24214977 22741048 21492331 20309761 19372430 18497878 17657799 17026502 16509868
3814A6509868n96302m43921l62660l48057l33423l27162k66833l29906k26967
$$ 16509868 15913566 15469645 15106985 14758928 14425505 14098343 13831510 13501604 13274637
3805A3274637j95730k58905k79563j59456j89798j90522j01771r1495j18543j50976
$$ 13274637 13078907 12820002 12540439 12380983 12191185 12000663 11898892 11807397 11688854 11537878
3795A1537878q9742J058m4592L3435M966j06914n0555j48569k26223j59977l12603
$$ 11537878 11448136 11449194 11404602 11438037 11443003 11336089 11285534 11136965 10910742 10750765 10438162
3784A0438162k02554j85141j14796r9337j11056p4577r8653k0502k9633r0756
$$ 10438162 10235608 10050467 9935671 9836334 9725278 9650701 9552048 9531546 9501913 9411157
3774I411157k2859k7128j00791l6403j3655n6490j32207k8929o5895j07466j01662
$$ 9411157 9388298 9361170 9260379 9223976 9210321 9153831 9021624 8992695 8926800 8819334 8717672
3763H717672n0781p9917j28196n3667j14197n2781o7322k7584M4539r0404o7118
$$ 8717672 8666891 8586974 8458778 8405111 8290914 8238133 8170811 8143227 8187766 8097362 8030244
3752H030244l1283J697n4314l1973K9933L4868J0511P89O158J1142N0132Q6275
$$ 8030244 7998961 8000658 7946344 7914371 7944304 7979172 7989683 7990472 7996630 8007772 8057904 8144179
3740H144179M5654K576J12214M2794O5257R9495P7512O4411Q6708J55716Q6682
$$ 8144179 8189833 8192409 8304623 8347417 8412674 8512169 8589681 8654092 8740800 8896516 8983198
3729H983198J40547P1570N5138J28101Q5131J39916J31478P1169Q6270O3422N4524
$$ 8983198 9123745 9195315 9250453 9378554 9463685 9603601 9735079 9806248 9892518 9955940 10010464
3718A0010464J18109J22764J4796M7137R4490k1816M9025J25357J10187L3583
$$ 10010464 10128573 10251337 10266133 10313270 10407760 10385944 10434969 10560326 10670513 10704096
3708A0704096Q0207Q3718Q2539O8635M0824N2043Q0825R4934N2520N2002J17462
$$ 10704096 10784303 10868021 10950560 11019195 11060019 11112062 11192887 11287821 11340341 11392343 11509805
3697A1509805J95923J59091J99183J70409J70257J64266K32667J80818J94884
$$ 11509805 11705728 11864819 12064002 12234411 12404668 12568934 12801601 12982419 13177303
3688A3177303O8709J1761M9916J26230K5039O7883J25445K44317J46320J53708
$$ 13177303 13246012 13257773 13307689 13433919 13458958 13526841 13652286 13896603 14042923 14196631
3678A4196631K80974J21443J98627K18989K53499K68585K55651K39884L12438
$$ 14196631 14477605 14599048 14797675 15016664 15270163 15538748 15794399 16034283 16346721
3669A6346721K63974K88805L32656L50432L37939M33075N70574M98186M41991
$$ 16346721 16610695 16899500 17232156 17582588 17920527 18353602 18924176 19422362 19864353
3660A9864353O50265O09413O04535O68285O51239P65006P59878P48719Q80424
$$ 19864353 20514618 21124031 21728566 22396851 23048090 23813096 24572974 25321693 26202117
3651B6202117R35286R07601R14770Q50005R00466R00014R07815R52395Q70780
$$ 26202117 27137403 28045004 28959774 29809779 30710245 31610259 32518074 33470469 34341249
3642C4341249Q67600R12393Q78508R39262R00953R44716R37025Q64418Q25484
$$ 34341249 35208849 36121242 36999750 37939012 38839965 39784681 40721706 41586124 42411608
3633D2411608P65237P67401P58186O83723P32686P18611P30017P08534P96189
$$ 42411608 43176845 43944246 44702432 45386155 46118841 46837452 47567469 48276003 49072192
3624D9072192R74660R51419R21683J095245J126575J238742J324976J383842J495449
$$ 49072192 50046852 50998271 51919954 53015199 54141774 55380516 56705492 58089334 59584783
3615E9584783J641183J843605J813106K005791K174454K325836K431752K616580
$$ 59584783 61225966 63069571 64882677 66888468 69062922 71388758 73820510 76437090
3607G6437090K792870K861131K961102L160277L304300L434113L676399L858783
$$ 76437090 79229960 82091091 85052193 88212470 91516770 94950883 98627282 102486065
3599A02486065M213809M514476M692068N034916N279900N575343N680261N972728
$$ 102486065 106699874 111214350 115906418 120941334 126221234 131796577 137476838 143449566
3591A43449566O391241O707254O995519P424931P803620Q293439Q652251R051509
$$ 143449566 149840807 156548061 163543580 170968511 178772131 187065570 195717821 204769330
3583B04769330R237759R186518Q876718Q273445P225410N907114M531004L144591
$$ 204769330 214007089 223193607 232070325 240343770 247569180 253476294 258007298 261151889
3575B61151889J812168P27999r25n60465p24792o33380n89597n66669m75502o81747
$$ 261151889 262964057 263692056 263691131 263130666 262405874 261772494 261182897 260616228 260140726 259458979
3565B59458979j045991j647191k442934l386269m257479m899581n268667n200662
$$ 259458979 258412988 256765797 254322863 250936594 246679115 241779534 236510867 231310205
3557B31310205m876319m207527l456415k495447j722999j083292n14774j02404
$$ 231310205 226433886 222226359 218769944 216274497 214551498 213468206 212953432 212851028
3549B12851028L06704N84228P74673J054643J198207J395408J454132J392268
$$ 212851028 213157732 213741960 214516633 215571276 216769483 218164891 219619023 221011291
3541B21011291J200546R74108P68519K54969j24681o44617j137829j614762j910510
$$ 221011291 222211837 223185945 223954464 224209433 224084752 223440135 222302306 220687544 218777034
3532B18777034k193581k450178k544113k680802k721856k663607k744422k710160
$$ 218777034 216583453 214133275 211589162 208908360 206186504 203522897 200778475 198068315
3524A98068315k723680k625855k599840k553909k405653k198213j966661j686937
$$ 198068315 195344635 192718780 190118940 187565031 185159378 182961165 180994504 179307567
3516A79307567j338956r20691n40328r2936L17445P01716J024677J410326J580629
$$ 179307567 177968611 177047920 176507592 176414656 176732101 177433817 178458494 179868820 181449449
3507A81449449J674108J789349J782714J820242J869717J851814J915703J932463
$$ 181449449 183123557 184912906 186695620 188515862 190385579 192237393 194153096 196085559
3499A96085559J995695J969941J865203J805684J603341J249412R45177O59295
$$ 196085559 198081254 200051195 201916398 203722082 205325423 206574835 207520012 208179307
3491B08179307K07407k05837n78161r29042j232230j545767j879229k074737k343017
$$ 208179307 208386714 208180877 207602716 206673674 205441444 203895677 202016448 199941711 197598694
3482A97598694k421479k482901k699758k631556k693288k727414k708008k705995
$$ 197598694 195177215 192694314 189994556 187363000 184669712 181942298 179234290 176528295
3474A76528295k661664k569535k482991k416672k184909j964814j771829j376224
$$ 176528295 173866631 171297096 168814105 166397433 164212524 162247710 160475881 159099657
3466A59099657r54994o12777j70879L88033R22726J401563J946131K564835L266504
$$ 159099657 158144663 157531886 157361007 157749040 158671766 160073329 162019460 164584295 167850799
3457A67850799L832209M457421N190062N862045O551798P306075Q118999R014149
$$ 167850799 171683008 176140429 181330491 187192536 193744334 201050409 209169408 218183557
3449B18183557R929903J0757939J1517177J2131382J2450977J2505251J1972238
$$ 218183557 228113460 238871399 250388576 262519958 274970935 287476186 299448424
3442B99448424J1000001R541359P696057N772691L763481J938438N02835o16805
$$ 299448424 310448425 319989784 327685841 333458532 337222013 339160451 339663286 339046481
3434C39046481j321543j677185k079220k269628k608189l273781m200321n519570
$$ 339046481 337724938 336047753 333968533 331698905 329090716 325816935 321616614 316097044
3426C16097044p080817q732112j0488921j2071070j3188890j3966628j4181594
$$ 316097044 309016227 300284115 289795194 277724124 264535234 250568606 236387012
3419B36387012j3989465j3495177j2806391j1897819j0972405j0099887r190628
$$ 236387012 222397547 208902370 196095979 184198160 173225755 163125868 153935240
3412A53935240q455800p607853p012666o503681n853622n308841m895875m565913
$$ 153935240 145479440 137871587 130858921 124355240 118501618 113192777 108296902 103730989
3404A03730989m139620l836398l550147l254625l067843k864011k693794k503338
$$ 103730989 99591369 95754971 92204824 88950199 85882356 83018345 80324551 77821213
3396G7821213k372770k227803j904010j882558j681739j605346j505829j339703
$$ 77821213 75448443 73220640 71316630 69434072 67752333 66146987 64641158 63301455
3388F3301455j221757j091553r81004r57218q17147o93332o55043o33161n57392
$$ 63301455 62079698 60988145 60007141 59049923 58232776 57539444 56884401 56251240 55693848
3379E5693848l95387m55083m83386m25064m91732m42375m25503m28353m96424
$$ 55693848 55298461 54843378 54359992 53934928 53443196 53000821 52575318 52146965 51650541
3370E1650541n59636m99848m97717n47909o32825o53606o06606p02254p40337
$$ 51650541 51090905 50591057 50093340 49545431 48912606 48259000 47652394 46950140 46209803
3361D6209803q85188r31224r09200r74288j024754j030881r23119j005440r62290
$$ 46209803 45324615 44393391 43484191 42509903 41485149 40454268 39531149 38525709 37563419
3352C7563419q92108r04243q31657q35175q62827p28258p16632p41346p16051
$$ 37563419 36671311 35767068 34935411 34100236 33237409 32509151 31792519 31051173 30335122
3343C0335122o29842n30774n63038n30423m81873m20918l75102l93575l47947
$$ 30335122 29705280 29174506 28611468 28081045 27599172 27178254 26803152 26409577 26061630
3334B6061630k25883p2096o8894o8562j50733j04574q0135Q453Q0734J47770J60566
$$ 26061630 25835747 25763651 25694757 25626195 25475462 25370888 25290753 25299206 25379940 25527710 25688276
3323B5688276K34095L74189N08901N54198N72113O49260O09634N98028N55678
$$ 25688276 25922371 26296560 26805461 27359659 27931772 28581032 29190666 29788694 30344372
3314C0344372N13101L32516K48485J82086J00517Q5173J7404K958j23232j60911
$$ 30344372 30857473 31189989 31438474 31620560 31721077 31806250 31823654 31826612 31703380 31542469
3304C1542469j22436r9704j88991j91905k36231l15367n15673o45974o96605p64576
$$ 31542469 31420033 31320329 31131338 30939433 30703202 30387835 29872162 29226188 28529583 27765007
3294B7765007p95802q94785q20426p13280o29110o08915m87778m87858m45164
$$ 27765007 26969205 26074420 25253994 24540714 23911604 23302689 22814911 22327053 21881889
3285B1881889l35105k93130k38861j93220j76429n4633n0955N78j354K2725J58184
$$ 21881889 21546784 21253654 21014793 20821573 20645144 20590511 20539556 20540134 20538780 20561505 20719689
3274B0719689J58011K12955K08179L45913L79483L55854M04469N05079O58815
$$ 20719689 20877700 21090655 21298834 21644747 22024230 22380084 22784553 23289632 23948447
3265B3948447P47696P80832Q32786J000229J206235J338943J472415J608489J695841
$$ 23948447 24696143 25476975 26309761 27309990 28516225 29855168 31327583 32936072 34631913
3256C4631913J841762J926863J953138J963677J701931J603915J310329J010025
$$ 34631913 36473675 38400538 40353676 42317353 44019284 45623199 46933528 47943553
3248D7943553P49528N42961M06920K43959J08451J39526J28637O8548J5057j55794
$$ 47943553 48693081 49236042 49642962 49886921 49995372 50134898 50263535 50332083 50347140 50191346
3238E0191346k04464m23844o43107q23405j068344j284078j678562k143848k346497
$$ 50191346 49986882 49563038 48919931 48096526 47028182 45744104 44065542 41921694 39575197
3229C9575197k441701k304596k036797j848485j709328j503821j267738j242943
$$ 39575197 37133496 34828900 32792103 30943618 29234290 27730469 26462731 25219788
3221B5219788j128808j009586q41133p51905o83625n51466n47456m72864m25289
$$ 25219788 24090980 23081394 22240261 21488356 20804731 20253265 19705809 19232945 18807656
3212A8807656k64680k72851k27772j54393j29841Q8549J27553J64855L9374k03547
$$ 18807656 18542976 18270125 18042353 17887960 17758119 17846668 17974221 18139076 18178450 17974903
3202A7974903l71033m48113m93463l53170k62180j80407q7164l8822K2102K1854
$$ 17974903 17603870 17155757 16662294 16309124 16046944 15866537 15779373 15740551 15762653 15784507
3192A5784507M7005R7064r294p2494j16750l11790l48742n37314n49710n49841
$$ 15784507 15831512 15928576 15919282 15846788 15730038 15418248 15069506 14532192 13982482 13432641
3182A3432641m92657m31482m33604m67061l51861l08680l14860k67307j73780
$$ 13432641 12939984 12508502 12074898 11607837 11255976 10947296 10632436 10365129 10191349
3173A0191349k48659j88901j40085j77153k07505j45055j70929j38128m7297o6906
$$ 10191349 9942690 9753789 9613704 9436551 9229046 9083991 8913062 8774934 8727637 8660731
3163H660731q8787r0968q3872o2604n1689k0489j25191o3997k2563r975n5796
$$ 8660731 8571944 8480976 8397104 8334500 8282811 8262322 8137131 8073134 8050571 8040596 7984800
3152G984800n0328k8738n9333k3216L4687m3820m8268n2648l3966m3243j9808
$$ 7984800 7934472 7905734 7846401 7823185 7857872 7814052 7765784 7713136 7679170 7635927 7616119
3141G616119r876o1649J10825l9755R651J6535K1400j3745N6391R2328Q5162J70548
$$ 7616119 7606243 7544594 7655419 7615664 7625315 7641850 7663250 7649505 7705896 7798224 7883386 8053934
3129H053934J95454K35313L37031L43939M71634N54736P43839R87197J186725
$$ 8053934 8249388 8484701 8821732 9165671 9637305 10192041 10935880 11923077 13109802
3120A3109802J295921J246731Q97274l22354j391596j634000j591171j192214
$$ 13109802 14405723 15652454 16549728 16227374 14835778 13201778 11610607 10418393
3112A0418393p60020o58806m91045k90366k84631j69835q4324J6046K0296L0127
$$ 10418393 9658373 8999567 8508522 8218156 7933525 7763690 7679366 7695412 7715708 7745835
3102G745835J58169J37756J67302L09654L71054M37933P50254P92424R54071J181393
$$ 7745835 7904004 8041760 8209062 8518716 8889770 9327703 10077957 10870381 11824452 13005845
3092A3005845J277305J219779O43730n90450j395553j528122j377659r70230o97300
$$ 13005845 14283150 15502929 16146659 15556209 14160656 12632534 11254875 10284645 9587345
3083I587345m59315k77188n4461Q2877L00628K33862K57816J45577m7990m82662
$$ 9587345 9128030 8850842 8796381 8879258 9179886 9413748 9671564 9817141 9769151 9286489
3073I286489o64920p48577o34905m73119m58243l30817k80605j76471r9055j26650
$$ 9286489 8621569 7872992 7238087 6764968 6306725 5975908 5695303 5518832 5419777 5293127
3063E293127j10872o8042o0175l3323Q560L3879K7283M5590P8225K19891K66548
$$ 5293127 5182255 5114213 5054038 5020715 5029275 5063154 5090437 5136027 5214252 5434143 5700691
3052E700691K85679L79193M13743L88652L60918j5529l76604o11091p01616n49259
$$ 5700691 5986370 6365563 6779306 7167958 7528876 7513347 7136743 6525652 5824036 5274777
3042E274777m46814k85424k79710k91298k29886j87936r0025p8505R78j28358
$$ 5274777 4827963 4542539 4262829 3971531 3741645 3553709 3463684 3385179 3386157 3257799
3032C257799k2845q9405q4654o0315m1463r1097n6137N227p5319n5434m3739m7224
$$ 3257799 3234954 3145549 3060895 3000580 2959117 2868020 2811883 2817110 2741791 2686357 2642618 2595394
3020B595394p8759m7098r598m912l1997q8123m7620K856r3333p119L7936j08763
$$ 2595394 2516635 2469537 2459939 2455027 2423030 2334907 2287287 2290143 2196810 2189691 2227627 2118864
3008B118864l8477O580j05975N6729m8982o1499o3316j5882q562j1320n0227n7859
$$ 2118864 2080387 2086967 1980992 2037721 1988739 1927240 1863924 1848042 1839480 1828160 1777933 1720074
2996A720074J5363k1322J0953j44973M8163K0659k1660j7571l2790L0019m8377
$$ 1720074 1735437 1714115 1725068 1580095 1628258 1648917 1627257 1609686 1576896 1606915 1558538
2985A558538J1981l6802r84Q0550p1314m084j8263l2525j091L7578J8141J3633
$$ 1558538 1570519 1533717 1532733 1613283 1541969 1537885 1519622 1487097 1486006 1523584 1541725 1555358
2973A555358m9495n798J5586J8639K8989L5399l5295j4352M9700J5614m1J7046
$$ 1555358 1505863 1500065 1515651 1534290 1563279 1598678 1563383 1549031 1598731 1614345 1614304 1631350
2961A631350P4314k7103L2780J0848M6915k22o507J1370n5252l4378O6817m8632
$$ 1631350 1705664 1678561 1711341 1722189 1769104 1768882 1762375 1773745 1718493 1684115 1750932 1702300
2949A702300k4830K8548O5971p7380o4386N5454J8269O526l4739r5926j6093Q648
$$ 1702300 1677470 1706018 1771989 1694609 1630223 1685677 1703946 1710472 1675733 1579807 1563714 1572362
2937A572362O012M1277K9740K6189m3564J4017M3335J1327j4384N0275O2237L5498
$$ 1572362 1578374 1619651 1649391 1675580 1632016 1646033 1689368 1700695 1686311 1736586 1798823 1834321
2925A834321R3552M1053O1243L3589k5209j7470l7209l7520p3523K3631l76n2452
$$ 1834321 1927873 1968926 2030169 2063758 2038549 2021079 1983870 1946350 1872827 1896458 1896082 1843630
2913A843630k3984m9285n0037n1980k5945q0512N349J7822K6425k45m3703J5403
$$ 1843630 1819646 1770361 1720324 1668344 1642399 1561887 1567236 1585058 1611483 1611238 1567535 1582938
2901A582938j377k9131j4020L7065L8522Q790j05479J767P0315J8072k579J09490
$$ 1582938 1581561 1552430 1538410 1575475 1613997 1622787 1517308 1519075 1589390 1607462 1604883 1714373
2889A714373k6917l5014P0455p746k3423L1743K9146k9112Q185k3235l9265k8722
$$ 1714373 1687456 1652442 1722897 1715151 1691728 1723471 1752617 1723505 1731690 1708455 1669190 1640468
2877A640468k2007P0801K3089q298L9206m394k4316L0781j3646k1180O4900j2980
$$ 1640468 1618461 1689262 1712351 1704053 1743259 1738865 1714549 1745330 1731684 1710504 1775404 1762424
2865A762424L2065k4666l0117p3497o5108k0090m1981K0846m7536K2844L4914
$$ 1762424 1794489 1769823 1739706 1666209 1601101 1581011 1539030 1559876 1512340 1535184 1570098
2854A570098P3273j22j6810j8031N9502P1401N1679K4555J5131M369p1921j5875
$$ 1570098 1643371 1643249 1626439 1608408 1667910 1739311 1790990 1815545 1830676 1835045 1763124 1747249
2842A747249M3956n39K9016K2630m4277k1260J7259p8032q8178o590O773k9088
$$ 1747249 1791205 1790666 1819682 1842312 1798035 1776775 1794034 1716002 1627824 1621234 1628007 1598919
2830A598919m7352p161N9776K4630m5055j7063p913K9959o1565p040N2854J5291
$$ 1598919 1551567 1544406 1604182 1628812 1583757 1566694 1558781 1588740 1527175 1520135 1572989 1588280
2818A588280k2522p1983Q8565l7783r4384N128k2543J08192J5258k4505o3425
$$ 1588280 1565758 1493775 1582340 1544557 1450173 1455301 1432758 1540950 1556208 1531703 1468278
2807A468278N2397M4095N8271J5825r478m469n5281m7011Q021q5697P137M7977
$$ 1468278 1520675 1564770 1623041 1638866 1629388 1624919 1569638 1522627 1530648 1444951 1452088 1500065
2795A500065k4375L0416k4908j6491k0545j5369j339n5359N950n3145q724j24337
$$ 1500065 1475690 1506106 1481198 1464707 1444162 1428793 1427454 1372095 1378045 1324900 1316176 1191839
2783A191839n4365K6846k7403q0551q3798j843J702n7222q0267j1216l3245p01
$$ 1191839 1137474 1164320 1136917 1056366 972568 970725 972427 915205 834938 823722 790477 789776
2771G89776j05230L761K8836P522l3501Q177N065l0434k1066k7148k5218l673
$$ 789776 684546 688307 717143 724665 691164 699341 704406 673972 652906 625758 600540 596867
2759E96867p1769l7127L195N4931K6366o2557l6667Q2883n4981l439k7463M9942
$$ 596867 525098 487971 491166 546097 572463 509906 473239 556122 501141 497702 470239 520181
2747E20181k4419J544L6303m3395q461j25899J3500M0696R1001n920k6146n3943
$$ 520181 495762 497306 533609 490214 481753 355854 369354 410050 501051 495131 468985 415042
2735D15042M0328J4454p9061j324J5151j5239k7808L1416J2107j3984l2895P977
$$ 415042 455370 469824 390763 389439 404590 389351 361543 392959 405066 391082 358187 366164
2723C66164K2520n7835K9528k9651J4092N0550O3753l5671j7940m0790m8084L7362
$$ 366164 388684 330849 360377 330726 344818 395368 459121 423450 405510 364720 316636 353998
2711C53998j5596m6151K5377J101j5215k156N2434J1890m4205J5224j542l9355
$$ 353998 338402 292251 317628 318729 303514 301358 353792 365682 321477 336701 335159 295804
2699B95804l1596L2156j6501l1712P5315K2759m0117N359j7764P98l4871n4666
$$ 295804 264208 296364 279863 248151 323466 346225 306108 311467 293703 294501 259630 204964
2687B04964N6876L8754l6538j876o976M8389l0531m8870L9675P2538p3756K9349
$$ 204964 261840 300594 264056 262180 255204 303593 273062 224192 263867 336405 262649 291998
2675B91998n8280l8998K9973J1936L0694k8488l1616N0133l6687r394J22113P933
$$ 291998 233718 194720 224693 236629 267323 238835 207219 257352 220665 211271 333384 341317
2663C41317n5785L6670o1007J7845j2663K7070J437n9030P2141J7811j03933j1266
$$ 341317 285532 322202 261195 279040 266377 293447 294884 235854 307995 325806 221873 210607
2651B10607N7962p797k7268o645j942l5032K6152n7026L891P9772J969n5875j7262
$$ 210607 268569 260772 233504 226859 224917 189885 216037 159011 162902 242674 244643 188768 171506
2638A71506J2587M433M4804o50K0242K6048p5861J9433m404K0465j0389L6004
$$ 171506 184093 188526 233330 232680 252922 278970 203109 222542 218138 238603 228214 264218
2626B64218L2468R456l0627O967k4974j07611K1486Q3625j980l319J031J9316
$$ 264218 296686 306142 275515 282482 257508 149897 171383 255008 253028 249709 250740 270056
2614B70056J1962n623m416K5148J3509R107P609n012j7818k5165K9496J4768L7283
$$ 270056 282018 276395 271979 297127 310636 319743 327352 322340 304522 279357 308853 323621 360904
2601C60904K9022M6657l575l5631k0515J3121O4602o4399o4533Q3393L1494q675
$$ 360904 389926 436583 433008 397377 376862 389983 454585 390186 325653 409046 440540 431865
2589D31865l7637Q453j4522P168J2628M4986j1194l5280N1334n4336o4078L7973
$$ 431865 394228 402681 388159 395327 407955 452941 441747 406467 457801 403465 339387 377360
2577C77360K5749L9209j0377p639K0494M211M15n6912R2128l6118n7249P466N1006
$$ 377360 403109 442318 431941 424302 444796 449007 449422 392510 484638 448520 391271 398737 449743
2564D49743k745K9068j1173J5118l5953n0084P7295m853p188K813j9564Q9759
$$ 449743 446998 476066 464893 480011 444058 393974 471269 466416 459228 462041 442477 532236
2552E32236j7661o0218L5947P862K5064J5117L108j1497O7817K5580o7691n4652
$$ 532236 514575 454357 490304 498166 523230 538347 541455 529958 597775 623355 555664 501012
2540E01012M325l6210k280K1618j9812j1897o6304l367k7051K3247J7992M3356
$$ 501012 505337 469127 466847 488465 468653 456756 390452 387085 360034 383281 401273 444629
2528D44629J3858q7263o3803K3379K3731P6807m99j0292l8619k7214P0515J2963
$$ 444629 458487 371224 307421 330800 354531 431338 430839 420547 381928 354714 425229 438192
2516D38192J3326p413P4593l3591n7724J583J9113L0294j3817l0210o2636o7308
$$ 438192 451518 444105 518698 485107 427383 428966 448079 478373 464556 434346 371710 304402
2504C04402Q5513m3231q1893O844N349m5864L1410l058J9968m928l8925l3026
$$ 304402 389915 346684 264791 271635 276984 231120 262530 259472 279440 274512 235587 202561
2492B02561M0589J5885k6509k5928l26K5610j8788k124j5903L0044m2636l4770
$$ 202561 243150 259035 232526 206598 206272 231882 213094 210970 195067 225111 182475 147705
2480A47705K3689l3224P7151o1169l4347Q7256M1678m0108m8577k762L683J0435
$$ 147705 171394 138170 215321 154152 119805 207061 248739 208631 160054 157292 160975 171410
2468A71410n6258k9638M4340m7905L6557L2551l5128j420m6705j5362J3183O1744
$$ 171410 115152 85514 129854 81949 118506 151057 115929 114509 67804 52442 65625 127369
2456A27369K1491J7183k5724m3816L514N518j03071j7209J6098P2579N2012j6132
$$ 127369 148860 166043 140319 96503 100017 105535 2464 -14745 1353 73932 125944 109812
2444A09812K7593j9850m4198K1567J0825L1986N440l8091o2580M0154j1440l5018
$$ 109812 137405 117555 73357 94924 105749 137735 143175 105084 42504 82658 71218 36200
2432C6200R627k4269J9797K7008J8470o0922J3550L1434N834j7901n263K0579
$$ 36200 45827 21558 41355 68363 86833 25911 39461 70895 76729 58828 53565 74144
2420G4144K34M1028O673L0015q8806N1364J4782o9868K4719l2683K7714r3417
$$ 74144 74378 115406 122079 152094 63288 114652 129434 59566 84285 51602 79316 -14101
2408a4101n3597N8873M9095k9635L4101m9373K6987P0997n7651o396L4557k1865
$$ -14101 -67698 -8825 40270 10635 44736 -4637 22350 93347 35696 29300 63857 41992
2396D1992K8987j3907o436J1606k5865K2745L3496k6209n0697M0089r920J0743
$$ 41992 70979 57072 50636 62242 36377 59122 92618 66409 15712 55801 45881 56624
2384E6624m4314n933L5591j763P17m0379m2911K6360K0393k087P565n6459J3173
$$ 56624 12310 6377 41968 40205 40922 543 -42368 -16008 4385 2298 9863 -46596 -33423
2371c3423J00412o6260N0940P9200n7303Q488l1823l7600L0962m4266L0944M6830
$$ -33423 66989 729 51669 130869 73566 82054 50231 12631 43593 -673 30271 77101
2359G7101k0664J082N876j8511n175J7500j5860n798o4205P641R373J1304k3582
$$ 77101 56437 57519 63395 44884 39709 57209 41349 35551 -28654 -21013 -11640 -336 -23918
2346b3918m1807M2524J9041M0994l2434j6166j313l2589N4962M7332l0232O51
$$ -23918 -65725 -23201 -4160 36834 4400 -11766 -13079 -45668 9294 56626 26394 27045
2334B7045L6633Q39k2325R246P216m6909N458l691J1256J8866j195m9343n4941
$$ 27045 63678 64517 42192 51438 58654 11745 17203 13512 24768 43634 42439 -6904 -61845
2321f1845Q2389L2598L2937M3351N619m711k2673O121k3234o4212K8777K8566
$$ -61845 20544 53142 86079 129430 135049 130338 107665 113786 90552 26340 55117 83683
2309H3683j7904j3055m6133K2677L7231L3874o2312n1959L1341l2078k1183l4297
$$ 83683 65779 52724 6591 29268 66499 100373 38061 -13898 17443 -14635 -35818 -70115
2297g0115N3140J347K2383J3203K7775J1330L1310m1929m6997J9305j7978O448
$$ -70115 -16975 -15628 6755 19958 47733 59063 90373 48444 1447 20752 2774 9222
2285I222l2550M1170j6469L7162k2156Q462J451o2911M531N1943p410m278J3362
$$ 9222 -23328 17842 1373 38535 16379 24841 26292 -36619 -32088 19855 12445 8167 21529
2272B1529Q88o5869o7264J00276K1938L6953N5537J349o6525o8264P1131M6584
$$ 21529 22417 -43452 -110716 -10440 11498 48451 103988 105337 38812 -29452 41679 88263
2260H8263J8106l6494m7343l7362j7473k8301j126Q5546R411q6267N8256N0104
$$ 88263 106369 69875 22532 -14830 -32303 -60604 -61730 23816 33227 -53040 5216 55320
2248E5320j7028P650k8327K4693O2004p697m6433j0006j5313J2260j5906J4703
$$ 55320 38292 45942 17615 42308 104312 96615 50182 40176 24863 37123 21217 35920
2236C5920J6623q091k2191J1159o868m6370K503K5535R005m4626J3132j0246J5169
$$ 35920 52543 44452 22261 33420 26552 -19818 -17315 8220 17225 -27401 -14269 -24515 -9346
2223i346Q095m3235K5120N0306j2457k4591J1143L7448k4791J1111j3117k2368
$$ -9346 -1251 -44486 -19366 30940 18483 -6108 5035 42483 17692 28803 15686 -6682
2211f682M1344J8227n9622p56p766o170L7896K1279N9079o0761o3004M0159k8599
$$ -6682 34662 52889 -6733 -7489 -15255 -21425 16471 37750 96829 36068 -26936 13223 -15376
2198a5376k5431j6010M9532O0448j9299k0189O3132J6878m7818k6529n809O131
$$ -15376 -40807 -56817 -7285 53163 33864 13675 76807 93685 45867 19338 13529 19660
2186A9660M897O2080l9378J7633K6507k0059l5211r319l0033J7291J1809j7734
$$ 19660 24557 86637 47259 64892 91399 71340 36129 26810 -3223 14068 25877 8143
2174H143J7465L1034M6964p341q2552L0272M649m8243M3245k415N6360j9236l4958
$$ 8143 25608 56642 103606 96265 13713 43985 48634 391 43636 41221 97581 78345 43387
2161D3387j7524K4526M9681n5260L3241q6448J8557J03302k516k4096j4711l7113
$$ 43387 25863 50389 100070 44810 78051 -8397 10160 113462 110946 86850 72139 35026
2149C5026k3228L3246L7478k9583r752M6357L7161l1767J8585M220k422M291M1339
$$ 35026 11798 45044 82522 52939 43187 89544 126705 94938 113523 117743 115321 119612 160951
2136A60951J2686n7134p622m7290O4005K4641p7628K9144O9082n4701j6779k9860
$$ 160951 173637 116503 108881 61591 125596 150237 72609 101753 170835 116134 99355 69495
2124F9495j7489K6588N6899O6112K0421j8345j2715N994M4M8081J5514n9033L9929
$$ 69495 52006 78594 135493 201605 222026 203681 190966 196960 197004 245085 260599 201566 241495
2111B41495K4443J8115l2730m1755O1022M4674j1361L1768J1552o4069J5539P8668
$$ 241495 265938 284053 251323 209568 270590 315264 303903 335671 347223 283154 298693 377361
2099C77361j9427M343R678O7768M3488m493L904M3407j0724m1670N3882K8863
$$ 377361 357934 362277 371955 439723 483211 478718 482622 526029 515305 473635 527517 556380
2087E56380r063M1563l0318m5491Q7108O8968K9206K2159k6696J02425M1797L6836
$$ 556380 547317 588880 558562 513071 600179 669147 698353 720512 693816 796241 838038 874874
2075H74874N6432P6001P4799M7047J12401K2235J17810P9229J05562J32443J43290
$$ 874874 931306 1007307 1082106 1129153 1241554 1263789 1381599 1460828 1566390 1698833 1842123
2064A842123J33304J98582J38734J31780L02505K72725L52759M09595N59924O79659
$$ 1842123 1975427 2174009 2312743 2444523 2747028 3019753 3372512 3782107 4342031 5021690
2054E021690Q02739J051349J216984J492438J326341J203434k63512j464645j780027
$$ 5021690 5824429 6875778 8092762 9585200 10911541 12114975 11851463 10386818 8606791
2045H606791j877366j337018q80162p02963n10387l43999l07868k38405k10403
$$ 8606791 6729425 5392407 4512245 3809282 3298895 2954896 2647028 2408623 2198220
2036B198220j26610r8123p7362q8786j88234j53464j01034j07056j8985j19248
$$ 2198220 2071610 1973487 1896125 1807339 1619105 1465641 1364607 1257551 1238566 1119318
2026A119318q0602o380p7482m4024p7859p1961Q272l6098j01956J7201K5156p0608
$$ 1119318 1038716 1032336 954854 910830 832971 761010 769282 733184 631228 648429 673585 602977
2014F02977k2823o4778K9843q0920j0840K8591j7268k3922K8512k1537l1556l5112
$$ 602977 580154 515376 545219 464299 453459 482050 464782 440860 469372 447835 416279 381167
2002C81167P8073o60r3528j808r033n1083j2987J6887k2055R255m9400n8087j2098
$$ 381167 459240 458580 365052 363244 354211 303128 290141 307028 284973 294228 244828 186741 174643
1989A74643N8228J01784l219n5616o5397k4248L1159M4767n167m0475K5568Q706
$$ 174643 232871 334655 331436 275820 210423 186175 217334 262101 256934 216459 242027 250733
1977B50733n0187l7835j5313L3732Q556O833l9980k061P561n6979l0020L9169
$$ 250733 200546 162711 147398 181130 189686 196519 156539 154478 162039 105060 75040 114209
1965A14209M5833p5576j5391J8936j9921n4361L2802j290m0415k659m4657R414
$$ 114209 160042 84466 69075 88011 68090 13729 46531 45241 4826 2167 -42490 -33076
1953c3076M8841P7634k4629j9438k641l8972N3453j6997n1905q484K6320n028
$$ -33076 15765 93399 68770 49332 46691 7719 61172 44175 -7730 -16214 10106 5078
1941E078R324L2289j1700j1034n0609O0674O0956k3978L3582K0683k0031r3748
$$ 5078 14402 46691 34991 23957 -26652 34022 94978 71000 104582 125265 105234 11486
1929A1486j280j8915m6632O3212J0439K8047M7963k6905m1661K4560l2757n9911
$$ 11486 10206 -8709 -55341 7871 18310 46357 94320 67415 25754 50314 17557 -42354
1917d2354L5710N0114j8454l9595j5332j2670J7357J6322J7603j5489q2521O3706
$$ -42354 -6644 43470 25016 -14579 -29911 -42581 -25224 -8902 8701 -6788 -89309 -25603
1905b5603N9959N920m7632o7731P2898M7057k5981p022K332K7080o4203K0509
$$ -25603 34356 40276 -7356 -75087 -2189 44868 18887 11865 14197 41277 -22926 -2417
1893b417J2003L0832O4855n0464k0782m9068L4040m5611J3880K1115j6829J0200
$$ -2417 9586 40418 105273 54809 34027 -15041 18999 -26612 -12732 8383 -8446 1754
1881A754n0539j1309O8459J8450K3432j31253K4443N4856J4112j7448j1989j1165
$$ 1754 -48785 -60094 8365 26815 50247 -81006 -56563 -1707 12405 -5043 -17032 -28197
1869b8197k6820M4778k6024L5358J2794K5648k3628j6952J7711K5009R042l7799
$$ -28197 -55017 -10239 -36263 -905 11889 37537 13909 -3043 14668 39677 48719 10920
1857A0920J6284J660p5159K6431q189k7443P2283m9251r335K8410k5429N0557
$$ 10920 27204 28864 -46295 -19864 -28053 -55496 16787 -32464 -41799 -13389 -38818 11739
1845A1739k4090J2417L6072n7708p1539O6043N4191m1860m337J5578j5668q2726
$$ 11739 -12351 66 36138 -21570 -93109 -27066 27125 -14735 -19072 -3494 -19162 -101888
1833a01888R4795o7700j4746K2114j1059N2556j3637r4888K099L7421N895Q2439
$$ -101888 -7093 -74793 -89539 -67425 -78484 -25928 -39565 -134453 -132354 -94933 -89038 -6599
1821f599k9615k8479K4229q380M435M6443k2848k1734J3615J12799k2589r8873
$$ -6599 -36214 -64693 -40464 -48844 -44409 2034 -20814 -42548 -28933 83866 61277 -37596
1809c7596n6089M9767P1033M6554r2312l3103J6943l563j7146K9505N3338k0998
$$ -37596 -93685 -43918 27115 73669 -18643 -51746 -34803 -38366 -55512 -26007 27331 6333
1797F333O171l3449r761j3817L6696J8546p795k3893Q4991k5545J4692j7349m4677
$$ 6333 12504 -20945 -30706 -44523 -7827 10719 2924 -20969 64022 38477 53169 35820 -8857
1784h857j1687J1900K4060k411L1105J6709p4290J6627L7356j7551l609O276L177
$$ -8857 -20544 -8644 15416 13005 44110 60819 -13471 3156 40512 22961 19352 25628 28805
1771B8805j18233n064O193M2364M0216q673j3151j8772J2724P6717m8439p148
$$ 28805 -89428 -94492 -88299 -45935 -5719 -14392 -27543 -46315 -33591 43126 -5313 -12461
1759a2461j5828R888O1105p708j04150J0291J8503l0244M7234M5565n6933m6807
$$ -12461 -28289 -18401 42704 34996 -69154 -58863 -40360 -70604 -23370 22195 -34738 -81545
1747h1545l7087Q0411K632r3351R0319j677j2079K4190j8310N852j7294j2454
$$ -81545 -118632 -38221 -35589 -128940 -38621 -40298 -52377 -28187 -46497 -40645 -57939 -70393
1735g0393m301M8206M8090m3129o3435k7931J1741P9991R72l3813j7070K1770
$$ -70393 -74694 -26488 21602 -21527 -84962 -112893 -101152 -21161 -20189 -54002 -71072 -49302
1723d9302j5511j9289j5547L2872M854l0573K3702L5372O448l0782l6718M9956
$$ -49302 -64813 -84102 -99649 -66777 -61923 -92496 -68794 -33422 -26974 -57756 -94474 -44518
1711d4518m2063k2177O2519n832r983K0194N1997m1134k7230J0757m3276K0073
$$ -44518 -86581 -108758 -46239 -52071 -62054 -41860 10137 -30997 -58227 -47470 -90746 -70673
1699g0673L3740M8687n2067o4706L0122o0795K4938K2137n929K9870N1701n757
$$ -70673 -36933 11754 -40313 -105019 -74897 -135692 -110754 -88617 -94546 -64676 -12975 -18732
1687a8732o6278p154K6101j7935M7931l8191Q4023o6988J3315l9246o215K5081
$$ -18732 -85010 -92164 -66063 -83998 -36067 -74258 9765 -57223 -43908 -83154 -89369 -64288
1675f4288j6618L1402j0138n862j6384k8350L8559N3150l8517n7667L7233M4173
$$ -64288 -80906 -49504 -59642 -65504 -81888 -110238 -71679 -18529 -57046 -114713 -77480 -33307
1663c3307J1892l5861l3079K851J2494j290L8000m2734L630O3933j02180j4438
$$ -33307 -21415 -57276 -90355 -87504 -75010 -76300 -38300 -81034 -77404 -13471 -115651 -130089
1651a30089j3085P2061J09111m5670j5529N652j6267K2092o9140K0155P797P5004
$$ -130089 -143174 -71113 37998 -7672 -23201 -17549 -33816 -11724 -80864 -60709 -52912 22092
1639B2092q4454j5453j2188r075J5024K2173Q783P461P1403n7078m602j6727Q186
$$ 22092 -62362 -77815 -90003 -99078 -84054 -61881 -53098 -45637 25766 -31312 -35914 -52641 -44455
1626d4455N0237O2681n3834q318l1447m0370M759l813l2657N0878K3621k1939
$$ -44455 5782 68463 14629 6311 -25136 -65506 -60747 -64560 -97217 -46339 -22718 -44657
1614d4657K4675o7451j0224L5164k9661j0429o954M7367l3091M3177P268j2925
$$ -44657 -19982 -87433 -97657 -62493 -92154 -102583 -109537 -62170 -95261 -52084 -44816 -57741
1602e7741L67j5345L5237J3782N482j1263k0320l1633n2439K5198L2560o2349
$$ -57741 -57374 -72719 -37482 -23700 -18218 -29481 -49801 -81434 -133873 -108675 -76115 -138464
1590a38464M7012J1197k3027j0591P258O746L8044m7185m4746M1241J1062J4485
$$ -138464 -91452 -80255 -103282 -113873 -106615 -99869 -61825 -109010 -153756 -112515 -101453 -86968
1578h6968k6999J9190J9869o7140L6319M5827M0207p8020o4122O7508N650O6938
$$ -86968 -113967 -94777 -74908 -142048 -105729 -59902 -19695 -97715 -161837 -94329 -88679 -21741
1566b1741J3493J387O399m0252l4391r032j2568K1849J0671l9751K4950n9670
$$ -21741 -8248 -6861 -462 -40714 -75105 -84137 -96705 -74856 -64185 -103936 -78986 -138656
1554a38656j3834J3301M1423K938O310J3556K8783j8663l4929J4139M482L8656
$$ -138656 -152490 -139189 -97766 -94828 -88518 -74962 -46179 -64842 -99771 -85632 -81150 -42494
1542d2494L7786n317J5686J7644m3578K4233k1950m7520N5378k8077J8731N5531
$$ -42494 -4708 -10025 5661 23305 -20273 3960 -17990 -65510 -10132 -38209 -19478 36053
1530C6053r6049Q399j6383m2732J0060K720O5381L8637Q219l4844J6740L3273
$$ 36053 -59996 -51597 -67980 -110712 -100652 -97932 -32551 6086 14305 -20539 -3799 29474
1518B9474n479m3177j2177j3754j8885L9399P268l1575K4384j2654J0069j6595
$$ 29474 23995 -19182 -31359 -45113 -63998 -24599 -17331 -48906 -24522 -37176 -27107 -43702
1506d3702R173p5235N2551K9228n969K7035n6317j1636K2501M8501l4990J4797
$$ -43702 -34529 -109764 -57213 -27985 -33954 -6919 -63236 -74872 -52371 -3870 -38860 -24063
1494b4063K1538l3735j2199k0397K6525Q7201p5487m0812O0378l437L6616j2999
$$ -24063 -2525 -36260 -48459 -68856 -42331 44870 -30617 -71429 -11051 -14488 22128 9129
1482I129k0616k9935K089J5838N3228n9431m6095J7624K5035K9861n8049p785
$$ 9129 -11487 -41422 -39333 -23495 29733 -29698 -75793 -58169 -33134 -3273 -61322 -69107
1470f9107J6316p585Q395L7490k4648K9309n695N2157q5882L436O3658K2114r2726
$$ -69107 -52791 -60376 -51981 -14491 -39139 -9830 -15525 36632 -49250 -45814 17844 39958 -52768
1457e2768l583O0968k3265J1046J2144N4177j703l5363o1464M9891P590N438K1776
$$ -52768 -56351 4617 -18648 -7602 4542 58719 57016 21653 -39811 10080 17670 23108 44884
1444D4884p9445N2012K1795m7049r338K1532K3476r50k3814L2785k3932m6167
$$ 44884 -34561 17451 39246 -7803 -17141 4391 27867 26917 3103 35888 11956 -34211
1432c4211r1128M978N1678L5462L0185q898n6010j6108J5833J3554j250M5697
$$ -34211 -125339 -120361 -68683 -33221 -3036 -11934 -67944 -84052 -68219 -54665 -55915 -10218
1420a0218K2402o9140N7405K7066j7975j9850k0747n5218m9326P7960J5658l6352
$$ -10218 12184 -56956 449 27515 9540 -10310 -31057 -86275 -135601 -57641 -41983 -78335
1408g8335j0776L5831L0250J4510n3683j7981K5919k3599O0913K6141m4945O7635
$$ -78335 -89111 -53280 -23030 -8520 -62203 -80184 -54265 -77864 -16951 9190 -35755 31880
1396C1880l0235k0069k4398m736M7496M5659n4424k7834j325J1103K6652m6452
$$ 31880 1645 -18424 -42822 -47558 -62 45597 -8827 -36661 -37986 -26883 -231 -46683
1384d6683m8788m1239O0476K8118J5636K708q137p714L4327j9319J3519q651j3991
$$ -46683 -95471 -136710 -76234 -48116 -32480 -29772 -37909 -45623 -11296 -30615 -17096 -25747 -39738
1371c9738R021k989k0996k4982l6684P2933k2425K504N647l0803J5292N7128o5949
$$ -39738 -30717 -33706 -54702 -79684 -116368 -43435 -65860 -63356 -57709 -88512 -73220 -16092 -82041
1358h2041q867m6977M5534Q9261l2434j571O7550K250m1333K080m4245O1943k2046
$$ -82041 -90908 -137885 -92351 -3090 -35524 -37095 30455 32705 -8628 -6548 -50793 11150 -10896
1345a0896l1848k6019m8648K966L5665n5710O0647K4303m9369m6322N3290M8051
$$ -10896 -42744 -68763 -117411 -114445 -78780 -134490 -73843 -49540 -98909 -145231 -91941 -43890
1333d3890R282K0364K4512j9957m1981k1140l5604J068J7414p142l3882N4100
$$ -43890 -34608 -14244 10268 -9689 -51670 -72810 -108414 -107346 -89932 -97074 -130956 -76856
1321g6856M4949K2894j1740K2217l7699K4590m7557j1252k802J3160J3237N3689
$$ -76856 -31907 -9013 -20753 1464 -36235 -11645 -59202 -70454 -73256 -60096 -46859 6830
1309F830L1m1805k9249L6850K1631P327j1026r755M9939n6192r513M3148N2932
$$ 6830 6861 -34944 -64193 -27343 -5712 1615 -9411 -19166 30773 -25419 -34932 8216 61148
1296F1148l8901l3969l7767N5230p4716Q4882N6665n5013K7016J5812m1285n1898
$$ 61148 22247 -11722 -49489 5741 -68975 15907 72572 17559 44575 60387 19102 -32796
1284c2796K4142j694p75J5933l9753q209N3016j8192K1237K398l4137k4359m3516
$$ -32796 -8654 -10348 -11123 4810 -34943 -43152 9864 -8328 12909 15307 -18830 -43189 -86705
1271h6705P846O9574N947J9591m5246p3227L877J7905l2720P4359k9583K8550
$$ -86705 -78859 -9285 -3338 16253 -28993 -102220 -98343 -80438 -113158 -38799 -68382 -39832
1259c9832l3631K7479J6418K7071k8929k712r134L9610r485j9010K0155k453M7869
$$ -39832 -73463 -45984 -29566 -2495 -31424 -34136 -43270 -3660 -13145 -32155 -12000 -14453 33416
1246C3416m637m3413P143O519p1361J0717j5770Q877L4610n9713o0874J01648
$$ 33416 28779 -14634 -7491 -972 -72333 -61616 -77386 -68509 -33899 -93612 -154486 -52838
1234e2838M1955j4069k4758K194r261L4081j7003r031l7444K6565o9390K0489
$$ -52838 -10883 -24952 -49710 -47516 -56777 -22696 -39699 -48730 -86174 -59609 -128999 -108510
1222a08510K0325m640L3972L1210j1103k140K1945O7027m9409k3154K8531k8416
$$ -108510 -88185 -92825 -58853 -27643 -38746 -40886 -18941 48086 -1323 -24477 4054 -24362
1210b4362o355K253n2070R3037m5089N1053j3377r0964N5291N3875j4586j8094
$$ -24362 -30717 -28464 -80534 12503 -32586 18467 5090 -85874 -30583 23292 8706 -9388
1198i388l1735M371l8709n894J650J7406N29L6672L1777l2119n6667K8795L5695
$$ -9388 -41123 -36752 -75461 -81355 -79705 -62299 -61770 -25098 6679 -25440 -82107 -53312 -17617
1185a7617N3178N9188l8723l3314L314N4849n9932j7759J6663j6593r7032m176
$$ -17617 35561 94749 56026 22712 26026 80875 20943 3184 19847 3254 -93778 -97954
1173i7954Q9075M4090j8344J0470n6351M3828k1517L4057k8315L6938n0759N3779
$$ -97954 -8879 35211 16867 27337 -29014 14814 -6703 27354 -961 35977 -14782 38997
1161C8997l7810n7235J8157J4912n922L1987N4058m8908L8120p835n8006n515
$$ 38997 1187 -56048 -37891 -22979 -28901 3086 57144 8236 46356 38521 -19485 -25000
1149b5000N8270k464K1879n8287l5129J6197N265j9070j4391j0121N3817Q021
$$ -25000 33270 30806 52685 -5602 -40731 -24534 -19269 -38339 -52730 -62851 -9034 -1013
1137a013k951L7855j8503K4593P398m3851r0681k174J2931M9818L3569n685r054
$$ -1013 -3964 33891 15388 39981 47379 3528 -87153 -89327 -76396 -26578 6991 1306 -7748
1124g748J5764l673n2162j3509L6724k0571p003J6295J0741K580r546k7654n6554
$$ -7748 8016 4343 -47819 -61328 -24604 -45175 -52178 -35883 -25142 -22562 -32108 -59762 -116316
1111a16316K7737L6762j8795o604j7552P3113K9032R536m048K8823p163n1292
$$ -116316 -88579 -51817 -70612 -77216 -94768 -21655 7377 16913 12865 41688 34525 -16767
1099a6767N3370j9973J2565O196l640k5224k1824M7535n7282k8608m1710N752
$$ -16767 36603 16630 29195 35391 31751 6527 -15297 32238 -25044 -53652 -95362 -89610
1087h9610M2689O0988l4144m7998k4883N6750L3601r6698N0690M4568J5910q098
$$ -89610 -46921 14067 -20077 -68075 -92958 -36208 -2607 -99305 -48615 -4047 11863 3765
1075C765P714k7480k4357J747K3004o618J0197Q328j9461l8438M0433n174R514
$$ 3765 11479 -16001 -40358 -38611 -15607 -22225 -12028 -3700 -23161 -61599 -21166 -26340 -16826
1062a6826p620O509L3226o9397n9216N6947J2557M064K090m2205K0179M7854M9810
$$ -16826 -24446 -17937 15289 -54108 -113324 -56377 -43820 -39756 -37666 -79871 -59692 -11838 37972
1049C7972m9575j327J1181J88k3232N072J4574m9498j1344M9212Q985r998k4630
$$ 37972 -11603 -12930 -1749 -1561 -24793 -19721 -5147 -54645 -65989 -16777 -7792 -17790 -42420
1036d2420p3685L6184O2589K5578J181j5522k4073n863p789j1586K9030L3118
$$ -42420 -116105 -79921 -17332 8246 9427 -6095 -30168 -36031 -43820 -55406 -26376 6742
1024F742k5930O772L8189j2248M5342J5694p2822n5664p2924L485R4872P9948
$$ 6742 -19188 -12416 25773 13525 58867 74561 1739 -53925 -126849 -123364 -28492 51456
1012E1456q190o631n81m7927L1432Q614k5217J1862j0952L7212m17M8060n143
$$ 51456 43266 36635 36054 -11873 19559 28173 2956 14818 3866 41078 40661 88721 83578
999H3578m8162n1390m0958k2268K2315P798M3933K0197m4868R17J8963J9382o8442
$$ 83578 35416 -15974 -56932 -79200 -56885 -49087 -5154 15043 -29825 -28908 -9945 9437 -59005
986e9005P7271n2702j774J5220K4175L3579j7911l2193J7449n55p4651J6597O7249
$$ -59005 18266 -34436 -36210 -20990 3185 36764 18853 -13340 4109 3554 -71097 -54500 12749
973A2749o0932M814M0162r1627O3582L5046l1051J4084N1939n3958j8689l9140
$$ 12749 -48183 -43369 -3207 -94834 -31252 3794 -27257 -13173 38766 -15192 -33881 -73021
961g3021M8530J4924j816j8717l043Q0549l3858o3534N5684l4413l589J8116m000
$$ -73021 -24491 -9567 -11383 -30100 -33143 47406 13548 -49986 5698 -28715 -32304 -14188 -18188
948a8188P124j8543Q5801j3587k8784l99q103K0700n8875k9116O463J4600J3955
$$ -18188 -11064 -29607 56194 42607 13823 13424 5321 26021 -32854 -61970 -55507 -40907 -26952
935b6952k7099L4772L5953J1524j0517j6468o9986n766Q3314K4413K4564j6768
$$ -26952 -54051 -19279 16674 28198 17681 1213 -68773 -74539 8775 33188 57752 40984
923D0984l4500m3085L3020j3444o6085j7162P4340L8555r5335M9781K7621n4512
$$ 40984 6484 -36601 -3581 -17025 -83110 -100272 -25932 12623 -82712 -32931 -5310 -59822
911e9822m320J17339m3700j8540M1096l8631L464k7068k1822L3330O0427j1319
$$ -59822 -64142 53197 9497 -9043 32053 -6578 -3114 -30182 -52004 -18674 41753 30434
899C0434o1518l4268k876L4170L784j3115l2368l9989O4032n404n3893N2931l719
$$ 30434 -31084 -65352 -68228 -34058 -30274 -43389 -75757 -115746 -51714 -57118 -111011 -58080 -61799
886f1799K4041M8872o8132K6841J9870o9124O4471K702l788L4574N7517R328o3277
$$ -61799 -37758 11114 -57018 -30177 -10307 -79431 -14960 -12258 -16046 18528 76045 85373 22096
873B2096j7833K2809l8034r5355M4638L8317Q190K0954j9382P252O2490j8941
$$ 22096 4263 27072 -10962 -106317 -61679 -23362 -15172 5782 -13600 -6348 56142 37201
861C7201L2052o6445q6109K4017p13Q2219l2195L4842K0314L062n5547k9765L2421
$$ 37201 69253 2808 -83301 -59284 -59997 22222 -9973 24869 45183 48245 -7302 -37067 -4646
848d646J2643M9662l293j4974j7587j3429m5853K4865K0765o2111l5016N1563
$$ -4646 7997 57659 54366 39392 21805 8376 -37477 -12612 8153 -53958 -88974 -37411
836c7411M0382j1029O8356k7779J839q832K8123L2785R535n3957q3793Q0171O3237
$$ -37411 2971 -8058 60298 32519 34358 25526 53649 86434 95969 42012 -41781 38390 101627
823A01627k7271l7873K6042J8706k5743J7770j4497r36k9059k0694p00q0760j441
$$ 101627 74356 36483 62525 81231 55488 73258 58761 57825 28766 8072 7372 -73388 -74829
810g4829J4844K6135N143J2396m9469Q8764L2848m2685K5379J5426J5756k6070
$$ -74829 -59985 -33850 -28707 -16311 -65780 22984 55832 13147 38526 53952 69708 43638
798D3638j9021k1252K4467r760r887k1538J3639K3292P3843l7973l3022K105p4423
$$ 43638 24617 3365 27832 18072 8185 -13353 286 23578 97421 59448 26426 28531 -45892
785d5892L3040M3385N69K2293M1687o3893k7829L9591J167K3713l709r662j6041
$$ -45892 -12852 30533 31102 53395 95082 31189 3360 42951 44118 67831 64122 54460 38419
772C8419m4402m945N1042K0473l991M0959m0184n1566l9126j1133M9431J6234
$$ 38419 -5983 -10928 40114 60587 56596 97555 57371 5805 -33321 -44454 4977 21211
760B1211j7161O5924L595n0535m0180L521r220M6232j0994J4888J8514l1445o8114
$$ 21211 4050 69974 73569 23034 -17146 -13625 -22845 23387 12393 27281 45795 14350 -53764
747e3764O9616K0717p120N9466j2502n0883L2238N5438m8315J060N6945p7631
$$ -53764 15852 36569 29449 88915 76413 25530 57768 113206 64891 65951 122896 45265
735D5265m1798P5693P595o691L8437p7661n0346L9342N6722k0151J7954j3202
$$ 45265 3467 79160 86755 80064 118501 40840 -9506 29836 86558 66407 84361 71159
723G1159j11755L6617J5960j0948l3432Q332j722l275K7740K7381M8813j4439
$$ 71159 -40596 -3979 11981 1033 -32399 -24067 -25789 -29064 -1324 26057 74870 60431
711F0431k7350Q929q5268j927P6348m2705q955N478L0565M4370l2614q9555J5443
$$ 60431 33081 42010 -43258 -45185 31163 -11542 -20497 -15019 15546 59916 27302 -62253 -46810
698d6810k5354P4365M6078o9071N1128j4488L4513j746j1723l1960n46J9359J3343
$$ -46810 -72164 2201 48279 -20792 30336 15848 50361 48615 36892 4932 4386 23745 37088
685C7088K3044L5115l1723L470J1327P8022J8256r8141r507J6797j6043J9060
$$ 37088 60132 95247 63524 66994 78321 156343 174599 76458 66951 83748 67705 86765
673H6765j6380o3065j1318K4292j97j2209K777J994L3540k871p6625M8573R608
$$ 86765 70385 7320 -3998 20294 20097 7888 10665 12659 46199 43328 -33297 15276 24884
660B4884K4022K9466j5285o9839q9713O1548K1049k9929m9764N5075O886j9235
$$ 24884 48906 78372 63087 -6752 -96465 -34917 -13868 -43797 -93561 -38486 -31600 -50835
648e0835L9935M402K5166l7510L0393j3577k3602o005J6091K3644N1317q861k6174
$$ -50835 -10900 -6498 18668 -18842 11551 -2026 -25628 -31633 -15542 8102 59419 50558 24384
635B4384l9996M1783M3907J3560K1184n0800O1992M6822o3116k237k3302J8477
$$ 24384 -15612 26171 70078 83638 104822 54022 116014 162836 99720 97483 74181 92658
623I2658q2614j0006R5840m5764j6440K4186j2853K6607l8656K172M1522L542
$$ 92658 10044 38 95878 50114 33674 57860 45007 71614 32958 35130 76652 80194
611H0194j4559r2903K0096L438O61J7972O824L3302j9416j7994m304k3255j181
$$ 80194 65635 -27268 -7172 -3734 -3073 14899 21723 55025 35609 17615 13311 -9944 -11125
598a1125J7813N6222K0761n1339J7242K7586k2053J6249l7468l110M2515R651
$$ -11125 6688 62910 83671 32332 49574 77160 55107 71356 33888 30778 73293 82944
586H2944n2352J1658K2965m3737n1031K1683O2104M310m5495J3123J0807L8455
$$ 82944 30592 42250 65215 21478 -29553 -7870 54234 58544 13049 26172 36979 75434
574G5434J2921N4784o331J7849k6293m4815p2850J818J2366j3692q649k2713j4445
$$ 75434 88355 143139 136808 154657 128364 83549 10699 12517 24883 11191 2542 -20171 -34616
561c4616j299L0462K7882j9430j2838k664O0821J7201o307R244p4601k509K8942
$$ -34616 -35915 -5453 22429 2999 -9839 -12503 48318 65519 59212 68456 -6145 -8654 20288
548B0288O4176l0187o7964j5464K1000j0309r925n270l3503K9904O9025j9557
$$ 20288 84464 54277 -13687 -29151 -8151 -18460 -28385 -33655 -67158 -37254 31771 12214
536A2214m9282Q8158M1760o0673k7534L2154L2173M0881k2239p1845K6256m2761
$$ 12214 -37068 51090 92850 32177 4643 36797 68970 109851 87612 15767 42023 -738
524g38o0229K5030M2494J4889J3323j7006l554n850O3221J526p4181j9579N2027
$$ -738 -60967 -35937 6557 21446 34769 17763 14209 8359 71580 73106 -1075 -20654 31373
511C1373K1479p7303J3750O1134j990j8535J0229M2732p979l0236P063P349l1719
$$ 31373 52852 -24451 -10701 50433 48443 29908 40137 82869 74890 44654 51717 59066 27347
498B7347K0550l9382R013P9470k9165J5805J7462m5237m1178L4872M1898k5328
$$ 27347 47897 8515 17528 96998 67833 83638 101100 55863 14685 49557 91455 66127
486F6127p4444l0970k346L8820K3395M9867L3573m5624p5831M1443N1630J3715
$$ 66127 -8317 -39287 -41633 -2813 20582 70449 104022 58398 -17433 24010 75640 89355
474H9355M4473o1785p3134L7324L979l7899J0600J7120l5432l1263L0809R0689
$$ 89355 133828 72043 -1091 36233 40212 2313 12913 30033 -5399 -36662 -5853 84836
462H4836j2637o5062k5490J0615K6026P227l209r76K806K5330P8435l4107l1344
$$ 84836 72199 7137 -18353 -7738 18288 25515 22306 21330 24136 49466 127901 93794 62450
449F2450q689n097O6272o5444j02281J6091P739p886Q710P6548L8892j1622j6599
$$ 62450 53761 48664 114936 49492 -52789 -36698 -28959 -36845 -28135 48413 87305 75683 59084
436E9084J1327l4216O3609k3618N050L3097k9145O58O158k4351m821L5004J661
$$ 59084 70411 36195 99804 76186 81236 114333 85188 85846 92004 67653 62832 97836 99497
423I9497n894L3947l266p5165j2572j8681J6748K0035L3534Q220J309o2868l929
$$ 99497 93603 127550 124284 49119 36547 17866 34614 54649 88183 96403 97712 34844 30915
410C0915N884O415K7005k2474L5111o029n5176L9701J983j8217J4079m2064O7131
$$ 30915 36799 43214 70219 47745 82856 76827 21651 61352 63335 45118 59197 17133 84264
397H4264j9162M5491k3337k7560Q7829l3869k1631J018L450j0038k9935j4024
$$ 84264 65102 110593 87256 59696 147525 113656 92025 93043 96493 86455 56520 42496
385D2496q661L6219o8152R769K3878J0308j5937L2712J8880m9087q066P396N2488
$$ 42496 33835 70054 1902 11671 35549 45857 29920 62632 81512 32425 24359 31755 84243
372H4243K8303K2326m0377j5136N2530n3233n2794j4045N2961l6553p0324M1402
$$ 84243 112546 134872 94495 79359 131889 78656 25862 11817 64778 28225 -42099 -697
360f97M6959r574J6433k6499o294J53199j7609m0788O7756j9547l8640j011L7951
$$ -697 46262 36688 53121 26622 20328 173527 155918 115130 182886 163339 124699 123688 161639
347A61639p6759n9719L7732R749k4365j512O3268p198l4309J6640J9160k5155
$$ 161639 84880 25161 62893 72642 48277 46765 110033 102835 68526 85166 104326 79171
335G9171l2614k9430q591K3238N273O4079J9371n9155P806k7801M898K3224O8355
$$ 79171 46557 17127 8536 31774 37047 101126 120497 61342 69148 41347 46245 69469 137824
322A37824o2904r333k8522M125M1130n1604o5217K1752J7609K2103J3968M39Q160
$$ 137824 74920 65587 37065 41190 82320 30716 -34501 -12749 4860 26963 40931 41370 49530
309D9530Q9490l4716l0606j9422m480K1160j1558l8503Q507l978o060K2239L0889
$$ 49530 139020 104304 73698 54276 49796 70956 59398 20895 29402 25424 19364 41603 72492
296G2492l1589j741r64O720j0926N1224J480J7188J2867n290r9254n8128O7933
$$ 72492 40903 39162 38198 44918 33992 85216 86696 103884 116751 111461 12207 -45921 22012
283B2012N08L9235R557J01215R47j21897Q16k8693J5797L6840Q456n3159K9709
$$ 22012 22520 61755 71312 172527 173474 51577 52393 23700 39497 76337 84793 31634 61343
270F1343M7528j9308K969R082k5283j1615L0973L6761J688l2808O81k0281J6630
$$ 61343 108871 89563 92532 101614 76331 64716 95689 132450 134138 101330 102011 81730 98360
257I8360n7942O236J4590j8074m6026L6227J9602j5242j7608K9321M0364K91o5153
$$ 98360 40418 46654 61244 43170 -2856 33371 52973 37731 20123 49444 89808 90099 24946
244B4946M6788L9068J8005j0708m6959j1585N611j0406R458M328K4547q4557M6343
$$ 24946 71734 110802 128807 118099 71140 59555 65166 54760 64218 68546 93093 8536 54879
231E4879L0658j3804j537k660K7307K4925Q754J3831j9359m6494m3959P7904m795
$$ 54879 85537 71733 70196 67536 94843 119768 128522 142353 122994 76500 32541 110445 105650
218A05650m1861L8957j736k4990M671j6997j6079l2814M8704j1252J7525l2295
$$ 105650 63789 102746 101010 76020 80691 63694 47615 14801 63505 52253 69778 37483
206C7483K6310L1967l1238j1910O1687R213m2213l6941Q565R092R174K0935n4577
$$ 37483 63793 95760 64522 52612 114299 123512 81299 44358 52923 62015 71189 92124 37547
193C7547k3488K7998K9832J2087r581r487j388L4845o7803j1355J395M9412L0655
$$ 37547 14059 42057 71889 83976 74395 64908 63520 98365 30562 19207 20602 70014 100669
180A00669m5422N0544o081o7431l4866N3817j0966l0715m7576M9849L1966O5528
$$ 100669 55247 105791 99710 32279 -2587 51230 40264 9549 -38027 11822 43788 109316
168A09316m7664N063n7274L193k7976K2453N4659m5030j6478O2071K5700O7224
$$ 109316 61652 66715 9441 12634 -15342 7111 61770 16740 262 62333 88033 155257
156A55257j00300l0450J1176L2042k9704L4810K7436k4706m2835k965N9374J8315
$$ 155257 54957 24507 35683 67725 38021 72831 100267 75561 32726 29761 89135 107450
144A07450N5349m9629K2133K4160n1781q464p542K1024K7469j5828l5915Q732
$$ 107450 162799 113170 135303 159463 107682 99218 91676 112700 140169 124341 88426 97158
132I7158p47r489m2944r700k6755j8977M1051j6482K8831N551k0202L3851m0131
$$ 97158 96411 86922 43978 34278 7523 -11454 29597 13115 41946 47497 27295 61146 21015
119B1015P3463J3065q246J4493m1701M1110J2248J2j3495l2325m687n925k9850
$$ 21015 94478 107543 99297 113790 72089 113199 125447 125459 111964 79639 74952 69027 39177
106C9177M8146j5473n4567J6929R080k8617J7058n550k6624O2178N793m9094K9799
$$ 39177 87323 71850 17283 34212 43292 14675 31733 26183 -441 61737 67530 18436 48235
93D8235J048L9394j7803P656l5979k9491L3202N5014j1952J0764p000k9360J5205
$$ 48235 49283 88677 70874 78530 42551 13060 46262 101276 89324 100088 93088 63728 78933
80G8933j3339j7920l78K0284j9155p188j3857K9013l944M2098L3925j0774n451
$$ 78933 65594 47674 47296 67580 48425 41237 27380 56393 52449 94547 128472 117698 112247
$$ [...]
##END NTUPLES=NMR SPECTRUM
##END=
