##TITLE=1H_CA-9080-4
 CDCl3
 8 sc, 
 27.10.2022
##JCAMPDX= 6.0         $$ Bruker NMR JCAMP-DX V2.0
##DATA TYPE= NMR SPECTRUM
##DATA CLASS= NTUPLES
##ORIGIN= UXNMR, Bruker Analytische Messtechnik GmbH
##OWNER= root
$$ XWIN-NMR		Version 3.5
$$ Thu Oct 27 14:34:14 2022 Russian Standard Time (UT+4h)  she@DPX200
##.OBSERVE FREQUENCY= 200.1313499994
##.OBSERVE NUCLEUS= ^1H
##.ACQUISITION MODE= SIMULTANEOUS
##.ACQUISITION SCHEME= undefined
##.AVERAGES= 8
##.DIGITISER RES= 18
##SPECTROMETER/DATA SYSTEM= spect
##.PULSE SEQUENCE= zg30
##.SOLVENT NAME= CDCl3
##.SHIFT REFERENCE= (INTERNAL, CDCl3, 0, 15.7403)
##AUDIT TRAIL= $$ (NUMBER, WHEN, WHO, WHERE, WHAT)
$$ ##TITLE= Audit trail, XWIN-NMR		Version 3.5
$$ ##JCAMPDX= 5.01
$$ ##ORIGIN= Bruker BioSpin GmbH
$$ ##OWNER= she
$$ F:/spectra/data/she/nmr/H-F/1/pdata/1/auditp.txt
$$ ##AUDIT TRAIL=  $$ (NUMBER, WHEN, WHO, WHERE, WHAT)
(   1,<2022-10-27 14:33:06.68 +0400>,<she>,<DPX200>,
      <created by zg, POWCHK disabled, PULCHK disabled
       terminated by command 'halt'
       configuration hash MD5:
       00 E9 B6 7A A2 85 ED C7 34 08 36 98 17 FE 4E 26
       data hash MD5: 16K
       51 81 15 83 96 30 73 81 22 51 BD 81 A9 CB 5E D5>)
(   2,<2022-10-27 14:33:10.64 +0400>,<she>,<DPX200>,
      <Start of raw data processing
       efp BC_mod = 2 LB = 0.24 FT_mod = 6 PKNL = 1 PHC0 = -18398.73 PHC1 = 20.8007 SI = 16K 
       data hash MD5: 16K
       25 94 15 2B 4E E6 88 A5 E5 84 AC D0 B9 41 70 68>)
(   3,<2022-10-27 14:33:28.81 +0400>,<she>,<DPX200>,
      <pk PHC0 = 5.941499 PHC1 = -12.6 
       data hash MD5: 16K
       FB 48 2F 27 D0 EA 79 40 E2 CD A7 45 4F C4 D7 36>)
(   4,<2022-10-27 14:33:31.90 +0400>,<she>,<DPX200>,
      <abs ABSG = 5 
       data hash MD5: 16K
       25 E3 57 31 F7 1E A6 A1 12 CA A7 58 C7 80 0D 08>)
$$ ##END=
$$ 
$$ hash MD5
$$ 15 00 F5 39 F7 03 DB 64 DC 27 BA F3 2C B0 6C A4
##$RELAX= 
##$RELAX= 
##$RELAX= 
##$RELAX= 
##$RELAX= 
##$RELAX= 
$$ Bruker specific parameters
$$ --------------------------
##$DU= <F:/spectra>
##$EXPNO= 1
##$NAME= <H-F>
##$PROCNO= 1
##$TYPE= <nmr>
##$USER= <she>
##$AMP= (0..31)
100 100 100 100 100 100 100 100 100 100 100 100 100 100 100 100 100 100 
100 100 100 100 100 100 100 100 100 100 100 100 100 100 
##$AQSEQ= 0
##$AQ_mod= 1
##$AUNM= <au_zg>
##$AUTOPOS= <>
##$BF1= 200.13
##$BF2= 200.13
##$BF3= 200.13
##$BF4= 200.13
##$BF5= 200.13
##$BF6= 200.13
##$BF7= 200.13
##$BF8= 200.13
##$BYTORDA= 1
##$CFDGTYP= 0
##$CFRGTYP= 5
##$CHEMSTR= <none>
##$CNST= (0..31)
1 1 145 1 1 1 1 1 1 1 1 1 1 1 1 1 1 1 1 1 1 1 1 1 1 1 1 1 1 1 1 1 
##$CPDPRG= <>
##$CPDPRG1= <>
##$CPDPRG2= <>
##$CPDPRG3= <>
##$CPDPRG4= <mlev>
##$CPDPRG5= <mlev>
##$CPDPRG6= <mlev>
##$CPDPRG7= <mlev>
##$CPDPRG8= <mlev>
##$CPDPRGB= <>
##$CPDPRGT= <>
##$D= (0..31)
0 1.2 0 0 0 0 0 0 0 0.06 0 0.03 0 0 0 0 0.0002 0 0 0 0 0 0 0 0 0 0 0 0 
0 0 0 
##$DATE= 1666866786
##$DBL= (0..7)
120 120 120 120 120 120 120 120 
##$DBP= (0..7)
150 150 150 150 150 150 150 150 
##$DBP07= 0
##$DBPNAM0= <>
##$DBPNAM1= <>
##$DBPNAM2= <>
$$ [...]
##$SUBNAM3= <"">
##$SUBNAM4= <"">
##$SUBNAM5= <"">
##$SUBNAM6= <"">
##$SUBNAM7= <"">
##$SUBNAM8= <"">
##$SUBNAM9= <"">
##$SW= 18.0517283424941
##$SWIBOX= (0..15)
0 0 2 0 0 0 0 0 0 0 0 0 0 0 0 0 
##$SW_h= 3612.71676300578
##$TD= 16384
##$TD0= 1
##$TE= 0
##$TE2= 300
##$TE3= 300
##$TEG= 300
##$TL= (0..7)
0 120 120 120 120 120 120 120 
##$TP= (0..7)
150 150 150 150 150 150 150 150 
##$TP07= 0
##$TPNAME0= <>
##$TPNAME1= <>
##$TPNAME2= <>
##$TPNAME3= <>
##$TPNAME4= <>
##$TPNAME5= <>
##$TPNAME6= <>
##$TPNAME7= <>
##$TPOAL= (0..7)
0.5 0.5 0.5 0.5 0.5 0.5 0.5 0.5 
##$TPOFFS= (0..7)
0 0 0 0 0 0 0 0 
##$TUNHIN= 0
##$TUNHOUT= 0
##$TUNXOUT= 0
##$USERA1= <user>
##$USERA2= <user>
##$USERA3= <user>
##$USERA4= <user>
##$USERA5= <user>
##$V9= 5
##$VALIST= <valist>
##$VCLIST= <CCCCCCCCCCCCCCC>
##$VD= 0
##$VDLIST= <DDDDDDDDDDDDDDD>
##$VPLIST= <PPPPPPPPPPPPPPP>
##$VTLIST= <TTTTTTTTTTTTTTT>
##$WBST= 1024
##$WBSW= 4
##$XGAIN= (0..3)
0 0 0 0 
##$XL= 0
##$YL= 0
##$YMAX_a= 168305
##$YMIN_a= -318953
##$ZGOPTNS= <>
##$ZL1= 120
##$ZL2= 120
##$ZL3= 120
##$ZL4= 120
##$ABSF1= 15.85487
##$ABSF2= -2.196981
##$ABSG= 5
##$ABSL= 3
##$ALPHA= 0
##$AQORDER= 0
##$ASSFAC= 0
##$ASSFACI= 0
##$ASSFACX= 0
##$ASSWID= 0
##$AUNMP= <proc_1d>
##$AZFE= 0.1
##$AZFW= 0.1
##$BCFW= 0
##$BC_mod= 2
##$BYTORDP= 0
##$COROFFS= 0
##$CY= -3
##$DATMOD= 1
##$DC= 0
##$DFILT= <>
##$DTYPP= 0
##$F1P= 0
##$F2P= 0
##$FCOR= 1
##$FTSIZE= 16384
##$FT_mod= 6
##$GAMMA= 0
##$GB= 0
##$INTBC= 1
##$INTSCL= 3.70164e-10
##$ISEN= 128
##$LB= 0.24
##$LEV0= 0
##$LPBIN= 0
##$MAXI= 10000
##$MC2= 0
##$MEAN= 0
##$ME_mod= 0
##$MI= 1.114404
##$NCOEF= 0
##$NC_proc= -7
##$NLEV= 6
##$NOISF1= 3.799351
##$NOISF2= 2.8
##$NSP= 0
##$NTH_PI= 0
##$NZP= 0
##$OFFSET= 15.74028
##$PC= 1
##$PHC0= -18392.79
##$PHC1= 8.200699
##$PH_mod= 1
##$PKNL= yes
##$PPARMOD= 0
##$PSCAL= 0
##$PSIGN= 0
##$REVERSE= no
##$SF= 200.130006255948
##$SI= 16384
##$SIGF1= 3
##$SIGF2= 2
##$SINO= 5.538805
##$SIOLD= 16384
##$SREGLST= <1H.CDCl3>
##$SSB= 0
##$STSI= 16384
##$STSR= 0
##$SW_p= 3612.71676300578
##$SYMM= 0
##$S_DEV= 0
##$TDeff= 16384
##$TDoff= 0
##$TI= <>
##$TILT= no
##$TM1= 0
##$TM2= 0
##$TOPLEV= 0
##$USERP1= <user>
##$USERP2= <user>
##$USERP3= <user>
##$USERP4= <user>
##$USERP5= <user>
##$WDW= 1
##$XDIM= 16384
##$YMAX_p= 311816156
##$YMIN_p= -903141
$$ End of Bruker specific parameters
$$ ---------------------------------
##NTUPLES= NMR SPECTRUM
##VAR_NAME=  FREQUENCY,     SPECTRUM/REAL,   SPECTRUM/IMAG
##SYMBOL=    X,             R,               I
##VAR_TYPE=  INDEPENDENT,   DEPENDENT,       DEPENDENT
##VAR_FORM=  AFFN,          ASDF,            ASDF
##VAR_DIM=   16384,         16384,           16384
##UNITS=     HZ,            ARBITRARY UNITS, ARBITRARY UNITS
##FACTOR=    0.220516191357247, 1,           1
##FIRST=     3150.10236516349, 0,            0
##LAST=      -462.614397842291, 0,           0
##MIN=       -462.614397842291, -903141,     0
##MAX=       3150.10236516349, 311816156,    0
$$ Real data points
##PAGE= N=1
##DATA TABLE= (X++(R..R)), XYDATA
$$ [...]
9114 12919609 13113553 13346992 13453438 13576112 13934597 14467063 14626588 14887033 15109331
9105 15109331 15367269 15748071 16268335 16661800 17095842 17512457 17906981 18512315 19044481
9096 19044481 19614889 19948435 20429305 20920634 21543205 22224722 23037860 23735885 24525016
9087 24525016 25541003 26582359 27844759 29207387 30459875 32281253 34426899 36658753
9079 36658753 39053610 41802237 44631369 47823613 51323746 54899456 57492105 58901802
9071 58901802 60074028 62073042 65199050 68421113 71006138 71864061 70510716 68427209
9063 68427209 66451758 65395560 65551355 66591237 68371606 69615743 69671497 68837719 68872639
9054 68872639 69949620 71715977 73221516 73564586 72409933 70656570 69309576 68768729
9046 68768729 69281273 71201474 73850519 76760554 79661534 81942852 84148363 85946046
9038 85946046 87817380 89867022 92638846 96228659 99407319 101226992 101571535 101094740
9030 101094740 100273238 98954760 96671332 93006517 88866236 85162006 82589505 80611882
9022 80611882 79330417 79406500 80456270 81407549 81924762 81412141 80368349 79116082 77335422
9013 77335422 74552249 70625603 66037263 62181812 59413645 57453218 55897220 54798687
9005 54798687 53978904 53551074 53316144 52953241 52335738 51429492 50084530 48197271 46133117
8996 46133117 43877228 41680160 39382381 36841929 34283661 32462301 31015468 30116983
8988 30116983 29096288 28243781 27248445 26574058 26085153 25618038 24855200 24471143 23957147
8979 23957147 23553956 23204575 22857422 22473397 21909446 21633115 21579459 21369179 20839680 20647598
8969 20647598 20387104 20404812 20383840 19913966 19805409 19653111 19680049 19642172 19604176 19756689
8959 19756689 19567920 19810801 20082693 19848131 19741319 19689062 19756985 19820124 19768469 19670641
8949 19670641 19675090 19905278 19962869 20067220 20262542 20400580 20437513 20603363 20514020 20650762
8939 20650762 20827136 20924435 21235148 21325412 21396259 21652343 21833096 22082571 22401777 22442911
8929 22442911 22606312 22776535 22909599 23230597 23656552 24036509 24405231 24751682 25057671
8920 25057671 25509606 26037059 26669642 27085092 27357568 27956543 28496975 29053439 29536215
8911 29536215 29854918 30026258 30447049 30923176 31341422 31635829 32017371 32657845 32978494
8902 32978494 33380032 34075917 34600047 34873170 35510643 36287245 37067080 37887654 38891756
8893 38891756 39912234 40928475 42153317 43448480 44891780 46419426 48015298 49584300
8885 49584300 51171219 52755140 53844964 54770520 55663696 56631095 57436557 58383269 59093459
8876 59093459 60291565 61199548 62056449 62991325 63808326 64563664 65146708 66026120 66810207
8867 66810207 67471895 68102682 68582656 69340845 70469417 71710240 73102732 74742351 76731902
8858 76731902 78869475 81238111 83656467 86266657 89185045 92190788 94998231 97515010
8850 97515010 99655942 101469025 102033967 101415048 99874555 98942952 98820788 98854130 99299012
8841 99299012 99989923 100805001 101848307 102838269 104251490 105710677 107106168 108206448 109044439
8832 109044439 109933995 110137831 109507029 108117796 106912952 106087448 105897872 106103435 107256972
8823 107256972 108546266 110020093 111632119 113653510 116287399 119015891 121590680 123138581
8815 123138581 123374649 121975952 119418393 116863102 115731716 115221238 115450670 115681260 115806736
8806 115806736 116095932 117046212 118986850 121201367 123610703 126343474 129034581 131056513
8798 131056513 131794568 130290076 126732383 122124611 117346298 113299681 110455945 108418257
8790 108418257 106210700 103878124 101664378 99755244 98361354 97001104 95817681 95611605
8782 95611605 95934807 96196620 96301406 95636156 94047625 91802400 89202787 86617231 84575034
8773 84575034 83264295 82697233 82672830 83293063 83965303 84231020 84175987 84466039 85399016 86963271
8763 86963271 88153027 88424489 87678952 85278923 82007521 78502879 74715415 71583546
8755 71583546 69241333 67579185 66020561 64706756 63396304 62412212 61377335 60369890
8747 60369890 59534859 58810760 58278606 57593105 56861733 56580376 56185371 55952004 55880152 55524648
8737 55524648 54937993 54172345 53453825 52628055 52028658 51707191 51669288 51318352 50741782 50439523
8727 50439523 50259867 50191800 50289280 50212095 50645398 51052294 51438705 51714507 51866210 51994482
8717 51994482 52395357 52912224 53795782 55067887 56138068 56944762 57887804 59056846 60859705
8708 60859705 62670737 64453734 65538968 65911470 66347785 68434711 71731518 75252545
8700 75252545 77196403 75546363 70246091 64007908 59687640 56740150 54667615 53255223
8692 53255223 52220517 51882608 52188027 53030595 54111874 54936279 55374384 55757783 56800592
8683 56800592 58090432 58582270 57851341 56574550 55606075 55737254 56282275 56768309 56524080
8674 56524080 55493979 53606563 51162209 47991761 44972810 42700153 40871795 39467232
8666 39467232 38521006 38063398 37760754 37371286 36967730 36670665 36619925 36657812 37043817 36917513
8656 36917513 36787204 37012780 37593944 38787026 40489648 42396738 43947542 44847842 44414360
8647 44414360 43097427 40903639 38336346 36048998 34245466 33191570 32607492 31761868
8639 31761868 30658128 29357288 28093084 26689078 25532890 24715882 23398575 22226756
8631 22226756 21314403 20746527 20462798 20255826 19899868 19685812 19573891 19723179 19822443 19906525
8621 19906525 20084034 19909926 19856104 20103817 20060102 19851477 19806294 19183549 18194770 17593945
8611 17593945 16972233 16272344 15797015 14863682 14204588 13753847 13196064 12448596 11917883
8602 11917883 11660650 11571423 11092075 10888149 10767330 10357656 10277981 9712417 9349167 9165759
8592 9165759 9042942 8914226 8695313 8615723 8593439 8351028 8182275 8047967 7755004 7640717
8582 7640717 7581113 7380303 7371620 7398444 7251720 6905747 6871474 6618169 6654400 6716417 6353538
8571 6353538 6486962 6469558 6436651 6249865 6205862 6006165 5750505 5662728 5658533 5841078 5781533
8560 5781533 5699570 5747912 5665476 5663171 5672269 5797573 5661159 5368061 5182193 5217130 5335843
8549 5335843 5145607 5074179 5067478 4761721 4598828 4633047 4602091 4279033 4100343 4261441
8539 4261441 4201802 4050070 3945526 3994035 3779771 3646895 3887638 3713712 3647249 3458854
8529 3458854 3411832 3460848 3214379 3081745 3207849 3146887 3102095 3309350 3128706 2951140
8519 2951140 3042043 3249087 3117620 2863100 2693484 2916830 3038986 3223006 2924238 2855926
8509 2855926 2995873 2885848 2742131 2754507 2757669 2517630 2397950 2486630 2407580 2508851
8499 2508851 2543280 2442914 2509496 2287420 2262323 2510236 2682191 2566733 2526198 2430734
8489 2430734 2451244 2376521 2296117 1973308 1981544 1987478 1987778 2061341 1943071 1930760 1905170 1701775
8477 1701775 1668503 1827776 1789911 1703503 1550056 1799445 1870672 1926970 1889787 1802507 1783135
8466 1783135 1705541 1674295 1640919 1837777 1680458 1633726 1701676 1691838 1557952 1354998 1398236
8455 1398236 1484580 1566339 1584707 1436620 1382019 1398727 1255439 1387216 1391960 1263880 1111259
8444 1111259 1325454 1345907 1333433 1494213 1398479 1437216 1184510 1273435 1253173 1246293 1316708
8433 1316708 1089081 1122657 1090669 1034333 1206726 1220895 1129456 904515 851283 748194 875745
8422 875745 992681 1042076 957634 863105 901981 980275 861162 779249 858417 647214 567240
8411 567240 388726 544223 655115 631373 622826 668180 803699 843277 670200 534092 755158
8400 755158 689323 600871 527999 538787 595115 418648 389472 294396 381652 577202 638262
8389 638262 639805 584211 513009 672942 737717 640611 489325 358716 294196 415016 313517
8378 313517 458671 565732 453681 513895 272441 373376 496875 418884 351722 294031
8368 294031 240024 329607 325478 132773 301715 283961 162077 250544 308249 355856 194661
8357 194661 95099 191098 163679 139697 226142 114805 119003 167645 379763 363130 114841
8346 114841 245582 247196 -31989 57696 210202 218862 192475 124071 58649 221568 170143
8335 170143 -147 104611 150801 299544 126571 339851 442814 362127 86494 168473
8325 168473 311218 361258 228807 193821 173827 197108 94131 -32866 96096 47582 231859
8314 231859 269885 377060 250378 44169 195210 57096 -122273 29057 179464 193112
8304 193112 142828 196872 106225 10573 159223 255902 111999 -65999 62708 60818 -80501
8293 -80501 -101950 -1527 167148 64997 36064 7571 -20136 40578 3943 -135822 61866
8282 61866 -76229 -119830 -58703 54816 56075 186604 126255 127298 -2275 65448 109209
8271 109209 -106564 -130932 -145798 -186993 -320717 -300058 -248031 -227235 -57246 -15990 -178187
8260 -178187 37928 7389 -109409 -44878 -103822 -89803 -108146 -77922 -41123 -245012 -195749
8249 -195749 1579 89991 -58745 -218482 -80572 -103552 -289778 -269049 -283555 -7672
8239 -7672 -133915 -214514 -227868 -214108 -192227 -246208 -50738 -44644 -139095 -295320 -174115
8228 -174115 -89946 -121534 -90588 -53516 -30214 17078 28904 17307 -2188 -62593 -82574 41339
8216 41339 -44883 -233396 -198813 -84997 -352644 -252699 -228171 -384390 -298833 -353665 -364400
8205 -364400 -337754 -468899 -464633 -456429 -345989 -145372 -195672 -160082 -447357 -281876 -410565
8194 -410565 -351091 -903141 186878 938804 193752 113071 -158747 -64294 -275175 -217612
8184 -217612 -144161 -120739 -279375 -311218 -295253 -341784 -369525 102465 57316 -11078 58111
8173 58111 -74136 70108 80108 156532 27030 -144847 -86640 -57380 -283437 -266517 -307949
8162 -307949 -158420 -39331 53962 -89693 -326145 -328065 -466204 -531763 -450376 -294690 -244592
8151 -244592 -301849 -287559 14505 -40364 -135480 -171810 -326753 -264672 -108366 -294295 -186242
8140 -186242 -337284 -403825 -236006 -185037 -198298 -163997 -20903 -250745 -262517 -232365 -181458
8129 -181458 -323296 -510487 -245042 -197158 -257206 -319469 -109383 62319 -114453 -268255
8119 -268255 -414302 -103393 -81581 -77761 -224678 -351777 -228236 -132161 -259796 -328342 -215472
8108 -215472 -281743 -145334 -255183 -330880 -286287 -314316 -82327 -209774 -260964 -204003 -305472
8097 -305472 -388193 -288383 -351546 -520197 -283319 -235679 -237459 -196134 -352708 -346560 -383623
8086 -383623 -444042 -477460 -312643 -94059 36732 -85020 -13227 -185689 -185524 48201 -159082
8075 -159082 -256705 -155933 -259322 -331090 -190877 -286607 -348312 -439001 -247403 -233687 -259694
8064 -259694 -362372 -465118 -316948 -95040 -99393 -149639 -338571 -466998 -457146 -106835 -152327
8053 -152327 -142184 -94601 -64941 -186165 -154978 -111508 -421043 -422494 -423390 -362370 -416600 -257906
8041 -257906 -248062 -356091 -202405 -235235 -245217 -474238 -375010 -255781 -250406 -281506 -254957
8030 -254957 -259707 -219020 -255602 -317763 -270795 -370822 -318849 -406746 -216824 68087 12577
8019 12577 -178174 -274731 -436589 -270050 -332209 -311383 -307811 -410741 -310106 -134763 -126188
8008 -126188 7582 -100144 -119073 -187824 -201523 -184487 -267108 -338448 -425590 -234992 -180553
7997 -180553 -264243 -356330 -407912 -371642 -402459 -399334 -382526 -401167 -406457 -160016 -95697 -205553
7985 -205553 -271860 -240698 -111344 -278954 -249322 -144186 -223490 -367604 -466133 -443483 -134469
7974 -134469 -164034 -407823 -349591 -368913 -307819 -74534 -154223 -301578 -316220 -314013 -302148
7963 -302148 -235075 6021 -127586 -247660 -72251 -81880 70757 -134906 -183454 -74308
7953 -74308 -222720 -119331 -102881 -117402 -267129 -236068 -207956 32493 101334 -136739 -85589
7942 -85589 -154213 -218696 -46832 -61311 29136 -53184 -36874 158210 54315 20269 -133593
7931 -133593 -26485 156643 236598 224601 204249 -44217 -110113 -133660 -17672 81250 72843
7920 72843 147518 -34236 -102062 121516 -32572 -214377 -252754 -423579 -321794 -259816 -67065
7909 -67065 -77727 -156494 -124701 -33582 -190460 -80873 -50139 -97849 -46260 -68753 91600
7898 91600 116335 29337 -22687 10866 -2875 -220971 -277374 -92513 -241735 -39794 -131136
7887 -131136 -163947 -45104 151455 89082 -19130 -20991 102714 105700 36440 -42129 -130169
7876 -130169 -228339 -181529 -59974 97701 202175 245196 133044 130807 378301 346451 258083
7865 258083 137393 -3159 -143226 -91079 50076 -59010 55959 87360 82497 157707 319371
7854 319371 303659 119243 164284 71018 -34954 -51675 -159869 -350985 -38352 -219071
7844 -219071 -88125 -72685 76756 74347 -19918 -70213 -152054 -128306 -19532 168919 135644
7833 135644 267110 160701 213545 222369 94283 157756 122320 198318 293397 207842 130707
7822 130707 112987 217655 224141 190642 90961 -4519 -36392 9087 179792 -112868 -114405
7811 -114405 1381 296451 -283367 -352640 116315 -45676 57564 64802 -55943 -144494
7801 -144494 -107064 -20186 298491 160110 19095 7091 48863 159569 169377 196660 217905
7790 217905 156839 126888 91219 37232 93057 20656 191735 198307 71939 118150 242893
7779 242893 144092 -95756 -5182 40342 74797 154687 266045 113074 32548 74877 103425
7768 103425 189454 39744 77008 127871 104737 328695 195909 125706 55290 110555 275365
7757 275365 170905 109834 87868 107952 171817 -59044 -112128 -169288 -217847 -119500 -78847
7746 -78847 -41278 72130 109875 110590 25466 -39091 86905 110136 177833 186087 268796 331584
7734 331584 177498 -39388 -133391 -108305 114753 69452 -24696 -28060 2706 -48830 -116595
7723 -116595 21573 -171527 -65669 65502 132120 111276 -11794 17207 41773 23065 108676
7712 108676 113946 183731 221201 240308 200736 309752 221902 110064 122266 181650 321643
7701 321643 367555 214255 124739 127650 103905 132207 142706 141361 189917 466377 471665 251138
7689 251138 189949 128834 225274 259181 283784 472874 389568 244569 322659 348254 329144
7678 329144 434589 455202 517867 629453 267010 191615 337296 296051 223834 243445 506341
7667 506341 507231 482024 502805 653512 552131 310914 321070 477622 363224 376711 407623
7656 407623 354180 250822 350909 494497 481696 344394 297861 404645 574608 407004
7646 407004 345953 359232 306676 325213 377290 150333 81177 248976 517255 511619 407828
7635 407828 425033 459392 559700 565088 584720 558570 571543 512073 590069 475271 480992 524035
7623 524035 293646 420882 576482 459299 603901 481374 164667 273365 233724 312863
7613 312863 523974 535159 472577 430139 561657 466396 427042 577384 507228 442039 573471
7602 573471 583475 653230 675825 726912 639616 751485 879038 733918 866751 988058 1064700
7591 1064700 868786 729934 711378 797173 761977 852721 899418 982350 1054509 1220626 1344442
7580 1344442 1257132 1030847 1176392 1226888 1167600 1235853 1276187 1302918 1417257 1527126 1430191
7569 1430191 1445692 1303204 1142391 1225586 1420379 1397458 1530140 1609554 1611206 1511229 1671390
7558 1671390 1954609 2057596 1849950 1955412 2062369 2070897 2115421 2252295 2239044 2378964
7548 2378964 2309776 2127828 2102773 2123786 2171215 2317432 2386740 2459865 2714109 2589153 2470796
7537 2470796 2687595 2938934 3235990 3223028 3210609 3439650 3756907 3959476 4155246 4730784
7527 4730784 5273741 5788266 6192271 6668732 7212315 7814044 8394657 9098250 9855817 10059361
7517 10059361 9802981 9518375 9492569 9730626 9884180 9432167 9020662 8425227 7619648 7086202
7507 7086202 6607655 6110748 5622982 4918681 4533089 4078452 3777244 3401890 3187682 3120018
7497 3120018 2866671 2819137 2868662 2841978 2726140 2616037 2557851 2561926 2366318 2060731 1970215
7486 1970215 1926694 1910379 1910909 1887127 1936020 1726200 1603001 1747031 1495547 1384714 1415610
7475 1415610 1440770 1457728 1540194 1600070 1405403 1356477 1202977 1189931 1158847 1184882 1062716
7464 1062716 1155166 1101992 1115040 1141123 1089525 1151036 1083579 995086 1148294 819517 853358
7453 853358 861977 927256 895676 845215 690101 816566 807106 773174 1049591 943501 750305
7442 750305 610329 731282 641021 432979 580298 702330 754141 697366 706081 417719 454527
7431 454527 307431 356490 564308 544367 540535 675020 551684 522280 401150 219859 320028
7420 320028 546705 621014 310018 300512 321536 348039 335411 373859 350970 443744 489460
7409 489460 463809 179842 213547 353358 539655 583879 567046 390369 520797 610362 720700
7398 720700 660536 440987 465284 413750 467110 451983 359920 425828 232894 479436 482726
7387 482726 435298 529677 587622 478765 448525 595317 567809 379503 506265 582902 507556
7376 507556 630551 538157 479771 624785 586990 520512 419010 357424 342542 394646 435453
7365 435453 532922 402059 411686 312477 192860 281515 422582 603333 574222 504305 252741
7354 252741 219149 472342 413541 350383 537600 472355 542850 504629 584242 542222 411193
7343 411193 387315 280391 352625 298970 503143 651935 657378 788229 591214 611689 467720
7332 467720 368707 554903 523682 701239 839477 718873 706145 708799 588761 677259 681248
7321 681248 489705 661463 794319 829679 606855 664540 641399 644307 691802 575857 683190
7310 683190 671405 635296 899288 935719 792180 901545 825979 738677 780165 800686 884190
7299 884190 921038 846220 779189 676518 703927 863592 852643 642046 477487 688699 849608
7288 849608 724512 816634 930127 839956 754164 669393 670018 510159 681805 850692 906558
7277 906558 861643 679977 624780 716438 852163 934568 708040 532946 526201 638302 657004
7266 657004 540973 582896 521693 459685 468682 633276 774318 735598 759752 769042 800606
7255 800606 738833 688605 733444 843615 968550 1059983 1063722 1159105 988385 995238 1045326
7244 1045326 1112023 1006248 994557 987292 784342 854868 863002 986386 994544 961063 963493 935921
7232 935921 996935 1076483 944124 974217 1090748 1199223 1264802 1169310 1001387 948732 862321
7221 862321 945150 1224317 1356491 1342767 1255633 1271768 1351086 1425063 1395908 1172878 1364813
7210 1364813 1284072 1186052 1023991 1174856 1371816 1312475 1182615 1317554 1389460 1548594
7200 1548594 1622393 1584569 1425998 1704769 1651026 1708721 1877051 1753625 1866784 1801649
7190 1801649 1950577 1879562 1907449 1908324 1834996 1930056 1943818 2102442 2171116 2286387 2388373
7179 2388373 2397413 2232711 2530293 2635259 2465907 2365453 2550391 2779915 2847529 2980070
7169 2980070 2955085 2908762 3014379 3229620 3106878 3271250 3431800 3570881 3733178 3639718
7159 3639718 3726741 3693651 3837119 4037920 4101605 4186776 4149707 4215097 4313407 4453735 4465069
7148 4465069 4800015 4888609 4947204 5171328 5606248 5641245 6032519 6131835 6116064 6480131
7138 6480131 6976875 7105589 7417244 7620117 7990193 8339660 8792097 9112579 9470851 10018598
7128 10018598 10391247 10932448 11351382 11890354 12492362 13341690 14306571 15441118 16602086
7119 16602086 17917772 19449965 21179989 23205476 25727389 29112559 33411851 38668530
7111 38668530 44431767 50114854 54222841 55531567 53478199 48652753 42495316 36783356
7103 36783356 32280566 29094843 26810385 25447786 24309876 23186406 22200183 21458104
7095 21458104 20864845 20375234 20208005 19960519 19931565 20136131 20519385 21094960 21915316 22920367
7085 22920367 24574589 26634264 29309871 32805984 37256200 42772456 49283781 56159401
7077 56159401 62423056 65969069 65279715 60258888 52777092 44338218 37002215 30992892
7069 30992892 26504791 22903851 20183511 18058698 16325232 15022562 13775669 12715718
7061 12715718 11765689 11124747 10222822 9597499 8822625 8311169 7844053 7585503 7343610
7052 7343610 7028891 6762663 6460937 6191329 6054434 5950071 5946005 5777077 5493903 5428626
7042 5428626 4996916 4885067 4689236 4779188 4646395 4568560 4497019 4408747 4196033 4131113
7032 4131113 4139911 4204286 4129535 3977442 3896507 3836981 3956908 3903503 3807880 3811094 3778498
7021 3778498 3710943 3653340 3402267 3426321 3796147 3818876 3822560 3974790 4041224 4109144 4133103
7010 4133103 4150991 4533816 4760930 4984721 5392153 5655133 5976503 5966432 5946706 6074175
7000 6074175 5876494 5954601 5826711 5394272 5007794 4766930 4707101 4368040 4007837 3931599
6990 3931599 3801053 3517569 3472555 3305311 3268929 3526435 3454271 3393240 3411269 3221627
6980 3221627 3395527 3499572 3586408 3874898 3831338 3593555 3784929 3721261 3751731 3665566
6970 3665566 3765136 3706033 3599945 3341397 3246862 3392324 3074154 3076053 3081895 2849131 3009996
6959 3009996 3026828 3118993 3331859 3410926 3428756 3361160 3349442 3471546 3479647 3311437 3233196
6948 3233196 3362164 3242647 3417712 3628199 3596560 3588326 3576310 3646388 3746270 4066092 4157170
6937 4157170 4078867 4178610 4394507 4472736 4557591 4771827 5010697 5302570 5453541 5776845
6927 5776845 5944420 6228473 6668392 7001637 7213953 7452122 7579134 7739242 8024562 8284655
6917 8284655 8713383 9174469 9622577 10275101 10939712 11657063 12609350 13865599 15106468
6908 15106468 16903638 19003928 21709383 24830674 28853552 34107546 41063676 50266602
6900 50266602 60426156 67665687 66555508 56382052 43455450 34166315 27685970 23066718
6892 23066718 19690902 16831482 14561914 13072240 11726851 10838772 10007225 9106074 8305166
6883 8305166 7841498 7346405 6783269 6305433 5874022 5391544 5223842 5144357 4835658 4385326
6873 4385326 4215342 4198488 4019548 3903884 3722174 3673707 3607158 3320757 3110729 3042234
6863 3042234 3033487 2781801 2576347 2734265 2716681 2623837 2433098 2185059 2409008 2474922
6853 2474922 2298876 2240961 2180762 2158067 2014617 1937247 2048387 2058863 1853256 1897997 1899187
6842 1899187 1873031 1922976 1702635 1707325 1518608 1766863 1627355 1398921 1387894 1542017
6832 1542017 1403039 1394958 1395418 1342028 1533349 1494184 1392516 1614941 1645940 1485963 1415890
6821 1415890 1261087 1419137 1622392 1399377 1225453 1259975 1136495 1032956 1082460 1290708
6811 1290708 1320771 1374022 1096964 848194 946187 1186773 1154749 1219595 1271187 1478328 1333216
6800 1333216 1240825 1125004 1081197 1162727 1016787 989814 1072448 1191152 993099 890793
6790 890793 1160492 990198 973947 976216 974094 1051372 815836 970726 829829 870715 1243371
6779 1243371 1048167 1007448 1074582 1224932 1120945 1129179 956654 827128 761910 886860
6769 886860 877886 660521 837926 934335 863468 865920 660590 772187 975385 747285 730261
6758 730261 799394 839298 740478 796917 889876 929006 978829 952153 755567 711308 779441
6747 779441 860080 702668 746213 793966 772511 712422 656335 803614 772701 767424 738191
6736 738191 662877 714147 622513 379946 509552 632847 692390 646448 786198 1085504 1029851
6725 1029851 832144 867276 808006 764391 664681 613795 845525 977502 1030933 1112015 1121162
6714 1121162 1179049 1204213 995083 1022015 1155613 1207540 985727 1057151 1267179 1212287 1254869
6703 1254869 1229864 1076777 1260323 1315592 1099099 1153164 994416 1027296 1072877 941581
6693 941581 918272 944758 1013561 1139977 1310095 1327172 1200337 1131177 1196390 1269732 1123040
6682 1123040 1141333 1264427 1257583 1222897 1367475 1447421 1410938 1391641 1222146 1337273 1382332
6671 1382332 1091545 979723 964588 1041501 1040134 947620 932343 1142628 1248121 1147847 1157044
6660 1157044 1139403 1018300 888722 890911 943430 1066207 997071 996911 952626 1023629 1107112
6649 1107112 1035544 892061 1017519 1078486 1095201 1181411 831188 942765 1056425 902597
6639 902597 954010 1024424 1100339 961022 1180125 1124697 1092764 1086285 1297105 1232534 1185559
6628 1185559 1206303 911009 1189002 1118854 944371 1130061 1205748 1037399 825369 1106208
6618 1106208 1060420 1241658 1275808 1297554 1394381 1266365 1109181 1168964 1254769 1276633 1329130
6607 1329130 1145708 1288500 1478239 1342443 1204223 1277821 1439230 1594899 1635927 1564262
6597 1564262 1531685 1595454 1760150 1543889 1412515 1504445 1656234 1611929 1676536 1737720 1744149
6586 1744149 1958261 2005057 2269010 2328952 2348783 2226988 2355605 2087826 2136180 2284109
6576 2284109 2065958 1855300 1825978 1777687 1789628 1646502 1737901 1731409 1733981 1867326 2099091
6565 2099091 2105476 2059027 2174533 2283005 2334953 2510432 2670469 2827770 2956970 2922327
6555 2922327 3170285 3421656 3677324 3574619 3513381 3343358 3194869 2949130 2741378 2867647
6545 2867647 2733801 2675565 2615924 2558798 2498565 2596403 2662562 2643288 2578126 2486149 2658081
6534 2658081 2666851 2773920 2842344 3080640 3387611 3495194 3766863 4135190 4249125 4190373
6524 4190373 4030119 4097497 3791776 3448190 3292701 3055149 3190269 2914106 2752732 2648055
6514 2648055 2589816 2428660 2479590 2576236 2626572 2624695 2640945 2796022 2895181 2926335 2919632
6503 2919632 3104403 3198766 3253679 3188368 3448376 3583927 3772655 3830500 3726549 3581141
6493 3581141 3299245 3092995 2881729 2610585 2493619 2232407 2089227 2101834 2043807 2192734
6483 2192734 2387077 2149116 2284912 2415235 2259335 2373738 2373444 2356452 2192645 2372202
6473 2372202 2434262 2478638 2478530 2437801 2598627 2613285 2251997 2244322 2231444 2143000 2239780 2237459
6461 2237459 1937952 1736131 1791321 1676522 1589241 1602963 1776610 1746485 1878311 1777251
6451 1777251 1910424 2140775 2086719 1908715 1773258 1867011 1922811 2064047 2175935 2078780
6441 2078780 1914791 1953216 1988898 2050880 2052785 1872141 1868390 1588351 1498647 1588875 1617491
6430 1617491 1943492 2016359 1946714 1685006 1576168 1854976 1970399 1952754 1957096 1992610 1847762
6419 1847762 1844034 1807639 1828169 1995789 1862142 1703123 1732556 1616669 1809682 1901502 1971390
6408 1971390 1883812 1858097 1882723 1816923 1776126 1774300 1952666 1918280 1663189 1578177 1926332
6397 1926332 1910882 1868433 1818525 1940479 1998470 1887816 1699291 1821980 1941238 1942043 2065584
6386 2065584 1967169 1908599 2006900 1925173 2170577 2318102 2004235 1977814 1941401 1879631 1913567
6375 1913567 2161430 2205219 2246992 2068946 2114510 2305561 2438203 2438727 2295878 2184606 2075071
6364 2075071 2297971 2401469 2288924 2147779 2323849 2460799 2378882 2330251 2294528 2263742
6354 2263742 2301288 2229700 2159966 2462083 2504142 2192132 2346734 2433727 2517271 2672178 2653895
6343 2653895 2561185 2647338 2593288 2438159 2462048 2757387 2617549 2643505 2553037 2338340 2473278
6332 2473278 2565708 2679344 2611581 2698380 2811912 2869398 2795270 2707142 2642476 2722130 2913055
6321 2913055 3023329 3127646 3126810 3202840 3036721 3119909 3036034 2770510 3012015 2917118 3003234
6310 3003234 2925817 2883704 2785532 2869343 2876754 2985523 3002517 2931211 2932987 3014629 3058510 3086848
6298 3086848 3089612 2896441 2974195 3065897 3172619 3137050 3272816 3632786 3734877 3634732
6288 3634732 3581128 3737814 3883331 3784793 3843247 3833836 3883616 3862039 3735591 3962879 4164480
6277 4164480 4131940 4136380 4054459 4295061 4447441 4432011 4444796 4525515 4651910 4806787 5051161
6266 5051161 5031837 4966113 5007112 5093089 5290881 5489819 5735350 5988414 6160015 6217749
6256 6217749 6144836 6166678 6275163 6627407 6775763 6743578 6887504 6865670 7147285 7514035
6246 7514035 7807895 7899051 8037836 8346066 8678597 8983497 9323547 9694725 9980830 10437873
6236 10437873 10906050 11313867 11868182 12608882 13322701 13917350 14824606 15909476 16918605
6227 16918605 18207123 19956542 21896000 24035772 26643781 28982947 30644350 31024055
6219 31024055 30564727 29481709 28187423 27253979 26723475 26911711 27555316 28766490 30380425
6210 30380425 32367637 34367066 36024333 36941945 37645586 38291657 39130519 40228927 41053541
6201 41053541 41006397 39989342 38238525 36494006 35196033 34258958 34513641 35134905 35956096
6192 35956096 36743571 36771430 35927792 34983780 33982854 33698636 34242625 35327835 37104666
6183 37104666 39398359 41273305 41876334 40436361 37071291 32849952 29136290 25787460
6175 25787460 22938386 21117480 19708413 18583251 17467544 16765968 16138117 15274830 14547180
6166 14547180 13981128 13288597 12652156 12126762 11809247 11414995 11088815 10823584 10536392
6157 10536392 10206685 10125615 9954767 9902190 9756390 9450766 9426291 9229981 9208129 9223301
6147 9223301 9363759 9250285 9027383 9226746 9158710 9187874 9252931 9037961 9065719 8966469
6137 8966469 8930103 8938315 8832520 8857648 9202697 9348329 9554010 9625731 9485615 9606638
6127 9606638 9813861 9993010 10064223 10243588 10522328 10973781 10878596 10878131 11010284 11192749
6117 11192749 11538460 11784941 12049360 12309169 12324086 12393419 12741504 12771680 13029072 13075637
6107 13075637 13339996 13640496 13855751 14408585 14687801 14897911 15185230 15508365 15926865
6098 15926865 16587925 17274845 17900853 18456498 18951109 19340811 19877418 20463320 20987913
6089 20987913 21442742 22052781 22805035 23402529 23942251 24498072 25241450 25951078 26555762
6080 26555762 27134279 27832300 28489801 29141205 30230927 31405816 32272425 32744074 33157259
6071 33157259 33357316 33294296 33264969 33681634 34472326 35430521 36563632 37608225 38668410
6062 38668410 39540517 39706251 39571618 38948602 38071543 37536787 37395099 37669222 37765092 37924376
6052 37924376 37703012 37665661 37611639 38005295 38329521 39091560 40188058 41260966 42606773
6043 42606773 43733560 44863252 45791515 47094798 48987158 51456271 54525576 58428796
6035 58428796 62735594 67500715 71888945 75845404 78504250 78797718 76206945 71305348
6027 71305348 66028925 61602539 58530320 56868671 56061729 56007909 56350569 56357841 55798802
6018 55798802 54668926 53115162 52253963 52223420 52607550 54002665 56009350 57916844 59055587
6009 59055587 59440288 58889748 57651211 56635111 56154292 55908709 55531071 54470738 53067260
6000 53067260 51946857 50788431 49877289 48913262 48156459 47620372 47639881 47838005 48272988
5991 48272988 48148731 47146865 45290167 42689785 40055690 37754294 35548555 33863208
5983 33863208 32290371 30678186 29627727 28521744 27516339 26729545 26180302 25629009 25135217
5974 25135217 24663628 24165032 23705152 23239341 23150207 22936971 22650129 22414435 22143479 21975189
5964 21975189 21546588 21194132 20884772 20468920 20377127 20251121 20130838 20218629 20065474 20064033
5954 20064033 20039310 20267848 20057067 19967326 19844759 19992732 20068999 20273537 20320928 20674841
5944 20674841 21293780 21533880 21932497 22582206 23307099 23704510 23806316 23778126 23636805 23190210
5934 23190210 22819941 22926208 22925605 23154086 23162954 23426340 23749582 24068022 24198333 24172207
5924 24172207 24233009 24550962 24977775 24931596 25135830 25096710 25077422 25007590 25040038 25036436 25167240
5913 25167240 25457207 25976130 26343650 27025674 27808430 28744304 29787490 30852365 31624069
5904 31624069 32016662 31548302 30738323 30516519 30550704 31010156 31049703 31261148 30998374 30330936
5894 30330936 29494987 29137854 29240272 29280601 29383602 29713545 30212319 30980690 32102712
5885 32102712 33542116 35089844 37011031 39158359 41879759 45307377 48999662 52554036
5877 52554036 55485817 57372285 58036054 57908621 57016804 55963367 54608994 53523683 52534754
5868 52534754 52070033 51917206 51899553 52335648 53562591 55286259 57773491 61100464 65155212
5859 65155212 69126967 72370982 74039206 73866493 72143215 69825458 68035252 66506914
5851 66506914 64877870 62784270 60280106 57789534 55881738 54985125 54638573 54937824 55854782
5842 55854782 57187265 58952838 60846510 63164409 65671230 68601803 71623503 73139357
5834 73139357 72174422 68630384 63824721 58789351 54279510 50881691 47850941 45746759
5826 45746759 44161109 42859859 41511556 40321126 39658221 38956119 38704473 38667917 38821648
5817 38821648 38925153 38890608 38343727 37438932 36614625 35920643 35247143 34792682 34438803 34187857
5807 34187857 34116072 33758071 33410126 33314476 33361510 33633678 33959265 34593790 35173713 35782830
5797 35782830 35998380 36119535 35678641 34679185 33566993 32173438 30858566 30056635 29284042
5788 29284042 28357824 27802581 27484628 27443304 27465387 27788085 27906762 27992482 28328283 28572257
5778 28572257 28773271 29061456 29087838 29003007 28692768 28442703 28024354 27458573 26799911 25961554
5768 25961554 25176017 24465924 24249449 23986824 23849317 23592323 23395859 23391519 23465087 23417876
5758 23417876 23417669 23285289 22985135 22802657 22558163 22328369 22182886 22098652 21888930 21880177
5748 21880177 21829532 21807121 21664170 21606728 21422447 21389348 21170301 21319043 21386039 21280124
5738 21280124 21209969 21307082 21229286 21412651 21426240 21347150 21523170 21689980 21886955 22105773
5728 22105773 22040149 22329457 22496992 22846253 23067238 23315320 23655358 24009894 24393701 24641172
5718 24641172 25285685 26005531 26669642 27144052 27702906 28025672 27927611 27992587 27837296 27437587
5708 27437587 27029148 26759032 26276299 25969432 25756075 25764577 25959924 25837730 25989731 26428321
5698 26428321 27162078 27439200 28121501 28692168 29155348 29552258 29929584 30072186 30233587
5689 30233587 30125919 29794398 29477036 29072090 28714232 28518293 28380619 28226864 28080028
5680 28080028 28341076 28470821 28444732 28720639 28967857 28940112 28852290 29128926 29280631 29382580
5670 29382580 29663163 29743199 30000258 30183438 30411223 30843985 31221490 31777785 32661773 33507404
5660 33507404 34691895 35679383 36708984 37580650 38724615 40151974 42129814 44359363
5652 44359363 47093859 50100386 53596924 57282523 60321429 62351916 62423867 60896024
5644 60896024 58276934 55371903 53167954 51754288 50488674 49733773 49215040 49068701 49263204
5635 49263204 49835509 50864816 52556533 54820845 57385345 59672409 61761965 63638864
5627 63638864 65078005 66683874 67419380 66598138 64565231 60763243 56403496 52170350
5619 52170350 48439419 45503635 43450213 42007828 41051118 40469907 39931073 39789708 39947932
5610 39947932 40294753 41162040 42255131 43723021 45027419 45372406 44744103 42943985 40290952
5601 40290952 37509230 34808394 32455613 30295214 28494379 27129660 25919486 24898246
5593 24898246 24130591 23370122 22685581 22119178 21624579 21192647 20820749 20400211 20142887
5584 20142887 20104727 19990359 19851795 19809699 19610559 19458562 19640756 19556743 19501048 19725303
5574 19725303 19797732 19800791 20024100 20345853 20684770 20971340 21280921 21483584 21141070 20599893
5564 20599893 20132304 19459356 19140416 18909798 18783278 18783722 18816095 18843209 19003367 18889446
5554 18889446 19048615 19232461 19334027 19338220 19383288 19606723 19611759 19965103 20236524 20281285
5544 20281285 20109250 19620161 19177131 19137199 18908077 18463352 18226348 17762375 17204099 17180081
5534 17180081 16979039 16976709 16763376 16842124 17192839 17555411 17812648 18245941 18828298 19032317
5524 19032317 19190431 19404113 19252520 18863154 18655880 18602781 18616175 18377058 18227157 17920900
5514 17920900 17491861 17207974 16835065 16855853 16969328 16898154 17040777 17191729 17565128 17534091
5504 17534091 17555807 18012367 18370163 18653720 19144598 19573868 20083353 20675976 21093461 21430675
5494 21430675 21369601 21573566 21648090 21643060 21620929 21694331 22075481 22249125 22134919 21995733
5484 21995733 21824424 21472774 21209295 20830459 20666566 20480972 20404881 20401602 20237925 20303617
5474 20303617 20393557 20117003 19785094 19487875 18982057 18570525 18373565 17871518 17680957 17690445
5464 17690445 17688228 17678720 17571687 17832043 18011227 18296699 18643682 18794195 19094447 19016846
5454 19016846 18519436 18192002 17735683 17124435 16732026 16478808 16021813 15485999 15368500
5445 15368500 15297128 15161571 15033376 14655958 14351928 14161270 14005534 14135202 13966499 13658012
5435 13658012 13632079 13516583 13390954 13428622 13218300 13024122 12989772 13125374 12972153 12916778
5425 12916778 12884242 12457828 12270257 12261343 12297401 12197987 11892777 11653731 11428952 11332217
5415 11332217 11069746 10722732 10676005 10642960 10390990 10430764 10347908 10402286 10383945 10365732 10491111
5404 10491111 10299002 10225482 10152697 10264915 10063300 9958559 9803691 9766893 9591870 9623433
5394 9623433 9673219 9523959 9361282 9263491 9072240 9191632 9097890 9263964 9304310 9137376
5384 9137376 9059252 8866106 8985739 8849949 8793056 8959965 8652568 8645962 8744846 8574443
5374 8574443 8596134 8374017 8344385 8291093 8334703 8434453 8226138 8228654 8222927 8264390 8221580
5363 8221580 8101230 8085681 8061151 7988870 7923559 8104332 8016354 7971013 7830972 7865960 7980628
5352 7980628 7968920 8006995 7975359 7747416 7540102 7447302 7589340 7493106 7489941 7488612 7569070
5341 7569070 7717023 7701137 7856871 7938882 7921763 7934579 7916057 7906258 8034816 7903921 7792141
5330 7792141 7779330 7838154 7879530 7801270 8005921 7951059 7866777 7705914 7753647 7663457 7590892
5319 7590892 7725511 7787756 7703824 7594495 7372892 7617088 7770334 7703376 7952379 7768812
5309 7768812 7857739 8056454 8003265 7992807 7855627 7681073 7839120 8094001 8030032 7922599
5299 7922599 7887322 7902295 7788276 7853287 7851660 7887315 7778330 7676710 7497640 7514840 7871050
5288 7871050 7760240 7563803 7610698 7466205 7488461 7472161 7334333 7341967 7148248 7350540
5278 7350540 7183601 7198914 7130425 7097539 6956750 7001440 6823258 6678880 6705989 6776291 6640992
5267 6640992 6771548 6735577 6793780 6713367 6545758 6492012 6396632 6544394 6591836 6689095 6679430
5256 6679430 6632931 6608904 6456544 6539994 6733090 6757751 6672080 6763425 6996851 6970430 7024423
5245 7024423 7016642 7039814 7187894 6956930 6926071 6947653 6804682 6530545 6700767 6683218 6687170
5234 6687170 6704741 6542967 6891115 6906680 6931313 7066135 7113836 7379891 7649656 7762421
5224 7762421 7886800 7974049 8044765 8039929 8074717 7888403 7849671 7715210 7598633 7273284 7124571
5213 7124571 6876493 6914300 6980435 6970549 7191303 7160258 7027615 6943087 6992737 7467408 7532181
5202 7532181 7547486 7550551 7506975 7506427 7387545 7164820 7048137 6764497 6654384 6609450 6389124
5191 6389124 6127893 6242885 6076847 5912951 5883966 6052980 6201827 6118417 5874339 5780529
5181 5780529 5685366 5594506 5717993 5728414 5718674 5834669 5628546 5467227 5714574 5612562
5171 5612562 5547181 5533966 5528706 5447559 5490008 5340248 5436002 5531879 5671894 5474389 5457548
5160 5457548 5427648 5452529 5594148 5273152 5109486 5317560 5330422 4918711 4831514 5021898
5150 5021898 4776272 4566784 4591551 4722788 4904089 4835042 4636013 4626493 4556120 4395161
5140 4395161 4541455 4638314 4862782 4855685 4752667 4893299 4621464 4492117 4687937 4821624
5130 4821624 4825352 5035861 4842056 5003257 4963813 4893366 4834349 5193553 4951226 5073765
5120 5073765 5165002 4933637 4940291 4781095 4914514 4727429 4605117 4471921 4576930 4637139
5110 4637139 4605609 4568426 4459559 4347477 4547940 4349820 4357723 4347722 4261269 4194801 4169740
5099 4169740 4259635 4212962 4146379 4234149 4227647 4237469 4175239 4182712 4238182 4220594 4121835 3932359
5087 3932359 3880326 3958077 3892667 3790226 3790686 3869057 4005262 4005090 3965861 4269046 4169517 3979612
5075 3979612 4055140 3988751 3993929 4023561 4215391 4132243 3922170 4000225 4086205 4126203 4236151
5064 4236151 4208320 4188312 4161475 4109438 4196750 4158631 4177138 4436429 4415760 4441938 4480563
5053 4480563 4276211 4167488 4137015 4029471 4315140 4310164 4304505 4430700 4327214 4120200
5043 4120200 4115347 4345551 4529286 4644952 4669891 4799088 4845801 4976484 4970609 4811290 4531356
5032 4531356 4280874 4269715 4331155 4363213 4565341 4475095 4398561 4383161 4270543 3979538 4192358
5021 4192358 4374138 4294165 4202758 3969068 3913881 4215627 4346872 4377925 4170072 4286632
5011 4286632 4124507 4100993 4069036 4102006 4171514 4209102 4331655 4227929 4226132 4159301 4199415
5000 4199415 4295839 4244306 4158343 4147825 4267167 4355312 4329826 4321899 4167490 4287436 4184789
4989 4184789 4160263 4113640 4355824 4405632 4442481 4532942 4609013 4478270 4515810 4671447 4918150
4978 4918150 4964044 4960842 5020469 4935845 4778353 4679360 4724839 4874384 4859051 4828010 4764833
4967 4764833 5001686 4895519 4738609 4878588 4922226 5056297 5044891 4783687 4798828 4946710
4957 4946710 4930305 4771364 4810410 4774323 4617123 4680065 4706393 4652888 4724591 4802630 4665348
4946 4665348 4763983 4953606 4889928 4881323 5028029 5173539 5056237 4943346 5069621 4931117
4936 4931117 5067660 5258835 5270683 5321449 5500678 5539144 5587941 5730465 5691983 5767347 5709904
4925 5709904 5763624 6016798 6239576 6297809 6353491 6733556 6681908 6542098 6320371 6356361
4915 6356361 6522691 6483672 6516948 6613713 6566235 6554671 6504413 6720827 7054917 7093686 7064591
4904 7064591 7218764 7264125 7399314 7611018 7732053 7949480 7959967 7979469 8169613 8309083
4894 8309083 8179166 8316966 8272094 8425706 8536751 8549650 8681158 8858874 8936980 8980211
4884 8980211 8977415 9053486 9240862 9494060 9755193 9872975 10134542 10378742 10695795 11091502
4874 11091502 11454133 11924530 12750938 13439155 13858793 14180492 14474363 14573444 14853053 14767495
4864 14767495 14927525 15026830 15078343 15125018 15335818 15447300 15602838 15794547 16070954 16424016
4854 16424016 16891211 17011979 17285567 17579903 18067957 18677978 19244363 19620059 20129241
4845 20129241 20476717 20296079 19975092 19584314 19216265 18869033 18960238 19047782 19414589 19733223
4835 19733223 20018635 20252296 20743095 21204905 21670088 22233179 22674306 23199804 23634710
4826 23634710 24217220 25002882 25594604 26533313 27642544 29043384 30562886 32199907 34240649
4817 34240649 36768921 39421131 42167447 45435914 49325936 53677775 59207166 66152729
4809 66152729 74474727 82340697 86615771 85766105 80693341 75505738 71577588 68464393
4801 68464393 66690871 66895976 69115323 72963275 77725467 82321613 86047623 88986533
4793 88986533 90694047 88226515 80930605 70498532 61380305 55052394 50501520 47083813
4785 47083813 44362361 42657163 41593379 41035031 41067572 41099130 41316546 41317817 41178736 40624422
4775 40624422 39836114 39182141 38773811 38606173 38880676 39368642 40233207 41266981 42858264
4766 42858264 44993378 47664003 50729942 53994365 56485018 57328509 56500760 54514642
4758 54514642 52776302 52050344 52050750 52689352 53907731 55844004 58655754 61809875 65373420
4749 65373420 68277986 69942422 70995969 72559010 75211673 78735541 83043838 87371640
4741 87371640 90255152 89792101 85687260 80635269 77560908 76198906 76125013 77761207 80877573
4732 80877573 85363904 91130328 98380769 106949278 117969185 133282412 153683407 177786102
4724 177786102 198931251 205074677 191011478 162258947 135470849 116605632 103412111
4717 103412111 93890161 86975741 81966711 78088400 74667492 70570704 66025850 61355547
4709 61355547 57096396 53418820 50358126 47738076 45057749 42244530 39892264 38177361
4701 38177361 36688632 35681488 34707780 33665178 33016712 32538709 32118830 31891295 31776481
4692 31776481 31717583 31653874 31524063 31498580 31462955 31974369 32235063 32687782 32707275 32760001
4682 32760001 32890624 32864776 32749246 32064547 31177502 30232611 29184853 28280198 27619146
4673 27619146 27234333 26988856 26972034 26834585 26512482 26288556 26233122 26451863 26990478 27562479
4663 27562479 28276261 29004449 29021508 28729627 28457082 27823666 26950634 26110760 25542014 25223542
4653 25223542 25502089 26010537 26575136 27294499 27654794 27987184 28210643 28199018 29045614 30101943
4643 30101943 31151735 32045645 32233088 31746796 30037821 28358052 27107807 26218578 25441450
4634 25441450 24715556 23945544 23420528 22610406 21831020 21333010 20602314 20240506 19947925
4625 19947925 19738675 19426955 19253779 19314321 19347903 19462310 19612574 19665624 19758404 19808289
4615 19808289 19605540 19296252 18821552 18328428 17529696 17154592 16997783 16844623 16878932 16868371
4605 16868371 17124819 17307176 17507194 17788242 18025653 17986511 17718298 17600158 17808765 18021677
4595 18021677 18725073 19314666 19732187 20291686 20434531 20009915 19255912 18500961 17681799
4586 17681799 16865378 16303714 15893067 15469017 15098292 15340971 15176299 14846032 14440163
4577 14440163 14119904 13847544 13624663 13435839 13369361 13443156 13354613 13411462 13269102 13367639
4567 13367639 13188468 13065715 13288437 13374769 13518436 13527968 13538341 13471457 13441332 13186733
4557 13186733 13087500 13145640 12927749 12893249 12897996 12821781 12798480 12799908 12792015 12849886 12859116 13171518
4545 13171518 12908237 12958507 13231481 13472066 13654906 13932412 14200376 14319152 14706021 14859439
4535 14859439 15004779 15131862 15057361 15012183 14871057 14586110 14472725 14256954 14375717 14199336
4525 14199336 14176716 14286680 14282396 14275010 14283375 14191766 14184821 14357762 14522021 14622891 14830323
4514 14830323 15336192 15430962 15380153 15595175 15940018 16462344 16992758 17581564 18127629 18478819
4504 18478819 18868721 18970905 19006369 18700506 18292858 18051460 17662337 17239628 16717566 16391792
4494 16391792 16242051 16002909 15802673 15797802 15778831 15588569 15693637 15567397 15515573 15407361
4484 15407361 15355024 15221488 15100351 15410920 15643514 15645157 15737534 15933371 16137420 16237062
4474 16237062 16234856 16151227 15964802 15882896 15839502 15545556 15279087 15030403 14901223 14915304
4464 14915304 14833373 14872531 14887535 14663380 14523225 14665180 14701980 14784955 15039977 15052772
4454 15052772 15284155 15503425 15539589 15797414 16072333 16050334 16214082 16478919 16922297 17236211
4444 17236211 17288632 17428685 17757516 17846570 17832533 18168468 18273138 18365282 18527007 18490686
4434 18490686 18361773 18308873 18245628 18081541 18141275 18304514 18413214 18584180 18702093 18893817
4424 18893817 18837785 19066368 19105901 19200043 19378508 19475807 19744112 19838457 19946735 20057956
4414 20057956 20332861 20480090 20894491 21199495 21739096 22325018 22758717 23379917 23757232
4405 23757232 24346164 24610563 25165487 25690896 26335851 27147596 28115872 29050288 29967489
4396 29967489 31080630 32393606 33763699 35371482 37371606 39357640 41678615 44302503
4388 44302503 46983105 48877459 49248969 48377860 47297224 46870200 46796422 46538661 45331935
4379 45331935 42658042 39202569 36094287 33501637 31278694 29533054 28003023 26748912
4371 26748912 25457432 24455437 23665866 23006394 22820369 22170380 21578916 21028098 20559386
4362 20559386 20149463 19970463 20033593 19785005 19479303 19205631 19121073 18907371 18706669 18509589
4352 18509589 18536608 18625816 18651274 18560387 18501992 18540613 18660156 18796151 18840132 18983206 19174658
4341 19174658 19066435 18904778 19055490 18965170 18646607 18624938 18958941 19004964 19032227 19133452
4331 19133452 19463763 19576498 19694711 19768185 19878144 20318751 20618473 20848644 21193553 21532661
4321 21532661 21930304 22288453 22634023 22799766 22898750 23087785 23108967 23462047 23954450 24296243
4311 24296243 24231762 23855292 23305647 22880099 22697102 22524028 22299178 22069264 21962615 21898514
4301 21898514 21848712 22023013 22259759 22575749 22933083 22966739 23134253 23590202 24211710 24857145
4291 24857145 25547410 26116899 26766096 27738818 28826911 30107929 31401256 33243457 34982548
4282 34982548 37263673 40120866 43394758 47255525 51046194 53704064 54035530 51591105
4274 51591105 47540060 43246618 39823113 37310746 35347831 34012097 33098385 32089803
4266 32089803 31150928 30347394 29641773 28928680 28246425 27676561 27310263 27044798 26924218
4257 26924218 27030191 27048327 27146602 27290563 27634004 27827360 27971131 28250157 28985604 29510506
4247 29510506 29818737 30346574 30939926 31227658 31303406 31103941 30829598 30701969 30454987 30410373
4237 30410373 30473176 30555018 30583176 30409084 30645985 31097446 31218476 31425224 32028816 32589777
4227 32589777 33144306 33821054 34686699 35572923 36565439 37530382 38282031 38583141 38350597
4218 38350597 38298247 38149264 38270358 38278488 38439478 38847832 39488615 39758381 40245142 40694040
4208 40694040 41317330 42188323 43048333 43933023 45064236 46220095 47567283 48940449 50143570
4199 50143570 51447010 52466842 53672132 54995646 56441042 57751839 59386665 60971214
4191 60971214 62069714 62899154 63988787 64900280 65661234 66263793 66688568 67412423 68493778
4182 68493778 69635783 71196834 72660051 73778873 75081536 76990700 79159478 81664798
4174 81664798 84673855 87848416 91367555 95400763 100044424 105364098 111415252 118611241
4166 118611241 127180057 136910569 148551315 162576316 179587111 200336306 224801140
4159 224801140 249975838 270447825 280416051 279529676 273747850 270217820 274608096 286528754
4151 286528754 301594493 311816156 309374533 291516363 265240577 238898451 219430655
4144 219430655 205580595 192682695 179139873 165284446 153548911 143548122 133775331
4137 133775331 123553202 113770723 105473576 98903635 93367111 88526863 84676760 81322133
4129 81322133 78587363 76469980 74942935 73781471 72763494 72169534 72008059 72258462 72929020
4120 72929020 74072459 75078238 74554106 72338445 68971808 65114828 61729617 58838724
4112 58838724 56722586 54744020 53151493 52063140 51347653 50746331 50373889 49861813 49845462
4103 49845462 49866162 50009330 50197587 50337463 49921080 49392437 48786278 48209011 47297610 46143477
4093 46143477 45095841 44664470 44113128 43553709 43336159 43018526 42976510 43138630 43399494
4084 43399494 43421557 43063294 42263095 41439869 40647178 39770977 38957814 38399664 38020606 37707151
4074 37707151 37199876 37245852 36948820 36558187 36220616 35608774 34822154 34201112 33614556 32976126
4064 32976126 32685067 32314908 31983291 31859668 31727702 31600844 31171699 30682711 30067826
4055 30067826 29372873 28717600 28111662 27550878 27107624 26923890 26686125 26235478 25826215
4046 25826215 25702138 25954551 26007809 25920629 26154161 26487890 26648465 26631718 26452255 25905995
4036 25905995 25199684 24765771 24467360 23913071 23531337 23137291 22856898 22713811 22438533
4027 22438533 22052507 21923806 21686305 21370470 20923974 20737723 20425565 20094540 19838986
4018 19838986 19643967 19629797 19394357 19221850 19174650 18947014 18933496 18999682 18781122 18921910
4008 18921910 18973981 19015283 19095856 19043316 19227470 19519021 20004818 20260545 20547481 20625264
3998 20625264 20590790 20246443 19914379 19779909 19425698 19162577 18888389 18690911 18199100 17989643
3988 17989643 17613152 17257936 17039555 16924769 16766154 16480369 16523052 16598174 16497519 16519519
3978 16519519 16516287 16555470 16753386 16907914 16800343 16866320 16876677 16676575 16705886 16834263
3968 16834263 16528685 16179498 16078331 16159608 15980065 16142138 16262694 16104365 15952136 16087825
3958 16087825 16279135 16289772 16244987 16054473 15942013 16043247 16154251 16263136 16191189 16062402
3948 16062402 16173505 16280180 16335103 16134388 16079766 15832700 15737981 15551254 15447576 15555604
3938 15555604 15673182 15803178 15639392 15321844 15136118 14784033 14289514 13824993 13501182
3929 13501182 13174925 12844106 12849761 12812593 12549003 12314988 12309010 12218522 11889342 11906195 11975725
3918 11975725 11986712 12041131 11772324 11682647 11636001 11490060 11415007 11502418 11466664 11565743 11625606
3907 11625606 11510480 11383720 11433828 11574112 11709448 11631427 11521227 11898168 12173102 12243357
3897 12243357 12156302 11889879 11298883 10981445 10685435 10398567 10165491 9830947 9651756 9451018
3887 9451018 9301929 9243739 9082768 9062297 9071258 9028200 8964978 9014188 8868984 8738255 8768492
3876 8768492 8756345 8838390 8721727 8654590 8643015 8779327 8845584 8989123 9217716 9067526
3866 9067526 8900706 8800009 8696274 8633178 8379310 8454412 8556672 8403598 8440208 8272727
3856 8272727 8060349 7889626 7762704 7777727 7636596 7648645 7512966 7282444 7133553 7121529
3846 7121529 7163385 6956376 6867822 6857683 6997278 6999809 6921410 6962053 7003745 6944417 6791668
3835 6791668 6860831 6747614 6519260 6180233 6120499 6054822 6019978 6073505 5855257 5862217 5724198
3824 5724198 5521749 5467354 5545276 5402871 5335419 5392652 5325406 5273767 5442656 5149902 4945686
3813 4945686 4936307 4922927 4853047 4803054 4642321 4549064 4475241 4580408 4628514 4567233 4574084
3802 4574084 4513623 4575232 4477116 4422945 4413640 4422267 4284173 4291825 4413128 4308494 4243245
3791 4243245 4220457 4253367 4231528 4231166 4307559 4156002 3930542 4117885 4180679 3979987 3901749
3780 3901749 3746112 3878779 4030230 3995034 3908985 3932656 3932641 3942695 4095733 4269865 4172699
3769 4172699 4086227 4023136 3994375 3936839 3955258 4032240 3907983 3876308 4004456 3902929 3999012
3758 3999012 4193318 4228651 4034213 4018674 4057796 4276237 4447710 4436148 4404869 4270704
3748 4270704 4138514 4118723 4184182 4096132 3994317 3906748 3897402 3778839 3884001 4280218 4350224
3737 4350224 4255204 4435987 4403665 4466981 4478410 4377662 4465216 4357148 4342933 4379731 4252553
3726 4252553 4127788 4181719 4055054 4166287 4457168 4423126 4164426 4153327 4294483 4304692
3716 4304692 4427218 4436792 4413053 4334850 4282796 4384474 4392905 4552834 4511216 4317754 4334041
3705 4334041 4304106 4166499 4297819 4488865 4206374 4154225 4135233 4160072 4210053 4323117
3695 4323117 4408206 4600357 4402346 4184024 4583290 4547128 4475667 4337882 4270272 4478600
3685 4478600 4439694 4456101 4479586 4364016 4461266 4507716 4536974 4551499 4539396 4603394 4564654
3674 4564654 4423068 4664442 4609526 4832711 4975720 5021455 5359231 5339967 5098948 5158059
3664 5158059 5398670 5391654 5442096 5549478 5713076 5821057 5809177 5742106 5840418 5941524 6026597
3653 6026597 6048441 6157238 6077852 6035289 6074071 6091609 5982437 5877866 6019489 6177848
3643 6177848 6156743 6172310 5943249 5959122 6111386 6188540 6196683 6360441 6459769 6341352 6424450
3632 6424450 6619245 6703677 6763011 6834981 6974024 6980623 6948975 7163162 7225346 7364341 7392505
3621 7392505 7350251 7478098 7537973 7725144 7559805 7304097 7264571 7236102 7396529 7493529
3611 7493529 7530024 7430981 7368044 7482300 7565682 7446567 7454561 7441406 7362435 7495142 7604483
3600 7604483 7720256 7744384 7781410 7771799 8060324 8292343 8384431 8495291 8536393 8535388 8528163
3589 8528163 8500482 8450690 8402742 8310541 8441992 8486236 8438072 8460430 8406922 8351291 8560981
3578 8560981 8558572 8508388 8550072 8455336 8684430 8670593 8545802 8593402 8773983 8716294 8713195
3567 8713195 8737875 8710291 8733637 8765752 8807552 8852210 9117622 9202652 9381633 9160730 9384826
3556 9384826 9651507 9456493 9389926 9422248 9687944 9849696 9765791 9715265 9691524 9543999
3546 9543999 9296988 9057206 8747275 8824641 8817748 8687114 8664728 8667533 8530898 8559181 8467336
3535 8467336 8227043 8024220 8147325 8157153 8110968 7998930 8085370 7984280 7831078 7789348
3525 7789348 7997210 8090348 8018273 8058204 8097901 8177217 7990722 7973623 7866451 7850180 7790785
3514 7790785 7955567 7776668 7810948 7742498 7755101 7776129 7919383 7877661 7927639 7896717 7746965
3503 7746965 7785419 7781702 7606941 7454364 7520021 7550818 7694208 7483289 7309719 7440015
3493 7440015 7450457 7475938 7808784 7740461 7764850 7748288 7707690 7468198 7396562 7296619 7321696
3482 7321696 7581590 7610803 7910064 7930219 7711825 7740836 7686527 7583417 7581247 7516776 7416803
3471 7416803 7680969 7658630 7456799 7426233 7403147 7547269 7506390 7491692 7384128 7368547 7224557
3460 7224557 7213276 7269441 7264947 7204790 7394368 7319833 7201318 7155054 7070364 6866250 6812757
3449 6812757 6794806 6809279 6712341 6676052 6819002 6622631 6637023 6722869 6862624 6648588 6488129
3438 6488129 6406062 6245134 6385787 6572407 6447569 6461516 6373972 6261669 6333578 6324931 6225074
3427 6225074 6344372 6449818 6500545 6443555 6370580 6250156 6212099 6200401 6128878 6263292 6394281
3416 6394281 6395965 6357356 6401418 6433310 6288689 6359376 6422757 6392186 6483163 6593050 6439593
3405 6439593 6414904 6275019 6316262 6224483 6187939 6265448 6313284 6456780 6550291 6599291 6475770
3394 6475770 6800811 6699470 6775496 6617998 6499776 6444963 6608228 6861565 6988774 6857966
3384 6857966 6769795 6763603 6857667 6571545 6374188 6413413 6748773 6922609 6737096 6701115 6584216
3373 6584216 6672574 6799172 6756956 6942339 6950197 6743807 6920251 6880948 6742128 6641823
3363 6641823 6773552 6949326 6950252 6860082 6753885 6975750 7020898 7074957 7201096 7174517 7374477
3352 7374477 7531235 7537732 7594494 7661498 7732159 7853321 7860639 7907005 7963226 8204063 8123480
3341 8123480 8043652 8064997 8026854 8182562 8453095 8698130 8771015 8914403 9098904 9500694
3331 9500694 9602094 9751574 10014373 10135352 10440374 10678779 10951485 10958870 11255686 11618941
3321 11618941 11886648 11900587 11895368 11803669 12037606 12509515 12886825 13217090 13607502 14116787
3311 14116787 14120596 14530667 15053749 15635419 16112313 16831364 17854909 18648934 19880467
3302 19880467 21113357 22902072 25060084 27664850 30321744 32729796 35050574 37073221
3294 37073221 38939208 41436366 44391408 46393748 45762952 42496606 37638403 33664035
3286 33664035 30635877 28562627 27221577 26050599 25652485 25196454 24888658 24847172 24848001
3277 24848001 25160448 25601896 26180605 27009874 28157278 29658192 31400176 33588556 36450612
3268 36450612 40099201 44501210 49809957 55485585 60167626 62470453 61066164 56530964
3260 56530964 50569418 44808294 40475474 36975115 33906310 31604764 29960728 28640594
3252 28640594 27727526 26945913 26551397 26320576 26106008 25800430 25669046 25814241 25986231
3243 25986231 26558256 27331887 27806031 28562502 29163113 29650455 30026622 30314168 30095953
3234 30095953 29888489 29598887 28869666 28018754 26391268 24476986 22301386 20765947 19671623
3225 19671623 18581609 17664259 16623033 15937948 15403710 14826686 14321788 13984425 13397155
3216 13397155 13076539 12677074 12027588 11507350 11226778 10996043 10563177 10161002 9747248
3207 9747248 9480160 9391354 9051882 8768674 8553264 8436313 8413729 8198354 7978649 8037057
3197 8037057 8107601 8141459 8075207 8020238 8021460 7870273 7751518 8042343 8098492 7891228 7946516
3186 7946516 8055484 7863897 7601991 7269753 6980870 6835432 6593836 6316455 6022668 5766779
3176 5766779 5873182 5609333 5495436 5553589 5420481 5216036 5106549 5115528 5242341 5241912 5087151
3165 5087151 5057408 4883276 4820099 4840042 5162456 5102081 5105340 5156758 5146073 5222862 5185267
3154 5185267 5093077 4863628 4700865 4641859 4742521 4606778 4555492 4644766 4397646 4121099
3144 4121099 4005599 4175756 3892451 3775446 3689637 3706129 3713959 3757984 3773091 3712399 3894936
3133 3894936 3984029 3819973 3767844 3826221 3763896 3637337 3556400 3479761 3330048 3252791 3111667
3122 3111667 3147294 3341147 3131940 2973000 3045901 3130342 3069529 2931866 2770502 2883341
3112 2883341 2720382 2698173 2827469 2949907 2861572 2997586 2972949 2934950 3074121 3031000
3102 3031000 2968700 3008823 3039072 3001676 2702894 2557601 2722388 2609527 2626750 2537797 2401477
3091 2401477 2259032 2123194 2056599 1953492 1999975 2114611 2090402 1885772 1784953 2016203
3081 2016203 1827817 1650590 1723375 1898057 1948186 1949053 2020753 1910031 1671055 1700274 1705080
3070 1705080 1600102 1760725 1812968 1731711 1876253 1737498 1755683 1806859 1711077 1672034 1724962
3059 1724962 1657787 1586385 1476832 1390015 1423297 1390478 1422520 1471268 1417738 1280975 1529787
3048 1529787 1577791 1289620 1358854 1304117 1289524 1414873 1418990 1396234 1397376 1625134 1535221
3037 1535221 1329488 1104333 1211882 1271954 1288308 1435230 1302922 1469934 1382870 1284116
3027 1284116 1326541 1224583 1344837 1481599 1389561 1343723 1360650 1509931 1458089 1471472 1746895
3016 1746895 1756866 1634231 1472159 1498651 1536296 1468944 1348848 1649388 1752547 1569453
3006 1569453 1568802 1363148 1530062 1477636 1493803 1510788 1454743 1334881 1310325 1389275 1285134
2995 1285134 1151441 1155891 1053158 1209085 1347513 1453430 1626767 1593429 1543248 1425363
2985 1425363 1340983 1315629 1474095 1401668 1246406 1189025 1329796 1536774 1580948 1557425 1470854
2974 1470854 1507770 1487928 1481523 1677092 1847146 1796371 1830698 1713545 1709473 1644723 1683688
2963 1683688 1771550 1793828 1872699 1928957 1930175 1766749 1726327 1694525 1815326 1746729 1779868
2952 1779868 1740014 1659266 1538828 1557945 1600925 1558303 1671088 1601928 1424855 1466103 1706154
2941 1706154 1621486 1719715 1742969 1804449 1854689 2073840 2110948 2021624 2137421 2292283 2440516
2930 2440516 2787015 2818349 3001788 3337182 3211598 3030376 2874014 2827884 2540824 2489964
2920 2489964 2257427 2312056 2232963 2198148 2081440 2274719 2378724 2242333 2150539 2166175
2910 2166175 2053067 2239831 2149892 2205151 2302349 2320827 2392987 2525022 2799029 2861737 3084385
2899 3084385 3030240 3312447 3418465 3365559 3515447 3356338 2965219 2704491 2520572 2335195
2889 2335195 2376775 2235493 2026381 1986386 1815535 1710211 1649369 1445367 1605547 1504178
2879 1504178 1589045 1591259 1460296 1580380 1731460 1661774 1675928 1697805 1577715 1590321 1639326
2868 1639326 1729144 1661979 1420454 1468340 1430975 1445164 1537922 1336889 1153139 1190299 1254169
2857 1254169 1302091 1451437 1227888 1261847 1124501 1085999 1306887 1056131 869576 1114984
2847 1114984 1173468 1138679 927147 934466 729742 746032 919131 734093 505573 523273 676245
2836 676245 638320 648547 543189 410909 541280 681519 619186 547730 548684 533663 577869
2825 577869 416444 368936 506815 472563 334035 488467 429840 514779 580692 540481 496542
2814 496542 401410 200787 417215 466880 468062 193250 70861 282878 276537 493048 381557
2803 381557 233814 530099 487139 362053 275798 217913 34061 118120 147343 274412 309412
2792 309412 119392 331184 148648 387124 433464 390677 324090 293540 304919 301268 223584
2781 223584 58452 152473 318083 168941 64074 64815 36957 148999 305673 71305 42049
2770 42049 6046 162414 90003 12192 56921 145444 66454 -67798 48494 175878 101393
2759 101393 59596 128944 -2763 -41103 40299 50365 48672 235858 84562 -127036 -48511
2748 -48511 116448 -32370 -61328 92706 163025 37942 -77823 -166606 -117948 -107734 -101978
2737 -101978 88502 91599 -74050 -198369 -13233 125977 69915 229500 263651 320031 121179
2726 121179 39360 -119955 -127572 -148469 -105995 -268857 -176682 33442 114929 -5003 -57191
2715 -57191 45599 -92881 -89072 26797 171961 -9236 -29456 41557 39817 -16345 60706
2704 60706 111602 -3695 69605 148087 113833 20404 -106447 -97594 -300760 -269500 -432380
2693 -432380 -213612 101674 155766 89886 261928 140149 -36200 -71606 27536 83354 57758
2682 57758 -199193 -162270 -20939 17337 40213 246456 317374 57444 117302 59711 110617
2671 110617 224848 147267 108555 374587 352488 145233 -74105 -65415 -19431 28351 -902
2660 -902 13047 -5877 2690 -1487 79338 105280 -79916 120024 -123926 -104664 -31265 23438
2648 23438 -13389 -171858 -103001 -102001 -94606 -186056 -109627 48352 100330 -86362 -182046 -295669
2636 -295669 -370623 -224184 -192342 -116609 -109173 -76795 47676 89662 42675 69609 155710
2625 155710 45195 15992 -75512 -103847 -126843 -166611 -97419 4743 33028 -303452 -442651
2614 -442651 -446676 -372527 -334242 -483932 -406672 -178852 82673 201036 71141 193720 164723
2603 164723 42193 -61577 -100509 -3967 -178052 -144638 -261824 -376562 -443870 -306384
2593 -306384 -156737 -142547 60038 12986 158899 -60957 -262596 -196619 -136033 -105086 -294035
2582 -294035 -19465 -74914 74905 57666 -173385 -341729 -195931 -79789 -125560 -243793
2572 -243793 -148224 -71553 -259569 -225721 16131 -51011 -109224 -61906 -106140 -120921 -80813
2561 -80813 -282604 -311230 -242769 -150519 -143928 1884 -11329 5407 102712 72617 -217210
2550 -217210 -339768 -328953 -214760 -39153 -85208 80552 -14690 -105163 -243561 -282394 -192889
2539 -192889 38775 165697 133378 81904 80883 -175068 -347874 -281234 -202911 -64397 -175521
2528 -175521 -172009 -223422 -325086 -327637 -238026 -100288 49603 -70233 37256 20136 -198656
2517 -198656 -277370 -251375 -86019 -23721 -11392 -28205 -35243 -83916 -177911 -36209 42476
2506 42476 -148680 21043 176926 39203 84491 177162 -15200 -204854 -304797 -283282 -309913
2495 -309913 -209261 -167377 589 -195496 -76632 -92644 -275424 -297371 -52263 -199359
2485 -199359 -275590 -186197 -129514 -206445 -107921 -236046 -92126 207483 21104 -51041 24522
2474 24522 -146467 -130697 -107515 -77774 -66641 -278846 -118485 -113323 -2295 -80876 -163839
2463 -163839 -117522 -157506 -31845 -206075 -124703 5767 -45519 -119454 -40333 -47207 64286
2452 64286 98663 -58138 -130384 -73134 -265789 -225003 -131164 -79339 -321150 -377833 -232147
2441 -232147 -235097 -47913 -87778 -115704 -238724 59367 -56603 -155425 -229213 -132877 -72601
2430 -72601 -61218 -41427 9120 52522 -74942 -123981 -133332 -265800 -394359 -149507 -210848
2419 -210848 -279888 -135377 -99291 -192714 -16086 54352 334 -84824 -95515 34460 -110063
2408 -110063 -90632 146655 131910 -88456 -233648 -334755 -191349 20673 68373 -109810
2398 -109810 54704 -44502 -116353 -67084 238070 201809 93562 115710 174203 142762 86951
2387 86951 -222137 -59333 -25901 -82417 -131573 -204792 -87794 -78490 -116295 -211224 -167260
2376 -167260 -43267 114480 -38873 -74295 -50361 -40587 280226 162847 -5135 35579 241006
2365 241006 102920 85445 116568 -13444 -26002 132369 361361 205173 53394 -60893
2355 -60893 -62325 118189 212110 -59203 -128051 -87667 -86666 -9969 67942 -38109 -3412 139577
2343 139577 42353 -54425 -84507 162530 169608 164296 135139 35782 265846 224420 101387
2332 101387 31547 -167959 -222255 -166205 -130428 -86731 -198771 -65870 -132759 -151375 -32205
2321 -32205 9288 31847 53759 -47752 60504 160061 131331 -41718 40292 31463 -70205
2310 -70205 -127216 -1230 -25688 -118808 25637 -84313 21479 6100 -77185 105501 131653
2299 131653 -6127 -130970 106064 178899 -92961 -79004 47380 22671 -148263 -22819
2289 -22819 76395 -110904 -152490 -120584 -23435 -131721 -158212 -93647 -139127 -28003 62337
2278 62337 72945 -162165 20680 63823 3971 263474 243205 462194 243516 281019 295587
2267 295587 235081 126051 86717 131315 229527 144617 82945 102431 268826 103751 65735
2256 65735 98466 128805 142491 131859 267251 264755 217622 222259 254187 307454 330654 244910
2244 244910 186758 162184 143416 325548 360496 83686 -98918 -141612 54458 33695 122752
2233 122752 22699 7229 32712 3520 -11282 126980 72451 409574 474783 544433 417178
2222 417178 309802 207157 9290 30715 80300 81309 193965 216171 60900 306232 189294
2211 189294 183778 197289 264996 357436 298717 389643 402528 362311 288311 387359 454977 574854
2199 574854 630642 386119 274651 481147 567549 650477 529035 319973 402366 469805 409624
2188 409624 514498 718023 773525 697698 570665 391809 420439 576501 592852 598504 617792
2177 617792 763948 893498 793020 629208 801001 1010251 1012145 823715 786420 984323
2167 984323 1231236 1156817 1136152 1044527 1069141 1296345 1219124 1299878 1187590 1220414 1314391
2156 1314391 1248428 1239400 1359288 1511318 1509659 1551794 1601696 1616839 1599707 1609646 1713428
2145 1713428 1859423 2046432 1951000 2059807 2031232 2107934 2240971 2469086 2475645 2442614 2648656
2134 2648656 2837885 2913382 2904565 2961781 3057925 3192096 3509404 3746182 4022198 4241215
2124 4241215 4486375 4598522 4918565 5183102 5442235 5748486 5883830 6506002 7145885 7662109
2114 7662109 8226989 8911235 9443628 9755927 10109984 10937777 12242387 13876856 15796703
2105 15796703 17744006 20722548 24307051 28877510 34961483 42440326 48693781 49814467
2097 49814467 44394520 34542129 26971135 22017155 18357405 15629799 13169361 11243064
2089 11243064 10224242 9163646 8385272 7698606 6955979 6794147 6563084 5839206 5278763
2080 5278763 4678376 4211110 3984128 3848516 3514745 3461640 3295741 3093617 2823248 2795290
2070 2795290 2622899 2392338 2362320 2175884 2107332 2016153 1878200 1591954 1501193 1591911
2060 1591911 1698679 1478155 1485291 1228236 1182036 1216900 1122747 1170060 988791 941224 829634
2049 829634 966902 704230 649662 756802 796043 664078 550425 575222 669302 683748 732739
2038 732739 714755 796547 872364 608926 516544 691665 614718 422957 274533 261644 380119
2027 380119 601991 715512 598246 703890 591913 607447 554427 494674 465355 421868 443812
2016 443812 534601 381271 432921 322160 285722 300427 176851 261356 396789 348007 174354
2005 174354 148114 101312 -68612 224341 226548 -56295 -146676 109162 327632 333516 98876
1994 98876 74600 180235 298490 106570 82561 113852 173274 152471 23233 -49022 -87935
1983 -87935 -137541 -127675 6812 95795 128064 96964 -19778 80530 127455 82224 29313
1972 29313 -9763 -42382 15958 53005 152249 77133 -181380 -164960 24272 -59554 72647
1961 72647 -120836 -96887 -59673 -174501 134525 73458 -16653 -123732 -224398 -11097 -73091
1950 -73091 -252864 -81399 -222709 -210918 -165749 114078 138481 16495 -101579 -93959 -235792
1939 -235792 -176840 -59273 -45008 -143722 -70664 -229031 -342042 -272064 -411443 -424944 -374278
1928 -374278 -362476 -255050 -47699 -217602 -341383 -86529 -73762 -297595 -280312 -271039 -207333
1917 -207333 -170204 -250894 -252854 -176077 -80510 -261584 -242391 -168703 96564 -41207 -73566
1906 -73566 -121156 -180107 -110069 -238265 -8745 -43280 -139075 -109358 -104150 -127524 -102276 -68052
1894 -68052 -160582 -174668 -160324 -218974 -158811 -83893 15407 -127227 -126590 -301 -127046 -42343
1882 -42343 -112191 -310347 -305201 -446994 -375902 -253485 -126737 242311 25566 -52975 -83728
1871 -83728 -112675 -13783 -44748 25848 66516 28216 -51020 -25168 -196169 -212418 -95035
1860 -95035 -108559 -103327 76893 54839 30034 111417 -81605 -194377 -313846 -385842 -13761
1849 -13761 180219 7632 13493 -157545 -45390 125961 142183 -19870 -249163 84021
1839 84021 192631 -117503 -139686 -152850 -234632 -185045 92489 101319 221496 262943 204406
1828 204406 285934 97423 -130879 -46460 176651 -120122 -95594 -113751 -112640 9607 163921
1817 163921 -59351 -248312 -206884 -19607 -57642 -122974 -139672 -57622 -226953 -387400 -344303
1806 -344303 -142845 42862 48618 -121480 -85562 -3938 -147624 -140833 -107615 -22215 -67158
1795 -67158 -93465 -166174 -185980 -161139 -150386 -44214 -46161 -213362 127363 -89866 -28705
1784 -28705 62518 37549 76661 72523 24039 48518 62499 -134433 81557 119146 -87981
1773 -87981 12371 127007 -137012 -248797 -325063 -273566 -163572 -133957 -197883 140468 265883
1762 265883 158019 40095 185563 90760 -47175 -68453 -65944 28282 87862 -83649 -54753
1751 -54753 -140549 -145125 -81802 -132471 117377 -38058 115819 53235 285338 175687 13718
1740 13718 215981 5306 -286597 -278855 -233964 -343585 -341238 -130471 -214489 -236303 -177586
1729 -177586 -126463 52476 66046 159251 34645 -210014 -120978 -78925 -102950 -156480 -247811
1718 -247811 -273758 -62933 -165570 -221064 -175509 -51251 -41097 -14982 25508 -161678 -226707
1707 -226707 -209409 -76767 -167786 -124304 -20479 -7669 145851 71839 34698 -75500 -228453
1696 -228453 -215371 -247650 -180279 -10856 81075 42838 -1773 -82599 77640 101578 15105
1685 15105 -36050 60380 39369 -49425 -32601 -2881 -17159 37177 -73167 -32693 142360
1674 142360 68444 -22490 115500 124855 65091 -24079 25953 -28523 60181 7580 -31546 -174504
1662 -174504 -97782 -180816 -98189 -17997 -122073 -82324 43113 106569 69878 9950 87292
1651 87292 -172730 -200940 102510 1084 -321180 -208241 -1002 -19696 110515 -35880
1641 -35880 32285 -134355 -161832 -166159 -212807 -336906 -239428 -139202 -235954 -268809 -112338
1630 -112338 -189834 4990 222962 122994 -90815 19082 -63796 -114664 -111885 -57353 -55274
1619 -55274 -186054 -208812 6334 -66742 -105170 -269799 -169415 -145424 -203145 -185963 -152428
1608 -152428 -147808 -104043 -212639 -226581 -202185 -226248 -286838 -240262 -106011 -288848 -280256
1597 -280256 -142825 -91727 60335 81804 4294 -180159 -142810 116703 44163 108032 -39039
1586 -39039 -121194 -111565 -38850 -109100 -223228 -220946 -68124 41971 152076 4920 -55314
1575 -55314 -28643 4527 -67969 -121116 6082 29003 -4738 -17108 44082 131211 -107191
1564 -107191 -103396 -142359 -319729 -298021 -170165 -161572 -316239 -319090 -126850 -28285 15851
1553 15851 -72497 15463 -166548 -167564 -168682 49322 18124 -107047 -112524 8416 16979 -176411
1541 -176411 -254154 -327952 -295689 -105804 48885 49526 -269146 -169968 119561 104503 -36691
1530 -36691 -227727 -171839 -102544 -134547 -240148 -100830 -28017 -97818 -231516 15683 -25768
1519 -25768 -207098 -290261 -183616 -58929 -776 -87255 49633 48722 -25673 -140044 -79944
1508 -79944 -125326 37810 -94284 -187013 98921 131104 43468 10919 127777 -97217 -114347
1497 -114347 -6296 234264 49156 164004 145399 -97159 -80030 -43564 -8458 4680 -326531
1486 -326531 -282714 -101092 -101909 180163 81154 -58101 -136754 -189583 -151812 -140326 -111771
1475 -111771 -68784 82843 214546 90972 44380 91976 127805 127834 -77767 -211753 2466
1464 2466 -98700 -257230 -353937 -312601 -229156 -177943 -95375 -168802 -159849 -1010 34367 104140
1452 104140 15021 -92649 -109084 19688 25752 -95212 -11522 -22428 -58857 -6382 -130599
1441 -130599 -68433 -147639 -124038 -144601 -221303 -144524 57641 -125842 -323614 -224578 -114249
1430 -114249 -137420 -119707 -210551 -151948 -115211 -103356 1041 132257 74201 76494 44923
1419 44923 -56789 166494 7077 -38905 -145694 -170147 -169686 -207242 -125162 -213466 -26917
1408 -26917 -26293 -147011 -119437 -183994 178290 58132 -10545 40280 93989 179745 156574 -1505
1396 -1505 119347 153609 -19663 15224 57549 100858 3386 -158238 -110775 -40 8487
1385 8487 216964 117213 -91304 -158946 -55657 14658 -132491 -278317 -65438 77131 144215
1374 144215 256891 74000 165963 90800 -66609 -118424 29779 -76552 -16260 7774 54798
1363 54798 -8205 108106 239106 31681 -6053 246108 51078 -12169 -32835 10551 134202
1352 134202 130445 9234 3874 75270 -124332 -49654 -27861 171044 186183 237688 235181 169146
1340 169146 193354 286479 206925 -77577 -127867 -46310 -171960 -294951 -64070 79055 68801
1329 68801 85480 -22892 -104921 8884 21332 55186 -68511 -55299 148260 188221 8506
1318 8506 215585 87411 -106343 -4807 -288291 -197834 -106680 -218939 -262596 103159 66377
1307 66377 81494 165533 120014 28561 -54627 -1261 129125 246378 272033 43891 108967
1296 108967 -16460 -204187 -11911 201510 249326 140412 57193 77543 -30521 13379
1286 13379 -18517 -89059 113592 72043 39341 -13318 -57251 -37723 -105865 56475 74416
1275 74416 21443 153515 24835 -59336 -99685 -149682 -133183 -162287 -126266 31652 54127
1264 54127 -53099 -40467 73809 -79323 -90519 -190831 31972 230339 24336 -84621
1254 -84621 -80645 -339196 -278128 50046 81949 97760 9559 80321 55759 77205 -29397
1243 -29397 -24470 -43509 -115697 -151511 -85771 43263 101303 305000 60314 -185528 -9644
1232 -9644 157228 -8316 -287201 -115227 -228752 -195686 -128278 6477 190823 229997 192606
1221 192606 4108 -175527 136258 26976 -12918 -106104 186182 242483 108675 15509
1211 15509 205029 114803 2879 125274 33789 135969 76069 116902 16318 7126 -79473
1200 -79473 -50347 -117200 57588 -114849 10422 -86702 -195433 22320 126985 5300
1190 5300 176947 175613 -25577 -132408 162942 122410 71666 87625 166935 155731 -11692
1179 -11692 -55860 -83890 -106792 60196 157475 108728 -9976 56039 -42116 -105223 -240733
1168 -240733 -144653 -21985 67996 33930 -30064 20437 -16029 -18602 -42323 -11018 -99827 -100987
1156 -100987 119432 101240 98080 239939 -26816 -162997 -184684 -255134 -346071 -336639 -262261
1145 -262261 -173673 38087 -19872 -222524 34967 83992 -65865 -57269 32466 238141 207840
1134 207840 127135 84699 -39740 -91523 -14741 151911 -80012 -58643 18196 172719 172704
1123 172704 220460 159605 137382 141743 196605 -41187 -192386 -290187 -187193 -90371 -142398
1112 -142398 -233674 -80184 42804 154885 82848 -58131 113017 -61954 -69516 -57251 -137628
1101 -137628 -83813 -193927 -179396 -19718 32136 -120787 -97637 87237 -20275 -85210 153357
1090 153357 116117 -28382 63627 50513 -34360 -93281 12672 21098 -31374 -50313 -82025
1079 -82025 -144779 -77879 -110066 -96204 -192121 -17431 -95405 -95386 -79729 -139699 -150708 -179930
1067 -179930 -69309 -125236 -39477 -21744 57709 93144 110703 99521 61956 -62695 -179637
1056 -179637 26558 98376 -24933 -133266 -8324 -45514 49882 94251 -103761 -93417 -11676
1045 -11676 67382 41515 127964 -48423 -187030 -120794 -136310 -205924 -67983 4753 -36411
1034 -36411 -77696 -131118 -196210 -134947 -203682 -111708 -56892 -131059 -101450 95251 108420 12707
1022 12707 -38252 -62289 -57795 -120113 -176876 -272217 -23455 -19989 -5386 -56402 -201282 -242647
1010 -242647 -69131 55996 -33314 -171413 26148 193426 168988 -4578 22304 209061
1000 209061 95319 50995 -113169 -15057 165079 280406 138337 148791 163710 83556 -165968
989 -165968 -136521 86280 -53245 -62475 -156523 -174461 -99991 101107 69951 31028 153529
978 153529 199869 -33702 -55141 -22913 140731 163474 161195 66301 -7622 188799 108885
967 108885 213735 186513 69349 80659 73631 55328 65991 31284 -103497 -117014 -35781
956 -35781 77334 126439 264675 331222 164933 25583 -61714 -78474 -10571 -46176 108714
945 108714 37169 -26577 52343 164194 15855 -173434 -51786 -15112 65546 151784 -39299
934 -39299 137663 206689 22193 54822 -108447 -65960 -94384 -125186 -99544 -132225 -53854
923 -53854 -48759 3358 30678 234221 1103 -245280 -123321 -39339 -180825 -146872 128674
912 128674 135739 194970 44449 35290 238643 142342 -72637 -21399 -101086 -22716 21174 49586
900 49586 10882 81534 218457 148037 -101519 -96236 -30987 -22816 -60258 42573 60298 50484
888 50484 32432 63154 22044 -133824 -134408 92547 69583 108527 -370 54558 157653 69844
876 69844 -109169 -55938 73193 73923 -35289 174838 276236 56858 -121429 51815 89535
865 89535 44945 -36998 -202441 -100688 -74494 241885 112356 267527 343704 118957 37830
854 37830 66513 271942 411704 220851 142387 137730 111938 -12733 136880 214317 223127
843 223127 127241 -28194 -90489 -37983 -65574 77572 30625 -80226 -32556 163101 129929
832 129929 219125 135112 16722 47928 174574 52681 95337 -31732 -113176 -59918 115309
821 115309 197440 39311 60695 129557 136618 115891 -79721 -225007 5515 44731 -107291
810 -107291 -106695 67505 118721 172226 61525 35684 -18061 47570 -80142 -103902 -237257
799 -237257 -73178 -194612 -132210 -28054 52610 53806 83873 195006 153305 109064 25863
788 25863 161657 133789 75574 163370 145941 134018 111917 363237 288728 88950 70246
777 70246 236203 149499 -47953 35104 114914 168712 125502 73630 109857 269175 159524
766 159524 45786 -10786 6290 72138 34956 -24381 73500 115517 83627 -68280 62956
755 62956 -145092 -202095 -151720 -111229 123690 -3811 141943 28366 117776 12928 26265
744 26265 15695 -162390 -46181 -39848 95951 139337 -87730 -76115 -178925 -104736 105154
733 105154 158493 51681 -64839 -42985 -36022 97587 312196 380538 377060 171022 120520
722 120520 313291 115428 131446 123290 -4629 -230704 -109652 -82145 -88237 54530 -143107
711 -143107 -2330 42879 68567 74853 -13952 86645 67180 144234 1699 -119203 -91932
700 -91932 39857 -56388 -279188 -222627 -79096 -59071 21069 -121660 -78722 20833 229372
689 229372 178871 106919 -29442 -16851 -28269 57585 -59639 -6543 89929 106525 93312
678 93312 97774 27402 12748 -118615 -155713 -243477 -271322 -236378 -89804 -47198 -248192 -49789
666 -49789 -185015 -190654 -83416 12566 -40215 -50366 -18323 -44495 -104661 -141575 101151 163782
654 163782 106462 -230643 -106700 69898 -31106 18289 27754 112954 183027 67104 -65104
643 -65104 -99695 -145224 -131642 -113276 206330 233085 303983 20136 114688 -56885 59674
632 59674 -9028 -102434 5521 48242 74866 117812 109000 132270 271626 176913 19930 69763
620 69763 -38780 137849 67795 -30598 59373 22316 -63196 140079 145712 18468 36338
609 36338 89752 189646 13474 -119637 -42994 -44529 28330 -87133 96885 154848 -139649
598 -139649 18283 -29869 135822 144231 107888 -94337 -99893 -3469 60350 -36861 -65868 13693
586 13693 89737 108173 9061 -43099 1957 117508 161739 -23922 -332136 -351813 -219391
575 -219391 -76309 33543 -2547 80784 178794 3455 -171061 176740 80557 -23529 -493
564 -493 -115702 29857 -55327 -176821 4694 -81493 -233904 48192 -3775 117169 11350
553 11350 -92709 -49398 152353 189322 147085 79804 95689 15598 -219347 -227270 -109255
542 -109255 -20413 -82180 -9098 85969 115080 60782 -130836 -183373 -56276 -77960 117436
531 117436 69842 201271 43804 76073 -29554 -104036 -50054 65455 107927 -39877 226473
520 226473 122922 75791 82553 -165586 50273 -9531 -186326 -125965 39396 96631 193798
509 193798 35585 -54465 10496 21831 -117473 -25011 103561 70762 65429 279730 301406
498 301406 172973 238573 9883 -157712 -150380 -2132 -157184 -261477 -74698 89265
488 89265 241921 228040 248256 139561 -76272 -87560 -12039 50316 46313 126566 59492 -76412
476 -76412 -42230 -47370 -15743 153204 117209 61575 77410 89701 -4209 -25219 248112 333011
464 333011 215551 154348 173636 204788 208908 368447 204568 135171 269497 188859 265822
453 265822 181153 -42477 57620 199791 202875 -26544 41000 -96274 7419 5153 -112238
442 -112238 12780 33909 -75235 -99739 -68673 -69341 -75107 -54267 17257 27876 92209 -23179
430 -23179 -38969 -202523 -86226 6785 -88409 -71831 -2063 -23187 -98685 -58424 154322
419 154322 134437 -63699 81127 174089 -32118 -10498 35994 3417 118881 60459 54174
408 54174 -231961 -178788 -44376 -89131 -112906 28787 2727 31723 29366 -107 5972 -4061
396 -4061 74426 13117 -238919 -86523 97182 3290 -95148 -98748 -55283 -8320 -19798 59580
384 59580 -166953 -24004 3857 -191818 -172346 -285448 -164236 -158786 -226530 -107822 -91507
373 -91507 -104918 -136590 91516 22324 -161391 14448 -97292 34568 86494 -40742 -198592
362 -198592 -326317 -232046 47998 77618 31427 -134179 -63623 -179887 -31861 83945 -57414
351 -57414 -69328 -102191 -161217 25278 -96050 -269864 -119405 64825 148326 135548 -54906
340 -54906 -6422 74364 22219 145442 145068 177474 53763 -86373 -127218 -130697 -81200 -142508
328 -142508 -180240 -76517 -10490 -90402 99990 58793 30992 -56375 -212791 -38768 -106925
317 -106925 -78187 66514 66095 130155 -115284 -217883 -136253 -49341 -81833 -1038 -116324
306 -116324 -247268 -120059 -150525 -44720 42667 -11188 -181924 -75175 -104678 50687 11817
295 11817 14352 116286 -126123 -8133 -23403 33693 -14209 -5040 -88545 54474 171326
284 171326 27135 -159988 -226490 200 -124841 -209395 -219132 -94352 78178 81912 -47200
273 -47200 -54456 -212417 -327890 -194296 99387 144665 193892 -81827 -94173 -102849 -70559
262 -70559 -118579 -145077 -228222 -216633 -126533 -189913 -258281 -267648 -123862 -142534 -44328 -51408
250 -51408 -62819 -45596 115059 -9281 -130152 -119010 -52551 64643 111166 49230 -15920
239 -15920 18535 3098 27190 19019 -123748 -129680 -223655 -201415 -76598 -22674 -301944 -193648
227 -193648 300 -78086 -83571 -97582 40126 159236 70376 -26595 136959 213693 118951
216 118951 53853 -9511 -98139 -106636 -147167 -58077 -94349 -54945 -23527 -198581 -139670 -136636
204 -136636 -196156 -132501 -126512 93419 106592 222552 381403 332948 21895 -151712 -18635
193 -18635 -60000 42052 -5966 -64503 49194 43920 -75652 -191890 -254545 -345226 -128687
182 -128687 91666 8548 -65546 -100413 -148373 -269712 -192087 -136209 -65265 -53635 -25418
171 -25418 -145117 -127062 54726 233877 151389 57135 -121293 -200836 -63603 -45905 -129708
160 -129708 13837 85210 -200803 -38189 -64020 49094 61521 -37 -82218 -55602 -71948
149 -71948 -45001 32192 -81449 -205290 -94888 -35790 49526 92577 -40983 16023 83364
138 83364 34588 -14050 -49311 -101571 -23736 -12840 -130554 -89376 11308 -137127 -165846
127 -165846 -201099 37702 125338 -126682 -83516 107542 19761 -135072 -88645 -228449 -152230
116 -152230 -154732 17353 -66385 -57814 -165803 -236441 -20447 -57955 -59344 -73305 -30534 112149
104 112149 48238 46303 91506 -62674 -90384 -56120 12046 -188552 -172088 -70311 25646
93 25646 22442 21270 -42179 -38443 27503 -91376 -195041 -116272 -2155 60634 9840 -23440
81 -23440 -16814 -71077 -183601 -4849 -83159 -181746 -191063 -141353 -45539 -94426 -72303 -98691
69 -98691 36236 -22290 -92474 -69245 -34269 -124554 -96881 -75555 -73711 83769 -26633 34719
57 34719 -564 75699 36278 -17815 88027 -120011 -238108 54447 -30262 -36341 34126 13605
45 13605 151225 122342 -22275 4927 -46701 48664 36210 -163576 -179690 -60668 7502
34 7502 36244 -41196 -47815 -74255 -167788 -197880 -130294 -6232 -37372 -93163 -206982 -245393
22 -245393 -80301 -44707 -180824 -211397 -43942 -22192 -144662 -90899 -63523 -96140 -49834
11 -49834 -40790 -42943 97442 40429 -48221 -107898 -8261 70767 134736 -10076 -60904
0 -60904
$$ Imaginary data points
##PAGE= N=2
##DATA TABLE= (X++(I..I)), XYDATA
16383 -1397010 -1351649 -1263035 -1212244 -1248451 -1319699 -1161685 -1017334 -967467 -997625 -987933 -890395
16372 -890395 -892164 -877284 -853951 -786551 -938040 -918194 -787985 -706671 -739325 -748715 -776887
16361 -776887 -762567 -591909 -531420 -487880 -332635 -414142 -313025 -294194 -336982 -281875 -352309
16350 -352309 -325617 -208743 -237546 -226009 -267079 -290388 -70147 18304 -18884 -21873 29272
16339 29272 207092 273176 212535 200572 269794 336339 86959 183264 305433 205572 345811
16328 345811 527320 543474 508345 536882 572689 538932 541997 581671 662035 584823 639888
16317 639888 762010 549496 677034 728296 698617 800081 734692 797772 984842 1102506
16307 1102506 994862 1000578 1053001 1044820 1064689 1050588 1134666 1174245 1345817 1210057 1154227
16296 1154227 1206433 1280754 1299434 1431278 1426800 1518006 1535601 1644430 1651159 1617847 1830694
16285 1830694 1859417 1799439 1649359 1621041 1641666 1571188 1823525 1907680 1740912 1593846
16275 1593846 1577707 1758284 1881320 1833442 1821172 1933414 1966483 2009812 2007026 2051950 2089932
16264 2089932 2102287 2111802 2124843 2265328 2251918 2202093 2337446 2297532 2076677 2265022 2503077
16253 2503077 2450608 2283006 2286219 2191618 2340449 2371090 2350841 2356065 2356115 2457537 2468026 2461551
16241 2461551 2576426 2540379 2514826 2673647 2527006 2533481 2624038 2761044 2745253 2828182 2835104
16230 2835104 2851638 2741217 2744702 2686735 2678960 2658932 2782347 2752355 2648604 2746733 2903148
16219 2903148 2853809 2789978 2843737 2949346 3089964 3099948 2965276 3053593 2891351 2846239 3022824
16208 3022824 2958228 2995549 2961129 3109661 3179251 3091141 3115994 3230999 3168419 3061516 3150965
16197 3150965 3302388 3321436 3145837 3218706 3230384 3109992 3225221 3227274 3107499 3358407
16187 3358407 3433732 3325710 3530054 3582570 3400348 3284073 3086170 3075736 3214388 3329922
16177 3329922 3295243 3394888 3353999 3188144 3288635 3415934 3373680 3438561 3448074 3445760 3310934
16166 3310934 3314425 3266936 3476757 3619072 3562990 3564948 3266890 3321275 3391435 3430103 3472998
16155 3472998 3482081 3465739 3394858 3247139 3313172 3511036 3533348 3628103 3702989 3577864 3567690
16144 3567690 3480073 3458763 3377238 3331224 3303813 3434064 3731073 3641381 3474279 3602776
16134 3602776 3594905 3563317 3525190 3515396 3581236 3700720 3502123 3415360 3558679 3731486 3630248
16123 3630248 3563678 3717028 3604163 3667620 3720759 3607614 3644088 3628916 3654839 3506028
16113 3506028 3463342 3493912 3639485 3787422 3879361 3992194 4085832 3884614 3677178 3535364
16103 3535364 3644025 3867202 3685240 3584541 3675070 3730012 3542281 3693610 3822854 3915507
16093 3915507 3897276 3786360 3694873 3679055 3594866 3385184 3611441 3732948 3982315 4023263
16083 4023263 3816408 3798290 3639156 3703397 3836174 3848471 3883060 3938596 3969082 3877482 3970437
16072 3970437 3852298 3710059 3743025 3812827 3911052 3880668 4111256 4004326 3842769 3710279
16062 3710279 3574160 3805194 3741327 3781154 3757292 3628733 3579939 3834864 3879863 3741006
16052 3741006 3628805 3753923 3904504 3844385 3855863 3852484 3882763 4016617 4120969 3779701
16042 3779701 3776231 3699121 3827709 3857307 3787902 3822185 3912609 3845989 3765244 3949856 3813842
16031 3813842 3690013 3745616 3609732 3619780 3852237 3989295 3946769 3820210 3725653 3815421
16021 3815421 3932017 3986395 3974405 4074325 4082949 3895764 3809882 3890415 3920439 3910213 3918157
16010 3918157 3884569 3814808 4058590 3911351 3950572 4037773 3942768 3710953 3649186 3832368
16000 3832368 3860457 3948917 3669943 3792335 3734489 3854107 3940157 3788204 3715820 3746469
15990 3746469 3718066 3796287 3972893 4065735 4082818 3836605 3933019 3896579 3861180 3695596 3678499
15979 3678499 3862956 3822182 3783043 3740530 3885018 3913570 3883369 3847197 4026147 3924068
15969 3924068 3973892 4021294 3967289 4215866 3967843 3931565 3998261 3801163 3642739 3846689
15959 3846689 4041916 4042366 4146926 3995884 3834967 3873901 3850790 3786892 3907755 4031602
15949 4031602 3978707 3941129 3917395 3970908 3934150 3831151 4036035 3995319 4068775 3973947 3862837
15938 3862837 3994861 3948588 3843804 3760343 3773357 3788008 3917092 3856615 3842562 3875685 3981848
15927 3981848 3994121 3848902 3780805 3679166 3637047 3675432 3749926 3761312 3834753 4002487 3954800
15916 3954800 3792221 3960696 3891656 4005663 3984253 3838388 3969063 4010372 3932066 3891917
15906 3891917 4020908 4101724 4076152 3965989 4006246 3882641 3958130 3947271 3721153 3741741
15896 3741741 3911680 4284199 4130207 4097597 4120967 3816589 3762819 3836551 3969711 4053431
15886 4053431 3985486 3884918 3831063 3947562 3943993 4110729 4258520 4123785 4045099 3781746
15876 3781746 3986848 4190216 4045485 3920113 3747725 3810883 3909180 3980054 3976081 3856337
15866 3856337 3961617 3986978 4053015 4003288 4147109 4127528 4038464 3973431 3805135 3869517 3886172
15855 3886172 3920534 3907294 3881167 4060260 4016508 4082468 4047784 3889717 3876446 3811805 3812003
15844 3812003 3864013 4020764 3949916 3879576 3925461 3965441 4055555 4106595 4254249 4206605 4023663
15833 4023663 4010433 3934813 3804040 3903647 3887531 3890706 3991190 3970123 3893237 4052879 4215190
15822 4215190 4008507 3773331 3843929 3746695 3713373 3895523 3878375 3942391 4019047 4081392 4050814
15811 4050814 3921164 3922183 4120602 3967066 4014941 3987001 3852358 3901364 4064982 3969161
15801 3969161 3795621 3898394 3913193 3906347 3939801 4026088 3855863 3654157 3957859 3936236
15791 3936236 3928394 4061824 4008134 4044176 3862376 3682623 3795111 3807864 3901519 3864770 4011439
15780 4011439 4001646 3917547 4008806 4082731 3899082 3943035 3958908 3759062 3782621 3946981 3994352
15769 3994352 3871287 3841662 3751849 3882633 4135537 4195614 4185315 3987819 4048526 4080095
15759 4080095 4002057 3985620 3876725 4033659 3943931 4102547 4083715 3988059 3991540 4067837 4109253
15748 4109253 4072262 3889836 4008318 3766434 3834394 3966610 4119567 4158255 4166288 4012023
15738 4012023 3938312 4059677 3792842 4036414 4228341 4298542 4247837 3997311 3940323 4043908
15728 4043908 3874626 3964357 4168412 4274453 4105302 3968793 4035425 3927681 3866815 3863934
15718 3863934 4027204 4030740 3956463 3994075 3924221 4036029 4157906 4094251 3973989 3822054
15708 3822054 3901035 3983253 3815090 3945299 4054513 3993783 3939246 3877894 3897522 3832115 3777694
15697 3777694 3992655 4092624 4067507 4028304 3857899 4081563 4085922 4159097 4169639 4153339 4062216
15686 4062216 3937326 4135110 3925266 3795163 3930895 3859973 3968078 4054926 4004948 3929676
15676 3929676 3812953 3831557 3912282 4097488 4004141 3839361 3813825 3967243 3955580 3952735 4178239
15665 4178239 4155824 4104075 3982953 3850546 3881666 3821730 3760530 3886648 4135412 3923927
15655 3923927 3890977 4024425 4149836 4014119 3958969 3970025 3973626 3801882 3755854 3883224
15645 3883224 3894030 4234860 4405405 4333356 4137244 3961951 4021607 4092295 4266967 4201223
15635 4201223 4058877 4121630 4177812 4074120 4157074 4109991 4019220 4170756 4038920 4069054
15625 4069054 4024059 3946697 4006261 4067857 3990709 3887772 3931597 3938523 4260353 4187969 3945272
15614 3945272 3997685 4166841 4185859 3993433 4072747 4096355 3889157 4007142 4148360 3859981
15604 3859981 3955713 3882897 4128162 4222579 4090315 4183015 4128483 3945299 4015669 4117758
15594 4117758 4086799 4125582 4103213 4185330 4217639 3993506 4156612 4249830 4193220 4085822 4009688
15583 4009688 4123165 4178668 4234222 4231652 4173936 4261745 4339227 4260663 4085749 3993572 3903760
15572 3903760 3860252 3920479 4082024 4163457 4134698 4067634 4021332 4085754 4042550 4284332 4251851
15561 4251851 4322842 4266342 4241002 4211573 4039527 4096131 4177882 4153431 4053545 4163428 4084244
15550 4084244 4148372 4294608 4231169 4141884 4134424 4068763 3995043 4087434 4082875 4048386 4028834
15539 4028834 4007466 4035946 4052607 4145553 4029811 4027353 4080896 4041128 4021524 3911004 4023700
15528 4023700 4136533 4011085 3890222 3870172 4047374 4167960 4295478 4440999 4246259 4153001
15518 4153001 4048079 4027936 3973831 3899020 3987271 4126767 4037639 4051645 4138715 4213574 4076501
15507 4076501 4044725 4223837 4098060 4052039 4159976 4175021 4205583 4230630 4165656 4014105
15497 4014105 4120660 4071036 3872413 3866367 3969636 4161177 4145001 4145758 4194301 3946870 4076774
15486 4076774 4002268 4002726 4160145 4037157 4002182 4035860 4244217 4315925 4178744 4101386 4289896
15475 4289896 4348241 4144575 4147329 4156217 4183363 4274114 4241373 4186647 4165723 4054177 4040520
15464 4040520 4139381 4092824 4057187 3882113 3999919 4058797 4110019 4183884 4213422 4010164 4078109
15453 4078109 4037587 3975010 4077410 3994306 4020261 4226963 4254167 4217061 4212715 4326998 4299619
15442 4299619 4087524 4038440 3922290 3926500 3987111 4066824 4111219 3983746 3987157 4163129 4161014
15431 4161014 3972413 3955938 3981972 4068962 4035309 4003457 4047741 4209096 4349385 4232514
15421 4232514 4122468 4107656 4068906 4087388 4091910 4176614 4284885 4240624 4130138 4085737 4104681
15410 4104681 4080120 4034202 4150617 4150907 4193049 4244456 4187042 4261463 4439088 4289034 4322140
15399 4322140 4210445 4061344 4314235 4079764 4015077 3991957 4158641 4225853 4251528 4178270
15389 4178270 4187442 4057090 3922545 4186208 4241838 4215218 4344263 4218971 4336403 4296436
15379 4296436 4400928 4619159 4512264 4425782 4271773 4017770 4082549 4193246 4250998 4352745
15369 4352745 4254386 4322547 4119088 4079455 4240252 4314350 4473538 4444563 4351927 4400544 4344305
15358 4344305 4239437 4361779 4390815 4263135 4217273 4098635 4185770 4467529 4360950 4247186
15348 4247186 4367605 4259553 4149466 4267657 4240483 4264370 4281574 4254825 4226791 4144154
15338 4144154 4162302 4084196 4176409 4245692 4010800 4091521 3999995 3921670 4100639 3985072 4109149
15327 4109149 4296221 4371431 4510765 4424541 4281843 4265913 4026399 4172567 4228261 4125103
15317 4125103 4269147 4301426 4244654 4258788 4338079 4235395 4229406 4166747 4150739 4146507 4350010
15306 4350010 4161896 4054679 4149269 4228737 4360114 4359515 4352761 4369174 4212817 4297744 4408403
15295 4408403 4252213 4338006 4303273 4423410 4364276 4264073 4150450 4369118 4349224 4133981
15285 4133981 4012615 4049818 4060867 4177029 4259755 4143398 4217879 4298561 4120221 4353158
15275 4353158 4411676 4245313 4381734 4042490 4067318 4409934 4287514 4121630 4135058 4048528
15265 4048528 3900246 4049110 4328709 4421476 4231738 4351194 4358385 4272896 4308857 4307845 4319819
15254 4319819 4374270 4570492 4551013 4412584 4276105 4218437 4163616 4357260 4317490 4262267
15244 4262267 4207439 4178768 4096669 4261774 4263461 4049217 4152052 4154150 4229689 4247773 4188690
15233 4188690 4279991 4122388 4043540 3960674 4206404 4406440 4475182 4440207 4389915 4355455 4290913
$$ [...]
##END NTUPLES=NMR SPECTRUM
##END=
