##TITLE=1H_CA-9080-3
 CDCl3
 8 sc, 
 24.10.2022
##JCAMPDX= 6.0         $$ Bruker NMR JCAMP-DX V2.0
##DATA TYPE= NMR SPECTRUM
##DATA CLASS= NTUPLES
##ORIGIN= UXNMR, Bruker Analytische Messtechnik GmbH
##OWNER= root
$$ XWIN-NMR		Version 3.5
$$ Mon Oct 24 14:02:37 2022 Russian Standard Time (UT+4h)  she@DPX200
##.OBSERVE FREQUENCY= 200.1313499994
##.OBSERVE NUCLEUS= ^1H
##.ACQUISITION MODE= SIMULTANEOUS
##.ACQUISITION SCHEME= undefined
##.AVERAGES= 8
##.DIGITISER RES= 18
##SPECTROMETER/DATA SYSTEM= spect
##.PULSE SEQUENCE= zg30
##.SOLVENT NAME= CDCl3
##.SHIFT REFERENCE= (INTERNAL, CDCl3, 0, 15.7579)
##AUDIT TRAIL= $$ (NUMBER, WHEN, WHO, WHERE, WHAT)
$$ ##TITLE= Audit trail, XWIN-NMR		Version 3.5
$$ ##JCAMPDX= 5.01
$$ ##ORIGIN= Bruker BioSpin GmbH
$$ ##OWNER= she
$$ F:/spectra/data/she/nmr/H-F/1/pdata/1/auditp.txt
$$ ##AUDIT TRAIL=  $$ (NUMBER, WHEN, WHO, WHERE, WHAT)
(   1,<2022-10-24 14:01:24.70 +0400>,<she>,<DPX200>,
      <created by zg, POWCHK disabled, PULCHK disabled
       configuration hash MD5:
       00 E9 B6 7A A2 85 ED C7 34 08 36 98 17 FE 4E 26
       data hash MD5: 16K
       6F BD 5F 24 29 D9 3C ED 6C 4E B5 C9 71 CE BD E5>)
(   2,<2022-10-24 14:01:27.07 +0400>,<she>,<DPX200>,
      <Start of raw data processing
       efp BC_mod = 2 LB = 0.24 FT_mod = 6 PKNL = 1 PHC0 = -18035.09 PHC1 = 11.4007 SI = 16K 
       data hash MD5: 16K
       51 68 99 44 15 2C 9E 1B 0E BE EB 16 A7 70 4D 43>)
(   3,<2022-10-24 14:01:46.78 +0400>,<she>,<DPX200>,
      <pk PHC0 = 1.905221 PHC1 = -0.8000002 
       data hash MD5: 16K
       7F A3 56 D8 33 DE 38 45 68 88 30 E4 48 07 26 0B>)
(   4,<2022-10-24 14:01:50.57 +0400>,<she>,<DPX200>,
      <abs ABSG = 5 
       data hash MD5: 16K
       5E 22 EC 80 F7 69 F2 D3 4D 75 BF 0F 4B A0 66 59>)
$$ ##END=
$$ 
$$ hash MD5
$$ D1 DA D4 08 5A 97 A6 C9 06 F8 95 78 34 3F 5B 4D
##$RELAX= 
##$RELAX= 
##$RELAX= 
##$RELAX= 
##$RELAX= 
##$RELAX= 
$$ Bruker specific parameters
$$ --------------------------
##$DU= <F:/spectra>
##$EXPNO= 1
##$NAME= <H-F>
##$PROCNO= 1
##$TYPE= <nmr>
##$USER= <she>
##$AMP= (0..31)
100 100 100 100 100 100 100 100 100 100 100 100 100 100 100 100 100 100 
100 100 100 100 100 100 100 100 100 100 100 100 100 100 
##$AQSEQ= 0
##$AQ_mod= 1
##$AUNM= <au_zg>
##$AUTOPOS= <>
##$BF1= 200.13
##$BF2= 200.13
##$BF3= 200.13
##$BF4= 200.13
##$BF5= 200.13
##$BF6= 200.13
##$BF7= 200.13
##$BF8= 200.13
##$BYTORDA= 1
##$CFDGTYP= 0
##$CFRGTYP= 5
##$CHEMSTR= <none>
##$CNST= (0..31)
1 1 145 1 1 1 1 1 1 1 1 1 1 1 1 1 1 1 1 1 1 1 1 1 1 1 1 1 1 1 1 1 
##$CPDPRG= <>
##$CPDPRG1= <>
##$CPDPRG2= <>
##$CPDPRG3= <>
##$CPDPRG4= <mlev>
##$CPDPRG5= <mlev>
##$CPDPRG6= <mlev>
##$CPDPRG7= <mlev>
##$CPDPRG8= <mlev>
##$CPDPRGB= <>
##$CPDPRGT= <>
##$D= (0..31)
0 1.2 0 0 0 0 0 0 0 0.06 0 0.03 0 0 0 0 0.0002 0 0 0 0 0 0 0 0 0 0 0 0 
0 0 0 
##$DATE= 1666605684
##$DBL= (0..7)
120 120 120 120 120 120 120 120 
##$DBP= (0..7)
150 150 150 150 150 150 150 150 
##$DBP07= 0
##$DBPNAM0= <>
##$DBPNAM1= <>
##$DBPNAM2= <>
##$DBPNAM3= <>
##$DBPNAM4= <>
$$ [...]
##$SUBNAM3= <"">
##$SUBNAM4= <"">
##$SUBNAM5= <"">
##$SUBNAM6= <"">
##$SUBNAM7= <"">
##$SUBNAM8= <"">
##$SUBNAM9= <"">
##$SW= 18.0517283424941
##$SWIBOX= (0..15)
0 0 2 0 0 0 0 0 0 0 0 0 0 0 0 0 
##$SW_h= 3612.71676300578
##$TD= 16384
##$TD0= 1
##$TE= 0
##$TE2= 300
##$TE3= 300
##$TEG= 300
##$TL= (0..7)
0 120 120 120 120 120 120 120 
##$TP= (0..7)
150 150 150 150 150 150 150 150 
##$TP07= 0
##$TPNAME0= <>
##$TPNAME1= <>
##$TPNAME2= <>
##$TPNAME3= <>
##$TPNAME4= <>
##$TPNAME5= <>
##$TPNAME6= <>
##$TPNAME7= <>
##$TPOAL= (0..7)
0.5 0.5 0.5 0.5 0.5 0.5 0.5 0.5 
##$TPOFFS= (0..7)
0 0 0 0 0 0 0 0 
##$TUNHIN= 0
##$TUNHOUT= 0
##$TUNXOUT= 0
##$USERA1= <user>
##$USERA2= <user>
##$USERA3= <user>
##$USERA4= <user>
##$USERA5= <user>
##$V9= 5
##$VALIST= <valist>
##$VCLIST= <CCCCCCCCCCCCCCC>
##$VD= 0
##$VDLIST= <DDDDDDDDDDDDDDD>
##$VPLIST= <PPPPPPPPPPPPPPP>
##$VTLIST= <TTTTTTTTTTTTTTT>
##$WBST= 1024
##$WBSW= 4
##$XGAIN= (0..3)
0 0 0 0 
##$XL= 0
##$YL= 0
##$YMAX_a= 370058
##$YMIN_a= -788162
##$ZGOPTNS= <>
##$ZL1= 120
##$ZL2= 120
##$ZL3= 120
##$ZL4= 120
##$ABSF1= 15.76232
##$ABSF2= -2.28953
##$ABSG= 5
##$ABSL= 3
##$ALPHA= 0
##$AQORDER= 0
##$ASSFAC= 0
##$ASSFACI= 0
##$ASSFACX= 0
##$ASSWID= 0
##$AUNMP= <proc_1d>
##$AZFE= 0.1
##$AZFW= 0.1
##$BCFW= 0
##$BC_mod= 2
##$BYTORDP= 0
##$COROFFS= 0
##$CY= -3
##$DATMOD= 1
##$DC= 0
##$DFILT= <>
##$DTYPP= 0
##$F1P= 0
##$F2P= 0
##$FCOR= 1
##$FTSIZE= 16384
##$FT_mod= 6
##$GAMMA= 0
##$GB= 0
##$INTBC= 1
##$INTSCL= 3.70164e-10
##$ISEN= 128
##$LB= 0.24
##$LEV0= 0
##$LPBIN= 0
##$MAXI= 10000
##$MC2= 0
##$MEAN= 0
##$ME_mod= 0
##$MI= 1.114404
##$NCOEF= 0
##$NC_proc= -5
##$NLEV= 6
##$NOISF1= 3.799351
##$NOISF2= 2.8
##$NSP= 0
##$NTH_PI= 0
##$NZP= 0
##$OFFSET= 15.75791
##$PC= 1
##$PHC0= -18033.19
##$PHC1= 10.6007
##$PH_mod= 1
##$PKNL= yes
##$PPARMOD= 0
##$PSCAL= 0
##$PSIGN= 0
##$REVERSE= no
##$SF= 200.130002728114
##$SI= 16384
##$SIGF1= 3
##$SIGF2= 2
##$SINO= 5.538805
##$SIOLD= 16384
##$SREGLST= <1H.CDCl3>
##$SSB= 0
##$STSI= 16384
##$STSR= 0
##$SW_p= 3612.71676300578
##$SYMM= 0
##$S_DEV= 0
##$TDeff= 16384
##$TDoff= 0
##$TI= <>
##$TILT= no
##$TM1= 0
##$TM2= 0
##$TOPLEV= 0
##$USERP1= <user>
##$USERP2= <user>
##$USERP3= <user>
##$USERP4= <user>
##$USERP5= <user>
##$WDW= 1
##$XDIM= 16384
##$YMAX_p= 348627138
##$YMIN_p= -218891
$$ End of Bruker specific parameters
$$ ---------------------------------
##NTUPLES= NMR SPECTRUM
##VAR_NAME=  FREQUENCY,     SPECTRUM/REAL,   SPECTRUM/IMAG
##SYMBOL=    X,             R,               I
##VAR_TYPE=  INDEPENDENT,   DEPENDENT,       DEPENDENT
##VAR_FORM=  AFFN,          ASDF,            ASDF
##VAR_DIM=   16384,         16384,           16384
##UNITS=     HZ,            ARBITRARY UNITS, ARBITRARY UNITS
##FACTOR=    0.220516191357247, 1,           1
##FIRST=     3153.63052621615, 0,            0
##LAST=      -459.08623678963, 0,            0
##MIN=       -459.08623678963, -218891,      0
##MAX=       3153.63052621615, 348627138,    0
$$ Real data points
##PAGE= N=1
##DATA TABLE= (X++(R..R)), XYDATA
$$ [...]
6289E57153M4715P5338J0846J9918L7034m690J6435n3496j3929K2832l9652p0395
6277F02109P1516L9323k2254n694n667L995j05112K6071l8223J257j7029k2866
6265E27426J4048R20K4975J9606p9091N0226q707p0758J7537K7398j511J4115
6253E36184J462j1982k4221N6339J2841J2238m0769M1665K8384j05640k3734J6061
6241D98828N4199K5604m8573J509N2734J3650L025P0452J01856M0774r073m6341
6229G58644m0560j02396j0835J7386K3215J3723k6536K0579M6807J1188L2087
6218G43302L4561J97j0922K5735J7189k2750L4639P0251K715k6589j5183o8075
6206G85070M2382K8118l2991k8770k2306K6437m5804P1525L7433K1073n028p365
$$ y = [557153, 601868, 677206, 688052, 707970, 745004, 740314, 756749, 703253, 689324, 712156, 672504, 602109, 673625, 712948, 690694, 685000, 679333, 683328, 578216, 604287, 566064, 567321, 550292, 527426, 541474, 542394, 567369, 586975, 507884, 558110, 549403, 478645, 496182, 523580, 522069, 536184, 537646, 525664, 501443, 557782, 570623, 582861, 542092, 583757, 612141, 506501, 482767, 498828, 553027, 578631, 530058, 531567, 584301, 597951, 600976, 671428, 773284, 814058, 804985, 758644, 718084, 615688, 604853, 622239, 645454, 659177, 632641, 653220, 700027, 711215, 743302, 777863, 778060, 767138, 792873, 810062, 787312, 821951, 892202, 894917, 868328, 853145, 785070, 827452, 855570, 822579, 793809, 771503, 797940, 752136, 823661, 861094, 882167, 877139, 869774]
6194H69774K220Q8131L9298L498M4338L2778m6614o6650l3981m7512J718k8027
6182H58971r535K0004j0582m5472j6022j4306K3549K1012l6707K6205M5125L0696
6170H92938J1839J1156r799L442N1760l8194M1726N980L629O2922O5726R1899
6158A195024O4963L5757K1971P1715k1296k6510m7703L3539n461M769N8111J9390
6146A404269M0037j0667l2974J7823K6945O5342r436O0331N5483M1175O4803J351
6134A724482O6159K7306K5107J7436O3845O9467O1463N1208J20316O8254J48625
6123B443668J40692K10092L74244M30869K34273j06679l74217m22011l45653j74481
6113B410797j18250j86075j49097j18342p0175q2332p766k9823K5053n4636j4294
$$ y = [869774, 871994, 960125, 999423, 1002921, 1047259, 1080037, 1033423, 966773, 932792, 885280, 886998, 858971, 849436, 869440, 858858, 813386, 797364, 783058, 806607, 827619, 790912, 817117, 862242, 892938, 904777, 915933, 906134, 909576, 961336, 923142, 964868, 970848, 974477, 1037399, 1103125, 1195024, 1259987, 1295744, 1317715, 1389430, 1368134, 1341624, 1293921, 1327460, 1321999, 1326768, 1384879, 1404269, 1444306, 1433639, 1400665, 1418488, 1445433, 1510775, 1501339, 1561670, 1617153, 1658328, 1723131, 1724482, 1790641, 1817947, 1843054, 1860490, 1924335, 1993802, 2055265, 2106473, 2226789, 2295043, 2443668, 2584360, 2794452, 3168696, 3599565, 3833838, 3727159, 3352942, 2930931, 2585278, 2410797, 2292547, 2106472, 1957375, 1839033, 1768858, 1686526, 1678760, 1648937, 1673990, 1619354, 1605060]
6102A605060K0243m603o6128p4016K2013j6283m5645m5001J3239O7628k4004j10044
6090A342459M0336J8490M646J1143K6511j1207q338K0445m2575N7701L012K5636
6078A488259M5972N9001N0890K9363M4126K4893J1617P663O8779R6939J26223
6067B053725J50634R4448J29524O0985J05711R2414O8192O3228n5123k04109p5716
6056B483913q5126p8967j02800p4133O2501Q5605P777M0511J28977O8932J26618
6045B663808P6282O7417R6322K01332K12377K09797K38503K85329K19761K14141
6035D485069Q9308M6000k3645j02917q1285j29890q4892j44138j50616m4940r234
6024C848820P6045J55915J92468K24217K41648L14665L15782M96936N86078P36345
$$ y = [1605060, 1625303, 1620700, 1554572, 1480556, 1502569, 1486286, 1440641, 1395640, 1408879, 1476507, 1452503, 1342459, 1382795, 1401285, 1405931, 1417074, 1443585, 1432378, 1424040, 1444485, 1401910, 1459611, 1462623, 1488259, 1534231, 1593232, 1644122, 1673485, 1717611, 1742504, 1754121, 1761784, 1830563, 1927502, 2053725, 2204359, 2298807, 2428331, 2489316, 2595027, 2687441, 2755633, 2818861, 2763738, 2559629, 2483913, 2398787, 2319820, 2217020, 2142887, 2205388, 2290993, 2298770, 2339281, 2468258, 2537190, 2663808, 2740090, 2807507, 2903829, 3105161, 3317538, 3527335, 3765838, 4051167, 4270928, 4485069, 4574377, 4620377, 4596732, 4493815, 4412530, 4282640, 4197748, 4053610, 3902994, 3858054, 3848820, 3924865, 4080780, 4273248, 4497465, 4739113, 5053778, 5369560, 5866496, 6452574, 7188919]
6014G188919Q63324R09201P63342K06218l40887p11556r65064r85194p37409n43580
6004E647314l62289l73621j93306j83193j18977j24930j17246r4350j10631q9062
5994C879709q037P379L3838k1248m645N5423n3867j879N4512n8760M4438L1032
5982C957895L6882L9922l4316K00P3475R3093K6340O611O2686O2122J41245L0817
5970D496972j6949Q8144K3588P9519Q4977M2107J09426J57318J12505J25615O9543
5959E372765J37816J41593K21935J56760J30742J05878J25207J44978J38200J11967
5949F787841J09025J11005J91254K63832J96158K35053L14614K79944K40690L89696
5939I119112L73183K83431J82024J98815K15664J88186K76668L59551M05926L90771
$$ y = [7188919, 8052243, 8961444, 9724786, 9931004, 9590117, 8878561, 7913497, 6928303, 6190894, 5647314, 5285025, 4911404, 4718098, 4534905, 4415928, 4290998, 4173752, 4079402, 3968771, 3879709, 3871672, 3879051, 3912889, 3891641, 3886996, 3942419, 3888552, 3886673, 3941185, 3882425, 3926863, 3957895, 3994777, 4034699, 4000383, 4000583, 4074058, 4167151, 4193491, 4200102, 4262788, 4324910, 4466155, 4496972, 4480023, 4568167, 4591755, 4671274, 4756251, 4798358, 4907784, 5065102, 5177607, 5303222, 5372765, 5510581, 5652174, 5874109, 6030869, 6161611, 6267489, 6392696, 6537674, 6675874, 6787841, 6896866, 7007871, 7199125, 7462957, 7659115, 7894168, 8208782, 8488726, 8729416, 9119112, 9492295, 9775726, 9957750, 10156565, 10372229, 10560415, 10837083, 11196634, 11602560, 11993331]
5929A1993331L72865M10684M10565K69774L14055K76757K28760L12571L51665
5920A4941027M88089N70625O67820P93988Q72054R28480J030435J236961J405128
5911B2934607J552809J857475K010704K261585K546995K787271L047504L496465
5903D2495415M311142N256326N717628M645723J375028k730800m954108m873489
5895E1242865l699020k230568q92995n0028Q84623J906807K806741L371027L203907
5886E6543359K884528L508853M265410M400797L396295K784750L114890J977881
5878H2876763p11000l614486m738570l922691k315514j157827j119201k393634
5870F2903840l269140k409115j671080j440976j653220j301326m49155P33391
$$ y = [11993331, 12366196, 12776880, 13187445, 13457219, 13771274, 14048031, 14276791, 14589362, 14941027, 15429116, 15999741, 16667561, 17461549, 18333603, 19262083, 20292518, 21529479, 22934607, 24487416, 26344891, 28355595, 30617180, 33164175, 35951446, 38998950, 42495415, 46806557, 52062883, 57780511, 62426234, 63801262, 61070462, 56116354, 51242865, 47543845, 45313277, 44420282, 44370254, 45254877, 47161684, 49968425, 53339452, 56543359, 59427887, 62936740, 67202150, 71602947, 74999242, 77783992, 80898882, 82876763, 82165763, 78551277, 73812707, 69890016, 67574502, 66416675, 65297474, 62903840, 59634700, 57225585, 55554505, 54113529, 52460309, 51158983, 50709828, 51443219]
5862E1443219K044781L286445M579787N763642N845839L517148j654227o610893
5854F8215741q178509p417059n902883m348781l126672k389603j741802j323050
5846C3787382r40811n59808k21894J6617J65118M69248N38182P28313R27129J355475
5836C6264951J736812K149300K806227L400865M112018M505565M399258L227849
5828F2602845J129397j031909k632014l255135k893609k070355j048682k27744
5820E0572794M69922P22646Q66969J328496K145268L075453M207820N507510O705410
5811G5602288P222654O279781L630441Q6471k512472l924115l992559l481952
5803G8910537l478207m339533n305850n100559l967483k629243j378078l24887
$$ y = [51443219, 53488000, 56774445, 61354232, 67117874, 72963713, 76480861, 74826634, 68215741, 60037232, 52620173, 46717290, 42368509, 39241837, 36852234, 35110432, 33787382, 32846571, 32286763, 32064869, 32081486, 32246604, 32715852, 33254034, 33982347, 34909476, 36264951, 38001763, 40151063, 42957290, 46358155, 50470173, 54975738, 59374996, 62602845, 63732242, 62700333, 60068319, 56813184, 53919575, 51849220, 50800538, 50572794, 51042716, 51765362, 52632331, 53960827, 56106095, 59181548, 63389368, 68896878, 75602288, 82824942, 89104723, 92735164, 92821635, 90309163, 86385048, 82392489, 78910537, 75432330, 71092797, 65786947, 60686388, 56718905, 54089662, 52711584, 52386697]
5795E2386697M68838J152730J521254J755006K300534L290618M067945M346293
5787G1289915L170658K52366l614873o628540p732945p370612o291813n038610
5779C8035546m083546l255718k654717k237923j840074j570915j355028j179459
5771A9858166r59713q95703p55781p01769p35098o57546o01476n12164o11396
5762A3427520n20770m71259m66639l28957m09213l53294k94700l31601l19665
5753I931422k26770l08078k03214k29505k40548k36896j76126j98223j42363j60995
5743G808704j21514r5824k03325j04915k17734p1539j35837j48683j12982r1224
5733F505127r5481j07154j26747j06362m2519N8578j37795o2018q1705m1478o0559
$$ y = [52386697, 52855535, 54008265, 55529519, 57284525, 59585059, 62875677, 66943622, 71289915, 74460573, 74712939, 71098066, 64469526, 56736581, 49365969, 43074156, 38035546, 33952000, 30696282, 28041565, 25803642, 23963568, 22392653, 21037625, 19858166, 18898453, 18002750, 17246969, 16545200, 15810102, 15152556, 14551080, 14038916, 13427520, 12906750, 12435491, 11968852, 11639895, 11230682, 10877388, 10582688, 10251087, 9931422, 9704652, 9396574, 9193360, 8963855, 8723307, 8486411, 8310285, 8112062, 7969699, 7808704, 7687190, 7591366, 7388041, 7283126, 7065392, 6993853, 6858016, 6709333, 6596351, 6505127, 6409646, 6302492, 6175745, 6069383, 6026864, 6085442, 5947647, 5885629, 5803924, 5762446, 5701887]
5722E701887j01835j7214k2067p1702J2926k9031m1245l9900J7910K6150r8066
5711E337813j7170m3113M8226L9214n6735L2456R4439n973j5584l3423o6395j2232
5699E301523L6343J031j9621j4648M8618n2834j2140K495K5559N2662M2905m957
5687E406936J6922R8294J56464P4638J25032P1577L0882J0858J36895N651J0019
5676F144168m954Q8155Q0221K9467J07248J7136N7712P8994j3648O9269L1284
5665F685052J9619J68662O8317J14759N2940O3182J70215Q0939J11941J48458
5655G684084K12115K41987K15859K65990K86121K85865L92994L33627L76988L24570
5645A0620200J88736L5612p7970r3487N484R3696J57720J35165K60154K60935
$$ y = [5701887, 5600052, 5582838, 5560771, 5489069, 5501995, 5472964, 5431719, 5391819, 5409729, 5435879, 5337813, 5320643, 5277530, 5325756, 5364970, 5308235, 5340691, 5435130, 5429157, 5413573, 5380150, 5313755, 5301523, 5337866, 5338897, 5319276, 5304628, 5353246, 5300412, 5288272, 5290767, 5316326, 5368988, 5411893, 5406936, 5423858, 5522152, 5678616, 5753254, 5878286, 5949863, 5980745, 5991603, 6128498, 6134149, 6144168, 6139214, 6227369, 6307590, 6337057, 6444305, 6461441, 6519153, 6598147, 6584499, 6653768, 6685052, 6704671, 6873333, 6941650, 7056409, 7109349, 7172531, 7342746, 7423685, 7535626, 7684084, 7896199, 8138186, 8354045, 8620035, 8906156, 9192021, 9585015, 9918642, 10295630, 10620200, 10808936, 10844548, 10766578, 10673091, 10678575, 10772271, 10929991, 11065156, 11325310, 11586245]
5635A1586245K40187L03777L35820M83208N03525O05186O65291O99895O66169
5626A6089303M87440M01599M21149L37677K66590L62625L46998L75406K98251
5617A9387038L74447M52736N60503P91795R33622J064490J270238J413877J545225
5608B7793971J851118K173329K437117K690294L050250L358513L635461M033606
5600E1023659M422171M535342M249470L109275J466147l43821j873372k687748
5592F3901123k681854k323630j739048j214932o96914k10114M25192J005168J690140
5583E8155131K437722L000059L354422L426509L191834L048909K718656K247322
5575H1580564J409144J60125j454351l166811m368063m909899m738628m031539
$$ y = [11586245, 11826432, 12130209, 12466029, 12949237, 13452762, 14057948, 14723239, 15423134, 16089303, 16576743, 16978342, 17399491, 17737168, 18003758, 18366383, 18713381, 19088787, 19387038, 19761485, 20214221, 20774724, 21566519, 22500141, 23564631, 24834869, 26248746, 27793971, 29645089, 31818418, 34255535, 36945829, 39996079, 43354592, 46990053, 51023659, 55445830, 59981172, 64230642, 67339917, 68806064, 68462243, 66588871, 63901123, 61219269, 58895639, 57156591, 55941659, 55244745, 55034631, 55459823, 56464991, 58155131, 60592853, 63592912, 66947334, 70373843, 73565677, 76614586, 79333242, 81580564, 82989708, 83149833, 81695482, 78528671, 74160608, 69250709, 64512081, 60480542]
5567F0480542l239953k381942j666752r89425n88963k85856m137L79379Q22433
5558E2525326J189687J369241J256276Q07852r0453j239399k314825k988569l206179
5549D7308957l121414k721678k301070j955509j525243j180409r25316o28018
5541C2950300l62597j32611j1231J15471L94388N92801P03317R01875J085037
5532C6236750J407553J711765K028225K431549K902444L398437L832029M207798
5524E8156550M091059L390299J947770j20709j954935k723596k848859k416554
5516E7521025j596187p75163K3870O85342J122174J350528J573938J649612J731687
5507F3286826J748764J704318J648017J741861K071360K130619J710649O56094
$$ y = [60480542, 57240589, 54858647, 53191895, 52202470, 51613507, 51327651, 51323514, 51702893, 52525326, 53715013, 55084254, 56340530, 57148382, 57057929, 55818530, 53503705, 50515136, 47308957, 44187543, 41465865, 39164795, 37209286, 35684043, 34503634, 33578318, 32950300, 32587703, 32455092, 32443861, 32559332, 32953720, 33546521, 34249838, 35151713, 36236750, 37644303, 39356068, 41384293, 43815842, 46718286, 50116723, 53948752, 58156550, 62247609, 65637908, 67585678, 67464969, 65510034, 62786438, 59937579, 57521025, 55924838, 55149675, 55173545, 55858887, 56981061, 58331589, 59905527, 61555139, 63286826, 65035590, 66739908, 68387925, 70129786, 72201146, 74331765, 76042414, 76698508]
5499G6698508p16667j943905k696437l098132l198653l205692l024555k734261
5491E6080206k350671k081523j758976j321177o83947l2820N84170J191231J680311
5482E1306804J938540J795500R56480l78914j898575l135462l822367l692012
5474D3069994l411172k991791k622118k479922k229292k043719j800180j489774
5466B4002026j335937j170170q96980q88960q33062p29576o70794o05498n31306
5457A6339743m50422l51099l30484l26921k34273j76245j03964j21674l3580q5447
5447A4125634m8321k18406k07071k30200l45089m35050m79264l52490l69098l62870
5437A1077775k92595k76233k71953k02422k20376m8744r5995j12046R670M8293
$$ y = [76698508, 75981841, 74037936, 71341499, 68243367, 65044714, 61839022, 58814467, 56080206, 53729535, 51648012, 49889036, 48567859, 47883912, 47851092, 48435262, 49626493, 51306804, 53245344, 55040844, 55997324, 55618410, 53719835, 50584373, 46762006, 43069994, 39658822, 36667031, 34044913, 31564991, 29335699, 27291980, 25491800, 24002026, 22666089, 21495919, 20598939, 19709979, 18876917, 18147341, 17476547, 16871049, 16339743, 15889321, 15538222, 15207738, 14880817, 14646544, 14470299, 14366335, 14244661, 14211081, 14125634, 14077313, 13858907, 13651836, 13421636, 13076547, 12641497, 12162233, 11809743, 11440645, 11077775, 10785180, 10508947, 10236994, 10034572, 9814196, 9765452, 9669457, 9557411, 9567081, 9615374]
5427I615374R233k5688l5198j3083Q9439M8940j5196j22854j60014k28190j86662
5416H976101k01054j81653l9773k4194o0806J3974J27892P6587J38254R9875P4904
5405I000107N2645N3962J9590N8861P4447o4874q9078k5986m4655j21654k02728
5394H710637j51091j09865q7319j5817L660k0789P9481M9967J2901K941L7887
5383H512593n3741l2786o007j5221Q1846M3517m2118r3771j49035k16268k43010
5372G785999j93201j51030n4680l6407k4886r8517n7652k9122q7321j21605k03454
5361F728124j27819j24458q8603l9282o2201l4627J3006J26213O5375J25148R3165
5350F674041J32579J75639J02544L4605p3491j15419k09805k33287k62242k03908
$$ y = [9615374, 9624607, 9598919, 9563721, 9550638, 9640077, 9689017, 9673821, 9550967, 9390953, 9162763, 8976101, 8775047, 8593394, 8553621, 8529427, 8468621, 8482595, 8610487, 8687074, 8825328, 8925203, 9000107, 9052752, 9106714, 9126304, 9185165, 9259612, 9194738, 9105660, 9079674, 9035019, 8913365, 8710637, 8559546, 8449681, 8362362, 8346545, 8350205, 8329416, 8408897, 8458864, 8471765, 8474706, 8512593, 8458852, 8426066, 8420059, 8404838, 8486684, 8530201, 8488083, 8394312, 8245277, 8029009, 7785999, 7592798, 7441768, 7387088, 7350681, 7325795, 7227278, 7169626, 7140504, 7053183, 6931578, 6728124, 6600305, 6475847, 6387244, 6347962, 6285761, 6251134, 6264140, 6390353, 6455728, 6580876, 6674041, 6806620, 6982259, 7084803, 7119408, 7045917, 6930498, 6720693, 6487406, 6225164, 6021256]
5340F021256j84182j52506r5181j13105q3213j9786R083K1281Q0263Q2925Q2860
5329E649695m3997L296R4617N0809k217O6723N0893M3680J34811n8025k44108
5318E746177k22888k04968k81276j75054j49649j03378j42142r4225l3241o2701
5308D276655m2549r038j08007L3167J6463n230N1364P2430M4685n152j5862k7137
5296D281789o4330j34366j44261q4387j02426r6357q3872j12721k2771K5493q2091
5285C379700M653K5342j5880q14J0145k9874O1245N8849q4763l554O4167M1399
5273C510615m8470Q3711m5078o4243m9114j9801K5380M3377M3284P7820L3407
5262C590888L7212j2717p271J3478L4781q594P1997Q0325k8581J4645k5600K5176
$$ y = [6021256, 5837074, 5684568, 5589387, 5476282, 5393069, 5373283, 5382366, 5403647, 5483910, 5566835, 5649695, 5605698, 5608994, 5703611, 5754420, 5752203, 5818926, 5869819, 5913499, 6048310, 5990285, 5746177, 5523289, 5318321, 5037045, 4861991, 4712342, 4608964, 4466822, 4372597, 4339356, 4276655, 4234106, 4225068, 4117061, 4150228, 4166691, 4161461, 4212825, 4285255, 4329940, 4324788, 4308926, 4281789, 4217459, 4083093, 3938832, 3854445, 3752019, 3655662, 3571790, 3459069, 3436298, 3461791, 3379700, 3384353, 3409695, 3393815, 3393001, 3403146, 3373272, 3434517, 3493366, 3408603, 3405049, 3469216, 3510615, 3462145, 3545856, 3500778, 3436535, 3387421, 3367620, 3393000, 3436377, 3479661, 3557481, 3590888, 3628100, 3615383, 3608112, 3621590, 3656371, 3647777, 3719774, 3800099, 3771518, 3786163, 3760563, 3785739]
5250C785739J4225k3041m0876j2370L4639m1666k1508N9760Q1629o619N892N2673
5238C888477j4621M4570N4757q668M1588N8952N9986r84J5257j3384j4606k3603
5226D087721L5026O8670M3925k5651n7176Q0381O4416k683L3318O0470K9070k9411
5214D388076L1306R388r048L8466N0391m1513l9274J26201O2398M9790j288O7131
5202D732024Q4192K7550M6800M1891k1867J26247J2519p825K3967O3182K1383
5191E150063k2064K0753R3184k612L2526P1012J89449J948K5226J09135L8514
5180E707134L6545N8199Q5734O5319K3071N5247m085R358R0090R0397O1010N6085
5168F334104J02198O4023j2978P5842P4070K3981J02429K9913O1198J25914M1451
$$ y = [3785739, 3799964, 3776923, 3736047, 3723677, 3758316, 3716650, 3695142, 3754902, 3836531, 3829912, 3835804, 3888477, 3873856, 3918426, 3973183, 3964515, 4006103, 4065055, 4125041, 4124057, 4139314, 4125930, 4111324, 4087721, 4122747, 4191417, 4235342, 4209691, 4152515, 4232896, 4297312, 4294629, 4327947, 4388417, 4417487, 4388076, 4419382, 4428770, 4419722, 4458188, 4508579, 4467066, 4427792, 4553993, 4616391, 4666181, 4664893, 4732024, 4816216, 4843766, 4890566, 4932457, 4910590, 5036837, 5049356, 5041531, 5065498, 5128680, 5150063, 5127999, 5148752, 5241936, 5239324, 5271850, 5342862, 5532311, 5534259, 5559485, 5668620, 5707134, 5743679, 5801878, 5887612, 5952931, 5976002, 6031249, 6027164, 6036522, 6126612, 6217009, 6278019, 6334104, 6436302, 6500325, 6487347, 6563189, 6637259, 6661240, 6763669, 6793582, 6854780, 6980694, 7022145]
5157G022145K7021O6559M3082J08074K6124J2996j0296N7536J4255J1803O2823
5146G442122L9070L3346O6146O1749L9449K7267P3600O3244R2115N7673L8768
5135H034549Q8834J34908M6960J2136K1738J59538P1395N315M4165R7359K6291
5124H743188O4129O4093R2874O6220M4105J03400O3801P8519M6068J02799Q0528
5113I549724n4738L5093J12687N7936Q6445N1547M5036R3138O3363k5463N3465
5102A0068233R4589P458M4091J11431R8217J08413R7941R4953L8668N1057m0293
5091A0774758n4555K4625n1854K4595Q226M5520N1309m1045K5271L4961Q741M987
5079A0855539M3696L6140L0273K7805k8805J00714N5754l784L7931J3012K2973
$$ y = [7022145, 7049166, 7115725, 7158807, 7266881, 7293005, 7306001, 7295705, 7353241, 7367496, 7379299, 7442122, 7481192, 7514538, 7580684, 7642433, 7681882, 7709149, 7782749, 7845993, 7938108, 7995781, 8034549, 8123383, 8258291, 8305251, 8317387, 8339125, 8498663, 8570058, 8575373, 8619538, 8716897, 8743188, 8807317, 8871410, 8964284, 9030504, 9074609, 9178009, 9241810, 9320329, 9366397, 9469196, 9549724, 9494986, 9530079, 9642766, 9700702, 9787147, 9838694, 9883730, 9976868, 10040231, 10014768, 10068233, 10162822, 10170280, 10214371, 10325802, 10424019, 10532432, 10630373, 10725326, 10763994, 10815051, 10774758, 10720203, 10744828, 10692974, 10717569, 10725795, 10771315, 10822624, 10781579, 10806850, 10841811, 10850552, 10855539, 10899235, 10935375, 10965648, 10993453, 10964648, 11065362, 11121116, 11117332, 11155263, 11168275, 11191248]
5068A1191248R6528Q4547J63371O5638J17017R6417J0750m6484j30508j16866
5058A1531658o2846l0635o393j2520o5568J0391m9240l0049q1762p1669q650M9457
5046A1172174j929n4227K8810k2150N232j3205O9786K8677K922j2760K4058J03716
5034A1331104J06922R2074k1788M689k5606p6527o380J5090n0090Q681L7991P0685
5022A1486845N8295J7091K0338O9059J48458K23294J69994J79228J65887K6455
5012A2564944r3005j66596l20551k57021k10353j01099j27440o0970k5942l7964
5002A1164003K7307j4196p0145l265M6526M2223P4024J25085L5230J06611J25893
4991A1659296J46731J88613K78006M21975M62103M06669K04310k12106l62237
$$ y = [11191248, 11287776, 11372323, 11535694, 11601332, 11718349, 11814766, 11825516, 11779032, 11648524, 11531658, 11468812, 11438177, 11431784, 11419264, 11353696, 11364087, 11314847, 11284798, 11203036, 11131367, 11122717, 11172174, 11170245, 11116018, 11144828, 11122678, 11127910, 11114705, 11184491, 11213168, 11216090, 11203330, 11227388, 11331104, 11438026, 11530100, 11508312, 11513001, 11487395, 11410868, 11404488, 11419578, 11369488, 11378169, 11416160, 11486845, 11545140, 11562231, 11582569, 11651628, 11800086, 12023380, 12193374, 12372602, 12538489, 12564944, 12471939, 12305343, 11984792, 11727771, 11517418, 11416319, 11288879, 11227909, 11201967, 11164003, 11191310, 11177114, 11106969, 11103704, 11150230, 11192453, 11266477, 11391562, 11426792, 11533403, 11659296, 11806027, 11994640, 12272646, 12694621, 13156724, 13563393, 13767703, 13555597, 13193360]
4982A3193360l87302m79722l42708k66598k31447k66203j69065r3755p0777j12462
4972A0773321j01907o681m1654j3365l1181r016N1683N0992Q168O942Q0490Q0350
4960A0848142J36941J49285J79329K07089K6635j5782j21292j56474k31386k26649
4950A0795838p7883j32432q1520j08563l0970p7298q8945k4652J2516n5041m7371
4939A0083679K7599J4129M6926j0606O5988p612n2150k8655m2073n7220Q9003
4928A0129008M5874j7100R6118r804l4267N0687j9107m1329O7257r878M4029J0738
4916A0312226M4681K6358q569K6579j1352m642R4511k204L8649l9841m6520K3488
4904A0453364n326L9910O2336K4573l4893K3565N6338O1956j091l8077j5560K6602
$$ y = [13193360, 12806058, 12326336, 11983628, 11717030, 11485583, 11219380, 11050315, 10956560, 10885783, 10773321, 10671414, 10664733, 10623079, 10609714, 10578533, 10569517, 10621200, 10672192, 10680360, 10687302, 10767792, 10848142, 10985083, 11134368, 11313697, 11520786, 11547421, 11531639, 11410347, 11253873, 11022487, 10795838, 10717955, 10585523, 10504003, 10395440, 10364470, 10287172, 10198227, 10173575, 10186091, 10131050, 10083679, 10111278, 10125407, 10172333, 10161727, 10227715, 10220103, 10167953, 10139298, 10097225, 10040005, 10129008, 10174882, 10157782, 10253900, 10244096, 10209829, 10260516, 10241409, 10200080, 10267337, 10257459, 10301488, 10312226, 10356907, 10383265, 10374696, 10401275, 10389923, 10385281, 10479792, 10477588, 10516237, 10476396, 10429876, 10453364, 10448038, 10487948, 10550284, 10574857, 10539964, 10563529, 10619867, 10681823, 10680732, 10642655, 10627095, 10653697]
4892A0653697M6754p25O986M312j6581l7260J4822R415L057P764j2903j3702K8544
4879A0694180j8980M4954k5658k6972L8922m5364O834l6911L870p332K2966k1974
4867A0628535n7584j3537l4042k5170o7570j3049J8807o7127j2025k965o7261
4856A0287012j8718m6952p880n4993m2054n8749l4060j9919m3020l0687o9172
4845I860808m7013o5637j20806o2074n919p6917j4701p4464o4838j3028m228j24010
4833I187173n1916K1636o3222j39231m5637o8008n2710n9774j01174m9053q6655
4822H491429q2497j4471l6618r5318n4830j14278o1718j04288j7550j7386p7155
4811G815320p7739q5265n2884q3054k3100m0846p2212p2674j17599p7760q6727
$$ y = [10653697, 10700451, 10699726, 10706712, 10711024, 10694443, 10657183, 10672005, 10681420, 10684477, 10692241, 10679338, 10665636, 10694180, 10675200, 10720154, 10694496, 10667524, 10706446, 10661082, 10667916, 10631005, 10634875, 10627543, 10650509, 10628535, 10570951, 10557414, 10523372, 10498202, 10430632, 10417583, 10436390, 10369263, 10357238, 10354273, 10287012, 10268294, 10221342, 10213462, 10158469, 10116415, 10057666, 10023606, 10003687, 9960667, 9929980, 9860808, 9813795, 9748158, 9627352, 9565278, 9559359, 9482442, 9467741, 9393277, 9328439, 9315411, 9311183, 9187173, 9135257, 9156893, 9093671, 8954440, 8908803, 8840795, 8788085, 8728311, 8627137, 8578084, 8491429, 8408932, 8394461, 8357843, 8262525, 8207695, 8093417, 8031699, 7927411, 7909861, 7892475, 7815320, 7737581, 7652316, 7599432, 7516378, 7493278, 7452432, 7380220, 7307546, 7189947, 7112187, 7025460]
4800G025460n2232k3143j08173m5734r6177r5195J4152n0786j01154j20494m9636
4789F296888l0382p2070P891j5711n9296n7016k6255q1982n8937j09977o0927
4778E732226l7231j02415j1273r3769k9271M606J0059j07066n7854n8340l1484
4767E218188l3505m9593k17m0753q9983m4020k8788q0988j9436q7317p1692k154
4755D669742K0688q5520n4926J7925m6033o7503j3918m776k2296L8064m4745k7968
4743D378734o9890n0416k9984l226k9388p7795m7204l9584j7849o246N2223j1732
4731D047643k8413j102L2758r2954j17213k2274Q4838m7338q6806m6259L6340
4720C759220n3584l0894l4544j9739q3215j8133q372k8142k7273m9673q3270J7728
$$ y = [7025460, 6973228, 6950085, 6841912, 6796178, 6700001, 6604806, 6618958, 6568172, 6467018, 6346524, 6296888, 6266506, 6194436, 6202327, 6186616, 6127320, 6070304, 6044049, 5962067, 5903130, 5793153, 5732226, 5694995, 5592580, 5581307, 5487538, 5458267, 5462873, 5472932, 5365866, 5308012, 5249672, 5218188, 5184683, 5135090, 5134873, 5094120, 5004137, 4960117, 4931329, 4850341, 4830905, 4743588, 4671896, 4669742, 4690430, 4604910, 4549984, 4567909, 4521876, 4454373, 4440455, 4435679, 4413383, 4451447, 4406702, 4378734, 4308844, 4258428, 4228444, 4225218, 4195830, 4118035, 4070831, 4031247, 4013398, 4007152, 4059375, 4047643, 4019230, 4018128, 4050886, 3957932, 3840719, 3818445, 3903283, 3855945, 3769139, 3722880, 3759220, 3705636, 3674742, 3640198, 3620459, 3537244, 3519111, 3510739, 3482597, 3455324, 3405651, 3322381, 3340109]
4708C340109L1544l893k4320l5427J2688j921k5884j7330n771m4999k9911K5893
4696C220778L1074j08559k4401J0059J2931k3819q9082l931n4875J5088Q86q4772
4684B901377k3946J4903M1222l1487l8381J8518J1503o9621o9K9098J314j3806
4672B840625j4969k3976k6621K3550j8289Q970k9243m9401N1624q32m9360k7402
4660B684676k8961L3672O7395k7721q437m1330O3854k3291j0064J2320m6193r4382
4648B581538K7082L9275o5800m320J5122n2788O404k5836M2443j6544m274m4381
4636B497921l8153j6651L7399K5706o1432N7085j6465n6098k9730M4568j5693
4625B428457N2775O922J1060l2342o8960q72j3643k110p636K1746J0319n3103
$$ y = [3340109, 3371653, 3367760, 3343440, 3308013, 3320701, 3318780, 3292896, 3275566, 3269795, 3224796, 3194885, 3220778, 3251852, 3143293, 3118892, 3128951, 3141882, 3118063, 3028981, 3025050, 2970175, 2985263, 2986149, 2901377, 2877431, 2892334, 2933556, 2902069, 2863688, 2882206, 2893709, 2824088, 2824019, 2853117, 2854431, 2840625, 2825656, 2801680, 2775059, 2798609, 2780320, 2789290, 2760047, 2710646, 2762270, 2761438, 2712078, 2684676, 2655715, 2689387, 2756782, 2729061, 2720624, 2679294, 2743148, 2719857, 2709793, 2722113, 2675920, 2581538, 2608620, 2647895, 2582095, 2577775, 2592897, 2540109, 2546513, 2520677, 2563120, 2546576, 2542302, 2497921, 2459768, 2443117, 2480516, 2506222, 2444790, 2501875, 2485410, 2429312, 2399582, 2444150, 2428457, 2481232, 2488154, 2499214, 2466872, 2397912, 2397040, 2383397, 2381287, 2373651, 2395397, 2405716, 2352613]
4613B352613j5091m515N6425K1685J372j9710k6160M6924k477q006l8708m1150
4601B323202L1724J3434j8492P9160m5779q1182N4068J6429l6722m9007k5590
4590B261245L4420J5987j4636l8211K713j3235Q7269l5098l5017L2434N3596m0763
4578B310704k5179m8581O2642l2028l2121L3634j6706m7823J2215l486N1844j6633
4566B248482k4755N6557l1197J6757J7146K5602k3645j8308p1006P762J8112L1150
4554B252657n4892k4453j4947K3454M613j0159J3962K9298m7088N1057j6196p7489
4542B129817k7991L526J422j6462K1935L6881j5261j6982r993N109L3889K0277
4530B166167L1967q2399j6738M2043J6991j6836K2866K6943q3044K6911L3776
$$ y = [2352613, 2337522, 2333007, 2389432, 2411117, 2412489, 2392779, 2366619, 2413543, 2411066, 2403060, 2364352, 2323202, 2354926, 2368360, 2349868, 2429028, 2383249, 2302067, 2356135, 2372564, 2335842, 2286835, 2261245, 2295665, 2311652, 2297016, 2258805, 2261518, 2248283, 2335552, 2300454, 2265437, 2297871, 2351467, 2310704, 2285525, 2236944, 2299586, 2267558, 2235437, 2269071, 2252365, 2204542, 2216757, 2213271, 2265115, 2248482, 2223727, 2280284, 2249087, 2265844, 2282990, 2308592, 2284947, 2266639, 2195633, 2203395, 2221507, 2252657, 2197765, 2173312, 2158365, 2181819, 2186432, 2176273, 2190235, 2219533, 2172445, 2223502, 2207306, 2129817, 2101826, 2105352, 2106774, 2090312, 2112247, 2149128, 2133867, 2116885, 2106892, 2112001, 2145890, 2166167, 2198134, 2115735, 2098997, 2141040, 2158031, 2141195, 2164061, 2191004, 2107960, 2134871, 2168647]
4519B168647k4023j5146Q2524k3011q5823J216L0123N537Q3799m1508o0605k689
4507B119041J2260k6892n0372k3663L8250j1751M8143J0819r890j2117O5765k0415
4495B139178l3794l9361N1748O3594J1150r44J4076M1723p369J3408j033M0600
4483B292976N6069J9178l469l0292J6909L3331N3383l0793l9953j6593j7486o6382
4471B266878M4410k0239q1798r854l087P5822O211m4880j3210M2963Q970m2715
4459B229471k8815j584j2240L0621M5976j8532j9418K3028R831J1047m0879O2387
4447B290893J9206O0271k3563l4313k7915J08094j2570j5022j2672j7205l6452
4436B298752O4296M2301l2955n893N2880M6827L7025J1888n753K4884j1371M4610
$$ y = [2168647, 2144624, 2129478, 2212002, 2188991, 2103168, 2104384, 2134507, 2140044, 2223843, 2182335, 2121730, 2119041, 2131301, 2104409, 2054037, 2030374, 2068624, 2056873, 2105016, 2115835, 2105945, 2093828, 2159593, 2139178, 2105384, 2066023, 2117771, 2181365, 2192515, 2191571, 2205647, 2247370, 2240001, 2253409, 2252376, 2292976, 2349045, 2368223, 2364754, 2334462, 2351371, 2384702, 2438085, 2407292, 2367339, 2350746, 2333260, 2266878, 2311288, 2291049, 2209251, 2199397, 2196310, 2272132, 2278343, 2233463, 2220253, 2263216, 2272186, 2229471, 2200656, 2199072, 2186832, 2217453, 2263429, 2244897, 2225479, 2248507, 2258338, 2269385, 2228506, 2290893, 2310099, 2370370, 2346807, 2312494, 2284579, 2392673, 2380103, 2365081, 2352409, 2335204, 2298752, 2363048, 2405349, 2372394, 2366501, 2419381, 2466208, 2503233, 2515121, 2509368, 2534252, 2522881, 2567491]
4424B567491q931K0094k221L9684M5979L1973L6976P3279Q0252R6910P8708J4585
4412C074779Q8422R6458J02044J16472K21657J84521K73306J51839J93147q4655
4402D417990k45051j96245j72305k00710p1437m1192q6502j0405o5160o551Q4035
4391C406467k3270M4592J309M9798M1823N5823P7892L9289J26961Q6078M5936
4380C952698N8528J04298J20707J40336R6325J21065K31673K47740K58575L02470
4370E634415L88281M66712N34248P52557Q25194J001082J220487J147947N87581
4361A2558504q5875l99670j95164J08092K16244k40429r52277j280031j174013
4352H555381r88428p07783o10195m74963k98984k32420j87125r5843j06692q8979
$$ y = [2567491, 2558560, 2578654, 2576433, 2616117, 2662096, 2694069, 2731045, 2804324, 2884576, 2981486, 3060194, 3074779, 3163201, 3259659, 3361703, 3478175, 3699832, 3884353, 4157659, 4309498, 4502645, 4417990, 4172939, 3976694, 3804389, 3603679, 3532242, 3491050, 3404548, 3394143, 3328983, 3322432, 3406467, 3383197, 3427789, 3429098, 3478896, 3520719, 3576542, 3654434, 3693723, 3820684, 3906762, 3952698, 4011226, 4115524, 4236231, 4376567, 4472892, 4593957, 4825630, 5073370, 5331945, 5634415, 6022696, 6489408, 7023656, 7776213, 8601407, 9602489, 10822976, 11970923, 12558504, 12472629, 12072959, 11877795, 11985887, 12202131, 11961702, 11009425, 9729394, 8555381, 7566953, 6859170, 6248975, 5774012, 5475028, 5242608, 5055483, 4959640, 4852948, 4763969]
4342D763969j51272j47036r1642j50435j44288n3590m397O1527j6162j33142j66073
4331C767459m7087r5892j15883o9048n9095J1932j20n0622L674k4431m3306K7385
4319C304966L3826k6109k3481l7621k7108m5881L2866M1326j1223l2055p211m828
4307C197467k2669M087L771n8697m6607m1191R0549p3678l6346k3269j26928L8937
4295B905426L3240R5599k5414J6257l3003M3109J24080P3025R0608L2057K1718
4284C376702j7214R229o4993J608Q0604j5672k977n984J4918K1770k3793M277
4272C378475K1890j6396l5445n351o3875k613J1841R2171L5831j5237N3832M0486
4260C495609k2879Q970J21367Q8472K8829j0745M4268K077J99Q6583P7215N9395
$$ y = [4763969, 4612697, 4465661, 4374019, 4223584, 4079296, 4025706, 4021309, 4082836, 4066674, 3933532, 3767459, 3720372, 3624480, 3508597, 3439549, 3380454, 3392386, 3392266, 3341644, 3345318, 3320887, 3277581, 3304966, 3338792, 3312683, 3289202, 3251581, 3224473, 3178592, 3211458, 3252784, 3241561, 3209506, 3202295, 3197467, 3174798, 3178885, 3182656, 3123959, 3077352, 3036161, 3126710, 3053032, 3016686, 2993417, 2866489, 2905426, 2938666, 3034265, 3008851, 3025108, 2992105, 3035214, 3159294, 3232319, 3322927, 3354984, 3376702, 3359488, 3368717, 3303724, 3305332, 3385936, 3370264, 3367287, 3361303, 3376221, 3397991, 3374198, 3378475, 3400365, 3383969, 3348524, 3343173, 3279298, 3276685, 3288526, 3380697, 3416528, 3401291, 3455123, 3495609, 3472730, 3481700, 3603067, 3691539, 3720368, 3709623, 3753891, 3755968, 3756167, 3842750, 3919965, 3979360]
4248C979360P2126J12878J22555P9605P0819L3931k8354L8547k1179j9093J0520
4237D451715K5116M4163Q8338Q0575N8743P3233O8321O3876L1123Q1125J82812
4226E249140N7702J2500J75453Q2799O8532J25583M0878Q9118R3045J00562J32637
4215F227949J25401J58484J37464K01329K19207K38787J90573K33755K32646K99417
4205H265012L59471L95229M53000N58063O63899P56671Q79666J043125J211704
4196A4585840J497447J868619K006480J439321K69901j304148j897140j842069
4188A6624251j417202j018553p87330n11193l79973l01459j30517j68654n5585
4179A1853785j0967O345J16893R3495J85209K06856K41896K11379J45432J99004
$$ y = [3979360, 4051486, 4164364, 4286919, 4366524, 4437343, 4471274, 4442920, 4481467, 4460288, 4441195, 4451715, 4476831, 4520994, 4609332, 4689907, 4748650, 4821883, 4890204, 4954080, 4985203, 5066328, 5249140, 5306842, 5319342, 5494795, 5577594, 5646126, 5771709, 5812587, 5901705, 5994750, 6095312, 6227949, 6353350, 6511834, 6649298, 6850627, 7069834, 7308621, 7499194, 7732949, 7965595, 8265012, 8624483, 9019712, 9472712, 10030775, 10694674, 11451345, 12331011, 13374136, 14585840, 16083287, 17951906, 19958386, 21397707, 21667608, 20363460, 18466320, 16624251, 15207049, 14188496, 13401166, 12889973, 12510000, 12208541, 12078024, 11909370, 11853785, 11842818, 11849163, 11966056, 12059551, 12244760, 12451616, 12693512, 12904891, 13050323, 13249327]
4169A3249327J60608J16703J79866J76831K81358K71642L41749L86697L57139
4160A5521920M51942M56584N57003N42892O52305O47058O65358O88050O62621
4151B0845733P99016Q69987P95308J008426J058923J086153J113435J316043J342977
4142C0236001J298216J415447J419677J492210J717691J889634K331850K635190
4134D4435916L122485L503566M033922M490908N034714N510877O345524P615042
4126H4092954R348918J1234738J3903629J7429198K2333294K8363991L5836218
4119B22542940M2090572M1227128K5044592m873414l2494897m8298820m6090329
4112A99147772l6807591k7314361k0070775j5236667j1949291r625413p830175
$$ y = [13249327, 13409935, 13526638, 13706504, 13883335, 14164693, 14436335, 14778084, 15164781, 15521920, 15973862, 16430446, 16987449, 17530341, 18182646, 18829704, 19495062, 20183112, 20845733, 21644749, 22514736, 23310044, 24318470, 25377393, 26463546, 27576981, 28893024, 30236001, 31534217, 32949664, 34369341, 35861551, 37579242, 39468876, 41800726, 44435916, 47558401, 51061967, 55095889, 59586797, 64621511, 70132388, 76477912, 84092954, 93441872, 104676610, 118580239, 136009437, 158342731, 186706722, 222542940, 264633512, 305860640, 330905232, 326031818, 293536921, 245238101, 199147772, 162340181, 135025820, 114955045, 99718378, 87769087, 78143674, 70313499]
4105G0313499o404730n179312m343781l616520l291030l015716k722727k486867
4097C9252816k380522k157894k017931j722546j551208j386711j210326j126509
4089B5699169j065645r78942q78254q43427p43659o32788o97934n36138m42873
4080A8879509m00948n57004p35544o91070o51818o54841o24742m94269m45496
4071A3623777m04241l46546k76219l31674l52566l23117m24276m18365l82934
4062A0363839l26485j68870r7745j79270o7029r1213j71756j02958r8530j65758
4052H894225j90586j85901j93806j95152j24173j41806r2243j04319r3949j51707
4042G420583j38614j64513j39209j09174l5557j10434q4593n5308j45933j23766
$$ y = [70313499, 63908769, 58729457, 54385676, 50769156, 47478126, 44462410, 41739683, 39252816, 36872294, 34714400, 32696469, 30973923, 29422715, 28036004, 26825678, 25699169, 24633524, 23654582, 22776328, 21932901, 21189242, 20556454, 19858520, 19322382, 18879509, 18478561, 17921557, 17186013, 16494943, 15843125, 15188284, 14563542, 14069273, 13623777, 13219536, 12872990, 12596771, 12265097, 11912531, 11589414, 11165138, 10746773, 10363839, 10037354, 9868484, 9770739, 9591469, 9524440, 9433227, 9261471, 9158513, 9059983, 8894225, 8703639, 8517738, 8323932, 8128780, 8004607, 7862801, 7770558, 7666239, 7572290, 7420583, 7281969, 7117456, 6978247, 6869073, 6833516, 6723082, 6638489, 6583181, 6437248, 6313482]
4032F313482L4016K5605Q42o4216p7414j11754l5522r4590l04439k77486j72571
4021E235953j88742j44228j32819j22685j01503r9959o5296m2975o3327m9635
4011D224784j13659r2956K5753p1476j00808q5663J2926m5088j27842q9463p3305
4000C463203n4005M120o3899q8378n4392j6979j2753K7687j1115j05785k880m1015
3988C043809K6412j1662K069k3304l6283k6515J9368m9731K1919m9727J5071o993
3976B924433r645p7805p2280L2960o104l5237j9234M6496o5238n4424k9431l5099
3964B599392q0470J9089l2025n5298l2287k9464m870Q505P5715p7390M8180J30587
3952B569664N2091K9685r4032l3033J5236P728K277J3601n5637k4367M8431J1609
$$ y = [6313482, 6347498, 6373103, 6373945, 6309729, 6232315, 6120561, 6085039, 5990449, 5686010, 5408524, 5235953, 5047211, 4902983, 4770164, 4647479, 4545976, 4446017, 4380721, 4337746, 4274419, 4224784, 4111125, 4018169, 4043922, 3972446, 3871638, 3785975, 3798901, 3753813, 3625971, 3536508, 3463203, 3409198, 3413318, 3349419, 3261041, 3206649, 3189670, 3176917, 3204604, 3193489, 3087704, 3084824, 3043809, 3070221, 3058559, 3060628, 3037324, 3001041, 2974526, 2993894, 2944163, 2966082, 2916355, 2931426, 2924433, 2914788, 2836983, 2764703, 2797663, 2791559, 2756322, 2737088, 2783584, 2718346, 2663922, 2634491, 2599392, 2518922, 2538011, 2505986, 2450688, 2418401, 2388937, 2384067, 2392572, 2468287, 2390897, 2439077, 2569664, 2621755, 2651440, 2557408, 2524375, 2539611, 2547339, 2549616, 2563217, 2507580, 2483213, 2531644, 2543253]
3940B543253l0336j3241m9300j5503L1859K8381l3947j00371k4130k6552n1820
3929B258293R3973Q4510J20476K06267J95367R8479J77587J11476r42J49159R3349
3918C587994l6229k11522k28134k26652k46257j61225q3522j24725j34420m7981
3908B087327p4173m2393q5172l2339m9128M074Q4859K6999o8769K283k2457k6302
3896A804809k350n9184n4106l1116o6072O1168n1317j3227m3539n5179k3717m8498
3884A417672j9625o5878j9448o9112n4310M1559K4144j9217l9723l2975n0259
3873A112828L668K4489k8672r482j1416k9325P398p535m4359N2283K9454l5637
3861A063694o93L0962L1052Q611Q973K2724p59L492O537Q324l8521J5089j579
$$ y = [2543253, 2512917, 2499676, 2450376, 2434873, 2466732, 2495113, 2461166, 2360795, 2336665, 2310113, 2258293, 2352266, 2436776, 2557252, 2763519, 2958886, 3057365, 3234952, 3346428, 3345486, 3494645, 3587994, 3551765, 3340243, 3112109, 2885457, 2639200, 2477975, 2394453, 2269728, 2135308, 2087327, 2013154, 1970761, 1885589, 1853250, 1804122, 1808196, 1893055, 1920054, 1851285, 1853568, 1831111, 1804809, 1802459, 1743275, 1689169, 1658053, 1591981, 1653149, 1601832, 1588605, 1545066, 1489887, 1466170, 1417672, 1398047, 1332169, 1312721, 1243609, 1189299, 1230858, 1255002, 1235785, 1196062, 1163087, 1112828, 1116496, 1140985, 1112313, 1102831, 1091415, 1062090, 1069488, 1061953, 1017594, 1069877, 1099331, 1063694, 1063001, 1093963, 1125015, 1133626, 1142599, 1165323, 1164564, 1168056, 1174593, 1182917, 1144396, 1159485, 1157906]
3848A157906n387k6982n3271o849K781j8008K8849L1576j1130l9006o51Q1103
3836A140931O0797K0484J43780N8346J09477J29207J70859J90108J90745J97847
3826B412581M3141j01801k17448k42189k22258j86164r0395j03653m2681l5958
3816A213175j65656k7920n0161k439j3746m736k6058j0647l3006p0314l5526L675
3804G76641l838j8774J0861k0713q254l2946j3547J9628J0317l8936j3875M2944
3792G09508m499O0m0761K5731N6610j2453k8886l4284J9406m3615k40K2552m5670
3779F23459o8795K180O1554j1777o7554j4941M3446P116k2828K6155N4545p4836
3767E57724K6180k0214j0612L0073p234L6903j04242K5388M2155J9702K8427L4067
$$ y = [1157906, 1152519, 1125537, 1072266, 1065417, 1068198, 1050190, 1079039, 1110615, 1099485, 1060479, 1059828, 1140931, 1201728, 1222212, 1365992, 1424338, 1533815, 1663022, 1833881, 2023989, 2214734, 2412581, 2455722, 2353921, 2136473, 1894284, 1672026, 1485862, 1395467, 1291814, 1249133, 1213175, 1047519, 1019599, 969438, 966999, 953253, 948517, 922459, 911812, 878806, 808492, 772966, 776641, 772803, 754029, 764890, 744177, 735923, 702977, 689430, 709058, 719375, 680439, 666564, 709508, 705009, 705069, 664308, 690039, 746649, 734196, 705310, 671026, 690432, 646817, 646577, 669129, 623459, 554664, 556844, 618398, 606621, 539067, 524126, 567572, 574688, 551860, 578015, 632560, 557724, 583904, 563690, 553078, 583151, 575917, 612820, 508578, 533966, 576121, 595823, 624250, 658317]
3755F58317k0210m4936p9121j161K7710n002j4304L608K8436J7844k0947K9132
3743E79366R57n7507r735M4528N6689p0576m3586l9562Q3704O949j9619N1295
3731E82903r2633N908M1837M6996N5610p1752o4396K0094K6954r404J3571p85
3719E54903j7263J773M0270J6615j4656J794k6013r526j6385j3169Q388L4273
3707E61004k8736K1637M9903n3762P8924J1346k2153l5081q7197K3237n2506P4816
3695E41432l477j01110k6798N6913M7499l8305j9097L383P4100k0080k0121k6646
3683D67693M1633o1k8932N8043j7117k5618K5883N986m0661j9472R493K5178M5359
3670E47407p3859m7487K757M5027N25L6685O4559K386j314j0377K3487m1609L2871
$$ y = [658317, 638107, 593171, 514050, 512889, 540599, 535597, 521293, 524901, 553337, 571181, 550234, 579366, 580323, 522816, 513081, 557609, 614298, 543722, 500136, 460574, 544278, 551227, 531608, 582903, 490270, 496178, 538015, 585011, 640621, 568869, 504473, 524567, 551521, 542117, 555688, 554903, 537640, 539413, 579683, 596298, 581642, 583436, 557423, 547897, 531512, 518343, 526731, 561004, 532268, 553905, 603808, 550046, 628970, 640316, 618163, 583082, 495885, 519122, 466616, 541432, 537955, 436845, 410047, 466960, 514459, 476154, 457057, 460440, 534540, 514460, 494339, 467693, 509326, 509265, 480333, 538376, 521259, 495641, 521524, 527510, 486849, 467377, 476870, 502048, 547407, 473548, 426061, 428818, 473845, 474370, 511055, 575614, 578000, 576686, 566309, 589796, 548187, 581058]
3657E81058K7431p1897K7341J219N5396K4515l9128O3552J4468p808j5755Q5311
3645G45703l9345o5207j2561Q0393J842n1280j2788k1137j3496M8988Q911L2944
3633G02967m638j507M2862L3378k5728j3038p136q774K4333Q764L904N4375k7673
3620G82089M0680J6848n8595M2010n9087k9780O7510O4219l3512j3970j774N8954
3608H75592K9262K6052Q296l0900j7070R59J209J7179R974M8569j0693M415K8134
3595I90978l4055J3395L5917p406O3637k7613l2642j6850l7939O0314J2210Q1315
3583A101261K0074L0687m920m6909N6237j4263K7150N8241k2967n8039O703j2425
3571A140830L5572K1935L3084j5291k2836N3692P1851J0094J13185J8408m3906
$$ y = [581058, 608489, 536592, 563933, 565152, 620548, 645063, 605935, 669487, 683955, 676147, 660392, 745703, 706358, 641151, 628590, 708983, 710825, 659545, 646757, 625620, 612124, 661112, 670023, 702967, 698329, 696822, 739684, 773062, 747334, 734296, 727160, 718386, 742719, 751483, 755387, 809762, 782089, 822769, 839617, 781022, 823032, 763945, 734165, 801675, 865894, 832382, 818412, 816638, 875592, 904854, 930906, 939202, 908302, 891232, 892191, 893400, 910579, 920553, 969122, 958429, 962844, 990978, 956923, 970318, 1006235, 998829, 1062466, 1034853, 1002211, 985361, 947422, 1007736, 1019946, 1101261, 1121335, 1152022, 1147102, 1100193, 1156430, 1142167, 1169317, 1227558, 1204591, 1146552, 1153255, 1140830, 1176402, 1198337, 1231421, 1216130, 1193294, 1246986, 1318837, 1328931, 1442116, 1460524, 1416618]
3560A416618L0333J61688R2647N9710J51330K45227J77452J59503K10286J71466
3550B876260P2308n5327j35409j19878l02687k02222j20335q4971m8862j4217
3540A864660l9494o4427J4765k5079j2774L8223J4944O8765N607M6230N6191J01880
3528B069491J09873J49324J58980J50608J94775J42493J38912k7506r0734j19008
3518B877208j79196k04848j54196j72259j8616o8037r4997o8566j9413q8150n0009
3507A758921q6684l1986l727K6605J5317n1590j8400K7482j7864l7341K041l6734
3495A546040n9397Q316P0450m5609k4101N9588k4338R080N6195L4528p681K447
3483A625518k9264J6691N009M6844L6019M0258l3091p0089K18J7495m797O7508
$$ y = [1416618, 1446951, 1608639, 1701286, 1760996, 1912326, 2157553, 2335005, 2494508, 2704794, 2876260, 2948568, 2893241, 2757832, 2637954, 2335267, 2133045, 2012710, 1927739, 1878877, 1864660, 1825166, 1760739, 1775504, 1750425, 1737651, 1775874, 1790818, 1859583, 1865190, 1911420, 1967611, 2069491, 2179364, 2328688, 2487668, 2638276, 2833051, 2975544, 3114456, 3086950, 2996216, 2877208, 2698012, 2493164, 2338968, 2166709, 2148093, 2080056, 1985059, 1916493, 1897080, 1808930, 1758921, 1672237, 1640251, 1636524, 1663129, 1678446, 1626856, 1608456, 1635938, 1618074, 1580733, 1582774, 1546040, 1486643, 1494959, 1565409, 1519800, 1495699, 1555287, 1530949, 1540029, 1596224, 1630752, 1623071, 1625518, 1596254, 1612945, 1617954, 1664798, 1700817, 1741075, 1707984, 1637895, 1638113, 1655608, 1650811, 1718319]
3471A718319J2821l3738K4752K2261K0276M2910J7038O6188l8126K2154J5398
3460A890253P7533J1142L350N6044J6103n4549O1861O8318k2810j696n589q7264
3448B012696J8021p2160p5698r4843Q120L35J7359J0124Q2138K7394J5902k0805
3436A928583R8946M8973O148N113q114N7248p663K6168P334J66952J23709m647
3424B448750Q8704p414l962M215p6362j06802j7584k4835o0370R5921R2693R0261
3412B523215l6413R268K4779N7051M1995R2965J4689M2637J3422J12947P4254
3401B970809K6667k4252P9709R3133J00102M3952R9657N3084L7389m3598K1806
3390C458458L3760Q5640Q3772P3173J07302R7150N3860J02230O0029N8789P7696
$$ y = [1718319, 1731140, 1697402, 1722154, 1744415, 1764691, 1807601, 1824639, 1890827, 1852701, 1874855, 1890253, 1967786, 1978928, 1982278, 2038322, 2054425, 1999876, 2061737, 2130055, 2107245, 2105549, 2099960, 2012696, 2030717, 1958557, 1882859, 1788016, 1796136, 1796471, 1813830, 1823954, 1906092, 1933486, 1949388, 1928583, 2027529, 2076502, 2082650, 2087763, 2079649, 2136897, 2129234, 2155402, 2162736, 2329688, 2453397, 2448750, 2537454, 2530040, 2526078, 2530293, 2453931, 2347129, 2329545, 2304710, 2244340, 2340261, 2432954, 2523215, 2486802, 2496070, 2520849, 2577900, 2619895, 2712860, 2727549, 2770186, 2783608, 2896555, 2970809, 2997476, 2973224, 3052933, 3146066, 3246168, 3290120, 3389777, 3442861, 3480250, 3436652, 3458458, 3492218, 3577858, 3661630, 3734803, 3842105, 3939255, 3993115, 4095345, 4155374, 4214163, 4291859]
3379D291859J19911J09712J61134J11955J68369P8827Q8960L7143O3004L1794
3369E262668M5494Q2981L8218M2442J05273Q1625Q2378N2004J01101J05426J06686
3358F106296J73537J69337J47662J42002J41731J86636J11177J54769K14008K11371
3348G758526J16472K11445J20563J47713K61741K43641K24119K08972K30962K18600
3338I742754Q1966J87389J76611K22281K30685K68569K50976K26796K94877M39268
3328A2122172L24286K98917L25504L14839L14412L29608K77423L42397L51021
3319A5000579K68303K01783L12010K33537L55313M20860M85114N55936O03936
3310A8437371N47965N27822O66117P56400Q20837R36224J104183J157248J098390
$$ y = [4291859, 4411770, 4521482, 4682616, 4794571, 4962940, 5041767, 5130727, 5167870, 5230874, 5262668, 5308162, 5391143, 5429361, 5471803, 5577076, 5658701, 5741079, 5793083, 5894184, 5999610, 6106296, 6279833, 6449170, 6596832, 6738834, 6880565, 7067201, 7178378, 7333147, 7547155, 7758526, 7874998, 8086443, 8207006, 8354719, 8616460, 8860101, 9084220, 9293192, 9524154, 9742754, 9824720, 10012109, 10188720, 10411001, 10641686, 10910255, 11161231, 11388027, 11682904, 12122172, 12446458, 12745375, 13070879, 13385718, 13700130, 14029738, 14307161, 14649558, 15000579, 15268882, 15470665, 15782675, 16016212, 16371525, 16792385, 17277499, 17833435, 18437371, 18985336, 19513158, 20179275, 20935675, 21756512, 22692736, 23796919, 24954167, 26052557]
3301B6052557P06372M64034L79218N93258P44790Q54385R93786J067464J151171
3292C3007035J277721J274538J421104J347620J337603J190772J473502J667991
3284D3997886K096476K213596K660875L014358L522059M061315M745943N589478
3276G1901986O867419Q135896R601817J0873617J2848788J5617056J9652006K4153457
3268A79652042K9293935L6046430M4734182M1861273J7039276k8520280n2001375
3261B68105483m7510040l7862538k6194032j8340382j3051649r650938o912948
3254A08582956n007348l416953k124226r70087R4970J248246K669642M360716
3246A05437916N845933P093530Q775580J1138578J4811174J9586833K5469596
$$ y = [26052557, 26758929, 27222963, 27602181, 28195439, 28940229, 29794614, 30788400, 31855864, 33007035, 34284756, 35559294, 36980398, 38328018, 39665621, 40856393, 42329895, 43997886, 46094362, 48307958, 50968833, 53983191, 57505250, 61566565, 66312508, 71901986, 78769405, 86905301, 96507118, 107380735, 120229523, 135846579, 155498585, 179652042, 208945977, 244992407, 289726589, 331587862, 348627138, 320106858, 268105483, 220595443, 182732905, 156538873, 138198491, 125146842, 115495904, 108582956, 103575608, 100158655, 98034429, 97064342, 97159312, 98407558, 101077200, 105437916, 111283849, 118377379, 127152959, 138291537, 153102711, 172689544, 198159140]
3239A98159140L1817577M0811248M3753733K8488962j1702861m8825276n1763845
3232B30738678m3429921l1738872k2339453j6100288j2257014r555857p719965
3225H7597308o342571n643709n089339m788902m319137m001752l423982l101105
3217E0886811k764873k541413k371941k276570k146597j920606j735146j447870
3209C3681795j241180j100835j109905j118608j123721j047591j011141j004475
3201B4924339r07163q42246q17057p54413p02992o03041o97368n91477n40858
3192A8467724n57097n20505o17855n54953l95767l22340l38676m54033m39041
3183A4267457l99994l21819k89830j53941r6278n2119j34618k22907k35677k70057
$$ y = [198159140, 229976717, 270787965, 314541698, 343030660, 331327799, 282502523, 230738678, 187308757, 155569885, 133230432, 117130144, 104873130, 95317273, 87597308, 81254737, 75611028, 70521689, 65732787, 61413650, 57411898, 53987916, 50886811, 48121938, 45580525, 43208584, 40932014, 38785417, 36864811, 35129665, 33681795, 32440615, 31339780, 30229875, 29111267, 27987546, 26939955, 25928814, 24924339, 24017176, 23174930, 22357873, 21603460, 20900468, 20297427, 19600059, 19008582, 18467724, 17910627, 17390122, 16772267, 16217314, 15821547, 15499207, 15160531, 14706498, 14267457, 13867463, 13545644, 13255814, 13101873, 13005595, 12953476, 12818858, 12595951, 12360274, 12090217]
3173A2090217l40200m28131m19157l55201l64935k48010k36443j20743k43527
3164I333870l39656k65643k17428j43953q8199r9997k04281k64828k12492k45752
3154G251641j91321k23144j70326j34769p9948j43314r5994j15878j19123r4928
3144E882896n6076j61029n7749n7185p873j33248o7559o7433q2587p1210q6860
3133E034087o3852l1157p4176n7320m3657o3395l9726j0071j17427n4071n9883
3122D419352m8304j51548q2087j2186o4193o4887o729r2539o7483p4016o4581
3111C690799o112j0536o3518q1350k458o6235j14328J6245k8065p7247n5304l1117
3099C170774L9762j0252r992j1139k6411n2200l1515l4093n5836o616j4965J7718
$$ y = [12090217, 11750017, 11321886, 10902729, 10547528, 10182593, 9934583, 9698140, 9577397, 9333870, 8994214, 8728571, 8511143, 8367190, 8278991, 8178994, 7974713, 7709885, 7497393, 7251641, 7060320, 6837176, 6666850, 6532081, 6452133, 6308819, 6212825, 6096947, 5977824, 5882896, 5826820, 5665791, 5608042, 5550857, 5542984, 5409736, 5342177, 5274744, 5192157, 5120947, 5034087, 4970235, 4939078, 4864902, 4807582, 4763925, 4700530, 4660804, 4650733, 4533306, 4479235, 4419352, 4371048, 4219500, 4137413, 4125227, 4061034, 3996147, 3989418, 3896879, 3829396, 3755380, 3690799, 3684687, 3674151, 3610633, 3529283, 3526825, 3460590, 3346262, 3362507, 3334442, 3257195, 3201891, 3170774, 3210536, 3200284, 3190292, 3179153, 3152742, 3100542, 3069027, 3034934, 2979098, 2972482, 2957517, 2975235]
3087B975235p7278o5169m5181J4863l9360m8430r6919j43664p9980r9895o2195
3076B232027k1557J8926N002J3743L2723o216K0069K5450l4311q1722p9554k0373
3064B104207P485l2613m5002M917K249j8874j0838j9096M2886n4495q2725j19109
3052A778992q1432j5041j04570n872K5357o412l9043l07k7497K8721M5210k182
3040A595924l8841o7147L5785P137L261j00351r6471K5487L610l2610j3176R184
3028A331792p740P801l1647n3890l5797j7165M8892K6592k3896k9110k6172O7175
3016A256835m4047j6478p433J2944m6890J7146M7515K1563k6715M406K998j6571
3004A205273k0391k8035N3433p8971j9970J0311j9477R163k5299P7462k8308k0291
$$ y = [2975235, 2897957, 2832788, 2787607, 2802470, 2763110, 2714680, 2617761, 2474097, 2394117, 2294222, 2232027, 2210470, 2229396, 2234398, 2248141, 2280864, 2274648, 2294717, 2320167, 2285856, 2204134, 2124580, 2104207, 2111692, 2079079, 2034077, 2038994, 2041243, 2022369, 2011531, 1992435, 2035321, 1980826, 1898101, 1778992, 1697560, 1682519, 1577949, 1572077, 1597434, 1591022, 1551979, 1551672, 1524175, 1552896, 1598106, 1595924, 1557083, 1489936, 1525721, 1532858, 1536119, 1435768, 1339297, 1364784, 1368394, 1335784, 1322608, 1331792, 1324052, 1331853, 1300206, 1246316, 1210519, 1193354, 1242246, 1268838, 1244942, 1215832, 1189660, 1256835, 1212788, 1196310, 1188877, 1201821, 1154931, 1172077, 1219592, 1241155, 1214440, 1218846, 1221844, 1205273, 1184882, 1156847, 1210280, 1131309, 1111339, 1121650, 1102173, 1111336, 1086037, 1163499, 1135191, 1114900]
2992A114900K9628K3426k2022J96L9686R7758Q8471M3873R31O4411N0260J68075
2980A699593J30566R7495J51855K25769J09022M8485o3350j45946j75827j26591
2970A951071j60517j63274p3879n7383q3060J7276m750m0165j9215M1875k3369
2959A384610n100k2618N2341J3460Q0038J05503J9790J30322J92511K09422K04964
2948B365243J04514L7359j9762j02835k13869k21805k08063j29409r5470j39805
2938A376098j8655o6749j5141q346R841J2903n7426r906m7430n5689K4068l0300
2926A113268l1258l6614J5897M9395p251p011L4593j4803P0936J773J00607J8239
2914A307771L7410l6190J7470N0878R841j758n9720j434K2248M0564N5149j2222
$$ y = [1114900, 1144528, 1167954, 1145932, 1146128, 1185814, 1283572, 1372043, 1415916, 1416847, 1481258, 1531518, 1699593, 1830159, 1927654, 2079509, 2305278, 2414300, 2462785, 2399435, 2253489, 2077662, 1951071, 1790554, 1627280, 1553401, 1496018, 1412958, 1430234, 1425484, 1385319, 1366104, 1407979, 1384610, 1379510, 1356892, 1409233, 1422693, 1502731, 1608234, 1628024, 1758346, 1950857, 2160279, 2365243, 2469757, 2507116, 2487354, 2384519, 2170650, 1948845, 1740782, 1611373, 1515903, 1376098, 1357443, 1290694, 1275553, 1267207, 1277048, 1289951, 1232525, 1222619, 1175189, 1119500, 1143568, 1113268, 1082010, 1045396, 1061293, 1110688, 1103437, 1096426, 1131019, 1116216, 1187152, 1188925, 1289532, 1307771, 1345181, 1308991, 1326461, 1377339, 1387180, 1385422, 1325702, 1324268, 1346516, 1387080, 1442229, 1430007]
2902A430007l5010N2870K9649L5722O6271J39033N1160j20834o7754L218n466
2891A578866l3649K8182K709O6314J5370K5889m4330L8679K6484P9472M6217o8007
2879A762196P2542J1489r1692m1767o3085k740p1106J5881j3329K0284N6337J20522
2867A775532J02360l1232o1388q1310p1291L2541n5377j4982N269R190k1188n6949
2855A531175K4365j6371l8126J4888n0r2222o8215L3683k7408o5028q476j5626
2843A272589n1986l3442p306q520l2973n4847k0424N3158J5486l4917Q422k5884
2831A079356j180n2300o1023o8700q663n1773o316N5035j21532r3267N9627o7515
2819F61749o2380O0572j1286n8069p429J4239l7204K8269J1412q2165l2076k577
$$ y = [1430007, 1394997, 1447867, 1477516, 1513238, 1579509, 1718542, 1769702, 1648868, 1581114, 1584332, 1578866, 1545217, 1573399, 1576108, 1642422, 1657792, 1683681, 1639351, 1678030, 1704514, 1783986, 1830203, 1762196, 1834738, 1846227, 1754535, 1712768, 1649683, 1646943, 1575837, 1591718, 1578389, 1598673, 1655010, 1775532, 1877892, 1846660, 1785272, 1703962, 1632671, 1665212, 1609835, 1594853, 1600122, 1609312, 1588124, 1531175, 1555540, 1539169, 1501043, 1515931, 1515881, 1423659, 1355444, 1389127, 1361719, 1296691, 1288215, 1272589, 1220603, 1187161, 1179855, 1171335, 1138362, 1083515, 1063091, 1116249, 1131735, 1096818, 1105240, 1079356, 1078176, 1025876, 964853, 896153, 887490, 835717, 829401, 884436, 762904, 669637, 729264, 661749, 599369, 659941, 648655, 590586, 583157, 597396, 560192, 588461, 599873, 517708, 485632, 483055]
2807D83055O3113l5666j6427j8669R514J6156j4656l7278O7203r473m6546p0395
2795C89931l776m801j5969m885J9785o272o1926m8204K1071n0853m9927J5350
2783A99524N1428l3813l3975N0574N4432O034l0635q7540j8810L9518K7197j2073
2771B11861J486J6515J3439j7551l2181l5197j073L1094l0153m9457M7872n1874
2759A04781p057M0081L4429K618l1418Q573j0421K2466N1743J3184j5530l2892
2747A80557j4573R985j2402m6745l8402M0678n716K5375k4451m9019J3037K4680
2735A03004M1K3537j1027r251N792m2444k2821L0039q732L4636l7198l8493L1227
2722E8310N7418K7400l1471m945l1547K3778K5084j3421l2676J6484K44K9015
$$ y = [483055, 546168, 510502, 494075, 475406, 484920, 501076, 486420, 449142, 516345, 506872, 460326, 389931, 386155, 381354, 365385, 360500, 380285, 374013, 312087, 263883, 284954, 234101, 184174, 199524, 250952, 217139, 183164, 233738, 288170, 294204, 263569, 176029, 157219, 196737, 223934, 211861, 213347, 229862, 243301, 225750, 193569, 158372, 157299, 188393, 158240, 108783, 156655, 104781, 97724, 137805, 172234, 174852, 143434, 152007, 141586, 164052, 215795, 228979, 213449, 180557, 165984, 175969, 163567, 116822, 78420, 119098, 113382, 138757, 114306, 65287, 78324, 103004, 103045, 126582, 115555, 106304, 112096, 69652, 46831, 76870, 68138, 102774, 65576, 27083, 58310, 115728, 143128, 111657, 106712, 75165, 98943, 124027, 110606, 77930, 94414, 94658, 123673]
2710A23673j8808j8372j5083m394m593k0786k464K5911N2314l7539k7821l9646
2698A2392P9463k1973l872K9015l3869j740N2126K8616o6666M159j2010k119L1564
2685I5086m4477m6850N6505N3843p5479L8364L428m429M6621j0587p3123m1204
2673b302L8809P0563n8696l1831l4089K4558M2533k5789M7949j9031K983K5870
2661H1527j11747m1983Q2747N5752L633l774M4434O8702p8404P576k1888m2666
2649D3909l3367J4797j1354O235P700O5498M236m6091k6533l8132K9367J3889
2637C0154K9842L1869j0640n8853n6748N4069J7634Q741m4901K0039N8613J745
2625H1564M947m3972K3646L781m6658q786J7339l3722L9808j262J053j306r219
$$ y = [123673, 104865, 86493, 71410, 67016, 62423, 41637, 39173, 65084, 117398, 79859, 52038, 12392, 91855, 69882, 66010, 95025, 61156, 59416, 111542, 140158, 73492, 77651, 65641, 63522, 95086, 50609, 3759, 60264, 114107, 38628, 76992, 80420, 75991, 122612, 112025, 38902, -2302, 36507, 107070, 48374, 16543, -17546, 7012, 49545, 23756, 71705, 52674, 55657, 81527, -30220, -72203, 10544, 66296, 69929, 66155, 110589, 179291, 100887, 108463, 86575, 43909, 10542, 25339, 13985, 20220, 27920, 93418, 97654, 51563, 25030, -13102, 16265, 30154, 59996, 91865, 81225, 22372, -34376, 19693, 37327, 46068, 1167, 21206, 79819, 81564, 86511, 42539, 66185, 69966, 23308, 14522, 31861, -1861, 37947, 36685, 37738, 36432, 27213]
2612B7213J5544m0683K9777M1117l6533K3678p5144K2190K9300J2091k1413q15
2600B6322J6314n0547j838K5265Q62k9050P5035Q1522m2965o2782J5960j6507
2588C7591k0118r211n3099K0190K0916M5431k306J4331J5100k7932o4713L3504
2576I684j1736o606R96N2106J3508n4230k5864m216N41L7919J7116k1445J3944
2563B1717L2977j7961J7213k3666n4691Q465K0319L7943K8820k1665n8904k8271
2551c7704M7035o8189j4172J936M2724O9283Q405L2469p2289j6255K6723P722
2539B7688k686r277q063n6282N362M7618M9719N2621l7167n3124k8969Q7057p503
2526F6994p5153J3663q8934K3821K7787r117K4953J7277L1356n708K8394p7138
$$ y = [27213, 42757, 2074, 31851, 72968, 36435, 60113, -15031, 7159, 36459, 48550, 27137, 26322, 42636, -7911, -9749, 15516, 16378, -12672, 62363, 143885, 100920, 38138, 54098, 37591, 17473, 8262, -44837, -24647, -3731, 41700, 39394, 53725, 68825, 40893, -23820, 9684, -2052, -8658, -7662, 44444, 57952, 3722, -22142, -26358, -25817, 12102, 29218, 7773, 21717, 54694, 36733, 53946, 30280, -24411, -15946, 4373, 42316, 71136, 49471, -9433, -37704, 9331, -58858, -73030, -71094, -28370, 40913, 49318, 81787, 9498, -6757, 19966, 27688, 25002, 15725, 7662, -48620, -43258, 4360, 54079, 106700, 69533, 16409, -12560, 74497, 66994, -8159, 5504, -83430, -59609, -31822, -40939, -15986, 1291, 32647, 26939, 55333, -21805]
2514b1805L4507j2422k4686k8220L6477K9839M5630j782o098J3235m7129J6486
2502C4032n2803l447N309J978j7495m687m6917M5705L0832j8320N341j3693j4874
2489d9039k101L1441j2047L3212k8431k8617J3423J3356L9669l1255q680O8332
2477C9263o5024K2651K8243M948N672n6106J585K5415m8063J9735j0498j5097
2465d7276j4275M4028O477L656L7921m8245J2814q396J8692J3100N703m068k7116
2452f985k6631l4202K5140L017K3876M586J2675j3252M707L3550J482m3734m1179
2439e6950J4885Q995N4365K0928n2127l5974o5817m1467M9024J989L7764J5739
2427d8646R914K4068N7811j6092n6622j3500L9397P435l3870L162J3362n4399
$$ y = [-21805, 12702, 280, -24406, -52626, -16149, 13690, 59320, 57538, 51440, 64675, 17546, 34032, -18771, -22218, -16909, -14931, -32426, -37113, -84030, -38325, -7493, -25813, -20472, -34165, -49039, -51140, -19699, -31746, 1466, -26965, -55582, -42159, -28803, 10866, -20389, -29069, 39263, -25761, -3110, 25133, 30081, 35753, -20353, -18768, 6647, -41416, -21681, -32179, -47276, -61551, -17523, -11046, -7390, 30531, -17714, -4900, -13296, 5396, 18496, 24199, 20131, -6985, -33616, -67818, -42678, -39661, -15785, -11199, 1476, -11776, -7069, 26481, 27963, -15771, -56950, -42065, -33070, 21295, 42223, -9904, -45878, -111695, -153162, -104138, -102149, -64385, -48646, -38732, -14664, 43147, 27055, -29567, -43067, -3670, 3765, -30105, -26943, -13581, -67980]
2415f7980l7702P3409k0792J6225L8224o898j8952k7497m2206P2512L2479j4909
2403d087J5175n2369R416K0234l3640J0036j3162L583M405K1169P688J4133K5913
2390B8494n4427j6207J1032P6857K6088L3532q7381j8460L5300l211p1436L1479
2378h340l6452k1080M9024j0775l4374J6821k8675j0499M0867k4012R006K5361
2366c3128M3143K5035n2797O597L9128o8962j7770k9918Q7980Q2908k6053l2847
2354B3316L172j1548P675R434O869l5249k7387q292N0845K7929o5800K8807K8527
2341C8298l7970m809j6091l481K2326N6340J0608N549K3168m6267n8321N300k136
2328g486p753L1916K0670q5625K7714P3694j5153o288N003m926k7630o1676r134
$$ y = [-67980, -105682, -32273, -53065, -36840, 1384, -5514, -24466, -51963, -94169, -21657, 10822, -4087, 11088, -41281, -31865, -11631, -45271, -35235, -48397, -44814, -40409, -19240, -11552, 2581, 28494, -25933, -42140, -31108, 45749, 71837, 105369, 17988, -472, 34828, 31617, -39819, -8340, -44792, -65872, -16848, -27623, -61997, -45176, -73851, -84350, -43483, -67495, -58489, -33128, 10015, 35050, -17747, -11150, 27978, -40984, -58754, -88672, -692, 82216, 56163, 23316, 26488, 14940, 22615, 32049, 38918, 3669, -23718, -32010, 18835, 46764, -19036, 9771, 38298, 328, -4481, -20572, -24053, -1727, 54613, 65221, 70770, 93938, 47671, -10650, -5350, -7486, -15239, 16677, 37347, -48278, -20564, 53130, 37977, 31689, 36692, 31766, 4136, -57540, -66674]
2315f6674O5793m5263M3716l5021q4937k617Q7049R2207j3484k8586l0165j5083
2303c3065M504K3746l8897L0895J6811M717K2113l6388q038m1334N9160j4300
2291a0076K0038M327l5134J2531L122K3439N715j3389N969N3540M6756n2670n8414
2278E754m7022L4333O352l2084K5004J6236K3743j8513J682j975m4037Q680J9898
2265a949j1078K8322k6785j5709K2335J2877k5156O725l391J9299M5318m9963
2253H45l3199K8340m2202O6396q0j7143m4355M1634L0642k8401n622M7313l1331
2240A2837N55M012l6433L2944J3447l1572l1651M7455R771L6388l9487k118R8793
2227A14941j9482M652j0666K700r7367l0183L4578q939k1861j2261O9763N247
$$ y = [-66674, -881, -46144, -2428, -37449, -122386, -125003, -37954, 54253, 40769, 12183, -17982, -33065, -28561, -4815, -43712, -12817, 3994, 8711, 30824, -5564, -13602, -54936, 4224, -10076, 9962, 14289, -20845, -8314, -5192, 18247, 23962, 10573, 16542, 70082, 116838, 64168, 5754, -41268, -6935, -583, -32667, -7663, 8573, 32316, 13803, 15485, 13510, -30527, -21847, -1949, -13027, 15295, -11490, -27199, -4864, 8013, -17143, -10418, -13809, 5490, 50808, 845, -32354, -4014, -46216, 20180, 20100, 2957, -41398, 236, 30878, 2477, -3145, 44168, 12837, 13392, 17404, -19029, 13915, 27362, -4210, -35861, 11594, 21365, 57753, 18266, 16148, 114941, 95459, 100111, 89445, 92145, -5222, -35405, -827, -9766, -31627, -43888, 25875, 31122]
2215C1122k498m662M1344L2829O332K1007p64k7843P075n763M797l2271K464n380
2201F7789K1354J6345r088o6540L091J4506N4763j9502n656J970j49J249J24423
2188B04555J0118q2227J3661m8475m3977R339O596L1597J1938m3106o059K1649
2176H5609L5256j126J9452K2575j4135o257Q7480Q2785m9574m6087J1973K6402
2164B54353o5888Q608P557l0532K6996L4813P2790r9571J0176L5166j3141j1626
2152B29701J8104J7232L3324J2156J0627L9647J1127J2985O31K8609o0510J3136
2140C66769L499k6510P5991j704k1054O7724l2987Q917R2374j0248n825J18880
2128F35826l4359k5442M6977n708J0299O4123M4412M0765J6681J0137J7369N2332
$$ y = [31122, 28624, 23962, 65306, 98135, 104467, 125474, 124710, 96867, 103942, 98179, 102976, 70705, 73169, 67789, 89143, 105488, 96400, 29860, 32951, 47457, 102220, 82718, 77062, 79032, 78883, 80132, 204555, 214673, 132446, 146107, 97632, 53655, 62994, 69590, 101187, 113125, 70019, 63960, 85609, 120865, 119739, 139191, 161766, 147631, 141374, 228854, 311639, 262065, 215978, 227951, 254353, 188465, 197073, 204630, 174098, 201094, 235907, 308697, 209126, 219302, 254468, 241327, 229701, 247805, 265037, 298361, 310517, 321144, 360791, 371918, 384903, 385534, 414143, 353633, 366769, 370268, 343758, 419749, 418045, 396991, 464715, 431728, 440645, 533019, 522771, 516946, 635826, 601467, 576025, 623002, 617294, 627593, 691716, 736128, 776893, 793574, 803711, 821080, 873412]
2116H73412L7403Q5623R3489L9309M7459J08443Q2710j4139O6852L5105J39989
2105A595655L9019J07251Q2342R9000J36159J01798K82531K33605J45565J30862
2095B953787K11191K21538L32050M79368M46736O91472P89259J026525J468677
2086H620603J920461K304115L139589K795238R45026k607385l931802k956239
2078A0229606k173397j390862j033509p62687o81795l60965m10900l43449j93187
2069B878855j07627q2037j05424j81903j78848k45927j88067j03681j22592j32765
2059A429984j14474n5673m284n7605j3191l6269j36809n6414J2090o4471o5150
2048H37734r3589j3385j8120j1515Q849o7668k4686j7578P967J3055j24087k3361
$$ y = [873412, 910815, 996438, 1089927, 1129236, 1176695, 1285138, 1367848, 1353709, 1420561, 1455666, 1595655, 1634674, 1741925, 1824267, 1923267, 2059426, 2161224, 2443755, 2677360, 2822925, 2953787, 3164978, 3386516, 3718566, 4197934, 4644670, 5336142, 6125401, 7151926, 8620603, 10541064, 12845179, 15984768, 18780006, 19725032, 17117647, 13185845, 10229606, 8056209, 6665347, 5631838, 4869151, 4187356, 3826391, 3415491, 3072042, 2878855, 2771228, 2689191, 2583767, 2401864, 2223016, 1977089, 1789022, 1685341, 1562749, 1429984, 1315510, 1259837, 1255553, 1197948, 1184757, 1148488, 1011679, 955265, 967355, 902884, 837734, 744145, 730760, 712640, 701125, 709974, 642306, 617620, 600042, 608009, 621064, 496977, 473616]
2036D73616j9632k6717L6583Q737m8078m4505k6704K6085L6537j7041l3699k7048
2024C38134n1733M2423j397k9026N117L1518J0687m3559k4016m241k3934j8378
2012B31595M1990j0280j5972J7229K467J9501j8974o2564q6586R2344q106o7333
2000A35311M0082n9747R092r377O1236J0099n3361j1002J6095j7794j4261r559
1988I6814N277J7137o797k2128l6726k3514l9384P0203j0786M8170j1482k7804
1976E8980J4827p786n718j3912K4897M0215l4810N9710K8295l4475m0224n1450
1964C8549j7207r921N2947n1278O3416j3162j9776J724q473R117O1700L5316l2478
1951A10474k8654k4052L6603j819Q957r277O47l3286L2544l7335m3000M5060L4181
$$ y = [473616, 453984, 427267, 463850, 472587, 424509, 380004, 353300, 379385, 415922, 398881, 365182, 338134, 286401, 328824, 327427, 298401, 303518, 335036, 345723, 302164, 278148, 273907, 249973, 231595, 273585, 263305, 247333, 264562, 267029, 286530, 267556, 204992, 118406, 210750, 202644, 135311, 175393, 115646, 124738, 115361, 176597, 186696, 133335, 122333, 138428, 120634, 106373, 96814, 102091, 119228, 112431, 90303, 53577, 30063, -9321, 60882, 50096, 98266, 86784, 58980, 73807, 66021, 60303, 46391, 71288, 111503, 76693, 136403, 164698, 130223, 89999, 38549, 21342, 11421, 64368, 13090, 76506, 63344, 43568, 45292, 36819, 45936, 107636, 142952, 110474, 81820, 57768, 94371, 92552, 101509, 92232, 92879, 59593, 92137, 54802, 11802, 56862, 91043]
1938I1043o4460k7052J7933P093j5195K5170M1493J988K053p8067L5741J1774
1926D9514l8480j1797M834O3077l0897N919N3713m4945l4522r809L3779J7652
1914E8038O7334n6835q420L436k2324J5172j7424o4181K3061L543m278L6889m834
1901B9177k7031l693K268k3246K1263O1104M9355k115j30698P714k9716N1556
1889E938k1202n9327K6150M0451K5735p907j7205r779M7421n9899J4047K5678
1877A0101m9278l618J5631m445L2092M5813L3912n3971j31720O664O1506L0640
1865f673L4833K2222M410J6309K9530j6794m4152k1006o0245j5230L0600M0753
1853A4557J3467l9574n5718L0880M8614m2713j9240J6910n492K3087Q4841l1540
$$ y = [91043, 26583, -469, 17464, 24557, 9362, 34532, 76025, 78013, 80066, 1999, 37740, 49514, 11034, -763, 4071, 67148, 36251, 42170, 95883, 50938, 16416, 6607, 40386, 58038, 125372, 68537, 60117, 63553, 41229, 56401, 38977, -25204, -2143, 1400, -2878, 34011, 29177, 2146, -1547, 721, -22525, -1262, 59842, 109197, 107082, -23616, -15902, -45618, 5938, -15264, -74591, -48441, -7990, 17745, 9838, -7367, -17146, 30275, -29624, -15577, 10101, -39177, -42795, -27164, -31609, 483, 46296, 80208, 26237, -105483, -98819, -37313, -6673, 28160, 50382, 54792, 71101, 100631, 83837, 39685, 18679, -41566, -56796, -26196, 14557, 28024, -11550, -67268, -36388, 12226, -30487, -49727, -32817, -38309, -15222, 69619, 38079]
1841C8079n1896P7461j6467m4012r279j3967Q413r698J7935J2394N0679k7950
1829C1692j8690r959j5253k4256k2181L1617K833k1065j2801K2892M6614k0551
1817i108K655L4298L0865l3384R1528L1390j7528k9235n7457k7063N2997j3477
1805E6481L1934k0216J5778l3018k1228J1012k8236j5616M2124r222l8227J0043
1793A609p0807L0767O8970l486o3416J0081L2891j5547M695m2705l7874L0475
1781e4347P3401K6106J6557p5934l1201P618K0919k8558J1716P1521M8952m3387
1769D3363m5018l7875j7617L3707N142k945J7878n723O371M6339j7525k6353m322
1756d578j7839l1675l7867m6135P1565J408K4557k7843K0573M0099k4676l9938
$$ y = [38079, -13817, 63644, 47177, 3165, -6114, -20081, -11668, -21366, -3431, 8963, 59642, 31692, 13002, 3043, -12210, -36466, -58647, -27030, -24197, -45262, -58063, -35171, 11443, -9108, -6453, 27845, 58710, 25326, 116854, 148244, 130716, 101481, 44024, 16961, 69958, 56481, 88415, 68199, 83977, 50959, 29731, 40743, 12507, -3109, 39015, 29793, -8434, 1609, -69198, -38431, 30539, 27053, -36363, -26282, 6609, -8938, -4243, -46948, -84822, -54347, 19054, 45160, 61717, -14217, -45418, -37800, -16881, -45439, -33723, 37798, 86750, 43363, -1655, -39530, -57147, -23440, -18298, -21243, -3365, -9088, -2717, 43622, 26097, -256, -4578, -22417, -54092, -91959, -138094, -66529, -65121, -40564, -68407, -47834, -7735, -32411, -72349]
1744g2349k8213J138j7199J256L1957j3119M7865K4485m4938k8804O6512J1234
1732b0175L357j5769k985m264J2553K2905k1490j5493r015L5831L2905r80L085
1719B0465l8088q137n862j506J0665l272l2924j7964J02079L7545m7764K533l9112
1706b1342M756k0106N079M8400n0012J2735j7754J3177l2088L997M3486j7102
1694b6774m492K253O113k446P275m3854J0334K4476M3640j8617K0921l5329J3712
1681b788j8091k9568M2845p880j2385l902L1394j6104o080P218k0235J302K2645
1668a1629O9543n5460k258Q135K8253J3219r9453l2668M4461q2346P8727J1173
1656c0303J7726J4450j8962M2521j9367m8380k0839M6268n2502l285j0127L609
$$ y = [-72349, -100562, -99424, -116623, -115367, -83410, -96529, -48664, -24179, -69117, -97921, -31409, -20175, -16818, -32587, -35572, -39836, -27283, -4378, -25868, -41361, -50376, -14545, 18360, 17380, 20465, -17623, -25760, -31622, -33128, -22463, -25735, -58659, -76623, 25456, 63001, 15237, 17770, -21342, -16586, -36692, -31613, 16787, -33225, -20490, -38244, -25067, -57155, -53158, -9672, -26774, -31266, -29013, -22900, -25346, -18071, -61925, -51591, -27115, 16525, -2092, 18829, -16500, -2788, -20879, -50447, -7602, -15482, -27867, -31769, -375, -16479, -22559, -15341, -35576, -34274, -11629, 57914, 2454, 196, 8331, 36584, 49803, -49650, -82318, -37857, -120203, -41476, -30303, -12577, 1873, -17089, 25432, 6065, -42315, -63154, -16886, -69388, -72673, -82800, -79191]
1644g9191J0322L3613L2202j2253j4335j158K7724K7056n5392k1509K4051J7990
1632a0880j2863j7605j250O6282J8521L5148n6941m0550l2288k2405j311L8224
1620c7918l472N5080K433k0879p0672q006l6259O8786O2477M9439k9731k9811
1608A467J3867r393j9665m9347L2657q779l2651M2513M5439L170k9952m4546N8911
1595C691j8470M1748k5684j4894N5661J3577p3661q906q63l8074K2033Q347Q7001
1582E1506o237o9354R773P0240o3227k5899P4425P0014n1974l2698J017l2749
1570e163K2226r800n5713m181J2123K9549l5288l2328j4323J7254L0198m785N333
1557d4898Q270N0722m8834J8438K6896L043M6309j8004J0488L1412m3683K8033
$$ y = [-79191, -68869, -35256, -3054, -15307, -29642, -30800, -3076, 23980, -31412, -52921, -28870, -10880, -23743, -41348, -42598, 23684, 42205, 77353, 20412, -20138, -52426, -74831, -76142, -37918, -41390, 13690, 16123, -4756, -75428, -83434, -119693, -50907, 11570, 61009, 31278, 1467, 15334, 5941, -13724, -63071, -30414, -39193, -71844, -29331, 16108, 19278, -10674, -55220, 3691, -14779, 26969, 1285, -13609, 42052, 55629, -18032, -26938, -27801, -65875, -43842, -35495, 51506, 45269, -24085, -14312, 55928, -7299, -33198, 41227, 111241, 59267, 26569, 27586, -5163, 17063, 7263, -48450, -52631, -40508, -10959, -46247, -78575, -92898, -75644, -45446, -50231, -44898, -36628, 14094, -34740, -16302, 10594, 13637, 59946, 41942, 52430, 83842, 40159, 68192]
1545F8192L0719j5240o3497m7791M716K4424J4272J0282m3003m0855J0230r624
1533e7175N8802L2408j09145N632M1285R813M6060j9555N0560R599p2559M9546
1521D5271o5760j2454k3654P7785m2437n1030N4494k2049J6675J7331P296l9761
1509c8293j6849P621J6299M151m2480n823q951R871O0893l1998j089L9672R771
1496B795j0969k8661l6753K6049l5737j2952O4555O1830l1017m6671M5932l2339
1484c3938M311j967M1290J6453p051L7282q0577k1379L3871K700j7768l5933M2474
1471b0232n40o422J253j8267j4930K1616k487l4176Q9866k64o7239j5954j834
1458f9610l2645J5374O110O479N4425l2322J6011k7294j109K0665r868Q458k302
$$ y = [68192, 98911, 83671, 20174, -27617, -22901, 1523, 15795, 26077, -16926, -57781, -47551, -57175, 1627, 34035, -75110, -69478, -28193, -18380, 27680, 8125, 58685, 68284, -4275, 45271, -20489, -32943, -56597, 21188, -21249, -72279, -17785, -39834, -23159, -5828, 1468, -38293, -55142, -47521, -31222, -27071, -69551, -75374, -84325, -74454, -13561, -45559, -46648, -6976, 2795, -8174, -36835, -73588, -47539, -83276, -96228, -31673, 30157, -860, -47531, -1599, -33938, -29627, -31594, 9696, 26149, 19098, 56380, -24197, -45576, -11705, -9005, -26773, -62706, -20232, -20772, -27194, -25941, -44208, -59138, -37522, -40009, -74185, 15681, 15417, -51822, -67776, -69610, -102255, -86881, -80771, -74292, -19867, -52189, -36178, -63472, -64581, -43916, -53784, -45326, -47628]
1445d7628J5983L2410j5385J52M1847M4907k5324o2550k6311q838J4525J5541
1433b0671N829r917k8471r970J0900l5010k9467O1020O1690R458J9380j4166r975
1420A0630L6199k565l4918L3015j8974l3688l542K2347j0739N7728j9784n1174
1408a5465l0907k0525M7871J1994r984n4518M403j4274O9482j6932j9572L8653
1396i774k697K3402m496k0273O862j797l3912J0119N413n6755o805O3927M7141
1383B0355J6069k4865J835Q3623l5935k6772j4942k5180K6525n6187L2772K4283
1371B1581p092q2267O8961l532K2192l294O811k3585J0605l446l706k2942N35
1358a9179j296N736j6694k5637M4215L011K0269K2237l0825l7271L3972K4634
$$ y = [-47628, -31645, 765, -14620, -14468, 27379, 72286, 46962, -15588, -41899, -50737, -36212, -20671, -14842, -24759, -53230, -63200, -52300, -87310, -116777, -55757, 5933, 15391, 34771, 20605, 10630, 46829, 44264, 9346, 42361, 23387, -10301, -13843, 8504, -2235, 55493, 35709, -15465, -46372, -66897, -19026, -7032, -17016, -71534, -67131, -81405, -11923, -28855, -48427, -9774, -12471, 10931, 6435, -13838, -6976, -8773, -42685, -32566, -27153, -83908, -90713, -26786, 20355, 36424, 11559, 13394, 97017, 61082, 34310, 19368, -5812, 20713, -35474, -2702, 21581, 14489, -67778, 1183, -2349, 19843, 16549, 23360, -225, 10380, 6934, 3228, -19714, -19179, -20475, -14739, -31433, -57070, -12855, -9844, 10425, 32662, 1837, -35434, -1462, 23172]
1346B3172l3250m846k9666k151O3740k3531K9780l456O7043M3252q3548m8456
1334a917K1052N2519r2182L6191J6994n2470L2381n1337k210K8296m6765p5996
1322a35444O6835Q6336J1477k6334L8846K942k2677L421M682l3049o7549n9392
1310a29906O1722L8762k5146j5982O065J3110L8335k2352J9170j9040l4964k2597
1298i2823M6277j37j289J5020M5074m094Q150n0126r789J7402J1083k1282P973
1285b8561N2162j2372o8346O1989K2765p5007l0246L5193N704m9831P0180L2421
1273A6051o7025m4954L9827J8251m914J5937K4312j9931n2975K1462O2426m5104
1261c6637o802j5173P990l9336O5292J4819r73L9326J1955L5144J1278n3407k5227
$$ y = [23172, -10078, -14924, -44590, -46741, 16999, -6532, 23248, 19792, 86835, 130087, 46539, -1917, 19135, 71654, -20528, 15663, 32657, -19813, 12568, -38769, -40979, -12683, -59448, -135444, -68609, 17727, 29204, 2870, 41716, 44658, 21981, 25402, 30084, -2965, -70514, -129906, -68184, -29422, -54568, -70550, -64485, -51375, -13040, -35392, -16222, -35262, -70226, -92823, -46546, -46683, -47972, -32952, 12122, 8028, 16178, -33948, -43737, -26335, -15252, -36534, -28561, 23601, 11229, -57117, 4872, 27637, -47370, -77616, -42423, -36719, -86550, -16370, 16051, -50974, -95928, -56101, -37850, -42764, -26827, -2515, -22446, -75421, -53959, 8467, -36637, -43439, -58612, -50622, -89958, -24666, -9847, -10820, 28506, 40461, 75605, 86883, 33476, 8249]
1248H249m7569l4494k9973L7744L1523L4467K64K0236M4142k1666m4805o454q5525
1235i3861j089L7817j2479j8975L9995o3935o2265J18417L657M0948k3752l783
1223c9305J1481L7953p2337O1799R215L0799M4951o9491m1549N472j1944k4070
1211e7026K2328K2063M050l3608J08284j5738k1195O087L7727r7708j0533M5546
1199A0277l8683p88p120l1392O149R477O5306M1613l091K8801r1934k2348K8576
1186e157p10q6525j2338K8037K3870N2636j0527r3858k2916K1092M0390P7993
1174A1987K795L9797j2436l356N6120r0888k5107j0803J2368J4154k6184q910
1162d0463R453P0157j9226j8289l4611j033l041p886N1522J033j0878j933k5679
$$ y = [8249, -39320, -73814, -103787, -66043, -34520, -53, 211, 20447, 64589, 42923, -1882, -8336, -93861, -94950, -57133, -69612, -88587, -48592, -112527, -174792, -56375, -52718, -11770, -35522, -39305, -27824, 10129, -62208, -409, 8806, 39605, 84556, 15065, -26484, -21012, -32956, -57026, -34698, -12635, -8585, -42193, 66091, 50353, 29158, 35245, 72972, -24736, -35269, 10277, -28406, -29194, -36314, -67706, -61557, -52080, 13226, 54839, 51748, 80549, -11385, -33733, -5157, -5867, -92392, -104730, -76693, -52823, -187, -10714, -104572, -127488, -106396, -66006, 11987, 14782, 54579, 42143, 38787, 94907, 4019, -21088, -31891, -19523, -5369, -31553, -40463, -31010, 39147, 19921, 1632, -32979, -34012, -37053, -44939, 6583, 7616, -3262, -5195, -30874]
1149c0874K3655r211j5792O7071l9625k45k8714K9813K7751j8042J6305j303m5095
1136b4306j7373k1489r084P3239k0707O8682n3162q8825l9467P2137P7048k5610
1124h917o171J3965K8276p941k5899m6015K0134M1721K9369m3412M721m3316l0201
1111g3686O8923P8014n5915l1663J0170m3677M6465J6606k9999K8640q853j0456
1099e431m8546M2910K5866m5240J0495m8339O2180Q058l1169j1530K7087p352
1087b1011L024J9090j8341K6653j4710K5369M0243p3587l63M9393m7231J3818
1075B347k3871k318L932q090O4374l1867N8078Q225n5039m5517J8589M9291k7983
1062A0151o0392P9059P4719n7846k0054L2876k3987K4564q484n2535M527J6839
$$ y = [-30874, -7219, -16430, -32222, 34849, -4776, -5021, -33735, -3922, 23829, 5787, 22092, 20789, -24306, -41679, -63168, -72252, 987, -19720, 48962, -4200, -93025, -132492, -60355, 16693, -8917, -15088, -1123, 27153, 19212, -6687, -52702, -32568, 9153, 38522, -4890, -169, -43485, -73686, -4763, 73251, 17336, -14327, -4157, -47834, -1369, 15237, -14762, 13878, 5025, -5431, -53977, -11067, 14799, -30441, -19946, -68285, -6105, 1953, -29216, -40746, -13659, -21011, -17987, 1103, -17238, 9415, -5295, 20074, 60317, -13270, -13633, 35760, -11471, 2347, -21524, -23842, -19910, -28000, 36374, 4507, 62585, 70810, 15771, -29746, -11157, 38134, 10151, -50241, 28818, 103537, 45691, 25637, 58513, 34526, 59090, 50606, -1929, 2598, 19437]
1050A9437m263m993n97O122Q068m1832L7503N4087j6985j8309k5246n2599K3557
1037a6050M5677k873j4509l8913N7090p517m7117L9156j0101L922o559K649p944
1024c089r69j4189j2163O2281K2190j3150p2563m2935P6114N7051l6482o0407
1012c8311K0021j0213l0117M6301K4106q288L7814P039r632m6364j6283N1779
1000B7852o6802l6139n262k249O0404M1288J8860l8209n079j8120N7420j6202
988A7762q3096l4447K1619K880Q233N5164J5933p0360K0093L2580k5061P1517
976C2817K7676l9348l9302k2356P2909p2013l6334Q6292k486j6864N175k4847
964b8681K3876n0251M6457K792j6396M8514k7855n7960M1719K9772l2386K6095
$$ y = [19437, 15174, 10181, 9584, 15706, 23774, -18058, 19445, 73532, 56547, 38238, 12992, -39607, -16050, 29627, 26754, 12245, -26668, 30422, 22905, -24212, 14944, 4843, 8765, 2206, 4855, -3089, -4058, -18247, -30410, 31871, 54061, 40911, -31652, -74587, 1527, 58578, 22096, -38311, -18290, -28503, -58620, -12319, 11787, 3499, 41313, 48352, 38720, -7644, -23927, 27852, -38950, -75089, -80351, -82600, -22196, 19092, 37952, -257, -5336, -23456, 33964, 17762, -65334, -99781, -78162, -75282, -67049, -11885, 4048, -66312, -46219, -13639, -38700, 32817, 60493, 21145, -18157, -40513, 32396, -39617, -75951, 10341, 7855, -9009, -3834, -28681, -4805, -55056, -8599, -5807, -22203, 26311, -1544, -59504, -17785, 11987, -20399, 5696]
952E696M65j6400l9127M643M5622P767m633K0467j2214j6200l8748k3325K2908
939d3079K8050k1467N1825R6466m2393m5263J223o262O4492r808l4153O072M930
926E0633l3291j1536j6968j8450M7604n272l922N1446q3875J9692n8803j3829
914g6571L0167J3050M7992m7648m8295M6194J9355J5738P784n4544K6938L3760
902A3920m3062N9950K2632o5667M1054Q525n6685m2925k4751M8142Q646K4775
890e446N357k1353j2765K6426L6626r757k0141O1301p1435m9008K4439L4597J8104
877A6945k9210L8169m478j5598k4410j4904j8922L8327K9977J4327K8438o797
865E1864q231Q085R319l289r882K311m2918J8947n1162J1148P2526m0146M2040
$$ y = [5696, 6161, -10239, -49366, -44723, 899, 8666, 4033, 24500, 12286, -3914, -42662, -65987, -43079, -15029, -36496, 15329, 111795, 69402, 24139, 25362, 19100, 83592, 73784, 39631, 45703, 50633, 17342, 5806, -11162, -29612, 17992, 12720, 8798, 60244, -23631, -3939, -62742, -76571, -46404, -33354, 14638, -33010, -81305, -35111, -15756, -18, 7766, -46778, -19840, 13920, -29142, 30808, 53440, -12227, 28827, 37352, -19333, -62258, -87009, -38867, -30221, -5446, -89, -21442, -34207, -7781, 28845, 19088, -1053, 60248, -11187, -60195, -35756, -1159, 16945, -12265, 25904, 21426, 5828, -18582, -33486, -52408, -14081, 15896, 30223, 58661, 51864, 43633, 51718, 61037, 57748, 47866, 50177, 7259, 26206, -24956, -13808, 58718, 18572, 60612]
852F0612M2773p1143o7657k2940O9938K6730K0917J445n6511k0069l1612K3859
840b3658k5735M8777L4493L169k8599J7816l7981r7157M2984M338J1786K617O8084
827B0934L7277l921o173j8927j4037R564Q065j0269k587r563r510N3587j2947
814D1493k9206O060m1857k0730P2959P513n286m3201j2526r028O163K3539q773
801a2880N50j5338n4100K4677J8967K4021j2501l8888j0826N5122j2733O139M9468
788B1678l0019M2196J893O631l339J7102J3332q7666n500L7220j4665j0278j0487
775b1902j2673n99J0027L80K1879k1791p864l6544j2225M2298L931M6369K0021
762C1307l3930k164L005P109L0104k7101m935N7105j834j6554p7896k2977k3837
$$ y = [60612, 103385, 32242, -35415, -58355, 11583, 38313, 59230, 60675, 4164, -15905, -47517, -23658, -49393, -616, 33877, 37046, 8447, 26263, -11718, -108875, -65891, -61553, -49767, -47150, 20934, 58211, 54290, 48117, 29190, 15153, 24717, 32782, 22513, 19926, 10363, 853, 54440, 41493, 12287, 18347, -23510, -44240, 28719, 36232, 30946, -12255, -24781, -33809, -27646, -4107, -12880, -12330, -27668, -81768, -57091, -38124, -14103, -26604, -65492, -76318, -21196, -33929, -27790, 21678, -8341, 33855, 35748, 42379, 39040, 56142, 69474, -18192, -23692, 13528, -1137, -11415, -21902, -34575, -35174, -25147, -24767, -2888, -24679, -32543, -69087, -81312, -39014, -35083, 11286, 31307, -2623, -4787, -1782, 5327, 35431, 8330, 3395, 60500, 58666, 42112, -35784, -58761, -82598]
749h2598L3212M5072J4727l1353J3418J6120j0300l4464K8280L5152j0581o1836
737d5151L1614p469P071O702O53M0326j8331l4046J7705k4046J1519M6675m4498
724a1276K6621M2261L1381o9850M253j5347q808P254M1179n2937K1165J2876Q366
711C7138o1863r462N0904J696J8320j1387j8335M1732r8806O19N6172l8475M2313
698A0566l9491K735p542L0438J6848k8416L6796k5528J0985q620K8986P1583R345
685A08685n7855m9929j5460n5171M4924M0220N9596K3617n5608k2646l9754j9560
673c8941N6563k7512L222L1638L091m7207M0291o437n2082O777N124L1813P812
660A4152n6071L3676K3913m3663L4862L0600k5390m17l2598L3292J7313l8417
$$ y = [-82598, -49386, -4314, 10413, -20940, -7522, 8598, -1702, -36166, -7886, 27266, 16685, -45151, -13537, -21006, -13935, -7233, -6580, 33746, 15415, -18631, -926, -24972, -13453, 33222, -11276, 15345, 57606, 88987, 19137, 23390, 8043, -765, 6489, 47668, -5269, 15896, 28772, 37138, -24725, -34187, 16717, 18413, 36733, 25346, 7011, 48743, -50063, -49444, 6728, -31747, 10566, -28925, -26190, -33732, -3294, 13554, -14862, 21934, -3594, 7391, -1229, 27757, 99340, 108685, 50830, 901, -14559, -69730, -24806, 15414, 75010, 98627, 43019, 20373, -19381, -38941, 17622, -9890, -6668, 24970, 28061, -19146, 21145, 14708, -37374, -30597, -25473, 6340, 14152, -41919, -8243, 15670, -27993, 6869, 37469, 12079, 11662, -20936, 12356, 29669, -8748]
648h748j961K6192r006J5066m8175M7627N0075l4665m0203m2502M3035j5989j2712
635c1966p093l4733J1778R7932P231m3703j4404K5462N9718k9124n2579n5744
623f7225L8567O1080r690l5739P109m2346P0082l7345l0027N0015M2010n0348
611c857K2126K1297l4523j3852k0154K7869M5435J6955j772M252l5659j530j646
598B4941l4834m5802M5561K4799j5299n635Q0592j5318L80q5701L9656N129K0597
585C9066O106J1656k4101L6542j7084n614j5973k9359N0058j7635J7363n4999
573c974m8618O3410K7983R595J348rk6936n2384o99j7841J6873O6438J0239o887
559C8538j5742J6081m0225J5554p180m930J889m7136L7862P4951o3205m4298K2258
$$ y = [-8748, -10709, 15483, 6477, 21543, -26632, 20995, 71070, 36405, -3798, -46300, -3265, -19254, -31966, -39059, -73792, -62014, 35918, 43149, -554, -14958, 10504, 70222, 41098, -11481, -67225, -28658, 32422, 22732, -13007, -5898, -48244, 21838, -15507, -45534, 4481, 46491, -3857, 18269, 39566, 5043, -8809, -28963, -1094, 44341, 61296, 59524, 63776, 28117, 26587, 24941, -9893, -55695, -10134, 14665, -634, -6269, 74323, 59005, 59385, -26316, 13340, 18469, 39066, 45172, 56828, 32727, 69269, 52185, 46571, 30598, 1239, 51297, 33662, 51025, -3974, -52592, 10818, 38801, 48396, 49744, 49735, 22799, -29585, -30284, -48125, -31252, 35186, 45425, 38538, 22796, 38877, -1348, 14206, 7026, 2096, 3985, -43151, -5289, 69662, 6457, -37841, -15583]
546a5583L6648J3805k8265K0902n916J1689l3479j7421M7996N4880L50r1923j3675
533a9992L614l4798J8575L7272Q2456j4039k3500K7626n0935j1621J0419L4818
521E9895L2122n6175k9605n6094j0919K8198K4810o560j6587k918M7017q91k108
508A0185p778M595J4530m2998L9159n1208n1673K2670N4334M7400k9970k8890
496a9644p636L3308J9625J965l9321J983k4476J3854M9254N766k3639L4908l8303
483G644Q512J2787r847j694j4382J6431r248l269k2502J1353Q1492l2216o4428
470a9367M072P646L669N0686M948k1348J4851Q269k8743M8691M324n6990l9490
457a8782N0456L5193J2458m7017j2655l046l2236L9500K283k0445N7704l7707
$$ y = [-15583, 21065, 34870, 6605, 27507, 21591, 33280, -199, -17620, 30376, 85256, 85606, -6317, -19992, -16378, -51176, -32601, 4671, 87127, 73088, 49588, 77214, 26279, 14658, 25077, 59895, 92017, 35842, 6237, -49857, -60776, -32578, -7768, -14328, -30915, -33833, 13184, 12293, 10185, 2407, 7002, 21532, -21466, 17693, -33515, -85188, -62518, -8184, 39216, 9246, -19644, -27280, 6028, 25653, 27618, -11703, -9720, -34196, -20342, 28912, 34678, 11039, 45947, 7644, 16156, 28943, 19096, 17402, 3020, 19451, 10203, 6934, -15568, -4215, 77277, 45061, -19367, -15295, -7649, -3980, 46706, 51654, 30306, 45157, 53426, 24683, 73374, 77698, 20708, -18782, 31674, 66867, 79325, 32308, 19653, 16607, -15629, 23871, 26154, 5709, 63413, 25706]
445B5706K576L4862M830J963r042p0696j9045P6816J8474k9448M2702j7733m7600
432A4365M1829l8807k0898L5293K2475j076Q154r7170r980J8917M004O6503L8274
419H1883j9450j18134j524N8777k3819Q8421o4302j4940J114N6662o1685J6071
407i26K6976J1092j2757m6482l7940M4731L8801n9786N7403l7128n3808M4668
395b5156O9070k1300J984k0696m2365R467K8514N1453j2773l7415K8552n1698
383b2363L9806o100r1156K9355J4725M5757J2979l2925j8608L1449J7854M24k9447
370h250j7827k0855K9993K5583j1927O269l7915K5965j301k1293M8118j8108k9233
357c0781r231O8053j8255j905l6912o0195L2640O678n5456K8580M2749K5104L3064
$$ y = [25706, 28282, 63144, 67974, 69937, 60895, -9801, -28846, 47970, 66444, 36996, 79698, 61965, 14365, 56194, 17387, -3511, 31782, 54257, 53181, 61335, -35835, -45815, -26898, -22894, 43609, 81883, 62433, -55701, -57225, 1552, -22267, 66154, 1852, -13088, -11974, 44688, -16997, -926, 26050, 37142, 24385, -22097, -60037, -15306, 23495, -36291, 21112, -16016, -69824, -25156, 43914, 22614, 24598, 3902, -38463, -28996, -482, 50971, 38198, 783, 29335, -22363, 17443, 11343, -79813, -50458, -35733, 10024, 23003, -9922, -28530, 2919, 20773, 21197, -8250, -26077, -46932, -16939, 8644, -3283, 2986, -34929, -8964, -10265, -31558, 16560, -1548, -30781, -40012, 28041, 9786, 7881, -29031, -89226, -56586, -49908, -105364, -76784, -34035, -8931, 24133]
344B4133K7184J6251l4912j3264J2367J5461m3117o3248K8065N9379j5181n7014
332d3896J1477K0548m2548N2741K2144k982J5036Q451j1957J2052K3655p5228
320a0507j8518K556L3614P33o068L3216K4991n6080k6463o728O095k5111l438
307e1708M8163L6731m87J9269O1080p6956j7021M3577N7743r9489o682L1158l7576
294G802L8456l9803m6937L3288o0399N9746M3309N2183r3198l4043j6123P4699
282A8980K061l7911N0594l4585k228P141j5812l0151R2J5946J5496K3337k3362
269a0402K3597l4012M9747l377o8717K0644M2219O750K8508l2876l1067o859k4803
256d0648P154j3496N375K370N1906M1391n8658k6331K4014p016J626n0370O7011
$$ y = [24133, 51317, 67568, 32656, 19392, 31759, 47220, 4103, -59145, -31080, 28299, 13118, -43896, -32419, -11871, -54419, -1678, 20466, 17484, 32520, 40971, 29014, 41066, 64721, -10507, -29025, -26469, 7145, 7878, 1810, 35026, 60017, 3937, -22526, -29254, -23159, -48270, -51708, -3545, 33186, 32699, 51968, 113048, 36092, 19071, 62648, 120391, 20902, 14220, 45378, 7802, 46258, 6455, -40482, -7194, -67593, -7847, 35462, 87645, -5553, -39596, -55719, 18980, 21041, -16870, 33724, -861, -3089, 4052, -11760, -41911, -41819, -25873, -10377, 12960, -10402, 13195, -20817, 28930, 25553, -43164, -22520, 19699, 26449, 54957, 22081, -8986, -15845, -40648, -33494, -46990, -41615, -39245, 12661, 54052, -4606, -30937, -6923, -13939, -12313, -62683, 4328]
243D328J5518q452K5603l522o2933J6647j991j3307L3061n219R375K0081j7334
230A1855P8066k8456o1741K8148l9010J0039o0559n808L2495M4938N152n3158
218c8039O6693q549p472L6473k5817j2342K9716j6608K2322k8386K4533j6431
206B6093k5514k8385K3112M5878M57R568j6977o1635P8125n4078M0843J1971J44
193D9602j5172l3047j6283l7907L2460l6638J8710L5112J4915J4166R457l702
181C1673k1399k6445k7929L7753J7847r414k5684L0729R316l5126m21l1657N5442
168D685j8172n6186J4081M7188M9788J3472m3794R644l693m6448k4133P4556N1080
155G2068k6053k1707J2107j5785l658Q190K8432m2673o9222L2852L6407M624n3684
$$ y = [4328, 19846, 11394, 36997, 33475, -29458, -12811, -14802, -28109, 4952, -267, 9108, 29189, 11855, 89921, 61465, -276, 27872, -11138, -1099, -61658, -67466, -34971, 9967, 15119, -38039, 28654, 20105, 12633, 49106, 23289, 10947, 40663, 24055, 46377, 17991, 42524, 26093, 579, -27806, -4694, 41184, 41641, 51209, 34232, -27403, 50722, -3356, 37487, 49458, 49602, 34430, 1383, -14900, -52807, -20347, -56985, -38275, -3163, 11752, 25918, 35375, 31673, 10274, -16171, -44100, -6347, 11500, 2086, -23598, 7131, 16447, -18679, -19100, -50757, 4685, -13487, -69673, -55592, -8404, 41384, 54856, 11062, 20706, 17013, -29435, -53568, 20988, 72068, 46015, 24308, 36415, 20630, 16972, 25162, 53594, 10921, -58301, -25449, 10958, 15582, -38102]
142c8102R042K5362k8940J589l8234L0999O7574j2646m394L115M6805j5800m4032
129B338J1107m3424L6746k156n951J7311K8350r027J044m1505L2427K0193l084
116D4369l3455J8508l080M292o4126J6854J1997j3805Q7831L813j596l2827m858
103C3917J1479j963J2110J4298j0235k6443m5470o447J0736J4846J1951P476j4457
90A1798k4794M5059M0029m8322j1196L5457L938K627j7185l4394j3307M5169m1593
77f714m5407K0585K9192M6089l1695r434P943K7755l5799K882J346k3234L1435
64A4944N4249N0051n3462j8319j209q2708l5663M9839O1346m024k7660j777j66
51E441K1224K3387m592n5639n7089J0531P392L6646P08l1016L4888J0807j7244
$$ y = [-38102, -29060, -3698, -32638, -31049, -69283, -38284, 29290, 16644, 12250, 15365, 62170, 46370, 2338, 13445, -29979, 6767, 4611, -1340, 15971, 44321, 35294, 36338, -5167, 27260, 47453, 44369, 10914, 29422, 26342, 30634, -33492, -16638, -4641, -18446, 69385, 73198, 71602, 38775, 33917, 45396, 43433, 55543, 69841, 59606, 33163, -12307, -18754, -8018, 6828, 18779, 26255, 11798, -12996, 32063, 72092, 23770, 12574, 48031, 51969, 54596, 37411, 3017, -10290, 34879, -6714, -52121, -31536, -2344, 43745, 12050, 2616, 10559, 38314, 2515, 5397, 6743, -16491, 14944, 69193, 119244, 65782, 47463, 46254, -36454, -72117, -22278, 39068, 35044, 7384, 5607, 5441, 26665, 50052, 45460, -10179, -67268, -56737, -49345, -12699, -11991, -43007, -8119, 2688, -14556]
38a4556R089J1280K062k2827J0332k9349K2017Q8242k1070j0989J5958n6982m767
25a560K7730K8163l4922L3297l5482k6673j2648L2700L903p425j6949L6753J1668
12C8555m2795K1005j693r101L1104q442K2481j804l1266J6013q952L0328
0E5433
$$ y = [-14556, -5467, 5813, 7875, -14952, -4620, -33969, -11952, 76290, 55220, 44231, 60189, 3207, -1560, 26170, 54333, 19411, 52708, 17226, -9447, -22095, 10605, 14508, 7083, -9866, 26887, 38555, -4240, 16765, 15072, 5971, 37075, 28633, 51114, 49310, 18044, 34057, 25105, 55433]
$$ Imaginary data points
##PAGE= N=2
##DATA TABLE= (X++(I..I)), XYDATA
16383a017102L0018k622J0503N5076N4622l502K3175J6191K4364n635j7301O0381
16371g71832J7954P3731o213K8195l884N0311J9159P45k328K4155J7298N111K0180
16358e27418L4289K7111K7619K7690j928L5397M1846J2398k559J274n093Q083
16346c21291K6970m054P188K3388N2156Q0779M185j518J1904N0397N1547p815
16334b6164m6209N2013R334k0560L1246N7657k1519j6309L4597K9527J01K4509
16322A08223L9776J9441k3111J9959L1693J2712L5791L0110m541K1539M323K7919
16310C23834j4204R6333L0662l266K3642m2691q823P7508R374j2768K5038L3473
16298E38112L4032j4487L8974J1783M0615j003n025k3840j032L0926L7387J6274
$$ y = [-1017102, -987084, -989706, -979203, -924127, -869505, -873007, -849832, -833641, -809277, -814912, -832213, -771832, -753878, -680147, -686360, -658165, -662049, -611738, -592579, -591834, -594162, -570007, -552709, -547598, -527418, -493129, -466018, -438399, -410709, -412637, -377240, -335394, -322996, -325555, -324281, -329374, -321291, -294321, -298375, -291187, -267799, -215643, -134864, -130679, -132197, -120293, -69896, -18349, -26164, -72373, -20360, -11026, -31586, -340, 57317, 35798, 19489, 54086, 83613, 83714, 108223, 147999, 167440, 144329, 164288, 195981, 208693, 244484, 274594, 270053, 291592, 295915, 323834, 309630, 405963, 436625, 433359, 457001, 414310, 405487, 482995, 492369, 479601, 504639, 538112, 572144, 557657, 596631, 608414, 649029, 648026, 643001, 619161, 618129, 649055, 686442, 702716]
16286G02716M5574K8072r9M0516N55m7051K878K2176N3138J1150L7557J6273J9632
16273I33087R675o071l794p560K7612K3815K5816K2621j9265J2823L2073J6393
16261A067225Q0346J2347k7012j2998k0256M4710K4777k0961k543J3295J3124
16250A172054J8918P6202K6599n7384O843J9701r896K3046j475m7572N2452Q662
16238A288150o524R364J9658R4156K181J4398k3856J8131J6655k6789j1534N9886
$$ y = [702716, 748290, 776362, 776263, 816779, 817334, 770283, 773161, 795337, 848475, 859625, 897182, 913455, 933087, 942762, 936691, 932897, 925337, 952949, 976764, 1002580, 1025201, 1005936, 1018759, 1050832, 1067225, 1147571, 1159918, 1132906, 1119908, 1099652, 1144362, 1169139, 1148178, 1145635, 1158930, 1172054, 1190972, 1267174, 1293773, 1236389, 1243232, 1262933, 1253037, 1276083, 1274608, 1227036, 1279488, 1288150, 1281626, 1290990, 1310648, 1404804, 1406985, 1421383, 1397527, 1415658, 1432313, 1405524, 1393990, 1453876]
$$ [...]
##END NTUPLES=NMR SPECTRUM
##END=
