##TITLE=1H_CA-9080-2
 CDCl3
 8 sc, 
 24.10.2022
##JCAMPDX= 6.0         $$ Bruker NMR JCAMP-DX V2.0
##DATA TYPE= NMR SPECTRUM
##DATA CLASS= NTUPLES
##ORIGIN= UXNMR, Bruker Analytische Messtechnik GmbH
##OWNER= root
$$ XWIN-NMR		Version 3.5
$$ Mon Oct 24 13:56:19 2022 Russian Standard Time (UT+4h)  she@DPX200
##.OBSERVE FREQUENCY= 200.1313499994
##.OBSERVE NUCLEUS= ^1H
##.ACQUISITION MODE= SIMULTANEOUS
##.ACQUISITION SCHEME= undefined
##.AVERAGES= 8
##.DIGITISER RES= 18
##SPECTROMETER/DATA SYSTEM= spect
##.PULSE SEQUENCE= zg30
##.SOLVENT NAME= CDCl3
##.SHIFT REFERENCE= (INTERNAL, CDCl3, 0, 15.7623)
##AUDIT TRAIL= $$ (NUMBER, WHEN, WHO, WHERE, WHAT)
$$ ##TITLE= Audit trail, XWIN-NMR		Version 3.5
$$ ##JCAMPDX= 5.01
$$ ##ORIGIN= Bruker BioSpin GmbH
$$ ##OWNER= she
$$ F:/spectra/data/she/nmr/H-F/1/pdata/1/auditp.txt
$$ ##AUDIT TRAIL=  $$ (NUMBER, WHEN, WHO, WHERE, WHAT)
(   1,<2022-10-24 13:54:59.23 +0400>,<she>,<DPX200>,
      <created by zg, POWCHK disabled, PULCHK disabled
       configuration hash MD5:
       00 E9 B6 7A A2 85 ED C7 34 08 36 98 17 FE 4E 26
       data hash MD5: 16K
       53 8C CD AC 2C 27 11 48 56 59 8E 20 AB 73 38 90>)
(   2,<2022-10-24 13:55:01.26 +0400>,<she>,<DPX200>,
      <Start of raw data processing
       efp BC_mod = 2 LB = 0.24 FT_mod = 6 PKNL = 1 PHC0 = -18037.99 PHC1 = 18.6007 SI = 16K 
       data hash MD5: 16K
       07 8E FB FF 67 EB E1 A7 CD B5 87 73 CF 3E A0 D1>)
(   3,<2022-10-24 13:55:15.14 +0400>,<she>,<DPX200>,
      <pk PHC0 = 2.904322 PHC1 = -7.199999 
       data hash MD5: 16K
       6E A8 C5 E7 81 34 6B 6D 6B 54 A8 8C 13 C9 9F EC>)
(   4,<2022-10-24 13:55:18.39 +0400>,<she>,<DPX200>,
      <abs ABSG = 5 
       data hash MD5: 16K
       89 C2 3F DC 4F AB 36 36 C4 75 01 D0 19 42 B7 A1>)
$$ ##END=
$$ 
$$ hash MD5
$$ 55 AA 1E BE 88 8D 29 F5 3F DB B1 9F 3C E9 7F 69
##$RELAX= 
##$RELAX= 
##$RELAX= 
##$RELAX= 
##$RELAX= 
##$RELAX= 
$$ Bruker specific parameters
$$ --------------------------
##$DU= <F:/spectra>
##$EXPNO= 1
##$NAME= <H-F>
##$PROCNO= 1
##$TYPE= <nmr>
##$USER= <she>
##$AMP= (0..31)
100 100 100 100 100 100 100 100 100 100 100 100 100 100 100 100 100 100 
100 100 100 100 100 100 100 100 100 100 100 100 100 100 
##$AQSEQ= 0
##$AQ_mod= 1
##$AUNM= <au_zg>
##$AUTOPOS= <>
##$BF1= 200.13
##$BF2= 200.13
##$BF3= 200.13
##$BF4= 200.13
##$BF5= 200.13
##$BF6= 200.13
##$BF7= 200.13
##$BF8= 200.13
##$BYTORDA= 1
##$CFDGTYP= 0
##$CFRGTYP= 5
##$CHEMSTR= <none>
##$CNST= (0..31)
1 1 145 1 1 1 1 1 1 1 1 1 1 1 1 1 1 1 1 1 1 1 1 1 1 1 1 1 1 1 1 1 
##$CPDPRG= <>
##$CPDPRG1= <>
##$CPDPRG2= <>
##$CPDPRG3= <>
##$CPDPRG4= <mlev>
##$CPDPRG5= <mlev>
##$CPDPRG6= <mlev>
##$CPDPRG7= <mlev>
##$CPDPRG8= <mlev>
##$CPDPRGB= <>
##$CPDPRGT= <>
##$D= (0..31)
0 1.2 0 0 0 0 0 0 0 0.06 0 0.03 0 0 0 0 0.0002 0 0 0 0 0 0 0 0 0 0 0 0 
0 0 0 
##$DATE= 1666605298
##$DBL= (0..7)
120 120 120 120 120 120 120 120 
##$DBP= (0..7)
150 150 150 150 150 150 150 150 
##$DBP07= 0
##$DBPNAM0= <>
##$DBPNAM1= <>
##$DBPNAM2= <>
##$DBPNAM3= <>
##$DBPNAM4= <>
$$ [...]
##$SUBNAM3= <"">
##$SUBNAM4= <"">
##$SUBNAM5= <"">
##$SUBNAM6= <"">
##$SUBNAM7= <"">
##$SUBNAM8= <"">
##$SUBNAM9= <"">
##$SW= 18.0517283424941
##$SWIBOX= (0..15)
0 0 2 0 0 0 0 0 0 0 0 0 0 0 0 0 
##$SW_h= 3612.71676300578
##$TD= 16384
##$TD0= 1
##$TE= 0
##$TE2= 300
##$TE3= 300
##$TEG= 300
##$TL= (0..7)
0 120 120 120 120 120 120 120 
##$TP= (0..7)
150 150 150 150 150 150 150 150 
##$TP07= 0
##$TPNAME0= <>
##$TPNAME1= <>
##$TPNAME2= <>
##$TPNAME3= <>
##$TPNAME4= <>
##$TPNAME5= <>
##$TPNAME6= <>
##$TPNAME7= <>
##$TPOAL= (0..7)
0.5 0.5 0.5 0.5 0.5 0.5 0.5 0.5 
##$TPOFFS= (0..7)
0 0 0 0 0 0 0 0 
##$TUNHIN= 0
##$TUNHOUT= 0
##$TUNXOUT= 0
##$USERA1= <user>
##$USERA2= <user>
##$USERA3= <user>
##$USERA4= <user>
##$USERA5= <user>
##$V9= 5
##$VALIST= <valist>
##$VCLIST= <CCCCCCCCCCCCCCC>
##$VD= 0
##$VDLIST= <DDDDDDDDDDDDDDD>
##$VPLIST= <PPPPPPPPPPPPPPP>
##$VTLIST= <TTTTTTTTTTTTTTT>
##$WBST= 1024
##$WBSW= 4
##$XGAIN= (0..3)
0 0 0 0 
##$XL= 0
##$YL= 0
##$YMAX_a= 398690
##$YMIN_a= -779128
##$ZGOPTNS= <>
##$ZL1= 120
##$ZL2= 120
##$ZL3= 120
##$ZL4= 120
##$ABSF1= 15.74138
##$ABSF2= -2.31047
##$ABSG= 5
##$ABSL= 3
##$ALPHA= 0
##$AQORDER= 0
##$ASSFAC= 0
##$ASSFACI= 0
##$ASSFACX= 0
##$ASSWID= 0
##$AUNMP= <proc_1d>
##$AZFE= 0.1
##$AZFW= 0.1
##$BCFW= 0
##$BC_mod= 2
##$BYTORDP= 0
##$COROFFS= 0
##$CY= -3
##$DATMOD= 1
##$DC= 0
##$DFILT= <>
##$DTYPP= 0
##$F1P= 0
##$F2P= 0
##$FCOR= 1
##$FTSIZE= 16384
##$FT_mod= 6
##$GAMMA= 0
##$GB= 0
##$INTBC= 1
##$INTSCL= 3.70164e-10
##$ISEN= 128
##$LB= 0.24
##$LEV0= 0
##$LPBIN= 0
##$MAXI= 10000
##$MC2= 0
##$MEAN= 0
##$ME_mod= 0
##$MI= 1.114404
##$NCOEF= 0
##$NC_proc= -5
##$NLEV= 6
##$NOISF1= 3.799351
##$NOISF2= 2.8
##$NSP= 0
##$NTH_PI= 0
##$NZP= 0
##$OFFSET= 15.76231
##$PC= 1
##$PHC0= -18035.09
##$PHC1= 11.4007
##$PH_mod= 1
##$PKNL= yes
##$PPARMOD= 0
##$PSCAL= 0
##$PSIGN= 0
##$REVERSE= no
##$SF= 200.130001845145
##$SI= 16384
##$SIGF1= 3
##$SIGF2= 2
##$SINO= 5.538805
##$SIOLD= 16384
##$SREGLST= <1H.CDCl3>
##$SSB= 0
##$STSI= 16384
##$STSR= 0
##$SW_p= 3612.71676300578
##$SYMM= 0
##$S_DEV= 0
##$TDeff= 16384
##$TDoff= 0
##$TI= <>
##$TILT= no
##$TM1= 0
##$TM2= 0
##$TOPLEV= 0
##$USERP1= <user>
##$USERP2= <user>
##$USERP3= <user>
##$USERP4= <user>
##$USERP5= <user>
##$WDW= 1
##$XDIM= 16384
##$YMAX_p= 290023942
##$YMIN_p= -170530
$$ End of Bruker specific parameters
$$ ---------------------------------
##NTUPLES= NMR SPECTRUM
##VAR_NAME=  FREQUENCY,     SPECTRUM/REAL,   SPECTRUM/IMAG
##SYMBOL=    X,             R,               I
##VAR_TYPE=  INDEPENDENT,   DEPENDENT,       DEPENDENT
##VAR_FORM=  AFFN,          ASDF,            ASDF
##VAR_DIM=   16384,         16384,           16384
##UNITS=     HZ,            ARBITRARY UNITS, ARBITRARY UNITS
##FACTOR=    0.220516191357247, 1,           1
##FIRST=     3154.51113500263, 0,            0
##LAST=      -458.205628003148, 0,           0
##MIN=       -458.205628003148, -170530,     0
##MAX=       3154.51113500263, 290023942,    0
$$ Real data points
##PAGE= N=1
##DATA TABLE= (X++(R..R)), XYDATA
$$ [...]
$$ plain form
9242 14746202 14976681 15153808 15221546 15268005 15382758 15780841 16355202 16775837 16927980 17007945
9232 17007945 17123629 17277559 17504482 17768309 18244441 19000787 19767735 20022867 19867174
9223 19867174 19672854 19373395 18859784 18011776 16558028 14926980 13559083 12545422 11856751
9214 11856751 11390552 11077694 10867776 10731106 10566388 10277744 9860020 9536744 9249559
9205 9249559 8860572 8372757 7837179 7460335 7038644 6666819 6368867 6153707 5976281 5704952
9195 5704952 5516381 5358471 5186097 4919793 4720439 4572079 4369058 4260417 4150499 4086609
9185 4086609 3963703 3862026 3809150 3719664 3688806 3668428 3604113 3484836 3450146 3460576 3482493
9174 3482493 3451126 3405050 3334594 3252709 3255412 3190771 3168359 3093586 3125111 3064584 3072480 3094043
$$ packed form
9242A4746202K30479J77127O7738M6459J14753L98083N74361M20635J52143P9965
9232A7007945J15684J53930K26923K63827M76132P56346P66948K55132j55693
9223A9867174j94320k99459n13611q48008j453748j631048j367897j013661o88671
9214A1856751m66199l12858k09918j36670j64718k88644m17724l23276k87185
9205I249559l88987m87815n35578l76844m21691l71825k97952k15160j77426k71329
9195E704952j88571j57910j72374k66304j99354j48360k03021j08641j09918o3890
9185D086609j22906j01677n2876q9486l0858k0378o4315j19277l4690J0430K1917
9174C482493l1367m6076p0456q1885K703o4641k2412p4773L1525o0527P896K1563
$$ plain form
9162 3094043 3105722 3080102 3064553 3105035 3133908 3150373 3076378 3065712 3129141 3142985 3129288
9151 3129288 3109381 3110411 3022414 3067368 3070002 2997808 3041529 3013801 3019803 2969547 2967679 2993805
9139 2993805 2986406 2956134 3006817 2937320 2966818 3007371 2972562 2981668 3059670 3103844 3106706 3129237
9127 3129237 3124190 3156719 3234214 3264601 3347553 3391886 3491259 3519606 3543439 3558437 3637715 3744691
9115 3744691 3732907 3845886 3875690 3937701 4009029 4001974 4011352 4074805 4099527 4144314 4172878 4256265
9103 4256265 4348453 4384880 4471802 4537848 4629974 4745047 4796103 4900958 5008091 5071823 5267024
9092 5267024 5439430 5606371 5756026 5888371 6048244 6240399 6463819 6673421 6806909 6964499
9082 6964499 7196839 7311595 7439008 7689720 7891298 8070003 8305805 8559081 8846027 9213594
$$ packed form
9162C094043J1679k5620j5549M0482K8873J6465p3995j0666O3429J3844j3697
9151C129288j9907J030q7997M4954K634p2194M3721k7728O002n0256j868K6126
9139B993805p399l0272N0683o9497K9498M0553l4809R106P8002M4174K862K2531
9127C129237n047L2529P7495L0387Q2952M4333R9373K8347K3833J4998P9278J06976
9115C744691j1784J12979K9804O2011P1328p055R378O3453K4722M4787K8564Q3387
9103D256265R2188L6427Q6922O6046R2126J15073N1056J04855J07133O3732J95201
9092E267024J72406J66941J49655J32345J59873J92155K23420K09602J33488J57590
9082F964499K32340J14756J27413K50712K01578J78705K35802K53276K86946L67567
$$ plain form
9072 9213594 9591150 10064523 10549697 10994272 11539281 12284874 13143220 13927220 14486337 14753491
9062 14753491 15008811 15567161 16545706 17558633 18393200 18847189 19070978 19408328 19900786
9053 19900786 20614083 21474817 22806297 24574150 26566384 27958372 28436467 28326831 28373032
9044 28373032 29140894 30544053 31904094 32356277 31527707 29884837 27973603 26269041 24939958
9035 24939958 24150153 23741206 23645161 23535911 23302977 23029649 22623602 22445214 22627101 23106294
9025 23106294 23684471 24035991 24241794 24591762 25134541 25737437 26200134 26623671 27122547
9016 27122547 27814593 28669860 29646067 30510868 31287711 32163331 33729210 35519298 36856468
9007 36856468 37176597 37064361 36876388 36337462 34951239 32367609 28947393 25475915 22532971
$$ packed form
9072I213594L77556M73373M85174M44575N45009P45593Q58346P84000N59117K67154
9062A4753491K55320N58350R78545J012927Q34567M53989K23789L37350M92458
9053A9900786P13297Q60734J331480J767853J992234J391988M78095j09636M6201
9044B8373032P67862J403159J360041M52183q28570j642870j911234j704562j329083
9035B4939958p89805m08947r6045j09250k32934k73328m06047j78388J81887M79193
9025B3106294N78177L51520K05803L49968N42779O02896M62697M23537M98876
9016B7122547O92046Q55267R76207Q64801P76843Q75620J565879J790088J337170
9007C6856468L20129j12236j87973n38926j386223k583630l420216l471478k942944
$$ plain form
8998 22532971 20211897 18230451 16657435 15407760 14457664 13683095 13046206 12359552 11632367
8989 11632367 11011864 10435841 9890771 9393367 8903488 8486057 8089671 7746142 7470476
8980 7470476 7164051 6977925 6848645 6645962 6457969 6281330 6164745 6012842 5834265 5759114
8970 5759114 5586999 5481148 5352866 5257541 5215862 5116108 4980992 4988795 4962611 4826188 4758702
8959 4758702 4755658 4752448 4750660 4705886 4654583 4580713 4563105 4555295 4438526 4334998 4367310 4283837
8947 4283837 4179312 4155264 4177173 4182320 4214782 4218305 4178377 4165212 4185854 4212497 4192657 4177184
8935 4177184 4252298 4299566 4279277 4256164 4286684 4265335 4295704 4304161 4334044 4346895 4325656 4353448
8923 4353448 4366222 4407655 4465810 4450813 4505706 4614664 4648154 4676846 4641158 4685718 4672532
$$ packed form
8998B2532971k321074j981446j573016j249675r50096p74569o36889o86654p27185
8989A1632367o20503n76023n45070m97404m89879m17431l96386l43529k75666
8980G470476l06425j86126j29280k02683j87993j76639j16585j51903j78577p5151
8970E759114j72115j05851j28282r5325m1679r9754j35116P803k6184j36423o7486
8959D758702l044l210j788m4774n1303p3870j7608p810j16769j03528L2312q3473
8947D283837j04525k4048K1909N147L2462L523l9928j3165K0642K6643j9840j5473
8935D177184P5114M7268k0289k3113L0520k1349L0369Q457K9883J2851k1239K7792
8923D353448J2774M1433N8155j4997N4893J08958L3490K8692l5688M4560j3186
$$ plain form
8912 4672532 4658920 4679443 4721386 4778917 4791506 4936892 4997167 5089891 5178703 5281043 5391768
8901 5391768 5394027 5449555 5499373 5654103 5786700 5828647 5869333 6024160 6153524 6225976 6381792
8890 6381792 6520947 6587851 6755907 6884943 7030769 7238535 7407196 7630197 7875078 8131177
8880 8131177 8409273 8772516 9078003 9314802 9615466 9927512 10219897 10456599 10682080 10936829
8870 10936829 11154625 11415550 11635328 11698044 11568871 11357700 11317034 11387589 11486748 11626027
8860 11626027 11774649 11970224 12143005 12250517 12430371 12656654 12924908 13204096 13602731
8851 13602731 14087661 14502055 14954653 15406509 15925385 16436300 17071699 17768911 18522757
8842 18522757 19306956 20164270 21112862 22152735 23142670 24177242 25279525 26223560 26731892
$$ packed form
8912D672532j3612K0523M1943N7531J2589J45386O0275R2724Q8812J02340J10725
8901E391768K259N5528M9818J54730J32597M1947M0686J54827J29364P2452J55816
8890F381792J39155O6904J68056J29036J45826K07766J68661K23001K44881K56099
8880H131177K78096L63243L05487K36799L00664L12046K92385K36702K25481K54749
8870A0936829K17796K60925K19778O2716j29173k11171m0666P0555R9159J39279
8860A1626027J48622J95575J72781J07512J79854K26283K68254K79188L98635
8851A3602731M84930M14394M52598M51856N18876N10915O35399O97212P53846
8842A8522757P84199Q57314R48592J039873R89935J034572J102283R44035N08332
$$ plain form
8833 26731892 26984423 27297662 27976788 29093490 30664343 32299289 33576152 34628253 35113993
8824 35113993 35207444 35094920 34915223 34732057 34629799 34543519 34710341 35066332 35070548 34379532
8814 34379532 32965685 31466973 30340065 29627309 29425013 29495572 29723972 29883875 29923591
8805 29923591 29916315 30195722 30812162 31746881 32941838 34281169 35767908 37423456 39403316
8796 39403316 41680745 44075109 46518149 48615300 50350806 51700662 52714066 53300738
8788 53300738 53557625 53757884 54181124 54629946 54650534 53810650 51584127 48116807 44400984
8779 44400984 41262723 38967242 37379698 35972825 34245519 32057613 29892956 28288499
8771 28288499 27140856 26181659 25471729 24858686 24435824 24366395 24773743 25359932 26121774
$$ packed form
8833B6731892K52531L13239O79126J116702J570853J634946J276863J052101M85740
8824C5113993R3451j12524j79697j83166j02258q6280J66822L55991M216o91016
8814C4379532j413847j498712j126908p12756k02296P0559K28400J59903L9716
8805B9923591p276K79407O16440R34719J194957J339331J486739J655548J979860
8796C9403316K277429K394364K443040K097151J735506J349856J013404N86672
8788E3300738K56887K00259M23240M48822K0588q39884k226523l467320l715823
8779D4400984l138261k295481j587544j406873j727306k187906k164657j604457
8771B8288499j147643r59197p09930o13043m22862o9429M07348N86189P61842
$$ plain form
8762 26121774 26865230 27600733 28375152 29363274 30656379 32370582 34408863 36307524 37372102
8753 37372102 37244929 36169354 34898950 33974818 33584271 33297936 32640627 31546718 29911503
8744 29911503 27832626 25530379 23395674 21395256 19770164 18498392 17409058 16537322
8736 16537322 15817745 15155161 14478887 13916587 13444462 13082766 12845536 12629958 12418427
8727 12418427 12264536 12133338 11923278 11760944 11528515 11352404 11314878 11378957 11586021 11784894
8717 11784894 11808828 11833867 11646107 11344606 11043483 10750794 10516059 10347268 10283828 10365469
8707 10365469 10591825 10866201 11215819 11782880 12560392 13555595 14953164 15945578 16417170
8698 16417170 15644975 13850556 12391412 11408373 10851946 10551187 10287551 10168324 10190590
$$ packed form
8762B6121774P43456P35503P74419R88122J293105J714203K038281J898661J064578
8753C7372102j27173j075575j270404r24132l90547k86335o57309j093909j635215
8744B9911503k078877k302247k134705k000418j625092j271772j089334q71736
8736A6537322p19577o62584o76274n62300m72125l61696k37230k15578k11531
8727A2418427j53891j31198k10060j62334k32429j76111l7526O4079K07064J98873
8717A1784894K3934K5039j87760l01501l01123k92689k34735j68791o3440Q1641
8707A0365469K26356K74376L49618N67061P77512R95203J397569R92414M71592
8698A6417170p72195j794419j459144r83039n56427l00759k63636j19227K2266
$$ plain form
8689 10190590 10280300 10422007 10591138 10738060 10889626 11055065 11168980 11251846 11331212 11507702
8679 11507702 11909083 12467789 13206137 14113407 15110313 15963712 16533087 17020487 17649786
8670 17649786 18473317 19411590 20040250 20022010 19483840 18615491 17787147 17075393 16336072 15426079
8660 15426079 14359546 13366723 12598245 11946857 11479025 11253692 11134645 11107321 11169672 11321698
8650 11321698 11511425 11739169 12084267 12598685 13304961 14058155 14640457 15031595 15363674
8641 15363674 15885799 16687135 17867496 19413242 21006096 22335952 23222886 23286428 22600680
8632 22600680 21422230 20094965 18921725 17846263 17137908 16830660 16888673 17114854 17003509
8623 17003509 16369078 15449795 14699988 14341938 14092780 13767296 13209946 12609114 12139393
$$ packed form
8689A0190590Q9710J41707J69131J46922J51566J65439J13915Q2866P9366J76490
8679A1507702M01381N58706P38348R07270R96906Q53399N69375M87400O29299
8670A7649786Q23531R38273O28660j8240n38170q68349q28344p11754p39321r09993
8660A5426079j066533r92823p68478o51388m67832k25333j19047k7324O2351J52026
8650A1321698J89727K27744L45098N14418P06276P53194N82302L91138L32079
8641A5363674N22125Q01336J180361J545746J592854J329856Q86934O3542o85748
8632B2600680j178450j327265j173240j075462p08355l07248N8013K26181j11345
8623A7003509o34431r19283p49807l58050k49158l25484n57350o00832m69721
$$ plain form
8614 12139393 11964517 11801583 11775735 11847714 11945772 12112281 12343438 12564223 12637547 12782054
8604 12782054 13093749 13425874 13746776 14006670 14119055 14062779 13955156 13784607 13729308 13827872
8594 13827872 13947988 14096190 14186605 14174816 13827177 13313240 12671659 12132679 11675257 11301378
8584 11301378 10985958 10606514 10114891 9629431 9144777 8739749 8447503 8274906 7935663
8575 7935663 7560392 7184904 6806878 6556784 6310410 6171954 6040269 5993778 5967486 6064285
8565 6064285 6114858 6249274 6367037 6413443 6403584 6473202 6598981 6728210 6782136 6523320 6230040
8554 6230040 6055181 5898960 5832484 5710472 5441808 5174567 4919911 4743542 4526958 4457661
8544 4457661 4418666 4329373 4199925 4142947 4049816 3937570 3896528 3894020 3920668 3925418 3893597
$$ packed form
8614A2139393j74876j62934k5848P1979R8058J66509K31157K20785P3324J44507
8604A2782054L11695L32125L20902K59894J12385n6276j07623j70549n5299R8564
8594A3827872J20116J48202R0415j1789l47639n13937o41581n38980m57422l73879
8584A1301378l15420l79444m91623m85460m84654m05028k92246j72597l39243
8575G935663l75271l75488l78026k50094k46374j38456j31685m6491k6292R6799
8565F064285N0573J34416J17763M6406r859O9618J25779J29229N3926k58816k93280
8554F230040j74859j56221o6476j22012k68664k67241k54656j76369k16584o9297
8544D457661l8995q9293j29448n6978r3131j12246m1042k508K6648M750l1821
$$ plain form
8533 3893597 3800570 3757314 3762229 3781114 3724524 3708261 3745919 3740974 3784212 3723970 3609875 3446897
8521 3446897 3197680 2968460 2743813 2686066 2526787 2386212 2330357 2211685 2127175 2106563
8511 2106563 1957478 1826973 1784580 1803875 1804932 1785786 1750799 1658732 1591025 1543664 1560360
8500 1560360 1543949 1493283 1459234 1435442 1347788 1345937 1369220 1386324 1337050 1305019 1241643 1258820
8488 1258820 1272161 1177479 1216676 1166360 1125258 1175556 1210583 1239770 1208826 1195656 1166302
8477 1166302 1184857 1122828 1067408 1063756 1043029 974571 1017569 1034239 958094 924765 943843 992779
8465 992779 964677 986535 956955 911528 908420 877375 805712 815768 848445 826429 794365 768292
8453 768292 758098 775612 842360 853013 852432 802929 837959 800958 741485 759872 788012 718524
$$ packed form
8533C893597r3027m3256M915J8885n6590j6263L7658m945M3238o0242j14095j62978
8521C446897k49217k29220k24647n7747j59279j40575n5855j18672q4510k0612
8511B106563j49085j30505m2393J9295J057j9146l4987r2067o7707m7361J6696
8500A560360j6411n0666l4049k3792q7654j851K3283J7104m9274l2031o3376J7177
8488A258820J3341r4682L9197n0316m1102N0298L5027K9187l0944j3170k9354
8477A166302J8555o2029n5420l652k0727o8458M2998J6670p6145l3329J9078M8936
8465I92779k8102K1858k9580m5427l108l1045p1663J0056L2677k2016l2064k6073
8453G68292j0194J7514O6748J0653n81m9503L5030l7001n9473J8387K8140o9488
$$ plain form
8441 718524 701827 699208 650261 662688 719269 719998 694051 704262 709014 711130 665475 645061 675916
8428 675916 759623 766690 824334 773923 743736 717241 774748 745374 713534 683669 675474 721203
8416 721203 692754 644979 583777 564748 537307 541786 568166 518918 542692 563464 542180 496301
8404 496301 493518 450811 439487 439785 443102 475340 416202 417474 416135 407621 433343 434740 369141
8391 369141 384692 426518 417470 381434 423263 438229 486733 470247 426790 405120 372417 342716
8379 342716 337912 322336 315700 325359 297090 278127 242253 252546 282776 282753 267090 269666 279840
8366 279840 281568 263303 300617 300818 265271 277807 231713 205038 195228 230288 228052 164659 213824
8353 213824 242802 259703 319576 284781 245182 278307 321001 300130 171817 184527 215505
$$ packed form
8441G18524j6697k619m8947J2427N6581P29k5947J0211M752K116m5655k0414L0855
8428F75916Q3707P067N7644n0411l0187k6495N7507k9374l1840k9865q195M5729
8416G21203k8449m7775o1202j9029k7441M479K6380m9248K3774K0772k1284m5879
8404D96301k783m2707j1324K98L317L2238n9138J272j339q514K5722J397o5599
8391C69141J5551M1826r048l6036M1829J4966M8504j6486m3457k1670l2703k9701
8379C42716m804j5576o636R659k8269j8963l5874J0293L0230k3j5663K576J0174
8366B79840J728j8265L7314K01l5547J2536m6094k6675r810L5060k236o3393M9165
8353B13824K8978J6901N9873l4795l9599L3125M2694k0871j28313J2710L0978
$$ plain form
8342 215505 208877 178192 245032 236246 225188 285020 267127 251004 199655 195015 224578 252838
8330 252838 240678 250390 260564 288523 252093 214342 193094 161235 199779 262451 252632 250634
8318 250634 269758 274627 229133 218211 272302 245181 256209 279937 263416 289270 264364 297378
8306 297378 270090 283217 286547 279892 334675 308889 288473 314418 325667 318822 371897 307413
8294 307413 294702 282739 305835 340941 382279 380472 347901 361716 336698 273271 251832 265235
8282 265235 314087 321338 298919 389776 403231 323591 315375 314050 334060 391745 421871 351021
8270 351021 313297 390519 463834 451730 425116 419779 448679 467750 407890 412674 453000 470553
8258 470553 379205 317276 331805 334032 363913 381477 351115 370619 359741 355851 416709 418751
$$ packed form
8342B15505o628l0685O6840q786j1058N9832j7893j6123n1349m640K9563K8260
8330B52838j2160R712J0174K7959l6430l7751k1248l1859L8544O2672r819j998
8318B50634J9124M869m5494j0922N4091k7121J1028K3728j6521K5854k4906L3014
8306B97378k7288J3127L330o655N4783k5786k0416K5945J1249o845N3075o4484
8294C07413j2711j1963K3096L5106M1338j807l2571J3815k5018o3427k1439J3403
8282B65235M8852P251k2419R0857J3455p9640q216j325K0010N7685L0126p0850
8270C51021l7724P7222P3315j2104k6614n337K8900J9071n9860M784M0326J7553
8258D70553r1348o1929J4529K227K9881J7564l0362J9504j0878l890O0858K042
$$ plain form
8246 418751 386221 406839 389368 391379 379438 386462 378237 426459 446237 395632 362622 453239
8234 453239 452124 419031 403494 407072 431015 436323 441806 433057 467652 451423 422236 454136 447417
8221 447417 473007 436869 400639 320207 311253 295147 310910 333991 284730 271239 307772 298717
8209 298717 236906 222569 217628 245011 325541 328368 381901 366013 294797 280481 324901 290189
8197 290189 269716 249545 215074 246223 278002 1320680 990826 496549 435635 328117 353172
8186 353172 293500 340750 277707 226645 127074 250805 216228 156178 209102 248517 218152
8175 218152 214717 167547 185991 169474 185454 164534 203007 202829 214294 206596 225754 209866
8163 209866 183374 189644 195904 204750 238764 251927 259525 200190 204635 212729 244595 212824 205686
$$ packed form
8246D18751l2530K0618j7471K011j1941P024q225M8222J9778n0605l3010R0617
8234D53239j115l3093j5537L578K3943N308N483q749L4595j6229k9187L1900o719
8221D47417K5590l6138l6230q0432q954j6106J5763K3081m9261j3491L6533r055
8209B98717o1811j4337m941K7383Q0530K827N3533j5888p1216j4316M4420l4712
8197B90189k0473k0171l4471L1149L1779J042678l29854m94277o0914j07518K5055
8186C53172n9672M7250o3043n1062r9571J23731l4577o0050N2924L9415l0365
8175B18152l435m7170J8444j6517J5980k0920L8473j78J1465p698J9158j5888
8163B09866k6492O270O260Q846L4014J3163P598n9335M445Q094L1866l1771p138
$$ plain form
8150 205686 229411 215327 163792 176069 223098 161438 117668 119686 73213 14879 74587 107651
8138 107651 123794 86781 72071 32787 67775 124323 88491 92157 76981 63014 125816 80749
8126 80749 120423 157540 145103 121260 125189 126312 128650 178595 97237 133977 144317 72798
8114 72798 166428 180711 87441 31621 33263 50749 17621 30830 38085 20709 63889 43111
8102 43111 44660 35893 9253 18815 559 -23560 6420 2616 18793 -15713 -4315 12266 23708
8089 23708 10479 -22674 25618 40464 30387 40417 46180 -21263 9003 4208 -7808 43509
8077 43509 36150 2880 52478 37497 -656 -74603 -81936 -6041 -15009 -26768 -38364 -63463
8065 -63463 -25648 43156 41766 -32248 -50113 -42785 -37051 -9832 -28953 -84630 -40888 -61835
$$ packed form
8150B05686K3725j4084n1535J2277M7029o1660m3770K018m6473n8334N9708L3064
8138A07651J6143l7013j4710l9284L4988N6548l5832L666j5176j3967O2802m5067
8126H0749L9674L7117j2437k3843L929J123K338M9945q1358L6740J0340p1519
8114G2798R3630J4283r3270n5820J642J7486l3128J3209P255j7376M3180k0778
8102D3111J549q767k6640R562j8256k4119K9980l804J6177l4506J1398J6581J1442
8089B3708j3229l3153M8292J4846j0077J0030N763o7443L0266m795j2016N1317
8077D3509p359l3270M9598j4981l8153p3947p333P5895q968j1759j1596k5099
8065f3463L7815O8804j390p4014j7865P328N734K7219j9121n5677M3742k0947
$$ plain form
8053 -61835 -96524 -37027 -28550 11762 -30180 -40212 -75775 -91959 -35872 -25557 -53488 29330
8041 29330 -19647 -58651 -54439 8599 8210 -34657 -2753 -26504 -79388 -57392 38829 12224
8029 12224 -10237 -73537 -36487 -76594 12257 -9653 -45007 -44338 -28022 -85804 -108829 -31016
8017 -31016 24702 -18630 -77786 -41706 -61255 -74289 -49770 -63572 -51203 -72688 -85087 -59558
8005 -59558 -57904 -28395 -101268 -70440 -69791 -72575 -43378 -73396 169 10426 -19750 -47677 -85161
7992 -85161 -72782 -36585 -39368 -33735 -43707 -43408 -17456 -28570 -40384 -31855 6125 -19019 -72916
7979 -72916 -45799 -71593 -75445 -27439 -28172 -45884 -76611 -76873 -115781 -56246 -21424 -58871 -289
7966 -289 -14069 -39791 -41425 -67757 -44616 -32454 -7865 -67551 -41470 -1915 -13888 1689
$$ packed form
8053f1835l4689N9497Q477M0312m1942j0032l5563j6184N6087J0315k7931Q2818
8041B9330m8977l9004M212O3038l89m2867L1904k3751n2884K1996R6221k6605
8029A2224k2461o3300L7050m0107Q8851k1910l5354O69J6316n7782k3025P7813
8017c1016N5718m3332n9156L6080j9549j3034K4519j3802J2369k1485j2399K5529
8005e9558J654K9509p2873L0828O49k784K9197l0018P3565J0257l0176k7927l7484
7992h5161J2379L6197k783N633r972K99K5952j1114j1814Q529L7980k5144n3897
7979g2916K7117k5794l852M8006p33j7712l0727k62l8908N9535L4822l7447N8582
7966b89j3780k5722j634k6332K3141J2162K4589n9686K6081L9555j1973J5577
$$ plain form
7954 1689 -45629 -28291 -55277 -75298 -16095 -36171 -32153 -72830 -106285 -161174 -63151 -41951
7942 -41951 -9620 -58662 -15084 -13133 -40162 -22224 -5653 6865 18411 53888 27197 -5030
7930 -5030 -21043 -43481 -55743 14635 12271 -5055 -70489 -49244 -50482 -60149 18661 56251 42897
7917 42897 18958 8144 -59159 5708 39673 -39993 -9650 27621 5822 -26787 -57101 -63164
7905 -63164 -19901 -20132 -54660 -398 4613 -18643 -19051 -20888 -58079 -91649 -36777 7458 65226
7892 65226 11324 -20051 -28008 -8102 -21940 -4725 -11154 9021 -10664 16024 61166 20316
7880 20316 -39161 -1369 301 36099 2837 -25652 -7544 -38795 18626 11346 -18128 -43274
7868 -43274 -98558 -102239 -32613 5625 56835 66267 41638 -10176 -6683 42674 22742 16302 1535
$$ packed form
7954A689m7318J7338k6986k0021N9203k0076M018m0677l3455n4889R8023K1200
7942d1951L2331m9042M3578J951k7029J7938J6571J2518J1546L5477k6691l2227
7930e030j6013k2438j2262P0378k364j7326o5434K1245j238r667P8810L7590j3354
7917D2897k3939j0814o7303O4867L3965p9666L0343L7271k1799l2609l0314o063
7905f3164M3263k31l4528N4262N011k3256m08j837l7191l3570N4872M4235N7768
7892F5226n3902l1375p957J9906j3838J7215o429K0175j9685K6688M5142m0850
7880B0316n9477L7792J670L5798l3262k8489J8108l1251N7421p280k9474k5146
7868d3274n5284l681O9626L8238N1210R432k4629n1814L493M9357j9932o440j4767
$$ plain form
7855 1535 18535 37560 462 -3875 -17579 -6567 -52253 -66977 -52600 -66559 -5463 -17253
7843 -17253 -58200 -30982 -5824 -52485 -86102 -45057 -35282 -50730 -41661 -30562 -24928 -36972
7831 -36972 -44712 -12534 -34206 -54246 -26383 -40127 -61642 -68898 -10294 14585 40641 17596
7819 17596 4422 15831 27240 -7528 -31334 -21387 -40096 -37499 -25255 -23604 -11753 57543
7807 57543 75160 48663 45914 5518 22029 114706 94447 96698 17172 20842 41830 -12529
7795 -12529 -26531 -46104 -5260 8479 -4226 -19952 -4827 69704 43890 79413 122323 41370
7783 41370 24084 36190 -811 -9337 43518 45169 -7279 49018 37992 7699 3224 -22120
7771 -22120 -66655 -88008 -34392 -32673 16448 76268 67108 58739 75184 86485 125017 132173 60359
$$ packed form
7855A535J7000J9025l7098m337j3704J1012m5686j4724J4377j3959O1096j1790
7843a7253m0947K7218K5158m6661l3617M1045R775j5448R069J1099N634j2044
7831c6972p740L2178k1672k0040K7863j3744k1515p256N8604K4879K6056k3045
7819A7596j3174J1409J1409l4768k3806R947j8709K597J2244J651J1851O9296
7807E7543J7617k6497k749m0396J6511R2677k0259K251p9526L670K0988n4359
7795a2529j4002j9573M0844J3739j2705j5726J5125P4531k5814L5523M2910q0953
7783D1370j7286J2106l7001q526N2855J651n2448N6297j1026l0293m475k5344
7771b2120m4535k1353N3616J719M9121N9820r160q369J6445J1301L8532P156p1814
$$ plain form
7758 60359 55639 92390 125766 96721 -35572 -24075 -17775 36156 -8375 -42287 -43232 -28762
7746 -28762 -51015 -20933 58936 19574 23208 34976 54847 29889 -10433 59047 50383 -48802
7734 -48802 -48240 -103 40495 38757 56374 70730 29515 51858 25849 8115 7070 -29684 -24050
7721 -24050 9020 -46314 -83679 -39273 -55353 -35196 -51313 -38087 19166 27411 28037 44308
7709 44308 26856 61482 8618 15920 20599 55891 73843 -22102 -125253 -16384 53786 1696
7697 1696 -46854 18821 29927 41655 49952 -40848 -13783 23849 21756 4628 36946 44249 4744
7684 4744 35623 16096 29959 47135 83696 28100 24562 98092 45052 39056 13585 9811 30838
7671 30838 91501 65955 8714 68066 39956 68020 69595 14923 22279 -27360 -18699 55718
$$ packed form
7758F0359m720L6751L3376k9045j32293J1497O300N3931m4531l3912r45J4470
7746b8762k2253L0082P9869l9362L634J1768J9871k4958m0322O9480q664r9185
7734d8802N62M8137M0598j738J7617J4356m1215K2343k6009j7734j045l6754N634
7721b4050L3070n5334l7365M4406j6080K0157j6117J3226N7253Q245O26J6271
7709D4308j7452L4626n2864P302M679L5292J7952r5945j03151J08869P0170n2090
7697A696m8550O5675J1106J1728Q297r0800K7065L7632k093j7128L2318P303l9505
7684D744L0879j9527J3863J7176L6561n5596l538P3530n3040n996k5471l774K1027
7671C0838O0663k5546n7241N9352k8110K8064J575n4672P356m9639Q661P4417
$$ plain form
7659 55718 41143 11470 24415 23736 11048 44217 16906 7691 89007 68961 31861 -15166
7647 -15166 17429 10521 31200 40190 48757 25023 10324 28035 32178 10817 -9949 19739 62234
7634 62234 54073 50805 32026 55895 34469 46150 51278 9560 6823 11269 32264 90935 90090
7621 90090 52197 77877 60132 68107 -6816 -18613 67989 147526 93800 70808 110072 71771
7609 71771 68715 81501 47087 33088 77795 -9013 46828 83545 70756 100124 127939 99029
7597 99029 59673 27040 78176 124604 163881 205944 235311 199877 149330 146754 139586 128981
7585 128981 124252 114179 145947 148646 150322 188834 167366 182503 97529 67416 98890 92151
7573 92151 188502 226656 214263 209710 205453 249820 266597 264772 220203 273267 227761 200458
$$ packed form
7659E5718j4575k9673J2945o79j2688L3169k7311r215Q1316k0046l7100m7027
7647a5166L2595o908K0679Q990Q567k3734j4699J7711M143k1361k0766K9688M2495
7634F2234q161l268j8779K3869k1426J1681N128m1718k737M446K0995N8671q45
7621I0090l7893K5680j7745P975p4923j1797Q6602P9537n3726k2992L9264l8301
7609G1771l056J2786l4414j3999M4707q6808N5841L6717j2789K9368K7815k8910
7597I9029l9356l2633N1136M6428L9277M2063K9367l5434n0547k576p168j0605
7585A28981m729j0073L1768K699J676L8512k1468J5137q4974l0113L1474o739
7573I2151R6351L8154j2393m553m257M4367J6777j825m4569N3064m5506k7303
$$ plain form
7561 200458 252001 284612 291025 259049 252422 245618 261606 238050 269895 290097 291414 303038
7549 303038 309806 367466 339304 308412 311733 317275 320507 358837 396878 401386 354337 418512 430656
7536 430656 506248 535809 563149 581704 563804 581172 617318 688086 658806 666539 666830 701853
7524 701853 695317 770233 809502 844822 885737 898318 901825 909919 912506 876666 956171 1007745
7512 1007745 1019644 1112366 1173915 1282589 1350174 1432937 1615575 1809821 2052785 2291577
7502 2291577 2517394 2666112 2867164 3153137 3495959 3902122 4109871 4045721 3831696 3664229
7492 3664229 3805786 3891358 3874306 3651082 3208883 2838070 2563974 2379013 2186112 2001755
7482 2001755 1780560 1587806 1463121 1318853 1192578 1094567 1007606 956843 872195 824616
$$ packed form
7561B00458N1543L2611O413l1976o627o804J5988k3556L1845K0202J317J1624
7549C03038O768N7660k8162l0892L321N542L232L8330L8041M508m7049O4175J2144
7536D30656P5592K9561K7340J8555j7900J7368L6146P0768k9280P733K91L5023
7524G01853o536P4916L9269L5320M0915J2581L507Q094K587l5840P9505N1574
7512A007745J1899R2722O1549J08674O7585Q2763J82638J94246K42964K38792
7502B291577K25817J48718K01052K85973L42822M06163K07749o4150k14025j67467
7492C664229J41557Q5572j7052k23224m42199l70813k74096j84961j92901j84357
7482B001755k21195j92754j24685j44268j26275r8011q6961n0763q4648m7579
$$ plain form
7472 824616 772654 783411 779132 733518 735020 711554 694029 677469 711728 628668 730106 733559
7460 733559 705267 682628 676365 712379 606454 578371 514464 529942 544056 542080 553546 518297
7448 518297 510118 508503 453159 488270 534631 476300 468446 448597 493421 503616 443625 485477
7436 485477 536851 473642 467405 471177 425888 472598 468294 432760 480626 423348 401592 350874
7424 350874 323875 335435 320113 311515 285006 272525 287915 307694 272799 241633 191191 182127
7412 182127 176639 231304 302313 244407 270899 321446 293779 237601 280813 270162 226628 257870
7400 257870 274882 258457 221657 228557 166657 165059 198164 192206 173658 214930 209015 260551
7388 260551 326147 310219 231361 254698 219900 229192 183471 146650 150539 200111 246511 292703
$$ packed form
7472H24616n1962J0757m279m5614J502k3466j7525j6560L4259q3060J01438L453
7460G33559k8292k2639o263L6014j05925k8083o3907J5478J4114j976J1466l5249
7448E18297q179j615n5344L5111M6361n8331p854j9849M4824J0195n9991M1852
7436D85477N1374o3209o237L772m5289M6710m304l5534M7866n7278k1756n0718
7424C50874k6999J1560j5322q598k6509j2481J5390J9779l4895l1166n0442r064
7412A82127n488N4665P1009n7906K6492N0547k7667n6178M3212j0651m3534L1242
7400B57870J7012j6425l6800O900o1900j598L3105n958j8548M1272n915N1536
7388B60551O5596j5928p8858K3337l4798R292m5721l6821L889M9572M6400M6192
$$ plain form
7376 292703 251425 249667 262700 291602 288105 258138 254116 252391 261803 270410 298095 274379 323579
7363 323579 291584 302599 307280 288906 312589 275544 243855 244891 271101 240482 220337 275813
7351 275813 257846 213082 271252 282046 263759 218524 268892 247960 258490 264584 301716 322535
7339 322535 256985 248404 214285 238483 267584 192532 181940 221976 222612 248855 245956 216890
7327 216890 173506 238986 296914 179834 158073 188358 155602 239672 240565 241753 238673 187576
7315 187576 263968 315479 333513 309082 239313 252128 324819 363613 307915 295680 339381 390428
7303 390428 326355 313488 313134 324714 364123 332889 297612 295509 273352 354025 347916 379284
7291 379284 372366 308992 320299 328976 284655 394185 478887 445304 456210 495025 446017 393757
$$ packed form
7376B92703m1278j758J3033K8902l497k9967m022j725R412Q607K7685k3716M9200
7363C23579l1995J1015M681j8374K3683l7045l1689J036K6210l0619k0145N5476
7351B75813j7967m4764N8170J0794j8287m5235N0368k0932J0530O094L7132K0819
7339C22535o5550q581l4119K4198K9101p5052j0592M0036O36K6243k899k9066
7327B16890m3384O5480N7928j17080k1761L0285l2756Q4070Q93J188l080n1097
7315A87576P6392N1511J8034k4431o9769J2815P2691L8794n5698j2235M3701N1047
7303C90428o4073j2867l54J1580L9409l1234l5277k103k2157Q0673o109L1368
7291C79284o918o3374J1307Q677m4321J09530Q4702l3583J0906L8815m9008n2260
$$ plain form
7279 393757 351803 286893 199996 182276 206401 278321 276881 331069 270266 242200 253676 325144
7267 325144 355505 266253 321550 328263 366395 349457 329352 356992 267541 228719 218502 223521
7255 223521 219521 197998 221439 267028 315176 243721 266390 319139 279230 284861 272747 233587
7243 233587 242518 277675 326440 278554 294475 303016 295348 246915 187178 203550 277204 325846
7231 325846 341539 311864 309923 307304 342639 364211 328062 290511 288353 325385 318230 334832
7219 334832 337869 348297 383220 397019 399018 366346 363475 432784 388503 404306 417700 377982
7207 377982 359583 397491 385173 393623 403909 372777 411729 386406 438940 463638 452431 459578
7195 459578 417586 343666 418232 430252 443204 455292 469209 483947 475101 512957 503026 476236
$$ packed form
7279C93757m1954o4910q6897j7720K4125P1920j440N4188o0803k8066J1476P1468
7267C25144L0361q9252N5297O713L8132j6938k0105K7640q9451l8822j0217N019
7255B23521m000k1523K3441M5589M8148p1455K2669N2749l9909N631j2114l9160
7243B33587Q931L5157M8765m7886J5921Q541p668m8433n9737J6372P3654M8642
7231C25846J5693k9675j941k619L5335K1572l6149l7551k158L7032p155J6602
7219C34832L037J0428L4923J3799J999l2672k871O9309m4281J5803J3394l9718
7207C77982j8399L7908j2318Q450J0286l1132L8952k5323N2534K4698j1207P147
7195D59578m1992p3920P4566J2020J2952J2088J3917J4738q846L7856r931k6790
$$ plain form
7183 476236 482848 483531 508588 529886 450267 482338 535663 549282 518453 509394 532999 509076
7171 509076 452546 442724 567437 570042 570359 583570 557382 515868 550336 555527 591086 588866 609952
7158 609952 652022 686252 671312 717331 706220 732972 775892 765300 761913 778802 854818 828695
7146 828695 826803 825617 837307 899385 1011222 1045840 1067331 1060649 1099745 1082939 1135316 1167219
7134 1167219 1149618 1191716 1232443 1267918 1262188 1292951 1299305 1371462 1375570 1516152 1467946 1510050
7122 1510050 1506851 1513523 1534317 1571890 1621392 1616386 1675322 1773638 1809036 1848472 1947375 1950308
7110 1950308 1972705 1994686 2054544 2101917 2145969 2152544 2250744 2274070 2363884 2466712 2529785
7099 2529785 2689061 2814916 2970828 3083466 3183937 3330579 3456656 3583507 3687900 3945555
$$ packed form
7183D76236O612O83K5057K1298p9619L2071N3325J3619l0829r059K3605k3923
7171E09076n6530r822J24713K605L17J3211k6188m1514L4468N191L5559k220K1086
7158F09952M2070L4230j4940M6019j1111K6752M2920j0592l387J6889P6016k6123
7146H28695j892j186J1690O2078J11837L4618K1491o682L9096j6806N2377L1903
7134A167219j7601M2098M0727L5475n730L0763O354P2157M108J40582m8206M2104
7122A510050l199O672K0794L7573M9502n006N8936R8316L5398L9436R8903K933
7110A950308K2397K1981N9858M7373M4052O575R8200K3326Q9814J02828O3073
7099B529785J59276J25855J55912J12638J00471J46642J26077J26851J04393K57655
$$ plain form
7089 3945555 4089722 4223601 4479546 4817568 5125470 5472194 5766745 6132375 6524497 6863163
7079 6863163 7150923 7404178 7666204 7951333 8276314 8668316 9246893 10022999 10953028 12217796
7069 12217796 13726310 15533272 17884559 20910766 24745782 29052735 32991162 35413897
7061 35413897 35274878 32653632 28439181 24094475 20487223 17915450 16356969 15740975
7053 15740975 15780546 16381377 17080838 17467795 17101800 15851486 13995660 12000658 10166486
7044 10166486 8604492 7472369 6712036 6085123 5588355 5273773 4885115 4504226 4256346
7035 4256346 4025879 3792588 3579655 3338355 3176857 2963379 2848284 2697116 2682346 2601598
7025 2601598 2407473 2382341 2321885 2256677 2153888 2061259 2041303 2001509 1844408 1768815 1716638
$$ packed form
7089C945555J44167J33879K55945L38022L07902L46724K94551L65630L92122L38666
7079F863163K87760K53255K62026K85129L24981L92002N78577P76106R30029J264768
7069A2217796J508514J806962K351287L026207L835016M306953L938427K422735
7061C5413897j39019k621246m214451m344706l607252k571773j558481o15994
7053A5740975L9571O00831O99461L86957l65995j250314j855826j995002j834172
7044A0166486j561994j132123p60333o26913m96768l14582l88658l80889k47880
7035D256346k30467k33291k12933k41300j61498k13478j15095j51168j4770q0748
7025B601598j94125k5132o0456o5208j02789r2629j9956l9794j57101p5593n2177
$$ plain form
7014 1716638 1630752 1602148 1623230 1584083 1509845 1478906 1519086 1464962 1394484 1372325 1330109
7003 1330109 1334650 1320372 1296879 1305560 1346995 1288470 1250664 1225492 1211368 1213410 1185270 1185272 1163005
6990 1163005 1163254 1183039 1137291 1200567 1170480 1127884 1111639 1124790 1164629 1109168 1133752 1157395
6978 1157395 1090443 1136606 1153539 1147233 1115879 1134521 1168916 1162871 1129584 1135649 1126218 1169949
6966 1169949 1218963 1227965 1266134 1265485 1246744 1238687 1263743 1275950 1338531 1360515 1341621 1389474
6954 1389474 1374480 1429768 1459039 1371740 1381564 1436023 1463862 1555310 1583102 1491628 1511938 1587924
6942 1587924 1598881 1607036 1589579 1630532 1656182 1668959 1741163 1754212 1696139 1781310 1843231 1798526
6930 1798526 1764332 1854454 1858456 1901182 1950409 2041570 2086867 2129804 2179960 2300594 2307257 2422337
$$ packed form
7014A716638q5886k8604K1082l9147p4238l0939M0180n4124p0478k2159m2216
7003A330109M541j4278k3493Q681M1435n8525l7806k5172j4124K042k8140Kk2267
6990A163005K49J9785m5748O3276l0087m2596j6245J3151L9839n5461K4584K3643
6978A157395o6952M6163J6933o306l1354J8642L4395o045l3287O065r431M3731
6966A169949M9014R002L8169o49j8741q057K5056J2207O2581K1984j8894M7853
6954A389474j4994N5288K9271q7299R824N4459K7839R1448K7792r1474K0310P5986
6942A587924J0957Q155j7457M0953K5650J2777P2204J3049n8073Q5171O1921m4705
6930A798526l4194R0122M002M2726M9227R1161M5297M2937N0156J20634O663J15080
$$ plain form
6918 2422337 2512571 2660029 2809114 2967560 3053824 3182058 3252530 3432639 3531717 3678307
6908 3678307 3815622 4018613 4213203 4399656 4560213 4722312 4903059 5130216 5370179 5640022
6898 5640022 5942997 6335041 6816536 7443296 8254446 9233178 10402455 11861836 13635355
6889 13635355 15716552 18265991 21797389 26508228 33343865 42037302 48276751 48078670
6881 48078670 39418507 29505147 22130462 17286243 14077786 11843779 10150204 8936742
6873 8936742 8011390 7368135 6804664 6309542 5746511 5269638 4899886 4547676 4241818 3912961
6863 3912961 3722508 3465482 3237896 3085664 3029861 2916962 2782768 2645958 2581137 2493072
6853 2493072 2364678 2233072 2201994 2062501 1990585 1981407 1898667 1805731 1755905 1753297 1773259
$$ packed form
6918B422337R0234J47458J49085J58446Q6264J28234P0472J80109R9078J46590
6908C678307J37315K02991J94590J86453J60557J62099J80747K27157K39963K69843
6898E640022L02975L92044M81495O26760Q11150R78732J169277J459381J773519
6889A3635355K081197K549439L531398M710839O835637Q693437O239449j98081
6881D8078670q660163r913360p374685m844219l208457k234007j693575j213462
6873H936742r25352o43255n63471m95122n63031m76873l69752l52210l05858l28857
6863C912961j90453k57026k27586j52232n5803j12899j34194j36810o4821q8065
6853B493072j28394j31606l1078j39493p1916r178q2740r2936m9826k608J9962
$$ plain form
6842 1773259 1737411 1665401 1626521 1597464 1544636 1532337 1495948 1457912 1323769 1285493 1201441
6831 1201441 1166955 1138407 1138936 1074712 1030438 1092903 1097415 1061953 1047594 996801 1065081 1072984
6819 1072984 1026026 888534 910591 960213 1032315 935736 878560 906251 876082 923450 994416
6808 994416 929696 926647 894022 904302 897972 922984 985021 1002503 916318 898327 923948 931526
6796 931526 905333 869120 834862 810777 813012 813767 826795 828932 795435 866494 924796 848362
6784 848362 827881 836775 901439 931868 895178 866482 820903 769965 746087 784964 777840 693550
6772 693550 714526 723983 727151 711636 705322 692737 649693 619185 643203 637547 663249 701335
6760 701335 693203 634373 607088 539264 569947 608441 580816 567383 509662 486204 501320 562742
$$ packed form
6842A773259l5848p2010l8880k9057n2828j2299l6389l8036j34143l8276q4052
6831A201441l4486k8548N29o4224m4274O2465M512l5462j4359n0793O8280P903
6819A072984m6958j37492K2057M9622P2102r6579n7176K7691l0169M7368P0966
6808I94416o4720l049l2625J0280o330K5012O2037J7482q6185j7991K5621P578
6796I31526k6193l6213l4258k4085K235P55J3028K137l3497P1059N8302p6434
6784H48362k0481Q894O4664L0429l6690k8696m5579n0938k3878L8877p124q4290
6772F93550K0976R457L168j5515o314j2585m3044l0508K4018n656K5702L8086
6760G01335q132n8830k7285o7824L0683L8494k7625j3433n7721k3458J5116O1422
$$ plain form
6748 562742 550968 550649 562820 574884 579662 559273 569744 570209 572392 598715 628595 577446 585902
6735 585902 540814 581129 650289 629486 584009 588606 603571 552552 488274 560880 608457 623319
6723 623319 622625 633610 632657 596938 627709 648954 698217 724635 707505 649183 585699 577669 596483
6710 596483 689916 741177 690937 706331 636315 579168 625096 683761 699241 675564 694942 750020
6698 750020 687253 733839 712148 716779 745335 742982 704061 762591 800333 732160 816837 870417
6686 870417 829854 857421 901255 916759 895543 962396 974617 919343 906491 850094 866056 865813
6674 865813 861981 890994 872187 905159 939243 895413 939067 912746 996065 1006780 1006579 1059191
6662 1059191 1080937 1119673 1166461 1168910 1082878 1086402 1086099 1084594 1106222 1043354 1091085 1061206
$$ packed form
6748E62742j1774l19J2171J2064M778k0389J0471M65K183K6323K9880n1149Q456
6735E85902m5088M0315O9160k0803m5477M597J4965n1019o4278P2606M7577J4862
6723F23319o94J0985r53l5719L0771K1245M9263K6418j7130n8322o3484q030J8814
6710E96483R3433N1261n0240J5394p0016n7147M5928N8665J5480k3677J9378N5078
6698G50020o2767M6586k1691M631K8556k353l8921N8530L7742o8173Q4677N3580
6686H70417m0563K7567M3834J5504k1216O6853J2221n5274j2852n6397J5962k43
6674H65813l832K9013j8807L2972L4084m3830M3654k6321Q3319J0715k01N2612
6662A059191K1746L8736M6788K449q6032L524l03j505K1628o2868M7731k9879
$$ plain form
6650 1061206 1089292 1135987 1046529 980814 1052310 1110056 1079664 1047734 1067925 1093184 1069023
6639 1069023 1040374 1039022 1036172 1006963 1029321 1070717 1075841 1070110 1051886 1096617 1066762 1043900
6627 1043900 1046907 1047563 1031850 1062552 1069233 1042681 1093593 1130674 1175089 1167748 1144672 1143480 1170866
6614 1170866 1187121 1224300 1258713 1301385 1323849 1330849 1396784 1415613 1404934 1424520 1423360 1518031
6602 1518031 1621532 1649195 1631569 1646956 1704572 1746578 1700409 1766083 1825723 1847954 2009449
6591 2009449 2135403 2302527 2463478 2555839 2643913 2742631 2679376 2619993 2594333 2573405 2609729
6580 2609729 2563993 2597404 2592695 2721038 2837520 2925940 3055147 3157700 3299096 3493844
6570 3493844 3607882 3760036 3909045 4041415 4274384 4543134 4905925 5292065 5801225 6418858
$$ packed form
6650A061206K8086M6695q9458o5715P1496N7746l0392l1930K0191K5259k4161
6639A069023k8649j352k850k9209K2358M1396N124n731j8224M4731k9855k2862
6627A043900L007O56j5713L0702O681k6552N0912L7081M4415p341k3076j192K7386
6614A170866J6255L7179L4413M2672K2464P000O5935J8829j0679J9586j160R4671
6602A518031J03501K7663j7626J5387N7616M2006m6169O5674N9640K2231J61495
6591B009449J25954J67124J60951R2361Q8074R8718o3255n9383k5660k0928L6324
6580B609729m5736L3411m709J28343J16482Q8420J29207J02553J41396J94748
6570C493844J14038J52154J49009J32370K32969K68750L62791L86140N09160O17633
$$ plain form
6560 6418858 7137877 7787349 8071304 7792199 7090331 6436998 5909985 5490355 5237838 5062588
6550 5062588 4916447 4879431 4932261 5005668 5130650 5268027 5458533 5706562 5991304 6275983
6540 6275983 6651673 7000867 7454165 8022838 8741810 9676597 10894378 12366142 14191203
6531 14191203 16116837 17111230 16671651 14996305 13003010 11263463 9979857 9131071 8531402
6522 8531402 8124649 7846888 7615915 7414193 7343271 7426753 7548786 7840065 8076302 8288886
6512 8288886 8572344 8866838 9343714 10012553 10857538 11907630 13208048 14888103 17081918
6503 17081918 19691706 21673644 21873572 20041775 17230642 14678168 12759044 11336223
6495 11336223 10302191 9514596 8864628 8381480 8032008 7743471 7690006 7655008 7693110 7782665
$$ packed form
6560F418858P19019O49472K83955k79105p01868o53333n27013m19630k52517j75250
6550E062588j46141l7016N2830P3407J24982J37377J90506K48029K84742K84679
6540F275983L75690L49194M53298N68673P18972R34787J217781J471764J825061
6531A4191203J925634R94393m39579j675346j993295j739547j283606q48786n99669
6522H531402m06753k77761k30973k01722p0922Q3482J22033K91279K36237K12584
6512H288886K83458K94494M76876O68839Q44985J050092J300418J680055K193815
6503A7081918K609788J981938J99928j831797k811133k552474j919124j422821
6495A1336223j034032p87595o49968m83148l49472k88537n3465l4998L8102Q9555
$$ plain form
6485 7782665 7786258 7864187 8004932 8318050 8748806 9304501 9908495 10815572 11917170 13370879
6475 13370879 15073618 16724834 17375231 16465709 14352446 12121891 10363606 8967787
6467 8967787 8009946 7366195 6839621 6419638 6169836 5982269 5851802 5776566 5816235 5768393
6457 5768393 5712840 5685903 5587894 5582446 5575824 5657945 5834004 6138419 6500279 6975413 7664646
6446 7664646 8319599 8786821 8606432 7860898 6967237 6174432 5523650 5142240 4798377 4524455
6436 4524455 4408746 4401681 4384466 4437654 4521856 4524747 4543379 4497733 4407878 4351617 4374978 4483034
6424 4483034 4629431 4882188 5181783 5572830 6033623 6673821 7419151 8350362 9538807
6415 9538807 10940947 12025681 12184868 11340272 9929418 8738643 7794849 6975681 6182770
$$ packed form
6485G782665L593P7929J40745L13118M30756N55695O03994R07077J101598J453709
6475A3370879J702739J651216O50397r09522k113263k230555j758285j395819
6467H967787r57841o43751n26574m19983k49802j87567j30467p5236L9669m7842
6457E768393n5553k6937r8009n448o622Q2121J76059L04415L61860M75134O89233
6446G664646O54953M67222j80389p45534q93661p92805o50782l81410l43863k73922
6436D524455j15709p065j7215N3188Q4202K891J8632m5646q9855n6261K3361J08056
6424D483034J46397K52757K99595L91047M60793O40198P45330R31211J188445
6415I538807J402140J084734J59187q44596j410854j190775r43794q19168p92911
$$ plain form
6406 6182770 5495781 4971961 4527113 4125510 3828101 3598679 3449237 3256815 3122122 3041772
6396 3041772 2917379 2840013 2767068 2740285 2731388 2631767 2527723 2442508 2403682 2359381 2278751
6385 2278751 2162731 2080010 2024229 1971342 1863212 1868656 1857507 1804091 1775786 1750313 1699076
6374 1699076 1699272 1669743 1653397 1657784 1692122 1711077 1746736 1757411 1709062 1676511 1703296 1655934
6362 1655934 1657165 1759854 1754519 1767752 1709121 1751428 1800533 1915154 1915783 1954282 2007698 1960972
6350 1960972 1905367 1856157 1821913 1813895 1747141 1810095 1850627 1837291 1833728 1858034 1908904 1937149
6338 1937149 1906653 1895671 1914066 1958759 1986896 1991767 2026824 2104285 2286903 2373231 2411989
6327 2411989 2397567 2306936 2145108 2115116 2077528 2041561 2059403 2118384 2138643 2085078 2040556
$$ packed form
6406F182770o86989n23820m44848m01603k97409k29422j49442j92422j34693q0350
6396C041772j24393p7366p2945k6783q897r9621j04044q5215l8826m4301q0630
6385B278751j16020q2721n5781n2887j08130N444j1149n3416k8305k5473n1237
6374A699076J96k9529j6346M387L4338J8955L5659J0675m8349l2551K6785m7362
6362A655934J231J02689n335J3233n8631M2307M9105J14621O29L8499N3416m6726
6350A960972n5605m9210l4244q018o6754O2954M0532j3336l563K4306N0870K8245
6338A937149l0496j0982J8395M4693K8137M871L5057P7461J82618Q6328L8758
6327B411989j4422r0631j61828k9992l7588l5967J7842N8981K0259n3565m4522
$$ plain form
6316 2040556 2049862 2074715 2146877 2139966 2208368 2289139 2395990 2472849 2558342 2569133 2650343 2673313
6304 2673313 2718309 2689441 2747573 2791009 2813525 2841434 2816544 2719306 2557598 2570645 2581261
6293 2581261 2555776 2581246 2569043 2494875 2477803 2442112 2403129 2417937 2412028 2423417 2440314 2510468
6281 2510468 2598684 2552209 2575387 2568437 2521293 2501415 2418881 2443737 2513215 2484554 2513084 2467754
6269 2467754 2462719 2484286 2541378 2589439 2655679 2671021 2685202 2646881 2671492 2686058 2712550 2791630
6257 2791630 2824599 2786777 2843133 2884468 2896955 2946343 2978819 2972612 2941024 3006298 3043624 3088153
6245 3088153 3132890 3175509 3273288 3311592 3376455 3499792 3599363 3592899 3758202 3830835 3864356
6234 3864356 3888716 3994685 4069339 4186574 4317915 4503495 4604300 4658776 4828857 4990294
$$ packed form
6316B040556R306K4853P2162o911O8402Q0771J06851P6859Q5493J0791Q1210K2970
6304B673313M4996k8868N8132M3436K2516K7909k4890r7238j61708J3047J0616
6293B581261k5485K5470j2203p4168j7072l5691l8983J4808n909J1389J6897P0154
6281B510468Q8216m6475K3178o950m7144j9878q2534K4856O9478k8661K8530m5330
6269B467754n035K1567N7092M8061O6240J5342J4181l8321K4611J4566K6492P9080
6257B791630L2969l7822N6356M1335J2487M9388L2476o207l1588O5274L7326M4529
6245C088153M4737M2619R7779L8304O4863J23337R9571o464J65303P2633L3521
6234C864356K4360J05969P4654J17235J31341J85580J00805N4476J70081J61437
$$ plain form
6224 4990294 5082230 5256167 5453187 5632760 5826256 6031939 6148308 6209985 6334113 6446375
6214 6446375 6551829 6702733 6856472 7083452 7192605 7379923 7514603 7648036 7778431 7954284
6204 7954284 8107552 8240080 8426455 8634995 8803637 9040987 9245810 9424721 9596068 9826863
6194 9826863 10053768 10307611 10543087 10789793 11086002 11320268 11677772 12098556 12489146 12820507
6184 12820507 12981018 13176776 13422096 13788682 14353189 14874324 15415701 16014562 16722193
6175 16722193 17442605 18204116 18824421 19463258 20050652 20752993 21518191 22284568 23067603
6166 23067603 24027848 24947006 26049097 27222916 28465867 29796777 31334044 32941378
6158 32941378 34763542 36878554 39298352 42362860 46648377 52174443 59020447 67228569
$$ packed form
6224D990294R1936J73937J97020J79573J93496K05683J16369O1677J24128J12262
6214F446375J05454J50904J53739K26980J09153J87318J34680J33433J30395J75853
6204G954284J53268J32528J86375K08540J68642K37350K04823J78911J71347K30795
6194I826863K26905K53843K35476K46706K96209K34266L57504M20784L90590L31361
6184A2820507J60511J95758K45320L66586N64507N21135N41377N98861P07631
6175A6722193P20412P61511O20305O38837N87394P02341P65198P66377P83035
6166B3067603R60245R19158J102091J173819J242951J330910J537267J607334
6158C2941378J822164K115012K419798L064508M285517N526066O846004Q208122
$$ plain form
6150 67228569 77093240 88196970 101258738 117978222 140691602 171758649 217354674
6143 217354674 268513303 290023942 257120760 201314175 153316976 117848736 94840012
6136 94840012 79047449 68030064 59359355 52725650 47311906 43385025 40064017 36969045
6128 36969045 33830531 31027527 28567483 26548283 24744925 23231431 21696423 20567796
6120 20567796 19519641 18697028 17904649 17320815 16646319 16077679 15491057 14911623 14221924
6111 14221924 13566594 12968392 12426481 11952305 11590068 11322753 11156092 10881361 10738110
6102 10738110 10417302 10064244 9646440 9422691 9209515 9020346 8695325 8348105 8137115
6093 8137115 7823531 7550019 7336624 7215702 7095999 6947235 6882799 6738164 6681371 6689409
$$ packed form
6150F7228569R864671J1103730J3061768J6719484K2713380L1067047M5596025
6143B17354674N1158629K1510639l2903182n5806585m7997199l5468240k3008724
6136I4840012j5792563j1017385q670709o633705n413744l926881l321008l094972
6128C6969045l138514k803004k460044k019200j803358j513494j535008j128627
6120B0567796j048155q22613p92379n83834o74496n68640n86622n79434o89699
6111A4221924o55330n98202n41911m74176l62237k67315j66661k74731j43251
6102A0738110l20808l53058m17804k23749k13176j89169l25021l47220k10990
6093H137115l13584k73512k13395j20922j19703j48764o4436j44635n6793Q038
$$ plain form
6083 6689409 6674425 6613057 6586702 6598412 6638323 6684905 6727512 6793465 6750449 6699415 6674895
6072 6674895 6699967 6661314 6673358 6654837 6601374 6559707 6483966 6404568 6308039 6363135 6400429
6061 6400429 6461546 6555110 6713960 6911100 7125859 7275325 7298409 7255578 7012627 6980972
6051 6980972 6959929 7041514 7153439 7195308 7157645 7232786 7303032 7283095 7254568 7192550 7132785
6040 7132785 7158674 7210611 7303282 7412880 7520073 7810181 8233651 8656543 9030592 9325575
6030 9325575 9490005 9487613 9468320 9447367 9520275 9693748 9880471 10139697 10344524 10377913 10112225
6019 10112225 9754168 9410475 9160561 8966267 8757611 8585037 8377800 8388495 8586371 8947601
6009 8947601 9373887 9666285 9622179 9428807 9092390 8848588 8543918 8148501 7715983 7342056
$$ packed form
6083F689409j4984o1368k6355J1710L9911M6582M2607O5953m3016n1034k4520
6072F674895K5072l8653J2044j8521n3463m1667p5741p9398r6529N5096L7294
6061F400429O1117R3564J58850J97140K14759J49466K3084m2831k42951l1655
6051F980972k1043Q1585J11925M1869l7663P5141P0246j9937k8527o2018n9765
6040G132785K5889N1937R2671J09598J07193K90108M23470M22892L74049K94983
6030I325575J64430k392j9293k0953P2908J73473J86723K59226K04827L3389k65688
6019A0112225l58057l43693k49914j94294k08656j72574k07237J0695J97876L61230
6009H947601M26286K92398m4106j93372l36417k43802l04670l95417m32518l73927
$$ plain form
5999 7342056 7116183 6978639 6869795 6698082 6586014 6482876 6447558 6530111 6572085 6621245
5989 6621245 6706095 6882011 7035039 7278465 7552988 7750205 7849655 7842388 7815610 7832395 7804827
5978 7804827 7680838 7646428 7553591 7472642 7435860 7546713 7681888 7791156 7943374 8021370
5968 8021370 8157385 8275442 8214424 8215091 8254257 8342020 8534585 8663327 8898239 9153859 9441440
5957 9441440 9752778 10027131 10262442 10558643 10846448 11092392 11302728 11544077 11713294 11889187
5947 11889187 11978047 12104317 12302957 12576278 12911120 13302538 13778117 14181473 14564319 14840284
5937 14840284 15079092 15407271 15817908 16266622 16815168 17389022 18146813 19050342 20118589
5928 20118589 21281870 22574836 24044101 25650966 27575446 30140462 33360621 37416818
$$ packed form
5999G342056k25873j37544j08844j71713j12068j03138l5318Q2553M1974M9160
5989F621245Q4850J75916J53028K43426K74523J97217R9450p267k6778J6785k7568
5978G804827j23989l4410r2837q0949l6782J10853J35175J09268J52218P7996
5968H021370J36015J18057o1018O67L9166Q7763J92565J28742K34912K55620K87581
5957I441440L11338K74353K35311K96201K87805K45944K10336K41349J69217J75893
5947A1889187Q8860J26270J98640K73321L34842L91418M75579M03356L82846K75965
5937A4840284K38808L28179M10637M48714N48546N73854P57791R03529J068247
5928B0118589J163281J292966J469265J606865J924480K565016L220159M056197
$$ plain form
5920 37416818 41857179 44899917 45008846 42359126 38801261 35834258 33940846 33076774
5912 33076774 33100980 33830481 35327192 37554670 39961816 42058848 43379429 44473491 46189950
5903 46189950 48419952 50502713 52354894 54823034 57548949 58994818 57980743 55200575
5895 55200575 52185397 50053615 49325340 49513458 49669310 49089456 48132362 47418235 46604773
5886 46604773 45300121 43757004 42749712 42715620 43648625 45405117 48102743 51771328 56436034
5877 56436034 60849624 62252944 59475778 53998084 48233672 43295216 39641294 37222747
5869 37222747 35835796 35364767 35546131 36389608 37661192 38873573 39433610 38914398 37598551
5860 37598551 35928335 34472999 33342262 32415703 31805189 31515511 31375328 31349815 31419602
$$ packed form
5920C7416818M440361L042738J08929k649720l557865k967003j893412q64072
5912C3076774K4206P29501J496711K227478K407146K097032J320581J094062J716459
5903D6189950K230002K082761J852181K468140K725915J445869j014075k780168
5895E5200575l015178k131782p28275J88118J55852n79854r57094p14127q13462
5886D6604773j304652j543117j007292l4092R33005J756492K697626L668585M664706
5877E6436034M413590J403320k777166n477694n764412m938456l653922k418547
5869C7222747j386951m71029J81364Q43477J271584J212381N60037n19212j315847
5860C7598551j670216j455336j130737r26559o10514k89678j40183k5513O9787
$$ plain form
5851 31419602 31849855 32756697 34286406 36446248 39351776 42840845 46342535 49044746
5843 49044746 50638284 50908672 49687704 47230906 44344022 41700107 39134763 36399089
5835 36399089 33701465 31354648 29655701 28610306 28117808 28039360 28212472 28477790 28771744
5826 28771744 29250882 30272452 31792614 33729587 35435557 35885112 34742519 32526460
5818 32526460 30195624 28554957 27520136 27142664 27149499 27126966 27260739 27647257 27849337
5809 27849337 27257425 25659713 23374916 21306903 19861868 18945260 18142218 17172073 16050692
5800 16050692 14875661 13838652 13063076 12392229 11880703 11504506 11199052 11024867 10927438
5791 10927438 10854765 10774081 10664435 10506372 10351018 10307344 10329497 10410277 10426283 10487232 10590579
$$ packed form
5851C1419602M30253R06842J529709K159842K905528L489069L501690K702211
5843D9044746J593538K70388j220968k456798k886884k643915k565344k735674
5835C6399089k697624k346817j698947j045395m92498p8448J73112K65318K93954
5826B8771744M79138J021570J520162J936973J705970M49555j142593k216059
5818C2526460k330836j640667j034821l77472O835k2533J33773L86518K02080
5809B7849337n91912j597712k284797k068013j445035r16608q03042r70145j121381
5800A6050692j175031j037009p75576o70847n11526l76197l05454j74185r7429
5791A0927438p2673q0684j09646j58063j55354m3674K2153Q0780J6006O0949J03347
$$ plain form
5780 10590579 10788993 11082197 11432497 11630397 11652312 11391220 11220641 11265043 11237766 10979415
5770 10979415 10481919 9753936 9062429 8576443 8239009 8032633 7897887 7809845 7674094 7371667
5760 7371667 7027149 6773746 6605993 6445834 6317775 6198701 6113812 5989012 5882772 5804868
5750 5804868 5665375 5600246 5581613 5418227 5303770 5265025 5255396 5152485 5093523 5099124 5108667
5739 5108667 5101078 5104915 5160617 5270879 5398407 5482740 5619011 5761994 5762374 5666337 5537699
5728 5537699 5404143 5339273 5257186 5241143 5270095 5263369 5227384 5239067 5259634 5238638 5272675
5717 5272675 5321245 5374067 5439582 5485100 5557180 5607188 5624159 5604449 5576651 5550863 5441225
5706 5441225 5441633 5588043 5682218 5781484 5895947 6033028 6155756 6255426 6352251 6382083 6414180
$$ packed form
5780A0590579J98414K93204L50300J97900K1915k61092j70579M4402k7277k58351
5770A0979415m97496p27983o91507m85986l37434k06376j34746q8042j35751l02427
5760G371667l44518k53403j67753j60159j28059j19074q4889j24800j06240p7904
5750E804868j39493o5129j8633j63386j14457l8745r629j02911n8962N601R543
5739E108667p589L837N5702J10262J27528Q4333J36271J42983L80r6037j28638
5728E537699j33556o4870q2087j6043K8952o726l5985J1683K0567k0996L4037
5717E272675M8570N2822O5515M5518P2080N0008J6971j9710k7798k5788j09638
5706E441225M08J46410R4175R9266J14463J37081J22728R9670R6825K9832L2097
$$ plain form
5695 6414180 6385907 6423927 6513963 6638937 6781879 6921790 7086597 7322277 7508887 7651642
5685 7651642 7850868 7962358 7967432 8106184 8336104 8552782 8801620 8994081 9277962 9548646
5675 9548646 9892159 10350313 10729017 11079603 11260637 11238109 11097441 10843928 10828639 10846637
5665 10846637 10942330 11159088 11436207 11617594 11744986 11909938 12153086 12427372 12770896 13313769
5655 13313769 13983958 14808085 15681455 16290247 16763911 17031369 17111484 17223794 17452714 17626205
5645 17626205 17766022 18057398 18595212 19265106 20251298 21467207 22929932 24505653 26240431
5636 26240431 27845193 29101916 29825048 29942700 29622097 29077362 28444233 27551372 26589857
5627 26589857 25654582 24904108 24373865 24093951 24061256 24308033 24851685 25600510 26525414 27540224
$$ packed form
5695F414180k8273L8020R0036J24974J42942J39911J64807K35680J86610J42755
5685G651642J99226J11490N074J38752K29920K16678K48838J92461K83881K70684
5675I548646L43513M58154L78704L50586J81034k2528j40668k53513j5289J7998
5665A0846637R5693K16758K77119J81387J27392J64952K43148K74286L43524N42873
5655A3313769O70189Q24127Q73370O08792M73664K67458Q0115J12310K28920J73491
5645A7626205J39817K91376N37814O69894R86192J215909J462725J575721J734778
5636B6240431J604762J256723P23132J17652l20603n44735o33129q92861r61515
5627B6589857r35275p50474n30243k79914l2695K46777N43652P48825R24904J014810
$$ plain form
5617 27540224 28447999 29399241 30342781 31155772 31778903 31918926 31554387 30605641 29261252
5608 29261252 27867995 26425661 25235058 24268326 23602557 23268062 23169738 23221918 23230518 23337807
5598 23337807 23585548 23935329 24464530 24950501 25337755 25493625 25545944 25146491 24287068 23162988
5588 23162988 22001117 20939465 20143041 19623633 19230703 19079348 18972697 18948674 19070422
5579 19070422 19202532 19454940 19658213 19899908 20344008 20915355 21774270 22703595 23423640
5570 23423640 23728720 23549631 23134065 22774819 22607666 22793669 23347206 24107188 24773960
5561 24773960 25438903 26072213 26801297 27743608 28925703 30270038 31796397 33690214 35772722
5552 35772722 38219204 40816878 43355905 45563366 47113689 47855455 47868778 47371051 46622789
$$ packed form
5617B7540224R07775R51242R43540Q12991O23131J40023l64539r48746j344389
5608B9261252j393257j442334j190603r66732o65769l34495r8324N2180Q600J07289
5598B3337807K47741L49781N29201M85971L87254J55870N2319l99453q59423j124080
5588B3162988j161871j061652p96424n19408l92930j51355j06651k4023J21748
5579A9070422J32110K52408K03273K41695M44100N71347Q58915R29325P20045
5570B3423640L05080j79089m15566l59246j67153J86003N53537P59982O66772
5561B4773960O64943O33310P29084R42311J182095J344335J526359J893817K082508
5552C5772722K446482K597674K539027K207461J550323P41766J3323m97727p48262
$$ plain form
5543 46622789 45773534 44973086 44450736 44239826 44503515 45276229 46471222 47895885 49507339
5534 49507339 51219313 52763271 53850939 54380881 54555805 54577535 54411287 54083805 53478738
5525 53478738 52363899 50864510 49152915 47324734 45555080 43901017 42440744 41247155
5517 41247155 40289378 39537403 39203955 39204092 39595599 40428549 41703882 43430210 45520286
5508 45520286 47763941 50146411 52336387 53802872 54057870 52666797 49630209 45415977
5500 45415977 41014383 36819851 33241546 30143411 27660636 25648889 23935201 22554559
5492 22554559 21400600 20436933 19746188 19134107 18666475 18291364 18081891 17975307 17899406
5483 17899406 18085303 18429314 18864175 19454642 20185742 20973054 21937843 22848555 23352567
$$ packed form
5543D6622789q49255q00448n22350k10910K63689P72714J194993J424663J611454
5534D9507339J711974J543958J087668N29942J74924K1730j66248l27482o05067
5525E3478738j114839j499389j711595j828181j769654j654063j460273j193589
5517D1247155r57777p51975l33448J37L91507Q32950J275333J726328K090076
5508D5520286K243655K382470K189976J466485K54998j391073l036588m214232
5500D5415977m401594m194532l578305l098135k482775k011747j713688j380642
5492B2554559j153959r63667o90745o12081m67632l75111k09473j06584p5901
5483A7899406J85897L44011M34861N90467P31100P87312R64789R10712N04012
$$ plain form
5474 23352567 23349408 22567428 21249295 19675800 18197352 16968364 16005874 15305864 14725290
5465 14725290 14301967 13995845 13838585 13777238 13704399 13479971 13086115 12588882 12164225 11788927
5455 11788927 11549370 11503488 11492201 11453192 11534650 11635376 11741888 11815547 11965381 12156616
5445 12156616 12307350 12442385 12748356 13105976 13620334 14286472 14916525 15559870 16328407
5436 16328407 17203130 18245234 19328734 20367820 20984311 21080318 20675977 19990842 19103047
5427 19103047 18198821 17453755 16880975 16425539 16025892 15767190 15646980 15731586 15897734 16281477
5417 16281477 16852086 17644670 18593859 19424596 20216446 20845303 21346984 21686610 21981277
5408 21981277 22297729 22656045 22919371 22914171 22691985 22012936 21055989 19781642 18483236
$$ packed form
5474B3352567l159p81980j318133j573495j478448j228988r62490p00010n80574
5465A4725290m23323l06122j57260o1347p2839k24428l93856m97233m24657l75298
5455A1788927k39557m5882j1287l9009Q1458J00726J06512P3659J49834J91235
5445A2156616J50734J35035L05971L57620N14358O66138O30053O43345P68537
5436A6328407Q74723J042104J083500J039086O16491R6007m04341o85135q87795
5427A9103047r04226p45066n72780m55436l99647k58702j20210Q4606J66148L83743
5417A6281477N70609P92584R49189Q30737P91850O28857N01681L39626K94667
5408B1981277L16452L58316K63326n200k22186o79049r56947j274347j298406
$$ plain form
5399 18483236 17288524 16290712 15494109 15020953 14746957 14640164 14795468 15015295 15300440
5390 15300440 15547015 15644128 15552436 15258186 14955596 14806957 14813270 14833960 14709881 14437105
5380 14437105 14212640 14140631 13918848 13402778 12744042 12138753 11461814 10759634 10151684 9643103
5370 9643103 9362139 9173590 9105843 9010955 8993215 8939404 8872811 8877835 8863083 8828160 8560844
5359 8560844 8349442 8208110 8157293 8074979 7935785 7751543 7725804 7750038 7783434 7604569
5349 7604569 7264825 6821394 6361232 6089486 5705448 5320077 5131527 4946051 4794611 4771149
5339 4771149 4695061 4594066 4568197 4535173 4537554 4691520 4849767 4988205 5125293 5388347
5329 5388347 5568888 5690017 5765063 5685831 5336956 4879152 4481403 4228035 3979063 3788074
$$ packed form
5399A8483236j194712r97812p96603m73156k73996j06793J55304K19827K85145
5390A5300440K46575R7113r1692k94250l02590j48639O313K0690j24079k72776
5380A4437105k24465p2009k21783n16070o58736o05289o76939p02180o07950n08581
5370I643103k80964j88549o7747r4888j7740n3811o6593N024j4752l4923k67316
5359H560844k11402j41332n0817q2314j39194j84242k5739K4234L3396j78865
5349G604569l39744m43431m60162k71746l84038l85371j88550j85476j51440k3462
5339D771149p6088j00995k5869l3024K381J53966J58247J38438J37088K63054
5329E388347J80541J21129P5046p9232l48875m57804l97749k53368k48972j90989
$$ plain form
5319 3788074 3647782 3486330 3366526 3285883 3206900 3190467 3113452 3052883 2989257 3055789 3153944
5308 3153944 3189865 3236811 3226417 3339193 3453718 3599918 3736620 3834663 3753353 3514313
5298 3514313 3313459 3104822 2988713 2876854 2669867 2549276 2422149 2316562 2290312 2308706
5288 2308706 2296630 2245150 2172238 2122489 2088820 2006056 1964003 1986457 1998334 1995600 1973960 1991716
5276 1991716 1969429 1891858 1871765 1905588 1949859 1945161 1956032 1863332 1841271 1814794 1815902 1839197
5264 1839197 1755748 1665362 1665342 1658817 1659517 1678100 1642407 1649817 1666131 1669367 1652852 1636584 1589633
5251 1589633 1554580 1567616 1581365 1600928 1570722 1561806 1577509 1623421 1686831 1653551 1640732 1554471
5239 1554471 1569929 1527769 1520088 1507186 1505620 1519661 1489288 1478284 1487986 1498431 1500232 1496000
$$ packed form
5319C788074j40292j61452j19804q0643p8983j6433p7015o0569o3626O6532R8155
5308C153944L5921M6946j0394J12776J14525J46200J36702R8043q1310k39040
5298C514313k00854k08637j16109j11859k06987j20591j27127j05587k6250J8394
5288B308706j2076n1480p2912m9749l3669q2764m2053K2454J1877k734k1640J7756
5276A991716k2287p7571k0093L3823M4271m698J0871r2700k2061k6477J108K3295
5264A839197q3449r0386k0o525P00J8583l5693P410J6314L236j6515j6268m6951
5251A589633l5053J3036J3749J9563l0206q916J5703M5912O3410l3280j2819q6261
5239A554471J5458m2160p681j2902j566J4041l0373j1004R702J0445J801m232
$$ plain form
5227 1496000 1503421 1591758 1621539 1623897 1602868 1590855 1609653 1516864 1497121 1519776 1530886 1535752
5215 1535752 1575734 1620552 1629984 1689650 1769722 1836404 1897027 1987250 2065724 2132604 2141044 2094643
5203 2094643 2065603 2010668 1860961 1768259 1712664 1643084 1567905 1513218 1544695 1563550 1575221
5192 1575221 1579291 1517807 1553641 1607346 1580012 1625898 1657130 1641610 1693862 1646104 1569112 1604199
5180 1604199 1648573 1669353 1613352 1601546 1567435 1551076 1552307 1491561 1491260 1485594 1438145 1358689
5168 1358689 1341954 1301222 1307433 1323191 1266900 1288722 1327698 1268755 1200478 1267616 1384627
5157 1384627 1376128 1336609 1280604 1213717 1237264 1279924 1301969 1376285 1437105 1391633 1343886 1318705
5145 1318705 1327777 1318096 1345149 1364870 1344996 1352285 1371731 1436067 1469778 1476511 1477137 1467457 1483059
$$ packed form
5227A496000P421Q8337K9781K358k1029j2013J8798r2789j9743K2655J1110M866
5215A535752L9982M4818R432N9666Q0072O6682O0623R0223P8474O6880Q440m6401
5203B094643k9040n4935j49707r2702n5595o9580p5179n4687L1477J8855J1671
5192A575221M070o1484L5834N3705k7334M5886L1232j5520N2252m7758p6992L5087
5180A604199M4374K0780n6001j1806l4111j6359J231o0746l01n666m7449p9456
5168A358689j6735m0732O211J5758n6291K1822L8976n8943o8277O7138J17011
5157A384627q499l9519n6005o6887K3547M2660K2045P4316O0820m5472m7747k5181
5145A318705R072r681K7053J9721j9874P289J9446O4336L3711O733O26r680J5602
$$ plain form
5132 1483059 1523293 1502609 1512555 1584222 1610704 1625254 1642365 1643150 1682123 1685135 1791930 1835642
5120 1835642 1857032 1866787 1976204 2046775 2062036 2091020 2187084 2266167 2323248 2388006 2489233
5109 2489233 2566822 2629112 2691281 2689332 2705237 2726160 2749938 2721889 2835510 3028552 3097271
5098 3097271 3203118 3312872 3339933 3404386 3350361 3278560 3222361 3274473 3310534 3376725 3442355
5087 3442355 3561426 3698221 3758926 3833294 4033071 4161772 4295895 4504767 4733199 4936080
5077 4936080 5140566 5355731 5470598 5540765 5583435 5596970 5736647 5919248 6147699 6370705
5067 6370705 6547579 6571671 6584630 6615313 6693907 6918303 7277519 7668203 8325269 9109341
5057 9109341 9964656 11091270 12482677 14382175 16593320 18839481 20020492 19704386 18038944
$$ packed form
5132A483059M0234k0684R946P1667K6482J4550J7111P85L8973L012J06795M3712
5120A835642K1390R755J09417P0571J5261K8984R6064P9083N7081O4758J01227
5109B489233P7589O2290O2169j949J5905K0923K3778k8049J13621J93042O8719
5098C097271J05847J09754K7061O4453n4025p1801n6199N2112L6061O6191O5630
5087C442355J19071J36795O0705P4368J99777J28701J34123K08872K28432K02881
5077D936080K04486K15165J14867P0167M2670J3535J39677J82601K28451K23006
5067F370705J76874K4092J2959L0683P8594K24396L59216L90684O57066P84072
5057I109341Q55315J126614J391407J899498K211145K246161J181011l16106j665442
$$ plain form
5048 18038944 15949826 14157196 12654997 11596352 10745982 10091768 9644712 9417956 9307415
5039 9307415 9220004 9249719 9290374 9249535 9301879 9461703 9813671 10395261 11141366 12029162
5029 12029162 13127999 14537885 16372861 18865194 22139934 26386310 30123071 30731392
5021 30731392 28456927 24724627 20772023 17450427 14833941 12996416 11649792 10557906
5013 10557906 9750826 9238378 8786057 8381409 8003811 7717239 7568948 7477457 7437190 7455257
5003 7455257 7560437 7744075 8031612 8463595 9021235 9766875 10725955 12050935 13590100
4994 13590100 14971303 15242181 14315826 12573354 10613433 9027739 7823661 7014976 6382549
4985 6382549 5854058 5520905 5256422 4957219 4695571 4492964 4341367 4127384 4037306 3933709
$$ packed form
5048A8038944k089118j792630j502199j058645q50370o54214m47056k26756j10541
5039I307415q7411K9715M0655m0839N2344J59824L51968N81590P46105Q87796
5029A2029162J098837J409886J834976K492333L274740M246376L736761O08321
5021C0731392k274465l732300l952604l321596k616486j837525j346624j091886
5013A0557906q07080n12448m52321m04648l77598k86572j48291r1491m0267J8067
5003G455257J05180J83638K87537M31983N57640P45640R59080J324980J539165
4994A3590100J381203K70878r26355j742472j959921j585694j204078q08685o32427
4985F382549n28491l33153k64483k99203k61648k02607j51597k13983r0078j03597
$$ plain form
4975 3933709 3775169 3714106 3638773 3580924 3546146 3512283 3460351 3423019 3412854 3380481 3305712
4964 3305712 3305881 3280813 3199590 3142450 3139561 3168360 3125841 3122431 3070104 3076918 3078513 3072815 3065372
4951 3065372 3010407 3000283 3022125 3015710 3031131 3018431 2921478 2916037 2907804 3019051 2980232 2943024
4939 2943024 2929672 3016375 3005559 2988869 2991495 3021551 3050025 3018628 3002612 2995132 3021495 3029675
4927 3029675 3067559 3036681 3048126 3107239 3128815 3158477 3134960 3180249 3171042 3239802 3246992 3202605
4915 3202605 3246216 3219599 3248655 3213904 3248313 3269069 3274007 3181529 3211104 3228413 3263662 3306539
4903 3306539 3262652 3260409 3292417 3339506 3396882 3426453 3435913 3422407 3484072 3475141 3454833 3448654
4891 3448654 3514839 3585408 3576937 3529661 3577971 3625246 3662797 3709266 3724908 3780697 3833343 3872015
$$ packed form
4975C933709j58540o1063p5333n7849l4778l3863n1932l7332j0165l2373p4769
4964C305712J69k5068q1223n7140k889K8799m2519l410n2327O814J595n698p443
4951C065372n4965j0124K1842o415J5421j2700r6953n441q233J11247l8819l7208
4939B943024j3352Q6703j0816j6690K626L0056K8474l1397j6016p480K6363Q180
4927C029675L7884l0878J1445N9113K1576K9662k3517M5289r207O8760P190m4387
4915C202605M3611k6617K9056l4751L4409K0756M938r2478K9575J7309L5249M2877
4903C306539m3887k243L2008M7089N7376K9571R460j3506O1665q931k0308o179
4891C448654O6185P0569q471m7276M8310M7275L7551M6469J5642N5789N2646L8672
$$ plain form
4879 3872015 3921981 3954745 3940678 4032868 4166254 4134273 4169134 4249007 4279756 4261580 4258762
4868 4258762 4220515 4166443 4142144 4156774 4171738 4169729 4174713 4204038 4162881 4154237 4182526 4196061
4856 4196061 4281968 4339458 4333608 4351009 4480141 4512916 4466747 4465923 4552583 4573024 4519060 4584440
4844 4584440 4643454 4723051 4667781 4681918 4706775 4749982 4798910 4808426 4770584 4888952 4927994
4833 4927994 4932496 4920508 4936535 5022566 5064747 5100010 5094923 5164947 5186889 5217620 5273950 5337785
4821 5337785 5421077 5507897 5514523 5559098 5616954 5740911 5836107 6007349 6211943 6365971 6450910
4810 6450910 6544773 6580551 6622843 6605064 6552396 6429344 6271557 6157435 6150207 6080218 6032466
4799 6032466 5953861 5896350 5869433 5880264 5939912 5936676 5956046 5944516 5887481 5951199 5935624 5973912
$$ packed form
4879C872015M9966L2764j4067R2190J33386l1981L4861P9873L0749j8176k818
4868D258762l8247n4072k4299J4630J4964k009M984K9325m1157q644K8289J3535
4856D196061Q5907N7490n850J7401J29132L2775m6169q24Q6660K0441n3964O5380
4844D584440N9014P9597n5270J4137K4857M3207M8928R516l7842J18368L9042
4833D927994M502j1988J6027Q6031M2181L5263n087P0024K1942L0731N6330O3835
4821E337785Q3292Q6820O626M4575N7856J23957R5196J71242K04594J54028Q4939
4810F450910R3863L5778M2292j7779n2668j23052j57787j14122p228o9989m7752
4799F032466p8605n7511k6917J0831N9648l236J9370j1530n7035O3718j5575L8288
$$ plain form
4787 5973912 5945776 5976404 5990634 5951489 5938181 6006233 6032635 6063358 6029512 6067084 6101312
4776 6101312 6164402 6190603 6203643 6217799 6215980 6243860 6249634 6263813 6292505 6359400 6345461 6347596
4764 6347596 6305457 6347887 6342383 6340937 6364826 6403335 6409788 6385110 6426125 6495630 6506719 6491911
4752 6491911 6498319 6549266 6616408 6665003 6744629 6887140 7029367 7179905 7256433 7196637 7056134
4741 7056134 6958598 6831530 6706407 6649603 6691222 6687247 6651098 6642455 6590257 6576181 6595652
4730 6595652 6674961 6642407 6622911 6604816 6566168 6582600 6584804 6671270 6726727 6716161 6645562 6643619
4718 6643619 6682671 6698615 6626993 6617558 6650717 6664143 6679753 6724683 6725568 6759370 6706260 6685899
4706 6685899 6687670 6653326 6689062 6752733 6719608 6708128 6662167 6718733 6701649 6675615 6687473 6696219
$$ packed form
4787E973912k8136L0628J4230l9145j3308O8052K6402L0723l3846L7572L4228
4776F101312O3090K6201J3040J4156j819K7880N774J4179K8692O6895j3939K135
4764F347596m2139M2430n504j446K3889L8509O453k4678M1015O9505J1089j4808
4752F491911O408N0947O7142M8595P9626J42511J42227J50538P6528n9796j40503
4741G056134r7536j27068j25123n6804M1619l975l6149q643n2198j4076J9471
4730F595652P9309l2554j9496j8095l8648J6432K204Q6466N5457j0566p0599j943
4718F643619L9052J5944p1622r435L3159J3426J5610M4930Q85L3802n3110k0361
4706F685899J771l4344L5736O3671l3125j1480m5961N6566j7084k6034J1858Q746
$$ plain form
4694 6696219 6770293 6773846 6807908 6840103 6889273 6908130 6868484 6853396 6882498 6921546 6960332 6969357
4682 6969357 7034683 7110041 7082722 7095789 7132430 7100360 7141084 7168016 7123709 7172995 7234620
4671 7234620 7244496 7281986 7262538 7244560 7270310 7268907 7318387 7330309 7419466 7396465 7388145 7436169
4659 7436169 7502383 7516845 7515041 7577194 7619078 7672883 7694352 7679974 7631734 7656072 7625878 7690314
4647 7690314 7667521 7713530 7688556 7594502 7636266 7676096 7668171 7712338 7800848 7791957 7826147 7823763
4635 7823763 7775999 7832092 7862403 7837832 7806924 7794165 7818649 7880358 7945239 7924471 7922274 7906592
4623 7906592 7866589 7853299 7857444 7881769 7920654 7898818 7870880 7818007 7829160 7866029 7813247 7758702
4611 7758702 7750426 7756231 7692506 7672537 7666705 7634403 7613945 7535522 7508974 7466918 7514642 7522620
$$ packed form
4694F696219P4074L553L4062L2195M9170J8857l9646j5088K9102L9048L8786R025
4682F969357O5326P5358k7319J3067L6641l2070M0724K6932m4307M9286O1625
4671G234620R876L7490j9448j7978K5750j403M9480J1922Q9157k3001q320M8024
4659G436169O6214J4462j804O2153M1884N3805K1469j4378m8240K4338l0194O4436
4647G690314k2793M6009k4974r4054M1764L9830p925M4167Q8510q891L4190k384
4635G823763m7764N6093L0311k4571l0908j2759K4484O1709O4881k0768k197j5682
4623G906592m0003j3290M145K4325L8885k1836k7938n2873J1153L6869n2782n4545
4611G758702q276N805o3725j9969n832l2302k0458p8423k6548m2056M7724P978
$$ plain form
4599 7522620 7431396 7409975 7351537 7356597 7388962 7366465 7265429 7262678 7271860 7258144 7211301 7135684
4587 7135684 7082605 7059415 6987442 6929660 6861079 6836335 6782715 6752569 6717082 6666800 6652477
4576 6652477 6584456 6546217 6533842 6458449 6368243 6337164 6297919 6238085 6237136 6120260 6116816 6080660
4564 6080660 6042468 6052686 6017286 5948099 5891830 5906743 5823563 5801909 5713983 5666914 5611526
4553 5611526 5581095 5554193 5520456 5519119 5459256 5477453 5480058 5469349 5409085 5405954 5377418 5343515
4541 5343515 5317107 5335099 5293869 5207331 5162937 5211632 5189778 5259829 5288094 5283824 5296334 5331975
4529 5331975 5410815 5500074 5620126 5714958 5915582 6073207 6296985 6475107 6521266 6363402
4519 6363402 6101369 5835983 5641166 5449927 5398385 5284202 5189079 5143118 5156014 5145941
$$ packed form
4599G522620r1224k1421n8438N060L2365k2497j01036k751R182j3716m6843p5617
4587G135684n3079k3190p1973n7782o8581k4744n3620l0146l5487n0282j4323
4576F652477o8021l8239j2375p5393r0206l1079l9245n9834r49j16876l444l6156
4564F080660l8192J0218l5400o9187n6269J4913q3180k1654q7926m7069n5388
4553E611526l0431k6902l3737j337n9863J8197K605j0709o0264l131k8536l3903
4541E343515k6408J7992m1230q6538m4394M8695k1854P0051K8265m270J2510L5641
4529E331975P8840Q9259J20052R4832K00624J57625K23778J78122M6159j57864
4519F363402k62033k65386j94817j91239n1542j14183r5123m5961J2896j0073
$$ plain form
4509 5145941 5105555 5111404 5143268 5196101 5225169 5241390 5300182 5397471 5441893 5526057 5575693 5628334
4497 5628334 5770665 5860162 6005838 6206744 6592815 6914451 7167273 7362960 7332369 7250772
4487 7250772 7214178 7349216 7604219 8061474 8615636 9013401 9115716 8973404 8720630 8529768
4477 8529768 8286162 7840893 7428147 7062504 6685684 6401058 6211134 6140177 6121196 6165148
4467 6165148 6209223 6298638 6445860 6675443 6965493 7288107 7406355 7166347 6852036 6541977
4457 6541977 6336896 6155719 6001305 5948474 5915518 5897514 6038708 6093114 6179984 6480558
4447 6480558 6730396 6907696 6886419 6739774 6623072 6438034 6284005 6223241 6226997 6171581
4437 6171581 6183873 6205154 6298702 6504408 6820318 7200805 7557486 7865039 7812687 7544138
$$ packed form
4509E145941m0386N849L1864N2833K9068J6221N8792R7289M4422Q4164M9636N2641
4497E628334J42331Q9497J45676K00906L86071L21636K52822J95687l0591q1597
4487G250772l6594J35038K55003M57255N54162L97765J02315j42312k52774j90862
4477H529768k43606m45269m12746l65643l76820k84626j89924p0957j8981M3952
4467F165148M4075Q9415J47222K29583K90050L22614J18248k40008l14311l10059
4457F541977k05081j81177j54414n2831l2956j8004J41194N4406Q6870L00574
4447F480558K49838J77300k1277j46645j16702j85038j54029o0764L756n5416
4437F171581J2292K1281R3548K05706L15910L80487L56681L07553n2352k68549
$$ plain form
4427 7544138 7264054 6993585 6812975 6669677 6774047 6893677 7018357 7223270 7515700 7825769
4417 7825769 7988203 7978559 7768082 7462607 7192191 6877925 6637730 6525923 6385654 6316865
4407 6316865 6275901 6234007 6218796 6277512 6319098 6359548 6416794 6492994 6593014 6751194 6883562
4396 6883562 7034887 7169334 7320085 7468753 7646129 7886874 8167640 8397621 8770631 9176069
4386 9176069 9545148 9705784 9701487 9814275 9926514 10126682 10427294 10989195 11750596 12644017
4376 12644017 13765111 15231495 17046744 18744584 19729351 19677259 18977435 18514313 18659358
4367 18659358 18965719 18921964 17894538 16082039 14366984 13068475 12141133 11560446 11107015
4358 11107015 10715783 10453903 10363686 10486395 10731047 11220933 11720500 12110554 11939703 11250396
$$ packed form
4427G544138k80084k70469j80610j43298J04370J19630J24680K04913K92430L10069
4417G825769J62434r644k10477l05475k70416l14266k40195j11807j40269o8789
4407F316865m0964m1894j5211N8716M1586M0450N7246P6200J00020J58180J32368
4396F883562J51325J34447J50751J48668J77376K40745K80766K29981L73010M05438
4386I176069L69079J60636m297J12788J12239K00168L00612N61901P61401Q93421
4376A2644017J121094J466384J815249J697840R84767n2092o99824m63122J45045
4367A8659358L06361m3755j027426j812499j715055j298509r27342n80687m53431
4358A1107015l91232k61880r0217J22709K44652M89886M99567L90054j70851o89307
$$ plain form
4348 11250396 10466550 9801274 9453153 9176596 9149337 9308183 9603654 9927659 10429435 10922524
4338 10922524 11093710 10647848 9825484 9013405 8278059 7824024 7486192 7271078 7090368
4329 7090368 6930507 6852293 6764737 6692125 6646447 6557599 6471071 6422442 6367876 6280051 6259530
4318 6259530 6282958 6257067 6208061 6243068 6275223 6349102 6481864 6586714 6708267 6827246 6970654
4307 6970654 7153459 7234744 7362606 7574728 7771329 7997928 8265906 8683926 9170940 9810051
4297 9810051 10552847 11440837 12491117 13817940 15303103 16692615 17503277 17444488 16509829
4288 16509829 15215469 14071777 13228035 12748138 12388925 11931244 11362390 10815167 10246315
4279 10246315 9714474 9307943 8982086 8679497 8458206 8330211 8230080 8119699 7996502
$$ packed form
4348A1250396p83846o65276l48121k76557k7259J58846K95471L24005N01776M93089
4338A0922524J71186m45862q22364q12079p35346m54035l37832k15114j80710
4329G090368j59861p8214q7556p2612m5678q8848q6528m8629n4566q7825k0521
4318F259530K3428k5891m9006L5007L2155P3879J32762J04850J21553J18979J43408
4307F970654J82805Q1285J27862K12122J96601K26599K67978M18020M87014O39111
4297I810051P42796Q87990J050280J326823J485163J389512Q10662n8789r34659
4288A6509829j294360j143692q43742m79897l59213m57681n68854n47223n68852
4279A0246315n31841m06531l25857l02589k21291j27995j00131j10381j23197
$$ plain form
4270 7996502 7926222 7907162 7858252 7952618 8045930 8175284 8261237 8397369 8554370 8828432 9093509
4259 9093509 9429420 9862332 10327578 10981683 11822333 12855309 14134824 15649353 17199243
4250 17199243 18140420 18055242 16880921 15197141 13738931 12632245 11820197 11255936 10847144
4241 10847144 10536360 10354770 10303777 10364426 10555495 10799748 11084291 11568784 12182092 12870037
4231 12870037 13778808 15061791 16596690 17967186 18498239 17846191 16328812 14811646 13664109
4222 13664109 12909103 12340318 11891907 11620811 11559157 11499957 11517718 11635762 11670092 11775282
4212 11775282 11944862 12172852 12484094 12986575 13567848 14322526 15191217 16249122 17554363
4203 17554363 19189392 21401329 24071853 26711956 28067106 27305876 24568465 21557220
$$ packed form
4270G996502p0280j9060m8910R4366R3312J29354Q5953J36132J57001K74062K65077
4259I093509L35911M32912M65246O54105Q40650J032976J279515J514529J549890
4250A7199243R41177q5178j174321j683780j458210j106686q12048n64261m08792
4241A0847144l10784j81590n0993O0649J91069K44253K84543M84493O13308O87945
4231A2870037R08771J282983J534899J370496N31053o52048j517379j517166j147537
4222A3664109p55006n68785m48411k71096o1654n9200J7761J18044L4330J05190
4212A1775282J69580K27990L11242N02481N81273P54678Q68691J057905J305241
4203A7554363J635029K211937K670524K640103J355150p61230k737411l011245
$$ plain form
4195 21557220 19110285 17345931 16099707 15196410 14577776 13983135 13585279 13328112 13185520
4186 13185520 13032898 12922827 12876290 12857770 12768114 12701178 12722107 12631953 12618632 12668753 12753059
4175 12753059 12895696 13011876 13198536 13348539 13533562 13672202 13862828 14068412 14076094 14236113
4165 14236113 14544241 14844882 15339638 15867733 16460455 17066769 17571091 18042034 18525324
4156 18525324 19045493 19613538 20249891 21022391 21904228 22774529 23677021 24694320 25684483
4147 25684483 26554281 27446347 28314876 29222595 30327690 31567476 33113243 35041959 37437799
4138 37437799 40529248 44570502 49416402 55344033 62402007 70960690 81728827 95609797
4130 95609797 113066965 132960845 150399422 158759028 153295462 135803359 113142415
$$ packed form
4195B1557220k446935j764354j246224r03297o18634n94641l97856k57167j42592
4186A3185520j52622j10071m6537j8520q9656o6936K0929r0154j3321N0121Q4306
4175A2753059J42637J16180J86660J50003J85023J38640J90626K05584P682J60019
4165A4236113L08128L00641M94756N28095N92722O06314N04322M70943M83290
4156A8525324N20169N68045O36353P72500Q81837Q70301R02492J017299R90163
4147B5684483Q69798Q92066Q68529R07719J105095J239786J545767J928716K395840
4138C7437799L091449M041254M845900N927631P057974Q558683J0768137J3880970
4130I5609797J7457168J9893880J7438577Q359606n463566j7492103k2660944
$$ plain form
4123 113142415 92158460 76031462 64336119 56007879 49796127 45184388 41637597 38936125
4115 38936125 36689237 34767103 33064436 31615665 30368350 29263484 28310325 27463769
4107 27463769 26485908 25582908 24933269 24457824 24254195 24270667 24397727 24443502 24240294 23860733
4097 23860733 23636166 23608125 23905881 24585757 25680098 27220621 29173977 31712611 34878606
4088 34878606 38572939 42998745 48099865 54099952 61245148 66617578 66537263 59063413
4080 59063413 48614104 39730596 33286208 28837630 25631686 23224923 21350213 19813933
4072 19813933 18655317 17765616 17019205 16373996 15857374 15442574 15109366 14840374 14463977
4063 14463977 13988632 13472800 13085151 12785838 12623493 12635107 12839989 13193661 13583339 13738222
$$ packed form
4123A13142415k0983955j6126998j1695343q328240o211752m611739l546791k701472
4115C8936125k246888j922134j702667j448771j247315j104866r53159q46556
4107B7463769r77861r03000o49639m75445k03629J6472J27060M5775k03208l79561
4097B3860733k24567k8041K97756O79876J094341J540523J953356K538634L165995
4088C4878606L694333M425806N101120O000087P145196N372430q0315p473850
4080E9063413j0449309q883508o444388m448578l205944k406763j874710j536280
4072A9813933j158616q89701p46411o45209n16622m14800l33208k68992l76397
4063A4463977m75345n15832l87649k99313j62345J1614K04882L53672L89678J54883
$$ plain form
4053 13738222 13440076 12862159 12280182 11813553 11508267 11215618 10911182 10566308 10152796
4044 10152796 9759682 9465362 9192818 8975008 8857680 8873945 8929149 9081027 9300147 9423291
4034 9423291 9471879 9276802 9022976 8827446 8667444 8522559 8343738 8113371 7840164 7591779
4024 7591779 7329179 6925047 6562599 6353761 6151378 6000465 5785871 5675413 5589104 5502402
4014 5502402 5371472 5352878 5248601 5160371 5112139 5057145 5036483 4984676 4937480 4990067 4993081
4003 4993081 4976317 5011075 5134252 5245312 5330824 5438356 5477323 5153572 4799698 4460499
3993 4460499 4257733 4072970 3928606 3798806 3819220 3801666 3749169 3721598 3765275 3840692 3817721
3982 3817721 3838056 3855650 3896292 3876692 3905539 3845930 3765728 3773738 3753686 3718056 3668527 3686876
$$ packed form
4053A3738222k98146n77917n81977m66629l05286k92649l04436l44874m13512
4044A0152796l93114k94320k72544k17810j17328J6265N5204J51878K19120J23144
4034I423291M8588j95077k53826j95530j60002j44885j78821k30367k73207k48385
4024G591779k62600m04132l62448k08838k02383j50913k14594j10458q6309q6702
4014E502402j30930j8594j04277q8230m8232n4994k0662n1807m7196N2587L014
4003D993081j6764L4758J23177J11060Q5512J07532L8967l23751l53874l39199
3993D460499k02766j84763j44364j29800K0414j7554n2497k7571M3677P5417k2971
3982C817721K0335J7594M0642j9600K8847n9609q0202Q010k0052l5630m9529J8349
$$ plain form
3970 3686876 3686759 3617882 3613526 3617177 3585447 3543764 3509913 3418366 3405793 3412333 3363392 3320102
3958 3320102 3344636 3368280 3442272 3510847 3503150 3601116 3616682 3550037 3547118 3545336 3518030 3525753
3946 3525753 3560259 3648534 3790383 3904232 3966757 4044717 4134353 4210636 4461856 4665351 4789862
3935 4789862 4763129 4696465 4665121 4648264 4581610 4556814 4540586 4513390 4478133 4410311 4282465
3924 4282465 4134646 4005727 3841919 3686504 3550428 3491662 3376429 3315440 3352549 3307841
3914 3307841 3285519 3308453 3277776 3290067 3329001 3354449 3352385 3316568 3258800 3158724 3117419
3903 3117419 3075580 3114017 3110960 3084947 3080067 3107838 3172672 3167886 3196381 3220868 3193913 3271890
3891 3271890 3263504 3260817 3306331 3354092 3406276 3453336 3521860 3597636 3662881 3805388 3906223
$$ packed form
3970C686876j17o8877m356L651l1730m1683l3851r1547j2573O540m8941m3290
3958C320102K4534K3644P3992O8575p697R7966J5566o6645k919j782k7306P723
3946C525753L4506Q8275J41849J13849O2525P7960Q9636P6283K51220K03495J24511
3935D789862k6733o6664l1344j6857o6654k4796j6228k7196l5257o7822j27846
3924D282465j47819j28919j63808j55415j36076n8766j15233o0989L7109m4708
3914C307841k2322K2934l0677J2291L8934K5448k064l5817n7768j00076m1305
3903C117419m1839L8437l057k6013m880K7771O4834m786K8495K4487k6955P7977
3891C271890q386k687M5514M7761N2184M7060O8524P5776O5245J42507J00835
$$ plain form
3880 3906223 4088603 4165763 4199392 4340619 4453657 4584401 4676721 4945496 5301059 5724202
3870 5724202 6146339 6750711 7549807 8438583 9507182 10852745 12638335 15125487 18283132
3861 18283132 20810609 21011358 18353276 14734690 11752427 9624765 8233415 7227689
3853 7227689 6436368 5864384 5377980 5013485 4747856 4531712 4305543 4145090 4016901 3839744
3843 3839744 3775954 3748759 3643799 3622082 3613807 3599612 3600263 3495876 3376428 3161033 2981868
3832 2981868 2850989 2721415 2544747 2431809 2323968 2227123 2210955 2098091 2067860 2028706
3822 2028706 2021968 2009268 1917004 1924144 1981392 1929355 1869475 1797233 1730144 1716125 1728733 1729546
3810 1729546 1694669 1732423 1718845 1757584 1736021 1719003 1742886 1712328 1670379 1641125 1581793
$$ packed form
3880C906223J82380P7160L3629J41227J13038J30744R2320K68775L55563M23143
3870E724202M22137O04372P99096Q88776J068599J345563J785590K487152L157645
3861A8283132K527477K00749k658082l618586k982263k127662j391350j005726
3853G227689p91321n71984m86404l64495k65629k16144k26169j60453j28189j77157
3843C839744o3790k7195j04960k1717q275j4195O51j04387j19448k15395j79165
3832B981868j30879j29574j76668j12938j07841r6845j6168j12864l0231l9154
3822B028706o738j2700r2264P140N7248n2037n9880p2242o7089j4019J2608Q13
3810A729546l4877L7754j3578L8739k1563j7018K3883l0558m1949k9254n9332
$$ plain form
3799 1581793 1584193 1634706 1627465 1618200 1678825 1731471 1744429 1690315 1712987 1804054 1841222 1858748
3787 1858748 1860695 1771290 1729157 1688704 1706551 1768859 1732753 1601805 1543603 1592274 1621158
3776 1621158 1645889 1645123 1671942 1715944 1729624 1682645 1600802 1501258 1469051 1470590 1473680 1496280
3764 1496280 1503021 1524141 1448550 1481149 1498151 1488299 1534046 1496792 1462397 1450551 1442190 1445578
3752 1445578 1466648 1489143 1509115 1505758 1524759 1510198 1490156 1485323 1458118 1537990 1482314 1507266
3740 1507266 1556699 1551756 1596402 1533723 1567097 1565733 1525129 1619242 1613037 1599131 1580086 1566970
3728 1566970 1604327 1601532 1666630 1680704 1698783 1701533 1671071 1776318 1753410 1850488 1903295 1966691
3716 1966691 1984068 2010470 2054525 2073968 2161446 2315761 2392733 2400243 2405722 2266004 2163437
$$ packed form
3799A581793K400N0513p241r265O0625N2646J2958n4114K2672R1067L7168J7526
3787A858748J947q9405m2133m0453J7847O2308l6106j30948n8202M8671K8884
3776A621158K4731p66K6819M4002J3680m6979q1843r9544l2207J539L090K2600
3764A496280O741K1120p5591L2599J7002r852M5747l7254l4395j1846q361L388
3752A445578K1070K2495J9972l357J9001j4561k0042m833k7205P9872n5676K4952
3740A507266M9433m943M4646o2679L3374j364m0604R4113o205j3906j9045j3116
3728A566970L7357k795O5098J4074J8079K750l0462J05247k2908R7078N2807O3396
3716A966691J7377K6402M4055J9443Q7478J54315P6972P510N479j39718j02567
$$ plain form
3705 2163437 2142302 2103213 2097280 2116541 2132958 2159938 2227222 2231818 2213033 2290751 2425874 2453176
3693 2453176 2500003 2627382 2690396 2777260 2868034 3011620 3205925 3460535 3712300 4079971
3683 4079971 4371158 4543606 4504300 4354646 4100473 3888216 3793728 3775040 3824077 3946164
3673 3946164 4108625 4320072 4597728 4928695 5384178 6015130 6655892 7187086 7530220 7515448
3663 7515448 7119323 6532986 6038974 5764563 5629894 5665018 5716798 5787721 5904959 6011895
3653 6011895 5991648 5860385 5373123 4757502 4285514 3935326 3716965 3638560 3503982 3342437
3643 3342437 3213857 3174347 3168755 3125432 3075919 3076123 2997567 2988702 2951082 2957865 2968641 3017439
3631 3017439 3060221 3069239 3092656 3081069 3128472 3184162 3177499 3259346 3335208 3461928 3531652 3675054
$$ packed form
3705B163437k1135l9089n933J9261J6417K6980O7284M596j8785P7718J35123K7302
3693B453176M6827J27379O3014Q6864R0774J43586J94305K54610K51765L67671
3683D079971K91187J72448l9306j49654k54173k12257r4488j8688M9037J22087
3673C946164J62461K11447K77656L30967M55483O30952O40762N31194L43134j4772
3663G515448l96125n86337m94012k74411j34669L5124N1780P0923J17238J06936
3653F011895k0247j31263m87262o15621m71988l50188k18361p8405j34578j61545
3643C342437j28580l9510n592m3323m9513K04p8556q865l7620O783J0776M8798
3631C017439M2782R018K3417j1587M7403N5690o663Q1847P5862J26720O9724J43402
$$ plain form
3619 3675054 3860555 4066985 4316561 4597819 5056278 5517070 6027624 6410528 6582905 6554919
3609 6554919 6445345 6373500 6365352 6303412 6272688 6371257 6644504 7132370 7682281 7965156 7923246
3598 7923246 7554312 6978158 6283036 5663068 5217464 4903140 4666934 4571623 4457102 4357059
3588 4357059 4364209 4467245 4564886 4774929 4965152 5224076 5272907 5023800 4650800 4280165
3578 4280165 4009594 3802534 3701241 3615159 3552282 3495377 3413160 3292921 3298681 3258284 3258957
3567 3258957 3231491 3269249 3264746 3281664 3298189 3369307 3444724 3523757 3680762 3869253 4073572
3556 4073572 4251214 4390290 4350304 4151757 3883700 3735012 3622253 3581666 3499940 3521821
3546 3521821 3469441 3409147 3331639 3237994 3151265 3198655 3185014 3229118 3146570 3156624 3192419
$$ packed form
3619C675054J85501K06430K49576K81258M58459M60792N10554L82904J72377k7986
3609F554919j09574p1845q148o1940l0724R8569K73247M87866N49911K82875m1910
3598G923246l68934n76154o95122o19968m45604l14324k36206r5311j14521j00043
3588D357059P150J03036R7641K10043J90223K58924M8831k49107l73000l70635
3578D280165k70571k07060j01293q6082o2877n6905q2217j20239N760m0397O73
3567C258957k7466L7758m503J6918J6525P1118P5417P9033J57005J88491K04319
3556D073572J77642J39076l9986j98547k68057j48688j12759m0587q1726K1881
3546C521821n2380o0294p7508r3645q6729M7390j3641M4104q2548J0054L5795
$$ plain form
3535 3192419 3180978 3179966 3184029 3309338 3413193 3484455 3615768 3772852 3835276 3869714 3867599
3524 3867599 3760372 3589147 3424444 3398460 3347843 3344102 3343879 3378962 3401586 3373820 3331827
3513 3331827 3307469 3211749 3224812 3236981 3188251 3160339 3099958 3111915 3138303 3092247 3078744
3502 3078744 3039020 3020906 2974069 2994331 3068993 3088230 3111296 3069151 3127071 3160428 3258322
3491 3258322 3288208 3323026 3352805 3365118 3376471 3377501 3408691 3495970 3425249 3424969 3469272 3491451
3479 3491451 3489494 3570145 3611021 3622180 3601671 3636482 3736350 3761000 3808172 3842202 3943974
3468 3943974 4093435 4338326 4466448 4577165 4694825 4892197 5082931 5253981 5399344 5499709
3458 5499709 5567551 5574773 5571995 5420041 5231917 5041730 4928825 4882891 4856194 4843944 4902990
$$ packed form
3535C192419j1441j012M063J25309J03855P1262J31313J57084O2424L4438k115
3524C867599j07227j71225j64703k5984n0617l741k23L5083K2624k7766m1993
3513C331827k4358r5720J3063J2169m8730k7912o0381J1957K6388m6056j3503
3502C078744l9724j8114m6837K0262P4662J9237K3066m2145N7920L3357R7894
3491C258322K9886L4818K9779J2313J1353J030L1190Q7279p0721k80M4303K2179
3479C491451j957Q0651M0876J1159k0509L4811R9868K4650M7172L4030J01772
3468C943974J49461K44891J28122J10717J17660J97372J90734J71050J45363J00365
3458E499709O7842P222k778j51954j88124j90187j12905m5934k6697j2250N9046
$$ plain form
3447 4902990 4901614 4953890 4984200 4950377 4947975 5001076 4977813 4992375 5006599 5059202 5121655 5192675
3435 5192675 5240177 5309831 5314656 5333948 5388838 5455535 5529746 5570835 5702318 5878167 5946876
3424 5946876 6023383 6092501 6231578 6375125 6549455 6742037 6905759 7081482 7327881 7599101
3414 7599101 8014386 8545153 9061291 9710777 10588114 11584014 12897560 14517334 15928645
3405 15928645 16496562 15833068 14445403 13082656 12053039 11371157 10951118 10713660 10504200
3396 10504200 10487476 10540146 10619481 10659458 10701177 10774613 10857525 11006637 11186032 11395491 11621965
3385 11621965 12020506 12592612 13235961 13978358 14889772 15913846 17157459 18675865 20643896
3376 20643896 23190106 26389397 29365698 30571556 29372735 26748770 24273047 22445089
$$ packed form
3447D902990j376N2276L0310l3823k402N3101k3263J4562J4224N2603O2453P1020
3435E192675M7502O9654M825J9292N4890O6697P4211M1089J31483J75849O8709
3424E946876P6507O9118J39077J43547J74330J92582J63722J75723K46399K71220
3414G599101M15285N30767N16138O49486Q77337R95900J313546J619774J411311
3405A5928645N67917o63494j387665j362747j029617o81882m20039k37458k09460
3396A0504200j6724N2670P9335L9977M1719P3436Q2912J49112J79395K09459K26474
3385A1621965L98541N72106O43349P42397R11414J024074J243613J518406J968031
3376B0643896K546210L199291K976301J205858j198821k623965k475723j827958
$$ plain form
3368 22445089 21176900 20170749 19448322 18873333 18398538 18046076 17842701 17676171 17386230
3359 17386230 17079863 16875771 16802313 16842038 16918553 17031359 17329195 17744150 18167020 18663300
3349 18663300 19305016 19980608 20793349 21785603 23025876 24462913 26227282 27993671 29007016
3340 29007016 29102542 28615712 28404147 28741989 29695126 31180263 33221314 35826023 39078698
3331 39078698 43064657 47496422 52029251 55821882 58335456 59151694 58062556 55206521
3323 55206521 50980294 46314384 42005635 38279992 35355827 33155085 31625661 30495506
3315 30495506 29763705 29213203 28849249 28688960 28636934 28680960 28930842 29385520 30096048 31030362
3305 31030362 32246621 33415086 34445430 34970768 35125023 35345713 35731644 36220120 36918009
$$ packed form
3368B2445089j268189j006151p22427n74989m74795l52462k03375j66530k89941
3359A7386230l06367k04092p3458L9725P6515J12806K97836M14955M22870M96280
3349A8663300O41716O75592Q12741R92254J240273J437037J764369J766389J013345
3340B9007016R5526m86830k11565L37842R53137J485137K041051K604709L252675
3331C9078698L985959M431765M532829L792631K513574Q16238j089138k856035
3323E5206521m226227m665910m308749l725643k924165k200742j529424j130155
3315C0495506p31801n50502l63954j60289n2026M4026K49882M54678P10528R34314
3305C1030362J216259J168465J030344N25338J54255K20690L85931M88476O97889
$$ plain form
3296 36918009 37542942 38298190 39084733 40063898 40982250 41968095 43081469 44471007 46032676
3287 46032676 47996363 50333786 53323596 56832484 61239093 66177674 71083970 75265292
3279 75265292 79377974 84534410 91449282 100016775 111048853 125311998 144622128 169085923
3271 169085923 199820725 228816508 241081422 225900152 190992255 156743953 130733398
$$ packed form
3296C6918009O24933P55248P86543R79165R18352R85845J113374J389538J561669
3287D6032676J963687K337423K989810L508888M406609M938581M906296M181322
3279G5265292M112682N156436O914872Q567493J1032078J4263145J9310130K4463795
3271A69085923L0734802K8995783J2264914j5181270l4907897l4248302k6010555
$$ [...]
##END NTUPLES=NMR SPECTRUM
##END=
