##TITLE=1H_CA-9080-1
 CDCl3
 8 sc, 
 21.10.2022
##JCAMPDX= 6.0         $$ Bruker NMR JCAMP-DX V2.0
##DATA TYPE= NMR SPECTRUM
##DATA CLASS= NTUPLES
##ORIGIN= UXNMR, Bruker Analytische Messtechnik GmbH
##OWNER= root
$$ XWIN-NMR		Version 3.5
$$ Fri Oct 21 14:10:07 2022 Russian Standard Time (UT+4h)  she@DPX200
##.OBSERVE FREQUENCY= 200.1313499994
##.OBSERVE NUCLEUS= ^1H
##.ACQUISITION MODE= SIMULTANEOUS
##.ACQUISITION SCHEME= undefined
##.AVERAGES= 8
##.DIGITISER RES= 18
##SPECTROMETER/DATA SYSTEM= spect
##.PULSE SEQUENCE= zg30
##.SOLVENT NAME= CDCl3
##.SHIFT REFERENCE= (INTERNAL, CDCl3, 0, 15.7711)
##AUDIT TRAIL= $$ (NUMBER, WHEN, WHO, WHERE, WHAT)
$$ ##TITLE= Audit trail, XWIN-NMR		Version 3.5
$$ ##JCAMPDX= 5.01
$$ ##ORIGIN= Bruker BioSpin GmbH
$$ ##OWNER= she
$$ F:/spectra/data/she/nmr/H-F/1/pdata/1/auditp.txt
$$ ##AUDIT TRAIL=  $$ (NUMBER, WHEN, WHO, WHERE, WHAT)
(   1,<2022-10-21 14:08:38.07 +0400>,<she>,<DPX200>,
      <created by zg, POWCHK disabled, PULCHK disabled
       configuration hash MD5:
       00 E9 B6 7A A2 85 ED C7 34 08 36 98 17 FE 4E 26
       data hash MD5: 16K
       F3 5B 90 7A B3 46 F2 C9 B0 64 1E FF 60 7D D5 0E>)
(   2,<2022-10-21 14:08:42.64 +0400>,<she>,<DPX200>,
      <Start of raw data processing
       efp BC_mod = 2 LB = 0.24 FT_mod = 6 PKNL = 1 PHC0 = -18038.65 PHC1 = 15.2007 SI = 16K 
       data hash MD5: 16K
       E6 11 3E AF 99 48 48 03 A7 68 22 82 A3 35 A6 7E>)
(   3,<2022-10-21 14:09:02.17 +0400>,<she>,<DPX200>,
      <pk PHC0 = 0.1775382 PHC1 = 0.3999998 
       data hash MD5: 16K
       51 4C FC 7E F7 97 20 C4 EC 8D DF 97 88 43 BC CF>)
(   4,<2022-10-21 14:09:05.60 +0400>,<she>,<DPX200>,
      <abs ABSG = 5 
       data hash MD5: 16K
       73 68 AE D9 4A 17 E9 48 79 8E 4A 3C C1 04 A8 96>)
$$ ##END=
$$ 
$$ hash MD5
$$ 69 E7 60 F5 1E 37 DD 4E C7 DC 3C 7A 97 54 AD 56
##$RELAX= 
##$RELAX= 
##$RELAX= 
##$RELAX= 
##$RELAX= 
##$RELAX= 
$$ Bruker specific parameters
$$ --------------------------
##$DU= <F:/spectra>
##$EXPNO= 1
##$NAME= <H-F>
##$PROCNO= 1
##$TYPE= <nmr>
##$USER= <she>
##$AMP= (0..31)
100 100 100 100 100 100 100 100 100 100 100 100 100 100 100 100 100 100 
100 100 100 100 100 100 100 100 100 100 100 100 100 100 
##$AQSEQ= 0
##$AQ_mod= 1
##$AUNM= <au_zg>
##$AUTOPOS= <>
##$BF1= 200.13
##$BF2= 200.13
##$BF3= 200.13
##$BF4= 200.13
##$BF5= 200.13
##$BF6= 200.13
##$BF7= 200.13
##$BF8= 200.13
##$BYTORDA= 1
##$CFDGTYP= 0
##$CFRGTYP= 5
##$CHEMSTR= <none>
##$CNST= (0..31)
1 1 145 1 1 1 1 1 1 1 1 1 1 1 1 1 1 1 1 1 1 1 1 1 1 1 1 1 1 1 1 1 
##$CPDPRG= <>
##$CPDPRG1= <>
##$CPDPRG2= <>
##$CPDPRG3= <>
##$CPDPRG4= <mlev>
##$CPDPRG5= <mlev>
##$CPDPRG6= <mlev>
##$CPDPRG7= <mlev>
##$CPDPRG8= <mlev>
##$CPDPRGB= <>
##$CPDPRGT= <>
##$D= (0..31)
0 1.2 0 0 0 0 0 0 0 0.06 0 0.03 0 0 0 0 0.0002 0 0 0 0 0 0 0 0 0 0 0 0 
0 0 0 
##$DATE= 1666346917
##$DBL= (0..7)
120 120 120 120 120 120 120 120 
##$DBP= (0..7)
150 150 150 150 150 150 150 150 
##$DBP07= 0
##$DBPNAM0= <>
##$DBPNAM1= <>
##$DBPNAM2= <>
##$DBPNAM3= <>
##$DBPNAM4= <>
$$ [...]
##$SUBNAM3= <"">
##$SUBNAM4= <"">
##$SUBNAM5= <"">
##$SUBNAM6= <"">
##$SUBNAM7= <"">
##$SUBNAM8= <"">
##$SUBNAM9= <"">
##$SW= 18.0517283424941
##$SWIBOX= (0..15)
0 0 2 0 0 0 0 0 0 0 0 0 0 0 0 0 
##$SW_h= 3612.71676300578
##$TD= 16384
##$TD0= 1
##$TE= 0
##$TE2= 300
##$TE3= 300
##$TEG= 300
##$TL= (0..7)
0 120 120 120 120 120 120 120 
##$TP= (0..7)
150 150 150 150 150 150 150 150 
##$TP07= 0
##$TPNAME0= <>
##$TPNAME1= <>
##$TPNAME2= <>
##$TPNAME3= <>
##$TPNAME4= <>
##$TPNAME5= <>
##$TPNAME6= <>
##$TPNAME7= <>
##$TPOAL= (0..7)
0.5 0.5 0.5 0.5 0.5 0.5 0.5 0.5 
##$TPOFFS= (0..7)
0 0 0 0 0 0 0 0 
##$TUNHIN= 0
##$TUNHOUT= 0
##$TUNXOUT= 0
##$USERA1= <user>
##$USERA2= <user>
##$USERA3= <user>
##$USERA4= <user>
##$USERA5= <user>
##$V9= 5
##$VALIST= <valist>
##$VCLIST= <CCCCCCCCCCCCCCC>
##$VD= 0
##$VDLIST= <DDDDDDDDDDDDDDD>
##$VPLIST= <PPPPPPPPPPPPPPP>
##$VTLIST= <TTTTTTTTTTTTTTT>
##$WBST= 1024
##$WBSW= 4
##$XGAIN= (0..3)
0 0 0 0 
##$XL= 0
##$YL= 0
##$YMAX_a= 349544
##$YMIN_a= -810502
##$ZGOPTNS= <>
##$ZL1= 120
##$ZL2= 120
##$ZL3= 120
##$ZL4= 120
##$ABSF1= 15.75129
##$ABSF2= -2.300559
##$ABSG= 5
##$ABSL= 3
##$ALPHA= 0
##$AQORDER= 0
##$ASSFAC= 0
##$ASSFACI= 0
##$ASSFACX= 0
##$ASSWID= 0
##$AUNMP= <proc_1d>
##$AZFE= 0.1
##$AZFW= 0.1
##$BCFW= 0
##$BC_mod= 2
##$BYTORDP= 0
##$COROFFS= 0
##$CY= -3
##$DATMOD= 1
##$DC= 0
##$DFILT= <>
##$DTYPP= 0
##$F1P= 0
##$F2P= 0
##$FCOR= 1
##$FTSIZE= 16384
##$FT_mod= 6
##$GAMMA= 0
##$GB= 0
##$INTBC= 1
##$INTSCL= 3.70164e-10
##$ISEN= 128
##$LB= 0.24
##$LEV0= 0
##$LPBIN= 0
##$MAXI= 10000
##$MC2= 0
##$MEAN= 0
##$ME_mod= 0
##$MI= 1.114404
##$NCOEF= 0
##$NC_proc= -5
##$NLEV= 6
##$NOISF1= 3.799351
##$NOISF2= 2.8
##$NSP= 0
##$NTH_PI= 0
##$NZP= 0
##$OFFSET= 15.77113
##$PC= 1
##$PHC0= -18038.47
##$PHC1= 15.6007
##$PH_mod= 1
##$PKNL= yes
##$PPARMOD= 0
##$PSCAL= 0
##$PSIGN= 0
##$REVERSE= no
##$SF= 200.130000081186
##$SI= 16384
##$SIGF1= 3
##$SIGF2= 2
##$SINO= 5.538805
##$SIOLD= 16384
##$SREGLST= <1H.CDCl3>
##$SSB= 0
##$STSI= 16384
##$STSR= 0
##$SW_p= 3612.71676300578
##$SYMM= 0
##$S_DEV= 0
##$TDeff= 16384
##$TDoff= 0
##$TI= <>
##$TILT= no
##$TM1= 0
##$TM2= 0
##$TOPLEV= 0
##$USERP1= <user>
##$USERP2= <user>
##$USERP3= <user>
##$USERP4= <user>
##$USERP5= <user>
##$WDW= 1
##$XDIM= 16384
##$YMAX_p= 343423667
##$YMIN_p= -164142
$$ End of Bruker specific parameters
$$ ---------------------------------
##NTUPLES= NMR SPECTRUM
##VAR_NAME=  FREQUENCY,     SPECTRUM/REAL,   SPECTRUM/IMAG
##SYMBOL=    X,             R,               I
##VAR_TYPE=  INDEPENDENT,   DEPENDENT,       DEPENDENT
##VAR_FORM=  AFFN,          ASDF,            ASDF
##VAR_DIM=   16384,         16384,           16384
##UNITS=     HZ,            ARBITRARY UNITS, ARBITRARY UNITS
##FACTOR=    0.220516191357247, 1,           1
##FIRST=     3156.27616976031, 0,            0
##LAST=      -456.440593245466, 0,           0
##MIN=       -456.440593245466, -164142,     0
##MAX=       3156.27616976031, 343423667,    0
$$ Real data points
##PAGE= N=1
##DATA TABLE= (X++(R..R)), XYDATA
$$ [...]
9278B144226Q4042Q3172J852J7095k2535r07K3230M9840N3240N8781K6251N9575
$$ 2144226 2228268 2311440 2313292 2330387 2307852 2306945 2330175 2380015 2433255 2492036 2518287 2577862
9266B577862R8445R7272J21250J63755O7442J47963J60723J06411J00040P1945
$$ 2577862 2676307 2773579 2894829 3058584 3126026 3273989 3434712 3541123 3641163 3713108
9256C713108J82331J95648J43297K00166J72728J31868J02807J15899K29815O9496
$$ 3713108 3895439 4091087 4234384 4434550 4607278 4739146 4841953 4957852 5187667 5257163
9246E257163j7253O6990J96910J51117P3769L1166j03796k20579j84969j84577
$$ 5257163 5239910 5306900 5503810 5654927 5728696 5759862 5656066 5435487 5250518 5065941
9236E065941k00403q7788p4422j3790J6713L4347M9588q2811j2908L8070L3804
$$ 5065941 4865538 4777750 4703328 4689538 4706251 4740598 4790186 4707375 4694467 4732537 4766341
9225D766341R3565K06823O8203M7031L6772J42845J00828K5651J59896P2157J24389
$$ 4766341 4859906 5066729 5134932 5181963 5218735 5361580 5462408 5488059 5647955 5720112 5844501
9214E844501J07095N0444j18623m2443J06974K51922J21562K6709l3948O808l1884
$$ 5844501 5951596 6002040 5883417 5840974 5947948 6199870 6321432 6348141 6314193 6321001 6289117
9203F289117q5790k05847l14873l08420l75037k38324j79133j92623j08466m0549
$$ 6289117 6203327 5997480 5682607 5374187 4999150 4760826 4581693 4389070 4280604 4240055
9193D240055o5666m5002J1496o9091j3495j70759j06392k289r2319j31844j29678
$$ 4240055 4174389 4129387 4140883 4071792 4058297 3887538 3781146 3778857 3686538 3554694 3425016
9182C425016j06174p2698j26941r6151j46665j06843n2133p4296N593j10964k0656
$$ 3425016 3318842 3246144 3119203 3023052 2876387 2769544 2717411 2643115 2648708 2537744 2517088
9171B517088n7718m4665m1831l9331o2519j6983K7310l021j993m3041j4506k1565
$$ 2517088 2459370 2414705 2372874 2333543 2271024 2254041 2281351 2278330 2276337 2233296 2218790 2197225
9159B197225R07O9096k158l4154j8584j8550J3986k6555L4043P663j6337k5785
$$ 2197225 2198132 2267228 2265070 2230916 2212332 2193782 2207768 2181213 2215256 2222919 2206582 2180797
9147B180797N032P9657j192L998k8800M1115j7159l9574m8923L4962l4771k1976
$$ 2180797 2185829 2265486 2264294 2268292 2239492 2280607 2263448 2223874 2174951 2209913 2175142 2153166
9135B153166K3116j8981L2244j857k160j1551O470m8085k028j3777o930L1022
$$ 2153166 2176282 2157301 2189545 2187688 2185528 2173977 2180447 2132362 2130334 2116557 2109627 2140649
9123B140649N3458P4546J2286N6237K6734j404J1549L6404M2694P806k6543M0178
$$ 2140649 2194107 2268653 2280939 2337176 2363910 2362506 2374055 2410459 2453153 2460959 2434416 2474594
9111B474594O8628L7657l2127J14750o131l1617Q0354M490R6904M7687k1466M047
$$ 2474594 2543222 2580879 2548752 2663502 2657371 2625754 2706108 2710598 2807502 2855189 2833723 2837770
9099B837770J8243Q7632R5848O8108K0055K7111K8641P8594O0540L926O5739L8949
$$ 2837770 2856013 2943645 3039493 3107601 3127656 3154767 3183408 3262002 3322542 3326468 3392207 3431156
9087C431156k0117P9355J17836Q1922L8024R0728K5004J04598R0896K7292P4881
$$ 3431156 3411039 3490394 3608230 3690152 3728176 3818904 3843908 3948506 4039402 4066694 4141575
9076D141575R9550J31845j759M9076J08191J02354O1966J61513J26637Q0199N2137
$$ 4141575 4241125 4372970 4371211 4420287 4528478 4630832 4692798 4854311 4980948 5061147 5113284
9065E113284R828J06653J59851Q7413J29110K01676J67174J21226J70907J38111
$$ 5113284 5123112 5229765 5389616 5477029 5606139 5807815 5974989 6096215 6267122 6405233
9055F405233J67936J79791K34235J50671K27778K82904K86050K84916K90216L93510
$$ 6405233 6573169 6752960 6987195 7137866 7365644 7648548 7934598 8219514 8509730 8903240
9045H903240M01629M30313M71445M42577M40053N72287O43827N31928N70694O64525
$$ 8903240 9304869 9735182 10206627 10649204 11089257 11661544 12305371 12837299 13407993 14072518
9035A4072518Q13396J035337J224710J486750J541838J611388J593928J715162
$$ 14072518 14885914 15921251 17145961 18632711 20174549 21785937 23379865 25095027
9027B5095027K053389K558465K594581J818138O02931n5343O57333J749812K417038
$$ 25095027 27148416 29706881 32301462 34119600 34722531 34667188 35324521 37074333 39491371
9018C9491371J796778j56387k249481l408560l723531l026916j993634j191762
$$ 39491371 41288149 41131762 38882281 35473721 31750190 28723274 26729640 25537878
9010B5537878o09120k12894m21371p79019r01564p87796m61253k60622J2998L67745
$$ 25537878 24928758 24715864 24294493 23515474 22613910 21826114 21364861 21104239 21117237 21484982
9000B1484982M66934P66851R87372J165543J625017J990691K206226K282916K072332
$$ 21484982 21951916 22718767 23706139 24871682 26496699 28487390 30693616 32976532 35048864
8991C5048864J867501J619420J189720J266924K065741K825859K734812J638313
$$ 35048864 36916365 38535785 39725505 40992429 43058170 45884029 48618841 50257154
8983E0257154K06921k46092n60317j654887l133695m785333n675088m960908l932084
$$ 50257154 50464075 50217983 49657666 48002779 44869084 40083751 34408663 29447755 25515671
8974B5515671k938789k117500j631651j226890q93643o36544p21546r36330j027733
$$ 25515671 22576882 20459382 18827731 17600841 16707198 16070654 15349108 14412778 13385045
8965A3385045r81485q49560p13397o01229m83978m53030m25826l57847k99542
$$ 13385045 12403560 11554000 10840603 10239374 9755396 9302366 8876540 8518693 8219151
8956H219151k84605k65198l15816k16959k32431k89866k60820k01243j34803k61288
$$ 8219151 7934546 7669348 7353532 7136573 6904142 6614276 6353456 6152213 6017410 5756122
8946E756122j01234r5142j36742j45043o4317j22253j52474p5965q1276p1165
$$ 5756122 5654888 5559746 5423004 5277961 5213644 5091391 4938917 4862952 4781676 4710511
8936D710511j10911n1566m2838p6788n8878j13888m4383q0458p51R2p9531r4471
$$ 4710511 4599600 4548034 4505196 4428408 4369530 4255642 4211259 4130801 4130050 4130142 4050611 3956140
8924C956140j5528n1442L2670l2558Q906k7767p3092o2260k8093N2958l8897j09649
$$ 3956140 3940612 3889170 3921840 3889282 3898188 3870421 3797329 3735069 3706976 3759934 3721037 3611388
8912C611388J8736j2595K0850P6439m4987o1167k5277O7715L1229J8017m1234
$$ 3611388 3630124 3617529 3638379 3714818 3669831 3608664 3583387 3651102 3682331 3700348 3659114
8901C659114j8298J55Q9071N3248j3991L6944Q8068O4173o083Q5301K1618M3063
$$ 3659114 3640816 3640971 3730042 3783290 3769299 3806243 3894311 3958484 3952401 4037702 4059320 4102383
8889D102383J40100O0352j3950J31452J01967K3008Q2926N2590N7837M9446Q3391
$$ 4102383 4242483 4302835 4288885 4420337 4522304 4545312 4628238 4680828 4738665 4788111 4871502
8878D871502N9635J19361J90432J27428J53511J39649J07445Q6144J74090J88688
$$ 4871502 4931137 5050498 5240930 5368358 5521869 5661518 5768963 5855107 6029197 6217885
8868F217885J45103J40691J08368J76675J45451J14560P4383J31497L7134L780
$$ 6217885 6362988 6503679 6612047 6788722 6934173 7048733 7123116 7254613 7291747 7295527
8858G295527l4069J22048J27878M8517Q0392J84528J48175M6667J21717J74903
$$ 7295527 7261458 7383506 7511384 7559901 7640293 7824821 7972996 8019663 8141380 8316283
8848H316283J80370K13153L24767K93334J96010L42681L27321L21655M17150M22026
$$ 8316283 8496653 8709806 9034573 9327907 9523917 9866598 10193919 10515574 10932724 11354750
8838A1354750M45706M28504M13380M95181M77789N29558N33695N26376N44340
$$ 11354750 11800456 12228960 12642340 13137521 13615310 14144868 14678563 15204939 15749279
8829A5749279M11245M62150N01246M75402P37722R68479J216400J183810J241900
$$ 15749279 16160524 16622674 17123920 17599322 18337044 19305523 20521923 21705733 22947633
8820B2947633J084794J065667J271215J376804J342727J141922Q78228Q99892
$$ 22947633 24032427 25098094 26369309 27746113 29088840 30230762 31108990 32008882
8812C2008882P13025j16502j250271k126744j990548j419250p61861k33980P0074
$$ 32008882 32721907 32605405 31355134 29228390 27237842 25818592 25056731 24822751 24892825
8803B4892825J22807k04800m80838n18685l46736j12527J47539M17744N22231
$$ 24892825 25015632 24810832 24329994 23811309 23464573 23352046 23499585 23917329 24439560
8794B4439560O77277R55161J278377J365611J572080J517086J586950J924238
$$ 24439560 25116837 26071998 27350375 28715986 30288066 31805152 33392102 35316340
8786C5316340K145435K552707K703488K874767K994288K826742K287729J444072
$$ 35316340 37461775 40014482 42717970 45592737 48587025 51413767 53701496 55145568
8778E5145568l57269k454241l963225m135139l112700j925459j289777j431713
$$ 55145568 54788299 52334058 48370833 44235694 41122994 39197535 37907758 36476045
8770C6476045k283331k832413k537809k143204j556772j397568j155198q58396
$$ 36476045 34192714 31360301 28822492 26679288 25122516 23724948 22569750 21711354
8762B1711354o44019m53257k09632M0128K79751L59762M43334N91370Q22423J109043
$$ 21711354 21067335 20614078 20404446 20444574 20724325 21084087 21527421 22118791 22941214 24050257
8752B4050257J452880J736900J717309J055356O98146O55517P97491J170856J188896
$$ 24050257 25503137 27240037 28957346 30012702 30710848 31366365 32163856 33334712 34523608
8743C4523608P68981Q1604j171891k352399k991278l206252k915517k194242j645194
$$ 34523608 35292589 35374193 34202302 31849903 28858625 25652373 22736856 20542614 18897420
8734A8897420j219463q95519o33139o74622p41960o88797o56311o25106m26922
$$ 18897420 17677957 16782438 16149299 15474677 14732717 14043920 13387609 12762503 12335581
8725A2335581k89963j71280k08646j37723j46103p8935n1769r2177o191o5388
$$ 12335581 12045618 11874338 11665692 11527969 11381866 11302931 11251162 11158985 11152794 11087406
8715A1087406K4357q938K0974L9352l013l4208O0765L657O3170K21108L39455
$$ 11087406 11111763 11102825 11123799 11163151 11160138 11125930 11186695 11190352 11253522 11474630 11814085
8704A1814085L45438O94653R68347J367819J298253N36111q99792j722192j501248
$$ 11814085 12159523 12854176 13822523 15190342 16488595 17024706 16124914 14402722 12901474
8695A2901474j057295o38633n29730l40094k11535j03188n5200L5865O1861J40405
$$ 12901474 11844179 11205546 10675816 10335722 10124187 10020999 9965799 10001664 10063525 10203930
8685A0203930J46154J45779K83219L40319L37708M01996N74009O32330Q10379
$$ 10203930 10350084 10495863 10779082 11119401 11457109 11859105 12433114 13065444 13875823
8676A3875823J193169J426433J473203J143793O64091M33151P73891J097205R96903
$$ 13875823 15068992 16495425 17968628 19112421 19776512 20209663 20983554 22080759 23077662
8667B3077662K07386r54271j560533j263470q45851n35514q04385j310640j389505
$$ 23077662 23285048 22330777 20770244 19506774 18660923 18125409 17321024 16010384 14620879
8658A4620879j224641q37638o29954m01137j84652j43597m1722R4629J18316K55141
$$ 14620879 13396238 12558600 11928646 11527509 11342857 11199260 11157538 11252167 11370483 11625624
8648A1625624L84930N75220Q19160R83183Q12358N14596K60367L89407O51592
$$ 11625624 12010554 12585774 13404934 14388117 15200475 15715071 15975438 16364845 17016437
8639A7016437J138969J715397K042258J971478J351178K83686q87009k015114
$$ 17016437 18155406 19870803 21913061 23884539 25235717 25519403 24632394 22617280
8631B2617280k621808k389934j840593j210521p49619m39675k48693l47490m44879
$$ 22617280 19995472 17605538 15764945 14554424 13804805 13365130 13116437 12768947 12324068
8622A2324068o36552o43397o14526n84090l09667k58975k44924j61181j59267
$$ 12324068 11687516 11044119 10429593 9845503 9535836 9276861 9031937 8870756 8711489
8613H711489j47219n640O4139K24641L69434L92859M78216J55977L1655N3059
$$ 8711489 8564270 8558630 8622769 8847410 9216844 9609703 10087919 10243896 10275551 10328610
8603A0328610L20134L35368K59230k72793o44110n98782l98643k88258k95037
$$ 10328610 10648744 10984112 11243342 10970549 10326439 9727657 9329014 9040756 8745719
8594H745719m92140o04020l93041l54348k83516j81711m5125j79735k06583k15361
$$ 8745719 8253579 7649559 7256518 6902170 6618654 6436943 6391818 6212083 6005500 5790139
8584E790139j35499k56794k85446j98263j90631j70425k31672j48085q2849j12364
$$ 5790139 5654640 5397846 5112400 4914137 4723506 4553081 4321409 4173324 4090475 3978111
8574C978111j46932j28224m8940j07490j60754j79992n2679r0878r9170R294N499
$$ 3978111 3831179 3702955 3654015 3546525 3385771 3205779 3153100 3062222 2963052 2972346 2977845
8563B977845j40782l4156M0600k304j9475j575m0781Q079j7555M9934P923r2683
$$ 2977845 2837063 2802907 2843507 2841203 2821728 2820153 2779372 2787451 2769896 2819830 2827753 2735070
8551B735070q6308j9959m6648n4562m9219r5593p9882j06258p1084m9213j10768
$$ 2735070 2648762 2628803 2582155 2527593 2478374 2382781 2302899 2196641 2125557 2076344 1965576
8540A965576o7952L5618l4165n3599n478p2732O4700O3246o6857r9368k9015N2426
$$ 1965576 1897624 1933242 1899077 1845478 1840000 1767268 1831968 1895214 1828357 1728989 1699974 1752400
8528A752400j9664O1927O4635l1012p5170k857l5779n9578N7791L0351R160J2543
$$ 1752400 1732736 1794663 1859298 1828286 1753116 1750259 1714480 1654902 1712693 1743044 1752204 1764747
8516A764747o5529o8161r3636p6874p1108p5629o7865N630j9728m4112p1755k0906
$$ 1764747 1699218 1631057 1537421 1460547 1389439 1313810 1245945 1251575 1231847 1187735 1115980 1095074
8504A095074n9808m0401k7728P555q0543j0031L228j6031l0901m2908k5169m0578
$$ 1095074 1035266 994865 967137 974692 894149 884118 887346 871315 840414 797506 772337 731759
8492G31759K9315j9038j5187J805j1706j03288J00494j4273j00032k4484N235
$$ 731759 761074 742036 726849 728654 716948 613660 714154 699881 599849 575365 580600
8481E80600l3147J9115k7735J1963M0280l4573m3856J3882m984K7705k0954o6015
$$ 580600 547453 566568 538833 550796 591076 556503 512647 526529 521545 549250 528296 462281
8469D62281k3968j6743K9856K3859j03442R27L0570l9900L4996K8868P631J1195
$$ 462281 438313 421570 451426 475285 371843 372770 403340 363440 398436 427304 434935 446130
8457D46130l6665p6858J2146J6395K1559n854L8468J2018J1630K9999L7737m3596
$$ 446130 409465 332607 344753 361148 382707 376853 415321 427339 438969 468968 506705 463109
8445D63109m2125j2244k0887q743l2057K7643q096l2100k235k428k2924m846L7904
$$ 463109 420984 408740 387853 379110 347053 374696 366600 334500 332265 329837 306913 302067 339971
8432C39971l9109k6488L5246n0309l919j4188l4182M3485j702J0460j9272j0715
$$ 339971 300862 274374 309620 259311 255392 241204 207022 250507 248805 259265 239993 229278
8420B29278Q0474n927j4289N2290J3201P040J241N599K412J0001O6503o1444j2317
$$ 229278 309752 303825 289536 341826 355027 362067 363308 368907 371319 381320 447823 386379 374062
8407C74062m2311p7329M1868j3098K262L137l3530q3643J2209O418J3486N626
$$ 374062 331751 254422 296290 283192 285454 288591 255061 171418 183627 190045 203531 209157
8395B09157M7383k7328N711K5021m2049m6773k72J0222O3147l3672l8440k0896
$$ 209157 256540 229212 234923 259944 217895 171122 170850 181072 244219 210547 172107 151211
8383A51211J4649K3770K411k2110Q3289l5141m1343L8054l3597j961m3650k1844
$$ 151211 165860 189630 192041 169931 253220 218079 176736 214790 181193 179232 135582 113738
8371A13738K1600N432L831j7687m2847L4931K2914j346j0657k9244p7356j1808
$$ 113738 135338 140770 144601 126914 84067 118998 141912 140566 129909 100665 23309 11501
8359A1501K0257J7641k7232K4890N0125l4630k3779m346R346k4768M6117K3650
$$ 11501 31758 49399 22167 47057 97182 62552 38773 34427 43773 19005 65122 88772
8347H8772l9822j18M6609m7930j8453O2782k6590J7742M845l314L4631m2355l4419
$$ 88772 48950 48832 95441 47511 29058 91840 65250 82992 87837 84523 119154 76799 42380
8334D2380j2155K6529k0656l90O4129p675J1328l0918L2028O992o0886o7348K5661
$$ 42380 30225 56754 36098 35708 99837 92162 103490 72572 104600 111592 50706 -16642 9019
8321I019J7727M5255j1394j5422R262l7296o695M4273k5030L1473Q343K9837k0610
$$ 9019 26746 72001 60607 45185 54447 17151 10456 54729 29699 61172 69515 99352 78742
8308G8742J0698R543P411M1510l9369M6859J6308j4439K3802j9445l9550k9813
$$ 78742 89440 98983 106394 147904 108535 155394 171702 157263 181065 161620 122070 92257
8296I2257k8280n390j9979m326J572J3395Q090K2348k4964L1444l4602K3144Q9558
$$ 92257 63977 58587 38608 34282 35854 49249 57339 79687 54723 86167 51565 74709 164267
8283A64267j5909l751m5782K8862M8867j0764J5298r353l1186J479R096n207K2393
$$ 164267 148358 144607 98825 127687 176554 165790 181088 171735 140549 142028 151124 145917 168310
8270A68310o787j8070j1369R81P85n2034j572P3867N8336n5900L552p5396o7764
$$ 168310 161523 143453 132084 133065 133850 81816 80244 154111 212447 156547 160099 84703 16939
8257A6939K3722M2130J7794J6738O269l5785n695L0671j3374o878O3808k5030
$$ 16939 40661 82791 100585 117323 123592 87807 82112 112783 99409 92531 156339 131309
8245A31309j08542J044Q0451K8527l5801l6384j6825M4944M8912M2716l1918p882
$$ 131309 22767 23811 104262 132789 96988 60604 43779 88723 137635 180351 148433 140551
8233A40551k8072K5530P5706j8962l0621N0546m0917p7561M0319L6274m2025j3502
$$ 140551 112479 138009 213715 194753 164132 214678 173761 96200 136519 172793 130768 117266
8221A17266k8953j5220j530Q2555p2109K6785M4656p4638M5959o6513l6748J8389
$$ 117266 88313 73093 71563 154118 82009 108794 153450 78812 124771 58258 21510 39899
8209C9899N7762j09125N8893O2686J6815l4292L4473r518m2462k904L596n3061
$$ 39899 97661 -11464 47429 110115 126930 92638 127111 117593 75131 72227 75823 22762
8197B2762K1980L8385J30964j8165L6252j37495j34981J09862k129L2370j6813
$$ 22762 44742 83127 214091 195926 232178 94683 -40298 69564 67435 99805 82992
8186H2992j2287m926K4357n359l3692k1993J2063m1960L1484K0577L21R037n396
$$ 82992 70705 65779 90136 84777 51085 29092 41155 -805 30679 51256 51577 60614 55218
8173E5218J1237j1651m381j2047k8424m9481L4155K6794M4341K6694m0694K5289
$$ 55218 66455 54804 50423 38376 9952 -39529 -5374 21420 65761 92455 51761 77050
8161G7050l3429j2468n9863N4266K1436p9387O8336J9478N1493k4611n8303J4380
$$ 77050 43621 31153 -28710 25556 46992 -32395 35941 55419 106912 82301 23998 38378
8149C8378J8014P614k0799j2488m3576m223l851O521K680J1489N0182m769n5100
$$ 38378 56392 64006 43207 30719 -12857 -17080 -20931 -14410 -11730 -241 49941 45172 -9928
8136i928k9595K1901J5107j0558L4344l812L9773K516K287l3436j3769J6391m599
$$ -9928 -39523 -17622 -2515 -13073 21271 17459 57232 59748 62035 28599 14830 31221 26622
8123B6622N2700k284J6793m7673j902L2579M277j9383J241l0565j9814M5340N4158
$$ 26622 79322 77038 93831 46158 44256 76835 81112 61729 62970 32405 12591 57931 112089
8110A12089l6388J1654l9701j4583l4186m5636L9412J5164J7028j2180k1288L0116
$$ 112089 75701 87355 47654 33071 -1115 -46751 -7339 7825 24853 12673 -8615 21501
8098B1501p0463M3387M4751J3815m620n6301K4657m7568J8431N6692K2612k1589
$$ 21501 -48962 -5575 39176 52991 48371 -7930 16727 -30841 -12410 44282 66894 45305
8086D5305l971l0209j1808m0437K0019l9576L0906M3002k3682m4264j9074Q86
$$ 45305 41334 11125 -683 -41120 -21101 -60677 -29771 13231 -10451 -54715 -73789 -72903
8074g2903P961j3201k9605k8179k0740N5815O0263N1567l4220n716L9219k5587
$$ -72903 -64942 -78143 -107748 -135927 -156667 -100852 -40589 10978 -23242 -28958 10261 -15326
8062a5326n710J4074k4270j5771O4600n5107o85o4894K0532r987k3268M3233j0973
$$ -15326 -21036 -6962 -31232 -47003 17597 -37510 -38195 -103089 -82557 -92544 -115812 -72579 -83552
8049h3552J5940L1324Q177R910K3598m3468O41j2784l5729N6831M780J2531L619
$$ -83552 -67612 -36288 -28111 -18201 5397 -38071 -37430 -50214 -85943 -29112 -24332 -11801 -8182
8036h182j2113Q826j0228l6220j1976j32k2414K4249J8043O58M2049l2003P037
$$ -8182 -20295 -11469 -21697 -57917 -69893 -70025 -92439 -68190 -50147 -49489 -7440 -39443 -32406
8023c2406m2089M5274m87k8226M7996k8748k1829j0820N4242M1625m4336p300
$$ -32406 -74495 -29221 -29708 -57934 -9938 -38686 -60515 -71335 -17093 24532 -19804 -27104
8011b7104j5526m6499l2583j8248N8392J5608l6600l826J5517q8M8482L5659K9936
$$ -27104 -42630 -89129 -121712 -139960 -81568 -65960 -102560 -106386 -90869 -90957 -42475 -6816 23120
7998B3120m1297n0471J0878l0767o574K3446J0522L9725p7741K1454L1075J1594
$$ 23120 -18177 -68648 -57770 -88537 -95111 -71665 -61143 -21418 -99159 -77705 -46630 -35036
7986c5036l2900K848m4961K5532L8736J6872l5713j6232q093N963M382j6628K9135
$$ -35036 -67936 -65088 -110049 -84517 -45781 -28909 -64622 -80854 -88947 -82984 -78602 -95230 -66095
7973f6095O0809R833l3228K271J7206m1415N3026l5934m6378K3283k9844k1667
$$ -66095 -5286 4547 -28681 -26410 -9204 -50619 2407 -33527 -79905 -56622 -86466 -108133
7961a08133K6669l7895K189J7686N8361K5134m727K5923j8519q2740Q407o006
$$ -108133 -81464 -119359 -117170 -99484 -41123 -15989 -20716 5207 -13312 -96052 -87645 -93651
7949i3651k8081K4783M7087n0255J5818L1388J9056O9482J9711k6756p6518K0276
$$ -93651 -121732 -96949 -49862 -100117 -84299 -52911 -33855 35627 55338 28582 -47936 -27660
7937b7660l2683l2413R6010K5996q9291j5077j349O1059m5506M3942k6634m711
$$ -27660 -60343 -92756 3254 29250 -60041 -75118 -76467 -15408 -60914 -16972 -43606 -48317
7925d8317r59L1547K2415L7015L1937m995j09106j1816K6767j448m2168K4501
$$ -48317 -49276 -17729 4686 41701 73638 68643 -40463 -52279 -25512 -26960 -69128 -44627
7913d4627M0175M9936K1337p116K2868m0214j01122j167Q5958K7469p074Q37l9460
$$ -44627 -4452 45484 66821 59705 82573 42359 -58763 -59930 26028 53497 46423 47260 7800
7900G800l703j8576j7702L2991k3413k6511K4070N5261M6535l9382m7452k135
$$ 7800 4097 -14479 -32181 810 -22603 -49114 -25044 30217 76752 37370 -10082 -12217
7888a2217J1899l5593Q672M0989m9408J8917o3858q561J714K7119J7653J7541
$$ -12217 -318 -35911 -27239 13750 -35658 -16741 -80599 -89160 -87446 -60327 -42674 -25133
7876b5133P7589n0487l6244q368j5396o855o0969M3703P7622K2949L359n454k448
$$ -25133 52456 1969 -34275 -42643 -58039 -64894 -125863 -82160 -4538 18411 21770 16316 13868
7863A3868K9803N722q8227o3036M3138K1614M8017K9306n0807P750N720M552L2044
$$ 13868 43671 49393 -38834 -101870 -58732 -37118 10899 40205 -10602 -2852 2868 7420 39464
7850C9464m7440K0750L4387j4925l3070K4596r5824N3151P6456j0696n7595k6698
$$ 39464 -7976 12774 47161 32236 -834 23762 -72062 -18911 57545 46849 -10746 -37444
7838c7444R4600M0724o6203p80l9758M64j9681K076M655L6696M4391L103m1141
$$ -37444 57156 97880 31677 30897 -8861 -8397 -28078 -26002 -21347 15349 59740 62843 21702
7825B1702q1652Q221o714M0008N2646J0048k3752j4291J8871m0418J9732j2711
$$ 21702 -59950 -51729 -58443 -18435 34211 44259 20507 6216 25087 -15331 4401 -8310
7813h310o748O1358j02441J13210j8080k7138K4068K9718J3286k06k5269j3969
$$ -8310 -15058 46300 -56141 57069 38989 11851 35919 65637 78923 78717 53448 39479
7801C9479k2901j9240l1440O421M4219k4995l5268L8155L7361j8102K3056K4177
$$ 39479 16578 -2662 -34102 -27681 16538 -8457 -43725 -5570 31791 13689 36745 60922
7789F0922k8334k5642k6554K8810l2315L2807M3317o406m6650L2502j9110p769
$$ 60922 32588 6946 -19608 9202 -23113 9694 53011 46605 -45 32457 13347 5578
7777E578M2844l329N327K513m1166N641L605j2006l1205K4635L3657l2839N9383
$$ 5578 48422 45093 50420 52933 11767 17408 21013 9007 -22198 2437 36094 3255 62638
7764F2638p4608N365P592J5130M7392L583k9821r290M5364M673m526m8670M3889
$$ 62638 -11970 -6605 987 16117 63509 67092 37271 27981 73345 78018 73492 24822 68711
7751F8711r703k6400J0356k5116L2722N3042K2896L029m7889k3463Q9150n0668
$$ 68711 59008 32608 42964 17848 50570 103612 126508 129537 81648 58185 147335 96667
7739I6667o2699J3680l1131J2377L65m4521r971K9293k3712j3316k6092K7665
$$ 96667 33968 47648 16517 28894 29259 -15262 -25233 4060 -19652 -32968 -59060 -31395
7727c1395P9657m4360k2288K0714M0076n6065M5846N002k4924M8956L4710n3853
$$ -31395 48262 3902 -18386 2328 42404 -13661 32185 37187 12263 61219 95929 42076
7715D2076k8616O4755l3060o5432J5895k312M3812k7656n090K3987N1766o8622
$$ 42076 13460 78215 45155 -20277 -4382 -6694 37118 9462 4372 28359 80125 11503
7703A1503m477O2127n4368q454P5920j6289l6856l1110j6501K4898Q153j7547
$$ 11503 7026 69153 14785 6331 82251 65962 29106 -2004 -18505 6393 14546 -3001
7691c001M8972l527j1584n4590L7655M0789m9937l3186M0033J1933j0776L0035
$$ -3001 45971 42444 30860 -23730 13925 54714 4777 -28409 11624 23557 12781 42816
7679D2816j8425l5081K7211M4872l5803j1359j4882K5471K0569J726j3558j4690
$$ 42816 24391 -10690 16521 61393 25590 14231 -651 24820 45389 47115 33557 18867
7667A8867k3312k284k204k6867L2736N8273j2388j4595m13K6111l2225M9467m033
$$ 18867 -4445 -6729 -8933 -35800 -3064 55209 42821 28226 27813 53924 21699 71166 67133
7654F7133k7318n9998L6894O8314m3320j1867k7914L7430k3585J2975J1128j3188
$$ 67133 39815 -20183 16711 85025 41705 29838 1924 39354 15769 28744 39872 26684
7642B6684J3108R375L6562j5136k9168m2583Q024j5441P7512r363j0046m0109
$$ 26684 39792 49167 85729 70593 41425 -1158 6866 -8575 68937 59574 49528 9419
7630I419M6577j9060j2845L4594J4881N06Q179J9250m6377K4165l6778O748L482
$$ 9419 55996 36936 24091 58685 73566 74072 82251 101501 55124 79289 42511 49259 52741
7617E2741k7382n877%J7882L4273K4755l5428J8771m4135L400K1100J4326n6440
$$ 52741 25359 19482 19482 37364 71637 96392 60964 79735 35600 39000 60100 74426 17986
7604A7986J1968L3231m4445K1072j9030K7118L717L7092m882J0327n9916P942
$$ 17986 29954 63185 18740 39812 20782 47900 51617 88709 83827 94154 34238 42180
7592D2180N4648J2266k5955m0792L511L1949P9630m0446l6391N391L8360n307
$$ 42180 96828 109094 83139 42347 45858 77807 157437 116991 80600 85991 124351 119044
7580A19044j9002k4381K9773n2153J1881N4282m4854N4728R318n1272J4308L8381
$$ 119044 100042 75661 105434 53281 65162 119444 74590 129318 138636 87364 101672 140053
7568A40053O464K0186K8636J8316l5645J3099J4485K0970O3637q0123J8438o0306
$$ 140053 146517 166703 195339 213655 178010 191109 205594 226564 290201 210078 228516 168210
7556A68210k0323M6498L9617l6361j8402P0832m729k9567k8167J6571K8376j9812
$$ 168210 147887 194385 234002 197641 179239 250071 245342 215775 187608 204179 232555 212743
7544B12743q4367P5121j8426p8441j0818K8509J9134m987L5477N9288n176J6167
$$ 212743 128376 203497 185071 106630 95812 124321 143455 138468 173945 233233 228057 244224
7532B44224M1883n963L1088Q842j0477n8274k5893J30328J2579P168n8938m176
$$ 244224 286107 280144 311232 320074 309597 251323 225430 355758 368337 375505 316567 312391
7520C12391N8426K9771P327m3727n2102L2364Q529N119m7411O9596N8950l0065
$$ 312391 370817 400588 407915 364188 312086 344450 352979 358098 310687 380283 439233 409168
7508D09168l1330R694p012L9937M1208m4653J5239O5388N6803J4566L9079p18
$$ 409168 377838 387532 380520 420457 461665 417012 432251 497639 554442 569008 608087 607369
7496F07369K9704k654Q3855O9369J55572J22585O5070J09468J16548J38856Q3033
$$ 607369 637073 634419 718274 787643 943215 1065800 1130870 1240338 1356886 1495742 1578775
7485A578775J75766J20104J85955R2190m8561o4767k5856P1209P4034p9555j34543
$$ 1578775 1754541 1874645 2060600 2152790 2104229 2039462 2013606 2084815 2158849 2079294 1944751
7474A944751k24452k13371j06526j00290r6137p2374o0803p4364j08904j04195
$$ 1944751 1720299 1506928 1400402 1300112 1203975 1131601 1070798 996434 887530 783335
7464G83335n450l1748j2372l6533l1685N9039l1622m2996O5844L6956n7386j2265
$$ 783335 777885 746137 733765 697232 665547 724586 692964 649968 715812 752768 695382 683117
7452F83117L1771n7219p6349K079l7748p750p883l4329o709q3883k8881P6532
$$ 683117 714888 657669 581320 583399 545651 537901 530018 495689 488980 405097 376216 452748
7440D52748l7854l9079O5782m7192j7086m9481k272n0963K5829K4010K1627p7934
$$ 452748 414894 375815 441597 394405 377319 327838 325566 274603 300432 324442 346069 268135
7428B68135O1963J9935m8822K6421j4871L215L0817m0304j2736N9261p1182m4558
$$ 268135 330098 350033 301211 327632 312761 315976 346793 306489 293753 353014 281832 237274
7416B37274n298L2324j3557l1293L3441J4662N9230j5m3243n7584m8637K8595
$$ 237274 231976 264300 250743 219450 252891 267553 326783 326768 283525 225941 177304 205899
7404B05899j1604K5759K2005n3869m323l368K0511M24j4491k9616m0079j8265
$$ 205899 194295 220054 242059 188190 183867 180499 201010 201434 186943 157327 117248 98983
7392I8983J634K298O6242R232k8213O2076j5658P187r28J2108j4491m3011l2311
$$ 98983 100617 102915 169157 178389 150176 212252 196594 203781 202853 214961 200470 157459 125148
7379A25148n9824O9857L4052q035N3882m536l556q2682l253Q1552l3454K6349
$$ 125148 65324 135181 169233 161198 215080 210544 206988 124306 121053 202605 169151 195500
7367A95500m842j5244m420j5894K9543M0927l2087q7006K297M8634M9124J1862
$$ 195500 190658 175414 170994 155100 184643 225570 193483 106477 108774 157408 206532 218394
7355B18394r192l0798M0175j3758J6269J1687n528q6560K6879L706l5274K4938
$$ 218394 209202 178404 218579 204821 221090 232777 227249 140689 167568 171274 136000 160938
7343A60938r0925j044L9223J8777K8877j3214j8152L0675O0146l0290p231J2146
$$ 160938 70013 68969 108192 126969 155846 142632 124480 155155 215301 185011 177780 189926
7331A89926K1720k3877L812J2327l8175l3452J7295N2230N6117o0663j4786M3144
$$ 189926 211646 187769 191581 203908 165733 132281 149576 201806 257923 197260 182474 225618
7319B25618j5560l3594r201j1371L8433P03lQ2232Q596l1578n7568k4191K766
$$ 225618 210058 176464 167263 155892 194325 195028 195025 277257 285853 254275 196707 172516 175282
7306A75282M7466O5608m2314j10044Q5355o368K3088R482M538K4174M3476k2283
$$ 175282 222748 288356 246042 135998 221353 214985 238073 247555 252093 276267 319743 297460
7294B97460k4607l4114o8559M4318M3889K6832O2199k8350k9820K613L660k9025
$$ 297460 272853 238739 170180 214498 258387 285219 347418 319068 289248 291861 295521 266496
7282B66496k4595J13215J1993q8415o9312N1264J8361p425K7011J4726o482l8466
$$ 266496 241901 355116 367109 278694 209382 260646 279007 271582 298593 313319 306837 268371
7270B68371n1879N5018M3032k2734J9757l7082M2997r048k6473k3116L1134L0834
$$ 268371 216492 271510 314542 291808 311565 274483 317480 308432 281959 258843 289977 320811
7258C20811K664m9783k1309M9473l4832J7019M6339K9602l4242k3800m9853M222
$$ 320811 323475 273692 252383 301856 267024 284043 330382 359984 325742 301942 252089 256311
7246B56311M6917R4756k2386O484N572n7394L160L5615q538L1164J4349l3517
$$ 256311 303228 397984 375598 382082 387654 330260 333420 369035 360497 391661 406010 372493
7234C72493K1036k2178J0895M3406J552Q342N333q685m3543M2650N3441J8967
$$ 372493 393529 371351 382246 425652 427204 435546 440879 432194 388651 431301 484742 503709
7222E03709J304j5794j700N936n6706l6153k2931P328L9221n0822j2581J0655
$$ 503709 505013 489219 487519 493455 436749 400596 377665 384993 424214 373392 360811 371466
7210C71466J2501K5227j0745k181L8338j8002L4739k1600K6350J7487L8998n7870
$$ 371466 383967 409194 398449 396268 434606 416604 451343 429743 456093 473580 512578 454708
7198D54708l2197N3824o576j4277K7725J866R793M9303J2434o8232j8441O8222
$$ 454708 422511 476335 469759 455482 483207 485073 494866 544169 556603 488371 469930 538152
7186E38152M4219k3979n3347K5442M3640L0667m6858l3376N4654j7536K7754M4385
$$ 538152 582371 558392 505045 530487 574127 604794 557936 524560 579214 561678 589432 633817
7174F33817K3938l2517P36J8991l0279N941J6011k4076O9758N4275p2951l8067
$$ 633817 657755 625238 625974 644965 614686 620627 636638 612562 682320 736595 663644 625577
7162F25577k6046M8996K9469j9256k4706R7992L8384n658k8213m6848Q9600M5173
$$ 625577 599531 648527 677996 658740 634034 732026 770410 764752 736539 689691 779291 824464
7150H24464r152Q1329L2236l3238J8794J1055K2085O1220K1036k8637N3246L6431
$$ 824464 815312 896641 928877 895639 914433 925488 947573 1008793 1029829 1001192 1054438 1090869
7138A090869n112L0721Q3525P2738l8445N8308J8101j8846O94P7273K1896N0557
$$ 1090869 1085757 1116478 1200003 1272741 1234296 1292604 1310705 1291859 1292553 1369826 1391722 1442279
7126A442279N3222l8529J4960J5132Q1883R0396L8007K8143K4939M4692J3222
$$ 1442279 1495501 1456972 1471932 1487064 1568947 1659343 1697350 1725493 1750432 1795124 1808346
7115A808346K6458N9419J23683K8530K0777R9484O9281N0396P1326L8070Q1306
$$ 1808346 1834804 1894223 2017906 2046436 2067213 2166697 2235978 2286374 2357700 2395770 2477076
7104B477076Q4991O4514N0676O1201N2373N7109P0705Q1108N7480Q5701J71403
$$ 2477076 2562067 2626581 2677257 2738458 2790831 2847940 2918645 2999753 3057233 3142934 3314337
7093C314337N7555R6821J81375K19098J45237J36366K49402J82651J99956K82726
$$ 3314337 3371892 3468713 3650088 3869186 4014423 4150789 4400191 4582842 4782798 5065524
7083E065524K28037K30480K71022L70016L33373L44801L77498L73536L17775M63953
$$ 5065524 5293561 5524041 5795063 6165079 6498452 6843253 7220751 7594287 7912062 8376015
7073H376015M45733M74234M79854M68024N86117P94867Q29664J146824J524968
$$ 8376015 8821748 9295982 9775836 10243860 10829977 11624844 12454508 13601332 15126300
7064A5126300J758963K218421K669650L374536M435832N651326O804701P064070
$$ 15126300 16885263 19103684 21773334 25147870 29583702 35235028 42039729 49103799
7056D9103799N654300K145278k093108n679481p546217p263467n966502m468358
$$ 49103799 54758099 56903377 54810269 49130788 41584571 34321104 28354602 23886244
7048B3886244l160480k244544j766056j543933j438434j341754j239088j126022
$$ 23886244 20725764 18481220 16715164 15171231 13732797 12391043 11151955 10025933
7040A0025933r52177p88128p49633n32007m89126l80217m27988l94933l08099
$$ 10025933 9073756 8285628 7535995 7003988 6514862 6134645 5706657 5311724 5003625
7031E003625k57242k26656j95308l01139k32473j55940j63773j72928q2907j23209
$$ 5003625 4746383 4519727 4324419 4023280 3790807 3634867 3471094 3298166 3215259 3092050
7021C092050j55572j40199j42120r5257j17632o2291n9952r3381n3772r6673j46278
$$ 3092050 2936478 2796279 2654159 2558902 2441270 2378979 2319027 2225646 2171874 2075201 1928923
7010A928923p3971q7629l9012M803n4644j20654p7688L6215O6370l8373r7608
$$ 1928923 1854952 1767323 1728311 1733114 1678470 1557816 1480128 1516343 1582713 1544340 1446732
6999A446732N712L4499j08824l2515M502k3181Q08o3406o539O465q584q5626l9483
$$ 1446732 1452444 1486943 1378119 1345604 1350106 1326925 1327733 1264327 1257788 1264253 1255669 1170043 1130560
6986A130560n0426L067q608l4017o513o6370K4793m1808M2843o0952o5797R281
$$ 1130560 1080134 1083201 1074593 1040576 1034063 967693 992486 950678 993521 932569 866772 876053
6974H76053N351M9941l0333q7819J3181j0622O4391j3676o4909P825m616N6233
$$ 876053 881404 931345 901012 813193 826374 815752 880143 866467 801558 809383 804767 861000
6962H61000Q0488j0642n4586j7833l269K7766R260p246N2380K4612m7671m4044
$$ 861000 941488 930846 876260 858427 855158 882924 892184 884938 937318 961930 914259 870215
6950H70215m855L730k5581J7227M7096l764j2339o2735K0970j2377m825K1648
$$ 870215 865360 869090 843509 860736 907832 904068 891729 828994 849964 837587 832762 854410
6938H54410l0375J1270L4734l3770N1240m9604k5725M6210O2679k006l6283m069
$$ 854410 824035 835305 870039 836269 887509 837905 812180 858390 921069 919063 882780 878711
6926H78711j268O9092n2450k6155J5046J6348o587Q2199K2798O2316k7040j4489
$$ 878711 877443 946535 894085 867930 882976 899324 892737 974936 997734 1060050 1033010 1018521
6914A018521Q9555J0920N6982N9578K8466P8984O058Q7945J0399r384L4388J66963
$$ 1018521 1108076 1118996 1175978 1235556 1264022 1343006 1349064 1437009 1447408 1438024 1472412 1639375
6902A639375L0435K5870O4321Q0209J10250P5551J24126J50606R3769J93370K46074
$$ 1639375 1669810 1695680 1760001 1840210 1950460 2026011 2150137 2300743 2394512 2587882 2833956
6891B833956K49386L13484M82937N01861N56674P88663R95684J400464K081330
$$ 2833956 3083342 3396826 3879763 4381624 4938298 5726961 6722645 8123109 10204439
6882A0204439K668663K123689L09137k259651k933690k260939j725088j159492
$$ 10204439 12873102 14996791 15305928 13046277 10112587 7851648 6126560 4967068
6874D967068p90297n27355m01081l73429k88641k02298j58826j11414j80365j43722
$$ 4967068 4176771 3649416 3248335 2874906 2586265 2383967 2225141 2113727 1933362 1789640
6864A789640r2028n5797n5057m8280j27131l8151k7825q9722o353p4205j33642
$$ 1789640 1697612 1641815 1586758 1538478 1411347 1373196 1345371 1255649 1249296 1175091 1041449
6853A041449p285l7668q0675k9183l304N4664j4063q6806J958j9746o639m7128
$$ 1041449 1034164 996496 915821 886638 883334 937998 923935 837129 839087 819341 812702 765574
6841G65574n460j4841j11637M0040l0170L0979j7874M1140o621l0382K7543k0500
$$ 765574 760114 745273 633636 673676 643506 674485 656611 697751 691130 660748 688291 667791
6829F67791l6412j0689N0434K0750l7196N515o0184j099m2832k2142k6167l9745
$$ 667791 631379 620690 671124 691874 654678 660193 600009 598910 556078 533936 507769 468024
6817D68024j8833R6055k374k1886J501K406k0936k0491K845M3486J095k7349K5347
$$ 468024 449191 545246 542872 520986 522487 524893 503957 483466 486311 529797 530892 503543 528890
6804E28890R846n2574k280K2034J6927M3340n4091J5256l342j75k0503m3657k3986
$$ 528890 538736 486162 483882 505916 522843 566183 512092 527348 524006 523831 503328 459671 435685
6791D35685j3961N5237M0280K7034j669l6606P78p872m293n420j2809n3653P2081
$$ 435685 421724 476961 517241 544275 542606 506000 506778 498906 494613 489193 476384 422731 494812
6778D94812n0158j6405k858K616J9878K124L9519M1011p6431o1527L0305N0703
$$ 494812 444654 428249 425391 428007 447885 450009 489528 530539 454108 392581 422886 473589
6766D73589L3625o7371m4156L8183k4835O927O5715L784L8309j3116k8342k8166
$$ 473589 507214 439843 395687 433870 409035 415962 481677 485461 523770 510654 482312 454146
6754D54146k9870J7014N671l372l7174M9191J2945K0579K375N0506J2515r8761
$$ 454146 424276 441290 446961 443589 406415 455606 468551 489130 491505 542011 554526 455765
6742D55765J4j2297j9698J600l7401L9246L7063P2410n0050j10018o32O2433O352
$$ 455765 455779 443482 423784 425384 387983 427229 464292 536702 486652 376634 376002 438435 444787
6729D44787k1542K8393K2594l1998j8755j0014J3420K6930K8030N002m00q73j8791
$$ 444787 423245 451638 474232 442234 423479 413465 426885 453815 481845 486847 486447 485574 466783
6716D66783k3569o9211N5849Q650j2074K1446M1560K0601K4600l6530J7528K3428
$$ 466783 443214 374003 429852 438502 426428 447874 489434 510035 534635 498105 515633 539061
6704E39061K989P3210p4838M64j8407q698J3044K9522j2537p087O6626J8072q109
$$ 539061 542050 615260 540422 540886 522479 513781 526825 556347 543810 536723 603349 621421 613312
6691F13312j07838J4066Q225K8245J1463m4053R269J5416L1995K809j6801K4796
$$ 613312 505474 519540 527765 556010 567473 523420 532689 548105 580100 582909 566108 590904
6679E90904l0878K8189L4587O303Q443J9819p647j3931O5715j3895j0596L7490
$$ 590904 560026 588215 622802 629105 637548 657367 649720 635789 701504 687609 677013 714503
6667G14503L7107O2978l2778J9675N6441o8168l171N6851M6986k8130O747N9888
$$ 714503 751610 814588 781810 801485 857926 789758 786587 843438 890424 862294 869041 928929
6655I28929O8255N8245p0366l6586R513K6691q4610k1410Q126n0862l3818p458
$$ 928929 997184 1055429 985063 948477 957990 984681 900071 878661 886787 835925 802107 794649
6643G94649q009l909N8077Q609p2476m5580J5583O745N0130J3212j5135m307j6962
$$ 794649 786640 782731 840808 849417 776941 731361 746944 753689 803819 817031 801896 797589 780627
6630G80627O1901j9545o194O6857L773o52p1955j0803K9687j7243N827J7443k392
$$ 780627 842528 822983 816789 883646 887419 886767 814812 804009 833696 816453 822280 839723 837331
6617H37331R131N4977J417K4621r81j2234K1478M6430j3020n3258L6703J9049
$$ 837331 846462 901439 902856 927477 926496 914262 935740 982170 969150 915892 952595 971644
6605I71644N1665K8016l7087n3776n677Q1318L0114n716P4055M7835J7944m8365
$$ 971644 1023309 1051325 1014238 960462 954785 1036103 1066217 1060501 1134556 1182391 1200335 1151970
6593A151970L1182O0899M8419M4854M6491L5569L8665L7326J8739Q6646M8333
$$ 1151970 1183152 1244051 1292470 1337324 1383815 1419384 1458049 1495375 1514114 1600760 1649093
6582A649093K763J51646J74223Q1671J00676J75063J40574o174j01965J4882j8465
$$ 1649093 1651856 1803502 1977725 2059396 2160072 2335135 2475709 2469535 2367570 2382452 2363987
6571B363987q3586M406p0444O9482N0146J4013R3809J422j1758P8166J51058J09728
$$ 2363987 2280401 2284807 2214363 2283845 2333991 2348004 2441813 2443235 2431477 2509643 2660701 2770429
6559B770429J15456J18000P5182K69029K68472K07528L08028M77364M88748O07660
$$ 2770429 2885885 3003885 3079067 3348096 3616568 3824096 4132124 4609488 5098236 5705896
6549E705896O84651O10972K91569j91789n96856o08360n34089k60419k53342j98291
$$ 5705896 6390547 7001519 7293088 7101299 6504443 5896083 5361994 5101575 4848233 4649942
6539D649942o0044j9607l143L7423Q6439R8537J91772J40055K37743K29632K64226
$$ 4649942 4589898 4570291 4567148 4604571 4691010 4789547 4981319 5121374 5359117 5588749 5852975
6528E852975L40404L99636N17071O98709Q86134J156795J341818J649094J618228
$$ 5852975 6193379 6593015 7110086 7808795 8694929 9851724 11193542 12842636 14460864
6519A4460864J034257j33020j413206j794355j520915j208750r54357o99415m07320
$$ 14460864 15495121 15362101 13948895 12154540 10633625 9424875 8470518 7771103 7363783
6510G363783k67198k53667j75971j02291P9319J49375J47180J80158K55043L53453
$$ 7363783 7096585 6842918 6666947 6564656 6643975 6793350 6940530 7120688 7375731 7729184
6500G729184M19516N86098P28451Q88069R86241J221185J490738J997416K239544
$$ 7729184 8148700 8734798 9463249 10351318 11337559 12558744 14049482 16046898 18286442
6491A8286442J745972L34928j471120k527215k500299j895931j417069j149096
$$ 18286442 20032414 20367342 18896222 16369007 13868708 11972777 10555708 9406612
6483I406612q56555n92155m76397l42325k44282j85926p2227m6508O0874M2166
$$ 9406612 8550057 7957902 7481505 7139180 6894898 6708972 6636745 6590237 6651111 6693277
6473F693277O9766J72299L39503L84752M76426O19080Q15257J060266J482420
$$ 6693277 6763043 6935342 7274845 7659597 8136023 8755103 9570360 10630626 12113046
6464A2113046J682994J524425P89165n92312j724097k009133j821816j236879
$$ 12113046 13796040 15320465 16109630 15517318 13793221 11784088 9962272 8725393
6456H725393r71889q09691o09261m97572l55107k36799k09224j97982j57357q8352
$$ 8725393 7753504 6943813 6334552 5836980 5481873 5245074 5035850 4837868 4680511 4592159
6446D592159q2367m6715N538K8821Q2097J51323J34776K70427M33148M55330N81621
$$ 4592159 4509792 4463077 4468615 4497436 4579533 4730856 4865632 5136059 5569207 6024537 6606158
6435F606158O22349L69764j10302n68345q09704p67474o17853l87522l02563k72082
$$ 6606158 7228507 7598271 7487969 6919624 6109920 5342446 4724593 4337071 4034508 3762426
6425C762426k88863j95742n6078p1713j16803p1716j20216O7466J5715J7223M2635
$$ 3762426 3473563 3277821 3221743 3150030 3033227 2961511 2841295 2908761 2924476 2941699 2984334
6414B984334P3969P4170J36062K27218L59800L80010M46652L29586k9021l09457
$$ 2984334 3058303 3132473 3268535 3495753 3855553 4235563 4682215 5011801 4982780 4673323
6404D673323m22732m34440l92680k78659k70573k10250j43405k26656j47339j46007
$$ 4673323 4250591 3816151 3423471 3144812 2874239 2663989 2520584 2293928 2146589 2000582
6394B000582q4630M1603O956q7947l1425j12186k0593K3985m3646p5722j260j8760
$$ 2000582 1915952 1957555 1964511 1876564 1845139 1732953 1712360 1736345 1692699 1616977 1615717 1596957
6382A596957r361K0754m8968o9660l9158n2006L8751j8214l2467K022n4843L6723
$$ 1596957 1587596 1608350 1559382 1489722 1450564 1398558 1437309 1419095 1386628 1388650 1333807 1370530
6370A370530N2230n2961l9846J8597J76n9606O433K2481K0032m9354P2352M1009
$$ 1370530 1422760 1369799 1329953 1348550 1348726 1289120 1295553 1318034 1338066 1288712 1361064 1402073
6358A402073j0702K7346K8480J6433L7763l1292R795J3316l6390K7896l2871K2884
$$ 1402073 1391371 1418717 1447197 1463630 1501393 1470101 1479896 1493212 1456822 1484718 1451847 1474731
6346A474731N7147K6743L3215n427K9238M479j10643k728O2720L3793P8075j4606
$$ 1474731 1531878 1558621 1591836 1586409 1615647 1620126 1509483 1506755 1569475 1603268 1681343 1666737
6334A666737L7512K6040J7602N2010Q8672J10617K7961P2139P8083n5091j4898
$$ 1666737 1704249 1730289 1747891 1799901 1888573 1999190 2027151 2099290 2177373 2122282 2107384
6323B107384l4288K3653R2643N7695P4011N2681J5195j01117J92k0721k5485p8866
$$ 2107384 2073096 2096749 2189392 2247087 2321098 2373779 2388974 2287857 2288049 2267328 2241843 2162977
6311B162977l2635O4935R3202l6408m6375r7590M400p3325P39j9975N6609M1201
$$ 2162977 2130342 2195277 2288479 2252071 2205696 2108106 2112506 2039181 2039920 2019945 2076554 2117755
6299B117755J4247M9486J2093J9334R155N104K863p1192K6975l3752N9785J2567
$$ 2117755 2132002 2181488 2193581 2212915 2222070 2227174 2230037 2158845 2185820 2152068 2211853 2224420
6287B224420Q1950Q7260J1340K5859K3709L9461l3576r0898O4492N8600k990o2161
$$ 2224420 2306370 2393630 2404970 2430829 2454538 2493999 2460423 2369525 2434017 2492617 2489627 2427466
6275B427466J4903L0424M0195R955O3956j2208R0274J9742O03p546K0757M8045
$$ 2427466 2442369 2472793 2512988 2522943 2586899 2574691 2664965 2684707 2685310 2677764 2698521 2746566
6263B746566L2823n7752M6555O9481O8943J9427L5552Q2349K3052M0785N5866
$$ 2746566 2779389 2721637 2768192 2837673 2906616 2926043 2961595 3043944 3066996 3107781 3163647
6252C163647M9787J7021K4018J07504N9122L6845j2563J8320N7595L7997P8999
$$ 3163647 3213434 3230455 3254473 3361977 3421099 3457944 3445381 3463701 3521296 3559293 3638292
6241C638292J53196J49057L2754J26054J43465P9328j499R7330N7060M8099J34329
$$ 3638292 3791488 3940545 3973299 4099353 4242818 4322146 4320647 4417977 4475037 4523136 4657465
6230D657465P6963J60901J28284J27609K01928K10177J80618J60673J68540J41772
$$ 4657465 4734428 4895329 5023613 5151222 5353150 5563327 5743945 5904618 6073158 6214930
6220F214930J64391J74194J83088J52285J71402J31743Q7836Q0864K34036J69620
$$ 6214930 6379321 6553515 6736603 6888888 7060290 7192033 7279869 7360733 7594769 7764389
6210G764389J59647K07307J88804K15827K59612K54817K94637J75824K59764K46618
$$ 7764389 7924036 8131343 8320147 8535974 8795586 9050403 9345040 9520864 9780628 10027246
6200A0027246J95844K31741K53729J63079K83198K42158L12143K69777M19087
$$ 10027246 10223090 10454831 10708560 10871639 11154837 11396995 11709138 11978915 12398002
6191A2398002K35866K01185K22332L51802L39517L91683L10844M81106M02840
$$ 12398002 12633868 12835053 13057385 13409187 13748704 14140387 14451231 14932337 15335177
6182A5335177M96690N64200P09835P12788Q17803P76139Q58687Q72867R85189
$$ 15335177 15831867 16396067 17105902 17818690 18636493 19412632 20271319 21144186 22129375
6173B2129375Q87494J039594R74829J072506R82826J110979J057855J337490J271123
$$ 22129375 23016869 24056463 25031292 26103798 27086624 28197603 29255458 30592948 31864071
6164C1864071J445561J636735J919550J996149K492864K655586L496058M050529
$$ 31864071 33309632 34946367 36865917 38862066 41354930 44010516 47506574 51557103
6156E1557103N083400N745065P277987R071784J1273500J2556577J5175303J9223255
$$ 51557103 56640503 62385568 69663555 78735339 90008839 102565416 117740719 136963974
6148A36963974K6433348L6711636N2338308N5837945L5138456j3985505n9873776
$$ 136963974 163397322 200108958 252447266 308285211 343423667 329438162 269564386
6141B69564386n9957331m6750800l1985144k2617362j6283630j2194501r542664
$$ 269564386 209607055 162856255 130871111 108253749 91970119 79775618 70232954
6134G0232954p901412o376080n303038m418777l707324l195375k864111k424090
$$ 70232954 62331542 55955462 50652424 46233647 42526323 39330948 36466837 34042747
6126C4042747k180164j902545j689671j561150j398163j185270j143846j030472
$$ 34042747 31862583 29960038 28270367 26709217 25311054 24125784 22981938 21951466
6118B1951466r90029r94791q18380p96888o79855o19673o99634p26778o90020
$$ 21951466 20961437 19966646 19148266 18351378 17671523 17051850 16352216 15625438 14935418
6109A4935418p50876o47162n94236m09939m89150m53945m98672m02812l60014
$$ 14935418 14184542 13537380 12943144 12533205 12044055 11590110 11091438 10688626 10328612
6100A0328612l50258l43904l15342l72151l21350j95260r0325j49457j51229k49203
$$ 10328612 9978354 9634450 9319108 8946957 8625607 8430347 8340022 8190565 8039336 7790133
6090G790133j72020k66115j50847j84435j12154j11057p5577j32238k4163j46778
$$ 7790133 7618113 7351998 7201151 7016716 6904562 6793505 6717928 6585690 6561527 6414749
6080F414749j24630L2626p8781j07307o7378j64549j73899q1299m4164o6811M8403
$$ 6414749 6290119 6322745 6243964 6136657 6069279 5904730 5730831 5649532 5605368 5538557 5586960
6069E586960M8775M4731l9351K864p3139j16914j79143r9482j04591l0917j08356
$$ 5586960 5635735 5680466 5641115 5643979 5570840 5453926 5274783 5175301 5070710 5039793 4931437
6058D931437p6580l8783O760j08276J0373m5676N3855k2174P0672J15993Q1889
$$ 4931437 4854857 4816074 4822834 4714558 4724931 4679255 4733110 4710936 4781608 4897601 4979490
6047D979490N4781K7305Q2995R0410L267N3551J9632O1119p526n5427n3718j09530
$$ 4979490 5034271 5061576 5144571 5234981 5238248 5291799 5311431 5372550 5365024 5309597 5255879 5146349
6035E146349k4415r6115j52730p1145l2869L0188n9667N7466J05884R388R4164
$$ 5146349 5121934 5025819 4873089 4801944 4769075 4799263 4739596 4797062 4902946 4912334 5006498
6024E006498J42297J07191R0413l9335Q160J85257K62015J47930K65970L29676
$$ 5006498 5148795 5255986 5346399 5307064 5315224 5500481 5762496 5910426 6176396 6506072
6014F506072K91112K20265J20477o0400j67239l26702l31651k86945k35129k13331
$$ 6506072 6797184 7017449 7137926 7077526 6910287 6583585 6251934 5964989 5729860 5516529
6004E516529k70231r8452J824L0386N649J35296J18557m1808j20762k31720j96592
$$ 5516529 5246298 5147846 5149670 5180056 5185705 5321001 5439558 5397750 5276988 5045268 4848676
5993D848676j42265j30476j15389q2140R342L6319j9580o2458k6808J7467j0213
$$ 4848676 4706411 4575935 4460546 4378406 4387748 4424067 4404487 4342029 4315221 4332688 4322475
5982D322475m1268J185m2598O9984M5261P2936J13790J31751L2212K388p795r190
$$ 4322475 4281207 4282392 4239794 4309778 4355039 4427975 4541765 4673516 4705728 4708116 4700321 4691131
5970D691131O6709M3684q349O6941P1444O2373J2863k1259L41Q0184P2618J10133
$$ 4691131 4757840 4801524 4793175 4860116 4931560 4993933 5006796 4985537 4985878 5066062 5138680 5248813
5958E248813J83041J45340J97564J62138J01566J23691J82471K20953J17084J71591
$$ 5248813 5431854 5577194 5774758 5936896 6038462 6162153 6344624 6565577 6682661 6854252
5948F854252J12202J24347J59578J65287J43974J93999J64742K00886J91326K47866
$$ 6854252 6966454 7090801 7250379 7415666 7559640 7753639 7918381 8119267 8310593 8558459
5938H558459J02024K64877K46055J93499L25524K55728J87667J54175J92309K89317
$$ 8558459 8660483 8925360 9171415 9364914 9690438 9946166 10133833 10288008 10480317 10769634
5928A0769634K83864K11550K55792K80356K94132M12712M30783M33366M95660
$$ 10769634 11053498 11265048 11520840 11801196 12095328 12508040 12938823 13372189 13867849
5919A3867849N17166M73993O04834P09675P29587R40459J057237J101141J235433
$$ 13867849 14385015 14859008 15463842 16173517 16903104 17843563 18900800 20001941 21237374
5910B1237374J445024J754269K303622K997621L616305L654355K673266O49988
$$ 21237374 22682398 24436667 26740289 29737910 33354215 37008570 39681836 40331824
5902D0331824j478625k455964k248114j523035q74194m40104k5590N16437J089420
$$ 40331824 38853199 36397235 34149121 32626086 31751892 31311788 31286198 31802635 32892055
5893C2892055J522547J643963J557338J603618K162209K405193K222822J807898
$$ 32892055 34414602 36058565 37615903 39219521 41381730 43786923 46009745 47817643
5885D7817643J708379J657304P20386p97490k044378k265490j563599o44788k16443
$$ 47817643 49526022 51183326 51903712 51106222 49061844 46796354 45232755 44587967 44371524
5876D4371524l59159j120324j382723r39059n46806n11839o53300m25456J36797
$$ 44371524 44012365 42892041 41509318 40570259 40023453 39511614 38858314 38432858 38569655
5867C8569655P24366J439525K249083L014391L635230L311214J374837j504732
$$ 38569655 39294021 40733546 42982629 45997020 49632250 52943464 54318301 52813569
5859E2813569l447602l476237k524295j315019r5282Q85285J294999R88664J40236
$$ 52813569 49365967 45889730 43365435 42050416 41955134 42840419 44135418 45124082 45264318
5850D5264318j084543j929685k101225j988624j545133r90212m82900n7603K23091
$$ 45264318 44179775 42250090 40148865 38160241 36615108 35624896 35141996 35084393 35307484
5841C5307484M73135P87377J176102J789596K262987K770647L142523L224826
$$ 35307484 35780619 36567996 37744098 39533694 41796681 44567328 47709851 50934677
5833E0934677K804438J465402k99750j529814k204849k216511j868706j763871
$$ 50934677 53739115 55204517 54904767 53374953 51170104 48953593 47084887 45321016
5825D5321016k193780k716164k803390k390588j667141r45027l30306J68376N64633
$$ 45321016 43127236 40411072 37607682 35217094 33549953 32604926 32274620 32442996 33007629
5816C3007629P09386R40350J211164J674187K252755K577480J979257L19732j705161
$$ 33007629 33717015 34657365 35868529 37542716 39795471 42372951 44352208 44671940 42966779
5807D2966779l253010l756505l617815l314447k975705k583864k248890j708560
$$ 42966779 39713769 35957264 32339449 29025002 26049297 23465433 21216543 19507983
5799A9507983j400677j128537r40024r26478q60864p80924n99638n32026n71262
$$ 19507983 18107306 16978769 16038745 15112267 14251403 13470479 12870841 12338815 11767553
5790A1767553m32099l41485l01403j55427k73165l08955l23090k69634j79209
$$ 11767553 11335454 10993969 10692566 10537139 10263974 9955019 9631929 9362295 9183086
5781I183086j89749j05247r5995q7071r4259p0130j01495j24455r4413j13884
$$ 9183086 8993337 8888090 8792095 8705024 8610765 8540635 8439140 8314685 8220272 8106388
5771H106388j86565j70843j87543j45481q0218k20049k20316j63128k53860j59160
$$ 8106388 7919823 7748980 7561437 7415956 7335738 7115689 6895373 6732245 6478385 6319225
5761F319225j98891j03083j00189q2087o155j04615j13241o8977p2653p1439p5840
$$ 6319225 6120334 6017251 5917062 5834975 5828820 5724205 5610964 5541987 5469334 5397895 5322055
5750E322055p6950j18191j1294L3406m7375j1808k8850o1864o8437k3528o8457
$$ 5322055 5245105 5126914 5115620 5149026 5101651 5089843 5060993 4999129 4930692 4907164 4838707
5739D838707j20384p3047K5422o4711l2602l45n3660M3792n592N4261K5309N9845
$$ 4838707 4718323 4645276 4670698 4605987 4573385 4573040 4519380 4563172 4557580 4611841 4637150 4696995
5727D696995Q0589J69m529p2302l1884K7303O2141m364N5699J16302P6761J37193
$$ 4696995 4777584 4777753 4773224 4700922 4669038 4696341 4758482 4754118 4809817 4926119 5002880 5140073
5715E140073R7390o8696k6730n7766r173l8397N6305N6501N0545K2254J07165
$$ 5140073 5237463 5168767 5142037 5084271 5075098 5036701 5093006 5149507 5200052 5222306 5329471
5704E329471O4261P9036K0619L1053J00801m319j0270M523O6698K3907R4491J00638
$$ 5329471 5393732 5472768 5493387 5524440 5625241 5620922 5610652 5615175 5681873 5705780 5800271 5900909
5692E900909J98767J11022J23648K14200J78630J39285J11034l4890m5151L8017
$$ 5900909 6099676 6210698 6334346 6548546 6727176 6866461 6977495 6942605 6897454 6935471
5682F935471l7858J5590L856Q4675M3797N6213J33893P2940O8115J05226Q5389
$$ 6935471 6897613 6913203 6917059 7001734 7045531 7101744 7235637 7308577 7376692 7481918 7567307
5671G567307L5606O2496J00899J12269J61364J59154K22081J31335J55190K24287
$$ 7567307 7602913 7665409 7766308 7878577 8039941 8199095 8421176 8552511 8707701 8931988
5661H931988L62956L42512K90855K49271J69361J01658J01833O5380J980K3171
$$ 8931988 9294944 9637456 9928311 10177582 10346943 10448601 10550434 10615814 10617794 10640965
5651A0640965L2996R6946J16869J58778K67415K81971L08776K51155L36357L96376
$$ 10640965 10673961 10770907 10887776 11046554 11313969 11595940 11904716 12155871 12492228 12888604
5641A2888604M67837M66699N34744N20584M28873M69282M90157N05437O46903
$$ 12888604 13356441 13823140 14357884 14878468 15307341 15776623 16266780 16772217 17419120
5632A7419120P61772Q28280Q94729R59121J186471J365974J635626J906514K264513
$$ 17419120 18180892 19009172 19903901 20863022 22049493 23415467 25051093 26957607 29222120
5623B9222120K706926L186212L425457L121242K038160O02969j039082j978710
$$ 29222120 31929046 35115258 38540715 41661957 43700117 44303086 43264004 41285294
5615D1285294k104892j890095j440106j073648q04674m50261r4172K98988P69928
$$ 41285294 39180402 37290307 35850201 34776553 33971879 33521618 33427446 33726434 34496362
5606C4496362J324631J780005K226058K260604K049830J799724J782181J852895
$$ 34496362 35820993 37600998 39827056 42087660 44137490 45937214 47719395 49572290
5598D9572290J668793J047940j84064j539216k728953l347460l252837k747355
$$ 49572290 51241083 52289023 52104959 50565743 47836790 44489330 41236493 38489138
5590C8489138k057953j497976j015364m84775j68003k0183Q7680J70837N35310
$$ 38489138 36431185 34933209 33917845 33433070 33265067 33244884 33332564 33503401 34038711
5581C4038711J012385J343646J466872J246137O83359k37027j284817j781150
$$ 34038711 35051096 36394742 37861614 39107751 39791110 39554083 38269266 36488116
5573C6488116j999657j868903j482949j173909q47081n47378k90514j20999k6622
$$ 36488116 34488459 32619556 31136607 29962698 29115617 28568239 28277725 28156726 28130104
5564B8130104M2154k62J02265K52691M54886P13518Q80929J087538J309135J548231
$$ 28130104 28172258 28171996 28274261 28526952 28981838 29695356 30576285 31663823 32972958 34521189
5554C4521189J874099K340772K833864L386536L855491L900338L284742K208570
$$ 34521189 36395288 38736060 41569924 44956460 48811951 52712289 55997031 58205601
5546E8205601Q30937l19562j353172j885400j438056o61825K63736J098169J976902
$$ 58205601 59036538 58716976 57363804 55478404 54040348 53378523 53642259 54740428 56717330
5537E6717330K753864L486635M415536M976755M776939L770445K331133J764727
$$ 56717330 59471194 62957829 67373365 72350120 77127059 80897504 83228637 84993364
5529H4993364K454252L766020N137057O252698O238656M538087J636763j213580
$$ 84993364 87447616 91213636 96350693 102603391 108842047 113380134 115016897 113803317
5521A13803317k567204k738760k512095k603140l136203l643904l237973k314103
$$ 113803317 111236113 108497353 105985258 103382118 100245915 96602011 93364038 91049935
5513I1049935j532467j040168j089147j645403k159222k263530j715004r17762
$$ 91049935 89517468 88477300 87388153 85742750 83583528 81319998 79604994 78687232
5505G8687232k03090O95813J890701L339823M708216N332439M471813K030497
$$ 78687232 78484142 79179955 81070656 84410479 89118695 94451134 98922947 100953444
5497A00953444j125997l428463l823919k532727p55179L65645l50964k670406
$$ 100953444 99827447 96398984 92575065 90042338 89287159 89652804 89301840 86631434
5489H6631434n704732p892297q300260p414279o136115m902412l868148l222277
$$ 86631434 80926702 73034405 64734145 57319866 51183751 46281339 42413191 39190914
5481C9190914k600931k058711j736151j435411j209695j025860p84167n60066
$$ 39190914 36589983 34531272 32795121 31359710 30150015 29124155 28339988 27779922
5473B7779922m31610k63283j95847j8424J48374K27338N31283R46315J281309
$$ 27779922 27348312 27085029 26889182 26870758 27019132 27246470 27777753 28724068 30005377
5464C0005377J505262J404071M89850p80596j856346k327009k170633j779436
$$ 30005377 31510639 32914710 33404560 32623964 30767618 28440609 26269976 24490540
5456B4490540j374369j220929j115691r59400r24013p53564n25444l80376l42449
$$ 24490540 23116171 21895242 20779551 19820151 18896138 18142574 17617130 17236754 16894305
5447A6894305k41875k62791j76868j25133k24794k62986k31851j98465j46633
$$ 16894305 16652430 16389639 16212771 16087638 15862844 15599858 15368007 15169542 15022909
5438A5022909j56165m2368K6712P8491P2299P8797J57176K56541K32981L38491
$$ 15022909 14866744 14824376 14851088 14929579 15001878 15080675 15237851 15494392 15727373 16065864
5428A6065864K00178R6384j2971j70495j86735l20898k51839j69940k11782r8574
$$ 16065864 16266042 16362426 16349455 16178960 15992225 15671327 15419488 15249548 15037766 14939192
5418A4939192j09774j33973k21361j78340m8309P2935J95209K16458L32144L92826
$$ 14939192 14829418 14695445 14474084 14295744 14247435 14320370 14515579 14732037 15064181 15457007
5408A5457007L61380L07835K90844K75829K34236J52930P75Q7938Q9548J93202
$$ 15457007 15818387 16126222 16417066 16692895 16927131 17080061 17080836 17168774 17258322 17451524
5398A7451524P4768m2385j32305k29371k59579k08192j44390r3218M5433J07215
$$ 17451524 17526292 17483907 17351602 17122231 16862652 16654460 16510070 16416852 16462285 16569500
5388A6569500K09080L07399M42486M48498M27771M44032M03548M13305O69888
$$ 16569500 16778580 17085979 17528465 17976963 18404734 18848766 19252314 19665619 20335507
5379B0335507Q31172Q16951Q60861J064120J264662J459132J651451J944357K266870
$$ 20335507 21166679 21983630 22844491 23908611 25173273 26632405 28283856 30228213 32495083
5370C2495083L007170L766131M867369O029548O699337O120620L771112O1380
$$ 32495083 35502253 39268384 44135753 50165301 56864638 62985258 66756370 66817750
5362F6817750l248435n797397o374947n477954m177229k944662j872659j105888
$$ 66817750 63569315 57771918 51396971 45919017 41741788 38797126 36924467 35818579
5354C5818579l58501L46948R36788J608394K299788K737341K859564K812521L206566
$$ 35818579 35460078 35807026 36743814 38352208 40651996 43389337 46248901 49061422 52267988
5345E2267988L526420L058885J784677J339065K619628L950226M004901J703474
$$ 52267988 55794408 58853293 60637970 61977035 64596663 68546889 72551790 74255264
5337G4255264k120074n328667o530810o472186n976310n456902m433125l400342
$$ 74255264 72135190 66806523 60275713 53803527 47827217 42370315 37937190 34536848
5329C4536848k539855j862681j274314q97089m27710n4193L02794P36665J219567
$$ 34536848 31996993 30134312 28859998 27962909 27535199 27481006 27783800 28520465 29740032
5320B9740032J669698K435590K860812K242230R67944m17865j363272k284741
$$ 29740032 31409730 33845320 36706132 38948362 39916306 39498441 38135169 35850428
5312C5850428l449908m087956l738980l041665k365347j812217j473967j134848
$$ 35850428 32400520 28312564 24573584 21531919 19166572 17354355 15880388 14745540
5304A4745540r08259q59765o66060n92963n10284m05163l38213l63972l05749
$$ 14745540 13837281 12977516 12311456 11718493 11208209 10803046 10464833 10100861 9795112
5295I795112l72734l50912k63030l43023l28192k21829k45273j99853j65648k27555
$$ 9795112 9422378 9071466 8808436 8465413 8137221 7915392 7670119 7470266 7304618 7077063
5285G077063j73905o7336j69269q7453j11271j29915k8078l6274j15807j71345
$$ 7077063 6903158 6835822 6666553 6579100 6467829 6337914 6309836 6273562 6157755 5986410
5275E986410j59194j04134n4744j09671r5459j23862j04165r1261l7173j25510
$$ 5986410 5827216 5723082 5668338 5558667 5463208 5339346 5235181 5143920 5106747 4981237
5265D981237p6396j0998j3356K5086p3123j03699m2283k5796J2939n0508J639
$$ 4981237 4904841 4893843 4880487 4905573 4832450 4728751 4686468 4660672 4673611 4623103 4624742
5254D624742M1244n830L21q0828r7829l0780m1411j16467j03562k1131j3387p3168
$$ 4624742 4665986 4660156 4660477 4579649 4481820 4451040 4409629 4293162 4189600 4168469 4155082 4081914
5242D081914m5233J3065j0493j2842l3138l8078l540j2749r353K3352k6352K9612
$$ 4081914 4036681 4049746 4039253 4026411 3993273 3955195 3951655 3938906 3929553 3952905 3926553 3956165
5230C956165O5877J30m5313L3732K2743l3424m4365O0744j2342N276p9842J6632
$$ 3956165 4022042 4022172 3976859 4010591 4033334 3999910 3955545 4016289 4003947 4009223 3929381 3946013
5218C946013L2950M6022N4440L2333N576O3457n0743m7347j0846L8811P5865L1936
$$ 3946013 3978963 4024985 4079425 4111758 4117334 4180791 4130048 4082701 4071855 4110666 4186531 4218467
5206D218467L2796O4878l0844k013J2250m5621o0588l4294j9798p4043o2670M037
$$ 4218467 4251263 4316141 4285297 4283284 4295534 4249913 4189325 4155031 4135233 4061190 3998520 4002557
5194D002557O606n2966Q486k9395P1338Q2905O286n6850P6780l6005m5162r1869
$$ 4002557 4009163 3956197 3964683 3935288 4006626 4089531 4095817 4038967 4115747 4079742 4034580 3942711
5182C942711o1993K3195p4776j2436m1083J6810l7762q9855L1364L8830n5388
$$ 3942711 3880718 3903913 3829137 3816701 3775618 3792428 3754666 3664811 3696175 3735005 3679617
5171C679617R215Q5117N640j3809n4415O3764Q19n479j953k3197n0216k0060M3800
$$ 3679617 3688832 3773949 3779589 3765780 3711365 3775129 3775948 3770469 3768516 3745319 3695103 3675043 3718843
5158C718843k4024n4267N0471j03364o0170M1904O0395p7373j0679M4284N0905
$$ 3718843 3694819 3640552 3691023 3587659 3527489 3569393 3629788 3552415 3541736 3586020 3636925
5147C636925N0054l992J9555M4276m08M3925J5887j4669j6420p929L4445O9815
$$ 3636925 3686979 3682987 3702542 3746818 3746410 3790335 3806222 3791553 3775133 3767204 3801649 3871464
5135C871464K6873P194L6647P2811J6763o802J8625l3152N6588j0071m603O870
$$ 3871464 3898337 3905531 3942178 4014989 4031752 4024950 4043575 4010423 4067011 4056940 4052337 4059207
5123D059207J00593M3662k0297J9554O1964K9909L27R9756M5327J0074p309N4210
$$ 4059207 4159800 4203462 4183165 4202719 4264683 4294592 4294919 4394675 4440002 4450076 4442767 4496977
5111D496977O3245L1382L569Q5959P7328J00589P1783N8920O8623L6237j1548
$$ 4496977 4560222 4591604 4595173 4681132 4758460 4859049 4930832 4989752 5058375 5094612 5083064
5100E083064Q7902L0640K3070Q1856N5204L7885J39379Q8804K8813P2648O1287
$$ 5083064 5170966 5201606 5224676 5306532 5361736 5399621 5539000 5627804 5656617 5729265 5790552
5089E790552L2850l405N8942Q8083J06742R0402J30529k679J12884J8229O6870
$$ 5790552 5823402 5819997 5878939 5967022 6073764 6164166 6294695 6292016 6404900 6423129 6489999
5078F489999Q0616P3597N6412J26415J89941K04240K13434J51533J18201J31525
$$ 6489999 6570615 6644212 6700624 6827039 7016980 7221220 7434654 7586187 7704388 7835913
5068G835913J06827M8380J21077P6264J51505K08281J09691J78012J19904M5504
$$ 7835913 7942740 7991120 8112197 8188461 8339966 8548247 8657938 8835950 8955854 9001358
5058I001358R4234J96890J94664J12798J63466K27303K62682L51753L22863L66891
$$ 9001358 9095592 9292482 9487146 9599944 9763410 9990713 10253395 10605148 10928011 11294902
5048A1294902M53748N45852O48721P79088R00491J167299J391168J728284K087390
$$ 11294902 11748650 12294502 12943223 13722311 14622802 15790101 17181269 18909553 20996943
5039B0996943K233374J925718Q00298m61518j542500j960464j724775j398616
$$ 20996943 23230317 25156035 25956333 25494815 23952315 21991851 20267076 18868460
5031A8868460r95583p22223n67788l49465j61975j20711m7402M0400J93371K81280
$$ 18868460 17872877 17150654 16582866 16233401 16071426 15950715 15903313 15943713 16137084 16418364
5021A6418364L59837M06889N37153P13974R61661J163803J358854J666260K271607
$$ 16418364 16778201 17185090 17722243 18436217 19397878 20561681 21920535 23586795 25858402
5012B5858402L032085L936932M201435L001362J64272k599227l453477l492972
$$ 25858402 28890487 32827419 37028854 40030216 40194488 37595261 34141784 30648812
5004C0648812l006577k396629j823321j419357j111088p97131o13154n24642l86627
$$ 30648812 27642235 25245606 23422285 22002928 20891840 20094709 19481555 18956913 18570286
4995A8570286k60213k01218j74848l6147L4320K02329K69971K50800L98729N63180
$$ 18570286 18310073 18108855 17934007 17897860 17932180 18134509 18404480 18655280 19054009 19617189
4985A9617189P73136R65310J196584J459667J494142J137286L87678o58474j385055
$$ 19617189 20390325 21355635 22552219 24011886 25506028 26643314 27030992 26372518 24987463
4976B4987463j614416j493079j212298q55049o58018n12157m01655k92908k07484
$$ 24987463 23373047 21879968 20667670 19812621 19154603 18642446 18240791 17947883 17740399
4967A7740399k23134l3672l0062p5968k7688j2589N360m095M3226P9798M5637
$$ 17740399 17517265 17483593 17453531 17377563 17349875 17337286 17342646 17338551 17381777 17461575 17507212
4956A7507212N4128Q5862O5818R7035J22332Q3848J21277J9825Q7334J29437J24761
$$ 17507212 17561340 17647202 17713020 17810055 17932387 18016235 18137512 18157337 18244671 18374108 18498869
4945A8498869J07934O1530Q0655J79304Q5821Q5517J38783J08216Q4045Q9017
$$ 18498869 18606803 18668333 18748988 18928292 19014113 19099630 19238413 19346629 19430674 19519691
4935A9519691Q3773R0681J21928J47343J06750Q1255J16642R9059J19587Q8571
$$ 19519691 19603464 19694145 19816073 19963416 20070166 20151421 20268063 20367122 20486709 20575280
4925B0575280N2769L5231K01911J18392L9181K4721N1245Q9765N7205L9086Q4168
$$ 20575280 20628049 20663280 20865191 20983583 21022764 21047485 21098730 21188495 21245700 21284786 21368954
4914B1368954J59657M8802P7499M2137M558K5468J0235o920J6423L3848m7736
$$ 21368954 21528611 21577413 21654912 21697049 21701607 21727075 21737310 21730390 21746813 21780661 21732925
4903B1732925L7761j2651K3610O8734K959q7585n367j8751n8152M24m4451k3052
$$ 21732925 21770686 21758035 21781645 21850379 21853338 21765753 21760386 21741635 21683483 21683907 21639456 21616404
4891B1616404n8797q5729k9974p0156l8085n7246r0925m8354q8813j35058j43753
$$ 21616404 21557607 21471878 21441904 21371748 21333663 21276417 21185492 21137138 21048325 20913267 20769514
4880B0769514r0120q0863q2173j23305j51909j90691n3168k9999j19192j10955
$$ 20769514 20679394 20598531 20516358 20393053 20241144 20050453 19997285 19967286 19848094 19737139
4870A9737139j08731j64575j33433j03110q9754j80748j80681o2403j26218r7317
$$ 19737139 19628408 19463833 19330400 19227290 19137536 18956788 18776107 18713704 18587486 18490169
4860A8490169j60947j02967k22098k41455q2667j54110j35747j69487j62234j52054
$$ 18490169 18329222 18226255 18004157 17762702 17680035 17525925 17390178 17220691 17058457 16906403
4850A6906403j28944j95929k09514j14181j48638j36509j84878j54850j27375
$$ 16906403 16777459 16581530 16372016 16257835 16109197 15972688 15787810 15632960 15505585
4841A5505585j95495j35335j56317r8885j06618k62302j67848q3486j70316j32264
$$ 15505585 15310090 15174755 15018438 14919553 14812935 14550633 14382785 14299299 14128983 13996719
4831A3996719j88062j59865j33788j56309q2371p6023k11303j18730j07526p1551
$$ 13996719 13808657 13648792 13515004 13358695 13276324 13200301 12988998 12870268 12762742 12691191
4821A2691191j49175j32981j15560j28537q9658j50190j48001j61304j40955p0069
$$ 12691191 12542016 12409035 12293475 12164938 12075280 11925090 11777089 11615785 11474830 11404761
4811A1404761n5560j59616j15392j25663n8967r2023o4759j27342j06099j14148
$$ 11404761 11349201 11189585 11074193 10948530 10889563 10797540 10732781 10605439 10499340 10385192
4801A0385192l3851j03648n0615k7118j08802n3244j40767j62525j48617j29936
$$ 10385192 10351341 10247693 10197078 10169960 10061158 10007914 9867147 9704622 9556005 9426069
4791I426069j00441r2252l6884j35892j30660j17126j41599p6001j29132p5396
$$ 9426069 9325628 9233376 9196492 9060600 8929940 8812814 8671215 8595214 8466082 8390686
4781H390686j67252o2483k8055n2194j54265r6313l4644q5683o0662n7406m8726
$$ 8390686 8223434 8160951 8132896 8080702 7926437 7830124 7795480 7709797 7649135 7591729 7543003
4770G543003n8182o1482j16338l3053q9116o6201o2893p5848k9837r802k4278
$$ 7543003 7484821 7423339 7307001 7273948 7184832 7118631 7055738 6979890 6950053 6940251 6915973
4759F915973j46939o3242n8200o7801n6813r0017l677l9175j5116o1955m5654
$$ 6915973 6769034 6705792 6647592 6579791 6522978 6432961 6429284 6390109 6374993 6313038 6267384
4748F267384m6746l0487J1526p799r3642K3649K5739K1721K3643l5651q8608R288
$$ 6267384 6220638 6190151 6201677 6193878 6100236 6123885 6149624 6171345 6194988 6159337 6070729 6080017
4736F080017N0942M3048R2980J08357J58331J72178J41234m8635j74786k83848
$$ 6080017 6130959 6174007 6266987 6375344 6533675 6705853 6847087 6798452 6623666 6339818
4726F339818k95002k94880k69267j30157j25346j02642n9994j6527r6654m7711
$$ 6339818 6044816 5749936 5480669 5350512 5225166 5122524 5062530 5046003 4949349 4901638
4716D901638r7719k1097n428q1211m3790L6085R328m6962O505j6454J691j01967
$$ 4901638 4803919 4782822 4777394 4696183 4652393 4688478 4697806 4650844 4657349 4640895 4642586 4540619
4704D540619p8505j26065q604n0967k1316l7311o0548l5496j4619m4027o1090
$$ 4540619 4462114 4336049 4327445 4276478 4255162 4217851 4157303 4121807 4107188 4063161 4002071
4693D002071l8747m0123r3016l9763L6751j2359j05447q204j9974m4215n047l6762
$$ 4002071 3963324 3923201 3830185 3790422 3827173 3814814 3709367 3701163 3681189 3636974 3631927 3595165
4681C595165j0257m270M0374k6919l6692j2963j3356J290j4380L2887J4152J5569
$$ 3595165 3584908 3580638 3621012 3594093 3557401 3544438 3531082 3532372 3517992 3550879 3565031 3580600
4669C580600j7282N7457L9853Q0029M5752N7250O2775J26133K07333J96173J41045
$$ 3580600 3563318 3620775 3660628 3740657 3786409 3843659 3906434 4032567 4239900 4436073 4577118
4658D577118P3309j05456k03136k57230k15509k05691j96593j41927q4545j3468
$$ 4577118 4650427 4544971 4341835 4084605 3869096 3663405 3466812 3324885 3240340 3226872
4648C226872k2531o5018m5459L907j7349J2316n3766j00589o0622m9376J1852
$$ 3226872 3204341 3139323 3093864 3097771 3080422 3092738 3038972 2938383 2877761 2828385 2840237
4637B840237K4087n0849j2613m5939j23055J5173N917j28117L4458N5969J960
$$ 2840237 2864324 2813475 2800862 2754923 2631868 2647041 2652958 2524841 2559299 2615268 2617228
4626B617228p6436J7859k0134k4654j08925l8918J7478j2828k7504J5701k3876
$$ 2617228 2540792 2558651 2538517 2513863 2404938 2366020 2383498 2370670 2343166 2358867 2334991
4615B334991p108Q989k6981k6376j9614q03j3787l8147K2681J9078k2143M1951
$$ 2334991 2327883 2336872 2309891 2283515 2263901 2263098 2249311 2211164 2233845 2252923 2230780 2272731
4603B272731p6767p1373J02672m51n1253K0566p664m0981j2259J8907O003j7482
$$ 2272731 2195964 2124591 2227263 2226812 2175559 2196125 2188461 2147480 2135221 2154128 2160131 2142649
4591B142649n5592m7977N1992o4495L5900Q487k051m6451k6993J5154l5208J7941
$$ 2142649 2087057 2039080 2091072 2026577 2062477 2070964 2068913 2022462 1995469 2010623 1975415 1993356
4579A993356k3034N1056j08301j4620M3654m9546l872M1266k5472N2738m5340
$$ 1993356 1970322 2021378 1913077 1898457 1942111 1892565 1888693 1929959 1904487 1957225 1911885
4568A911885j9127M3010l7436j411M2174k4742o6737l4232L4021N6746l336p1477
$$ 1911885 1892758 1935768 1898332 1896921 1939095 1914353 1847616 1813384 1847405 1904151 1900815 1829338
4556A829338o322O081m162L1268j4867J7082j1898j7107l9632K0529L6817J9232
$$ 1829338 1823016 1829097 1824935 1856203 1841336 1858418 1846520 1829413 1789781 1810310 1847127 1866359
4544A866359l2544k4951K8915K4530k3996l6325m309j7831k7336O6865M5079n8454
$$ 1866359 1833815 1808864 1837779 1862309 1838313 1801988 1797679 1779848 1752512 1819377 1864456 1806002
4532A806002j5061l660J9207J2122j7680N6577m0566K0941K3570k5349k7778J2532
$$ 1806002 1790941 1787281 1806488 1818610 1800930 1857507 1816941 1837882 1861452 1836103 1808325 1820857
4520A820857l511L2901J2155j5883O7374P2728Q6148O8592K2895k5197K4159k7142
$$ 1820857 1817346 1850247 1862402 1846519 1913893 1986621 2072769 2141361 2164256 2139059 2163218 2136076
4508B136076l6097n4465j3815l0447m0274M640M6565m7906K6306k1033j7174L3655
$$ 2136076 2099979 2045514 2031699 2001252 1960978 1965618 2012183 1964277 1990583 1969550 1952376 1986031
4496A986031p1419j2712J3506Q8510N1122M322N9543j858M6058K405O4994M0707
$$ 1986031 1914612 1901900 1915406 2003916 2055038 2059360 2118903 2117045 2163103 2165508 2230502 2271209
4484B271209N6183J08465R8394Q6775L1579N8968m4187M1214Q2789J77222K14788
$$ 2271209 2327392 2435857 2534251 2621026 2652605 2711573 2667386 2708600 2791389 2968611 3183399
4473C183399J03110O2311m722m667r6338j49415r3682j11910j25781j51538r2609
$$ 3183399 3286509 3348820 3344098 3339431 3243093 3093678 2999996 2888086 2762305 2610767 2518158
4462B518158n4933j3393L957n4328m4429O936O7625N8796N3615P2042P7604J0027
$$ 2518158 2463225 2449832 2453789 2399461 2355032 2361968 2429593 2488389 2542004 2614046 2691650 2701677
4450B701677n185K3533q1382l5584J1216j26153m7303k4461l0313M0493l782N3341
$$ 2701677 2696492 2720025 2638643 2603059 2614275 2488122 2440819 2416358 2386045 2426538 2422756 2476097
4438B476097M5775o350K8631k6946J3826q6090l3208K0891j5269q0142n7858J3485
$$ 2476097 2521872 2515522 2544153 2517207 2531033 2444943 2411735 2432626 2417357 2337215 2279357 2292842
4426B292842J4867M4193K8784Q8030J09333R8920N9758L0591n0448r4886n4759
$$ 2292842 2307709 2351902 2380686 2468716 2578049 2676969 2736727 2767318 2716870 2621984 2567225
4415B567225j8455j7376K9966O9812L1044J36798J02641R4223R1224k5020N566
$$ 2567225 2548770 2531394 2561360 2631172 2662216 2799014 2901655 2995878 3087102 3062082 3067648
4404C067648P8652J12371L9015l6734j10274j35766j33954o8903r3441o8979k4034
$$ 3067648 3146300 3258671 3297686 3260952 3150678 3014912 2880958 2812055 2718614 2649635 2625601
4393B625601o1300L0480m1588K217P602l3422K2586L8010K8147K4338N8281P4263
$$ 2625601 2564301 2594781 2553193 2555410 2563012 2529590 2552176 2590186 2618333 2642671 2700952 2775215
4381B775215P3217L8755O4185R5707J14906O8857J08845L6204r013M4530J11233
$$ 2775215 2848432 2887187 2951372 3047079 3161985 3230842 3339687 3375891 3366878 3411408 3522641
4370C522641J5015J33690J21835J31865J48862J62123J94728K89800M02702L81378
$$ 3522641 3537656 3671346 3793181 3925046 4073908 4236031 4430759 4720559 5123261 5504639
4360E504639N83055O96423N28964L20435K7005j45948q2162J89270K04571j60230
$$ 5504639 6087694 6784117 7313081 7633516 7660521 7514573 7432411 7621681 7826252 7666022
4350G666022m28175n57222m57466l12768j55541j4997P7070P7617Q1079l7056
$$ 7666022 7237847 6680625 6223159 5910391 5754850 5739853 5816923 5894540 5975619 5938563
4340E938563r5196N6755K03274J21908o2621k24914m71858n02033k99596j75901
$$ 5938563 5843367 5900122 6103396 6225304 6162683 5937769 5465911 4963878 4664282 4488381
4330D488381k01149n3778p5116P8036J01857J07801k5336j94124k00652k20049
$$ 4488381 4287232 4233454 4158338 4236374 4338231 4446032 4420696 4226572 4025920 3805871
4320C805871k03164j61844n8036k4892q1030j03768n2846P018j7672p5557L0850
$$ 3805871 3602707 3440863 3382827 3357935 3276905 3173137 3120291 3127309 3109637 3034080 3064930
4309C064930K2978J232j1670j0076J1687O6864j0819L3978R1337P5815R5022J34835
$$ 3064930 3087908 3089140 3077470 3067394 3079081 3145945 3135126 3169104 3260441 3336256 3431278 3566113
4297C566113J21506R9415J24751K29976K03145K98359K24039L20129N15355M97105
$$ 3566113 3687619 3787034 3911785 4141761 4344906 4643265 4867304 5187433 5702788 6199893
4287F199893K17358J5990k36481l51292l84369k45022j42610j19933p208q7318
$$ 6199893 6417251 6433241 6196760 5845468 5461099 5216077 5073467 4953534 4946326 4859008
4277D859008r6870j21230j06300j15899j31219k06812j22718r0154m3517J1600
$$ 4859008 4762138 4640908 4534608 4418709 4287490 4080678 3957960 3867806 3824289 3835889
4267C835889p5176Q0142P6983j7658k9782P888K7945K3236P6901J08779J74459
$$ 3835889 3760713 3840855 3917838 3900180 3870398 3878286 3906231 3929467 4006368 4115147 4289606
4256D289606J04214J39374J84031K54499L02626L54183M91652N57972M72712K61583
$$ 4289606 4393820 4533194 4717225 4971724 5274350 5628533 6120185 6678157 7150869 7412452
4246G412452m6066j39428j81033j05096N1889J60578L14039J88908r4337l04757
$$ 7412452 7366386 7226958 7045925 6940829 6992718 7153296 7467335 7656243 7561906 7257149
4236G257149l41344l66914k68974j53190j21948j7864L8057J29529K26881K67011
$$ 7257149 6915805 6548891 6279917 6126727 6004779 5986915 6024972 6154501 6381382 6648393
4226F648393L33865J44112j85604l27386k08029k25728k17587j03608j55542o9175
$$ 6648393 6982258 7126370 6940766 6613380 6405351 6179623 5962036 5858428 5702886 5633711
4216E633711n4731j47322p0370K7286K3240K6587R2265K7113N4742L1486K984
$$ 5633711 5578980 5431658 5361288 5388574 5411814 5438401 5530666 5557779 5612521 5644007 5646991
4205E646991Q1928R6362L3595k52Q1582J83124J42421J88139J82946K11279L34797
$$ 5646991 5728919 5825281 5858876 5858624 5940206 6123330 6265751 6453890 6636836 6848115 7182912
4194G182912L22332M33317N12825N56534P45302Q93499R97989R87752M84899k42836
$$ 7182912 7505244 7938561 8451386 9007920 9753222 10646721 11644710 12632462 13117361 12874525
4184A2874525q34454r35122p92612m67757l79019k91675j11794q4792j31807N829
$$ 12874525 12040071 11104949 10312337 9844580 9465561 9173886 9062092 8977300 8845493 8851322
4174H851322k444L9428O3551J10086J42609J45860J24160P8039J75840J37090
$$ 8851322 8848878 8888306 8951857 9061943 9204552 9350412 9474572 9552611 9728451 9865541
4164I865541J53545K63296J56064J19175J38746K18355L29279K03713J82020K41608
$$ 9865541 10019086 10282382 10438446 10557621 10696367 10914722 11244001 11447714 11629734 11871342
4154A1871342K03145K77493L36404L79172M97550N14892O08621O22998O37638
$$ 11871342 12074487 12351980 12688384 13067556 13565106 14079998 14688619 15311617 15949255
4145A5949255O57154O56058O75698O40955O09184O85391P20747P39807Q06548
$$ 15949255 16606409 17262467 17938165 18579120 19188304 19873695 20594442 21334249 22140797
4136B2140797Q16001R14254J018048J192271J385279J529870J784691K051740
$$ 22140797 22956798 23871052 24889100 26081371 27466650 28996520 30781211 32832951
4128C2832951K359166K726155L200998M001075M946456O135619P220932Q634214
$$ 32832951 35192117 37918272 41119270 45120345 50066801 56202420 63423352 72057566
4120G2057566J0221939J2722338J6316326K0867481K4085424K2053105J1434612
$$ 72057566 82279505 95001843 111318169 132185650 156271074 178324179 189758791
4113A89758791n229835j9766601k6990119k5132602j9879156j4754838j0940596
$$ 189758791 184528956 164762355 137772236 112639634 92760478 78005640 67065044
4106F7065044q161315o238240n017020m240328l466672k917124k445075k062491
$$ 67065044 58903729 52665489 47648469 43408141 39941469 37024345 34579270 32516779
4098C2516779j852126j662271j492455j347911j119886r86005r28249q02110p09596
$$ 32516779 30664653 29002382 27509927 26162016 25042130 24056125 23127876 22325766 21616170
4089B1616170o11234n66273m25531l21033r8875Q6027J84645J86556M44321O32707
$$ 21616170 21004936 20438663 20013132 19692099 19593224 19679251 19863896 20050452 20494773 21127480
4079B1127480R03607J285248J547629R64756n31516k127277k487943k220398j786783
$$ 21127480 22031087 23316335 24863964 25828720 25297204 23169927 20681984 18461586 16674803
4070A6674803j324808j068358r04915p93374o01076n09999l97865l41285k92420
$$ 16674803 15349995 14281637 13376722 12583348 11982272 11472273 11074408 10733123 10440703
4061A0440703k86347k82623k43475k41862k22955j73124k03397j73666n7492J631
$$ 10440703 10154356 9871733 9628258 9386396 9163441 8990317 8786920 8613254 8555762 8557393
4051H557393k0369K2577J46459Q0791j0987j34029j84290j84156j16185k33401
$$ 8557393 8537024 8559601 8706060 8786851 8775864 8641835 8457545 8273389 8157204 7923803
4041G923803k00771j72590j52066q0537q8830j74445o1456q696J14368N1897m4858
$$ 7923803 7723032 7550442 7398376 7317839 7229009 7054564 6993108 6984412 7098780 7150677 7105819
4030G105819k05979k72281l16177j98998j41183j81741o0053p0402j13030r5529
$$ 7105819 6899840 6627559 6311382 6112384 5971201 5789460 5729407 5659005 5545975 5450446
4020E450446q7072o0104j7217p3437m0319p2530r3479j23777j08575r8108m7569
$$ 5450446 5363374 5303270 5286053 5212616 5172297 5099767 5006288 4882511 4773936 4675828 4628259
4009D628259q1086r6215k8004n7010j25986j4796l4866L2813m2322p9133K953
$$ 4628259 4547173 4450958 4422954 4365944 4239958 4225162 4190296 4223109 4180787 4101654 4104607
3998D104607j03330r6208k6721k2200J0308j7015J3569j31943n5616q5043p0092
$$ 4104607 4001277 3905069 3878348 3856148 3866456 3849441 3863010 3731067 3675451 3590408 3520316
3987C520316p9770n2118m0048o6139j5312l8535m2125j1087R847l5648k214L3153
$$ 3520316 3440546 3388428 3348380 3282241 3266929 3228394 3186269 3175182 3185029 3149381 3147167 3180320
3975C180320K8123j0960j9147M8560L1461N4706j486l1031L9072Q956m3844m2907
$$ 3180320 3208443 3197483 3178336 3226896 3258357 3313063 3311577 3280546 3319618 3328574 3284730 3241823
3963C241823q3633o2044J7544L2787k7187l9944J8880L7793K3308J4546j9458
$$ 3241823 3158190 3096146 3113690 3146477 3119290 3079346 3098226 3136019 3159327 3173873 3154415
3952C154415n9727J9075j12808o7010m4896j28708o3046k0523j6798o9235k792
$$ 3154415 3094688 3113763 3000955 2933945 2889049 2760341 2697295 2676772 2659974 2590739 2587947
3941B587947j5533M4680k1758P141P5861J146j0418j7723L2056N0228L5498J2662
$$ 2587947 2572414 2617094 2595336 2602477 2678338 2679484 2669066 2651343 2683399 2733627 2769125 2781787
3929B781787J85799M0554j0279j6483o707o4775J1740O4754L762L235K6196P3847
$$ 2781787 2967586 3008140 2997861 2981378 2974671 2909896 2921636 2986390 2990152 2993387 3019583 3093430
3917C093430m0778k9339n3921r4193o1235k9440o8340j02322o1016j1600l2551
$$ 3093430 3052652 3023313 2969392 2875199 2813964 2784524 2716184 2613862 2552846 2541246 2508695
3906B508695m7557l8002l9638m0635N495J3714O19M029n1141L7879Q4971N7881
$$ 2508695 2461138 2423136 2383498 2342863 2348358 2362072 2362691 2366720 2315579 2353458 2438429 2496310
3894B496310n9195k2957K4064j4103q5364JO3211j5001k7124n0856L3696k250
$$ 2496310 2437115 2414158 2438222 2424119 2338755 2338756 2401967 2386966 2359842 2308986 2342682 2340432
3882B340432m7565o5690M5069O9207j8946n0296o2459l6914P8131M2425j6167
$$ 2340432 2292867 2227177 2272246 2341453 2322507 2272211 2209752 2172838 2250969 2293394 2277227
3871B277227M3304j9134M2335R0852Q7694R9541R9354J63333K32528K43715L16111
$$ 2277227 2320531 2301397 2343732 2434584 2522278 2621819 2721173 2884506 3117034 3360749 3676860
3860C676860L72514N95956P44491O16999K20863m22559q07842p61810n65391l98533
$$ 3676860 4049374 4645330 5389821 6006820 6227683 5805124 4997282 4235472 3670081 3271548
3850C271548k78858k33966j82473q3728j25815r0401l0896r3738q9836p6421m4342
$$ 3271548 2992690 2758724 2576251 2492523 2366708 2276307 2245411 2151673 2061837 1985416 1941074
3839A941074j9445o5257k2251k5773p1936K1574M6414K9114n1683L6742L9006
$$ 1941074 1921629 1856372 1834121 1808348 1736412 1757986 1804400 1833514 1781831 1818573 1857579
3828A857579O7936R5231J21770Q8549J03129m993r8030j11461j35718p9822j81096
$$ 1857579 1925515 2020746 2142516 2231065 2334194 2329201 2231171 2119710 1983992 1904170 1723074
3817A723074j21701q756o6818q1831l2095o7332m1553l2514M5605p1710J6239
$$ 1723074 1601373 1592617 1525799 1443968 1411873 1344541 1302988 1270474 1316079 1244369 1260608
3806A260608M0671n6642k9325m71k0423n8884M080j1629M1609L2115n1246J9624
$$ 1260608 1301279 1244637 1215312 1214841 1194418 1135534 1139614 1127985 1169594 1201709 1150463 1170087
3794A170087K2075o9638J344o727L512j751k0374n4615K0993R648N399K2088K8912
$$ 1170087 1192162 1122524 1123868 1117141 1120653 1118902 1098528 1043913 1064906 1074554 1079953 1102041 1130953
3781A130953L0472o5556J7212j788l3091R943P965Q2283L1090l0278L6914k4671
$$ 1130953 1161425 1095869 1113081 1111293 1078202 1088145 1096110 1178393 1209483 1179205 1216119 1191448
3769A191448q180m9439n2634p59K3166j9984N4686n4644r8985j4640j9243M9300
$$ 1191448 1183268 1133829 1081195 1080436 1103602 1083618 1138304 1083660 984675 970035 950792 1000092
3757A000092k8880l8459L0920K3065l563P417j1316j2349J7512r673p6987K0282
$$ 1000092 971212 932753 963673 986738 983175 990592 979276 966927 984439 974766 897779 918061
3745I18061L4825l2257k4399K9350Q8604M4584j1427M2124m4346k5813j8925N935
$$ 918061 952886 920629 896230 925580 1014184 1058768 1047341 1089465 1045119 1019306 1000381 1006316
3733A006316l5428l6811k9865J4853O8775k2187J6715K3088J1905j8395K4981
$$ 1006316 970888 934077 904212 919065 987840 965653 982368 1005456 1017361 998966 1023947
3722A023947L4117n7713L5401K4713J4282R374J2458j1938j6935r636K784J3441
$$ 1023947 1058064 1000351 1035752 1060465 1074747 1084121 1096579 1084641 1067706 1058070 1060854 1074295
3710A074295N2151M4793J03n117l332l7311k2819M6849J7977m1341P465K9815
$$ 1074295 1126446 1171239 1171342 1166225 1162893 1125582 1102763 1149612 1167589 1126248 1133713 1163528
3698A163528L4n6745o215M2594l0312L1783Q9643K3887j3713J0317j377N5235
$$ 1163528 1163562 1106817 1100602 1143196 1112884 1144667 1234310 1258197 1244484 1254801 1253424 1308659
3686A308659K5610M9720R0232L9852L4896R8078J01232M293M2046J3582j03979
$$ 1308659 1334269 1383989 1474221 1514073 1548969 1647047 1748279 1752572 1794618 1808200 1704221
3675A704221l8783k8352K6885p892L2880r495P9786J43836R0961O4759J18087
$$ 1704221 1665438 1637086 1663971 1656079 1688959 1679464 1759250 1903086 1994047 2058806 2176893
3664B176893K26165J39465J37730L6710r7532j58606j29931o6174L5971n21r0824
$$ 2176893 2403058 2542523 2680253 2716963 2619431 2460825 2330894 2264720 2300691 2300170 2209346
3653B209346j8072K9439P796K2812n1322j32878j31670l7870L261j14730l1290
$$ 2209346 2191274 2220713 2228509 2251321 2199999 2067121 1935451 1897581 1900842 1786112 1754822
3642A754822o8059n105K4403r276m5059k7605l2138K469O4591k7104m5059M8662
$$ 1754822 1686763 1681658 1706061 1696785 1651726 1624121 1591983 1594452 1659043 1631939 1586880 1635542
3630A635542L5246N5128k025m11K95N0709K6103N040M6289P5929M2775N2258P8011
$$ 1635542 1670788 1725916 1723891 1723480 1723775 1774484 1800587 1805627 1851916 1927845 1970620 2022878 2100889
3617B100889J02569P1127J04620R2237Q7340M1225M8454L9654k6280L4608L0981
$$ 2100889 2203458 2274585 2379205 2471442 2558782 2600007 2648461 2688115 2661835 2696443 2727424
3606B727424L7117R6710J25499J19751O0423j03620l6171p9004j44978m0118j02059
$$ 2727424 2764541 2861251 2986750 3106501 3166924 3063304 3027133 2948129 2803151 2763033 2660974
3595B660974j30222r1894k1220J377k8433K4853J3200K7886p608J26437L921K2262
$$ 2660974 2530752 2438858 2417638 2419015 2390582 2415435 2428635 2456521 2448913 2575350 2579271 2601533
3583B601533l4230j16214m3648p1128k9071p1789K044n54J1259O8879L758m0855
$$ 2601533 2567303 2451089 2407441 2336313 2307242 2235453 2237497 2236943 2248202 2317081 2320839 2279984
3571B279984m9343K094j2465M8008K0217L6496M5490J1589k2942O5862O1035N21
$$ 2279984 2230641 2232735 2220270 2268278 2288495 2324991 2370481 2382070 2359128 2424990 2486025 2486546
3559B486546m8789J10688J28258L7601l0417L7133K5464k3208J46431J16332O9257
$$ 2486546 2437757 2548445 2676703 2714304 2683887 2721020 2746484 2723276 2869707 2986039 3055296
3548C055296J25733P9716R6652l1397p9259j03979q9872n7090j22041q5435o489
$$ 3055296 3181029 3260745 3357397 3326000 3246741 3142762 3052890 2995800 2873759 2788324 2781835
3537B781835m0959o1627J4275j1500K5343q766l6786J9069P0425O3954m0344l1075
$$ 2781835 2740876 2679249 2693524 2682024 2707367 2698601 2661815 2680884 2751309 2815263 2774919 2743844
3525B743844P5149P9335M9083P7816Q5940L2905J11114N5814j7536o5975p4317
$$ 2743844 2818993 2898328 2947411 3025227 3111167 3144072 3255186 3311000 3293464 3227489 3153172
3514C153172j24305j28540o3030n3109p1313j3316m0225o2028m703J1742o8629
$$ 3153172 3028867 2900327 2837297 2784188 2712875 2699559 2659334 2597306 2592603 2604345 2535716
3503B535716o7023K0001k655k0084j2918M8484K5012m774k4114K85l9888N4263
$$ 2535716 2468693 2488694 2486039 2465955 2453037 2501521 2526533 2521759 2497645 2497930 2458042 2512305
3491B512305n9012j5130J2310k3513j8192J780K0193L1049o2726k1075O0985j119
$$ 2512305 2453293 2438163 2450473 2426960 2408768 2410548 2430741 2461790 2399064 2377989 2438974 2437855
3479B437855O704k0311P0951O629J0677N584M993n2311K8786N4369K9368j6013
$$ 2437855 2444559 2424248 2495199 2501828 2512505 2518089 2523082 2470771 2499557 2553926 2583294 2567281
3467B567281J50k9776J8999m5231K2117J29N1367K5518j9779R6952L4565J2696
$$ 2567281 2567431 2537655 2556654 2511423 2533540 2533669 2585036 2610554 2590775 2687727 2722292 2734988
3455B734988j5062J8142M6180P98Q5240J26187J4275J45366N8554O2689M9640
$$ 2734988 2719926 2738068 2784248 2785046 2870286 2996473 3010748 3156114 3214668 3277357 3326997
3444C326997j5803r497l137n2425n7572L347j2636m9707j3320J26246M120m673
$$ 3326997 3311194 3301697 3298560 3246135 3188563 3191910 3179274 3129567 3116247 3242493 3246613 3241940
3432C241940J3480j5856p9245L1326M64m0760O840M1366J4334k2983k0982J4118
$$ 3241940 3255420 3239564 3160319 3191645 3192109 3151349 3158189 3199555 3213889 3190906 3169924 3184042
3420C184042r213N3493J00471O3242P946N1180R0980N2275k4147m7744L4500M3800
$$ 3184042 3174829 3228322 3328793 3392035 3399981 3451161 3542141 3594416 3570269 3522525 3557025 3600825
3408C600825L4446J36095J91518J30221J11853J56133J20114K18675K98844L52443
$$ 3600825 3635271 3771366 3962884 4093105 4204958 4361091 4481205 4699880 4998724 5351167
3398E351167L33764K30399n9987k74827k75546l19639k33935j71010j18353r882
$$ 5351167 5684931 5915330 5855343 5580516 5304970 4985331 4751396 4580386 4462033 4452151
3388D452151l8513J4567J3692M145N1236O0367m528m0824M3565J50379J01492
$$ 4452151 4413638 4428205 4441897 4446042 4497278 4557645 4553117 4512293 4555858 4706237 4807729
3377D807729K9226R5762J92786J79003J97299K57044K57893L79754M39922O03237
$$ 4807729 4836955 4932717 5125503 5304506 5501805 5758849 6016742 6396496 6836418 7439655
3367G439655P63410P17281M58218M378m88677o52318m51301k32694j82765o2225
$$ 7439655 8203065 8920346 9378564 9382942 8894265 8241947 7790646 7557952 7375187 7312962
3357G312962L446n6057j31034j6824l9989q8657r8559l9821n4452L9502L4732
$$ 7312962 7316408 7260351 7129317 7112493 7072504 6983847 6885288 6845467 6791015 6830517 6865249
3346F865249O4812J48080J46617Q7140J93136K84372K62577K68726K84289L44740
$$ 6865249 6930061 7078141 7224758 7311898 7505034 7789406 8051983 8320709 8604998 8949738
3336H949738L79979M53481M83739M06165J50581o4539n5327m5985J70420K80649
$$ 8949738 9329717 9783198 10266937 10673102 10823683 10759144 10703817 10657832 10828252 11108901
3326A1108901M05636N19531O70898Q09373Q64348R91123J108062J098851J086509
$$ 11108901 11514537 12034068 12704966 13514339 14378687 15369810 16477872 17576723 18663232
3317A8663232R00039O14347Q0033l68339p69039q68812q09540o57168n49026l63503
$$ 18663232 19563271 20177618 20257651 19889312 19120273 18251461 17441921 16784753 16235727 15872224
3307A5872224k24350j43077q5410L6350N9015J83704K16814L47049L67606N33778
$$ 15872224 15647874 15504797 15419387 15455737 15514752 15698456 15915270 16262319 16629925 17163703
3297A7163703N70240O20697N85691M77636M25327M03831M50364N04546N75262
$$ 17163703 17733943 18354640 18940331 19417967 19843294 20247125 20697489 21202035 21777297
3288B1777297O55480O66887P89421Q42642Q39570R72958J085720J051674J171895
$$ 21777297 22432777 23099664 23889085 24731727 25571297 26544255 27629975 28681649 29853544
3279B9853544J392104J500756J830631K121486K485099K878280K946801L122724
$$ 29853544 31245648 32746404 34577035 36698521 39183620 42061900 45008701 48131425
3271D8131425L491601M177510N256081O535711P550812R285652J1942521J5553776
$$ 48131425 51623026 55800536 61056617 67592328 75143140 84428792 96371313 111925089
3263A11925089K0365020K6251474K8168475J9443379j530138k4583667l0597066
$$ 111925089 132290109 158541583 186710058 206153437 204623299 180039632 149442566
3256A49442566k5817786j8995330j3401592r538809o740769m691838l281124k181213
$$ 149442566 123624780 104629450 91227858 81689049 74948280 70256442 66975318 64794105
3248F4794105j501938q50895r0725N26003R07262J261405K033633L095730M376400
$$ 64794105 63292167 62441272 62350547 62876550 63783812 65045217 67078850 70174580 74550980
$$ [...]
##END NTUPLES=NMR SPECTRUM
##END=
