##TITLE=1H_CA-9079x
 CDCl3
 8 sc, 
 21.10.2022
##JCAMPDX= 6.0         $$ Bruker NMR JCAMP-DX V2.0
##DATA TYPE= NMR SPECTRUM
##DATA CLASS= NTUPLES
##ORIGIN= UXNMR, Bruker Analytische Messtechnik GmbH
##OWNER= root
$$ XWIN-NMR		Version 3.5
$$ Fri Oct 21 14:04:19 2022 Russian Standard Time (UT+4h)  she@DPX200
##.OBSERVE FREQUENCY= 200.1313499994
##.OBSERVE NUCLEUS= ^1H
##.ACQUISITION MODE= SIMULTANEOUS
##.ACQUISITION SCHEME= undefined
##.AVERAGES= 8
##.DIGITISER RES= 18
##SPECTROMETER/DATA SYSTEM= spect
##.PULSE SEQUENCE= zg30
##.SOLVENT NAME= CDCl3
##.SHIFT REFERENCE= (INTERNAL, CDCl3, 0, 15.7513)
##AUDIT TRAIL= $$ (NUMBER, WHEN, WHO, WHERE, WHAT)
$$ ##TITLE= Audit trail, XWIN-NMR		Version 3.5
$$ ##JCAMPDX= 5.01
$$ ##ORIGIN= Bruker BioSpin GmbH
$$ ##OWNER= she
$$ F:/spectra/data/she/nmr/H-F/1/pdata/1/auditp.txt
$$ ##AUDIT TRAIL=  $$ (NUMBER, WHEN, WHO, WHERE, WHAT)
(   1,<2022-10-21 14:02:59.45 +0400>,<she>,<DPX200>,
      <created by zg, POWCHK disabled, PULCHK disabled
       configuration hash MD5:
       00 E9 B6 7A A2 85 ED C7 34 08 36 98 17 FE 4E 26
       data hash MD5: 16K
       3C 7F B7 10 55 4D 25 3D F1 D9 3C D7 16 C9 5E 57>)
(   2,<2022-10-21 14:03:02.03 +0400>,<she>,<DPX200>,
      <Start of raw data processing
       efp BC_mod = 2 LB = 0.24 FT_mod = 6 PKNL = 1 PHC0 = -18032.95 PHC1 = 9.2007 SI = 16K 
       data hash MD5: 16K
       14 A7 68 15 F1 D3 8F C3 90 95 FE 5A 97 2C C2 0E>)
(   3,<2022-10-21 14:03:26.79 +0400>,<she>,<DPX200>,
      <pk PHC0 = -5.701554 PHC1 = 6 
       data hash MD5: 16K
       D9 7D D9 EB 52 38 0D E7 15 59 F0 03 8C 8D D5 9C>)
(   4,<2022-10-21 14:03:30.07 +0400>,<she>,<DPX200>,
      <abs ABSG = 5 
       data hash MD5: 16K
       3D 61 83 7D 6E 17 CF A5 E2 04 2B DE BB B1 79 4F>)
$$ ##END=
$$ 
$$ hash MD5
$$ 64 A7 B6 E7 83 82 25 68 80 13 E2 6A 1E 45 78 C8
##$RELAX= 
##$RELAX= 
##$RELAX= 
##$RELAX= 
##$RELAX= 
##$RELAX= 
$$ Bruker specific parameters
$$ --------------------------
##$DU= <F:/spectra>
##$EXPNO= 1
##$NAME= <H-F>
##$PROCNO= 1
##$TYPE= <nmr>
##$USER= <she>
##$AMP= (0..31)
100 100 100 100 100 100 100 100 100 100 100 100 100 100 100 100 100 100 
100 100 100 100 100 100 100 100 100 100 100 100 100 100 
##$AQSEQ= 0
##$AQ_mod= 1
##$AUNM= <au_zg>
##$AUTOPOS= <>
##$BF1= 200.13
##$BF2= 200.13
##$BF3= 200.13
##$BF4= 200.13
##$BF5= 200.13
##$BF6= 200.13
##$BF7= 200.13
##$BF8= 200.13
##$BYTORDA= 1
##$CFDGTYP= 0
##$CFRGTYP= 5
##$CHEMSTR= <none>
##$CNST= (0..31)
1 1 145 1 1 1 1 1 1 1 1 1 1 1 1 1 1 1 1 1 1 1 1 1 1 1 1 1 1 1 1 1 
##$CPDPRG= <>
##$CPDPRG1= <>
##$CPDPRG2= <>
##$CPDPRG3= <>
##$CPDPRG4= <mlev>
##$CPDPRG5= <mlev>
##$CPDPRG6= <mlev>
##$CPDPRG7= <mlev>
##$CPDPRG8= <mlev>
##$CPDPRGB= <>
##$CPDPRGT= <>
##$D= (0..31)
0 1.2 0 0 0 0 0 0 0 0.06 0 0.03 0 0 0 0 0.0002 0 0 0 0 0 0 0 0 0 0 0 0 
0 0 0 
##$DATE= 1666346578
##$DBL= (0..7)
120 120 120 120 120 120 120 120 
##$DBP= (0..7)
150 150 150 150 150 150 150 150 
##$DBP07= 0
##$DBPNAM0= <>
##$DBPNAM1= <>
##$DBPNAM2= <>
##$DBPNAM3= <>
##$DBPNAM4= <>
$$ [...]
##$SUBNAM3= <"">
##$SUBNAM4= <"">
##$SUBNAM5= <"">
##$SUBNAM6= <"">
##$SUBNAM7= <"">
##$SUBNAM8= <"">
##$SUBNAM9= <"">
##$SW= 18.0517283424941
##$SWIBOX= (0..15)
0 0 2 0 0 0 0 0 0 0 0 0 0 0 0 0 
##$SW_h= 3612.71676300578
##$TD= 16384
##$TD0= 1
##$TE= 0
##$TE2= 300
##$TE3= 300
##$TEG= 300
##$TL= (0..7)
0 120 120 120 120 120 120 120 
##$TP= (0..7)
150 150 150 150 150 150 150 150 
##$TP07= 0
##$TPNAME0= <>
##$TPNAME1= <>
##$TPNAME2= <>
##$TPNAME3= <>
##$TPNAME4= <>
##$TPNAME5= <>
##$TPNAME6= <>
##$TPNAME7= <>
##$TPOAL= (0..7)
0.5 0.5 0.5 0.5 0.5 0.5 0.5 0.5 
##$TPOFFS= (0..7)
0 0 0 0 0 0 0 0 
##$TUNHIN= 0
##$TUNHOUT= 0
##$TUNXOUT= 0
##$USERA1= <user>
##$USERA2= <user>
##$USERA3= <user>
##$USERA4= <user>
##$USERA5= <user>
##$V9= 5
##$VALIST= <valist>
##$VCLIST= <CCCCCCCCCCCCCCC>
##$VD= 0
##$VDLIST= <DDDDDDDDDDDDDDD>
##$VPLIST= <PPPPPPPPPPPPPPP>
##$VTLIST= <TTTTTTTTTTTTTTT>
##$WBST= 1024
##$WBSW= 4
##$XGAIN= (0..3)
0 0 0 0 
##$XL= 0
##$YL= 0
##$YMAX_a= 55667
##$YMIN_a= -90104
##$ZGOPTNS= <>
##$ZL1= 120
##$ZL2= 120
##$ZL3= 120
##$ZL4= 120
##$ABSF1= 15.73588
##$ABSF2= -2.315969
##$ABSG= 5
##$ABSL= 3
##$ALPHA= 0
##$AQORDER= 0
##$ASSFAC= 0
##$ASSFACI= 0
##$ASSFACX= 0
##$ASSWID= 0
##$AUNMP= <proc_1d>
##$AZFE= 0.1
##$AZFW= 0.1
##$BCFW= 0
##$BC_mod= 2
##$BYTORDP= 0
##$COROFFS= 0
##$CY= -3
##$DATMOD= 1
##$DC= 0
##$DFILT= <>
##$DTYPP= 0
##$F1P= 0
##$F2P= 0
##$FCOR= 1
##$FTSIZE= 16384
##$FT_mod= 6
##$GAMMA= 0
##$GB= 0
##$INTBC= 1
##$INTSCL= 3.70164e-10
##$ISEN= 128
##$LB= 0.24
##$LEV0= 0
##$LPBIN= 0
##$MAXI= 10000
##$MC2= 0
##$MEAN= 0
##$ME_mod= 0
##$MI= 1.114404
##$NCOEF= 0
##$NC_proc= -9
##$NLEV= 6
##$NOISF1= 3.799351
##$NOISF2= 2.8
##$NSP= 0
##$NTH_PI= 0
##$NZP= 0
##$OFFSET= 15.7513
##$PC= 1
##$PHC0= -18038.65
##$PHC1= 15.2007
##$PH_mod= 1
##$PKNL= yes
##$PPARMOD= 0
##$PSCAL= 0
##$PSIGN= 0
##$REVERSE= no
##$SF= 200.130004051498
##$SI= 16384
##$SIGF1= 3
##$SIGF2= 2
##$SINO= 5.538805
##$SIOLD= 16384
##$SREGLST= <1H.CDCl3>
##$SSB= 0
##$STSI= 16384
##$STSR= 0
##$SW_p= 3612.71676300578
##$SYMM= 0
##$S_DEV= 0
##$TDeff= 16384
##$TDoff= 0
##$TI= <>
##$TILT= no
##$TM1= 0
##$TM2= 0
##$TOPLEV= 0
##$USERP1= <user>
##$USERP2= <user>
##$USERP3= <user>
##$USERP4= <user>
##$USERP5= <user>
##$WDW= 1
##$XDIM= 16384
##$YMAX_p= 285418813
##$YMIN_p= -2703048
$$ End of Bruker specific parameters
$$ ---------------------------------
##NTUPLES= NMR SPECTRUM
##VAR_NAME=  FREQUENCY,     SPECTRUM/REAL,   SPECTRUM/IMAG
##SYMBOL=    X,             R,               I
##VAR_TYPE=  INDEPENDENT,   DEPENDENT,       DEPENDENT
##VAR_FORM=  AFFN,          ASDF,            ASDF
##VAR_DIM=   16384,         16384,           16384
##UNITS=     HZ,            ARBITRARY UNITS, ARBITRARY UNITS
##FACTOR=    0.220516191357247, 1,           1
##FIRST=     3152.30770441656, 0,            0
##LAST=      -460.409058589216, 0,           0
##MIN=       -460.409058589216, -2703048,    0
##MAX=       3152.30770441656, 285418813,    0
$$ Real data points
##PAGE= N=1
##DATA TABLE= (X++(R..R)), XYDATA
$$ [...]
$$ plain form
4866 -235171 -36720 465790 473325 -632979 -494971 -586288 275827 327695 680677 206557
4856 206557 234248 -33331 -1029071 -65575 -259811 -434732 224494 -961314 -1371580 -1119691
4846 -1119691 -612205 -185792 -495001 209706 -567197 -512881 -375522 -253225 -386829 -165762
4836 -165762 -774267 463411 231301 -438478 652136 2085154 2426773 1707105 1455858
4827 1455858 2112348 1443145 1100512 919629 1430727 906280 995116 1227082 1128389 1344893
4817 1344893 824554 347339 340515 309927 21026 514270 845854 -164505 -230615 -210964
4807 -210964 -1033226 -1053706 -866735 -209119 -1530173 -1310548 -623051 -806748 -520570 -106156
4797 -106156 617750 -38432 -832105 -834945 92818 -393757 -107993 -198868 21300 -906269
$$ packed form
4866b35171J98451N02510P535j106304J38008r1317Q62115N1868L52982m74120
4856B06557K7691k67579r95740R63496j94236j74921O59226j185808m10266K51889
4846a119691N07486M26413l09209P04707p76903N4316J37359J22297j33604K21067
4836a65762o08505J237678k32110o69779J090614J433018L41619p19668k51247
4827A455858O56490o69203l42633j80883N11098n24447Q8836K31966r8693K16504
4817A344893n20339m77215o824l0588k88901M93244L31584j010359o6110J9651
4807b10964q22262k0480J86971O57616j321054K19625O87497j83697K86178M14414
4797a06156P23906o56182p93673k840R27763m86575K85764r0875K20168r27569
$$ plain form
4787 -906269 -1495097 -362049 -756664 -729933 -1215663 -44479 136350 320902 116226 841195
4777 841195 885305 68945 -818417 -543291 479641 -154349 -280322 -119615 -670261 -627323
4767 -627323 332064 864918 -429324 -663330 276829 169792 -649268 -328715 -693389 -881235
4757 -881235 -663367 -120110 172815 594040 465586 206539 57080 -186392 -535432 -1242882
4747 -1242882 -789585 -846312 -569364 258800 940076 637413 73324 -230190 162597 -92197
4737 -92197 -535943 804192 93406 -655846 -194343 91321 120928 346647 771310 785537
4727 785537 -71968 -378256 333759 538008 699448 -368915 -428210 -579924 10167 573415
4717 573415 963684 1150052 -588295 -247654 -337345 -435702 -414204 -327739 320989 179175
$$ packed form
4787i06269n88828J133048l94615K6731m85730J171184J80829J84552k04676P24969
4777H41195M4110q16360q87362K75126J022932o33990j25973J60707n50646M2938
4767f27323R59387N32854j294242k34006R40159j07037q19060L20553l64674j87846
4757h81235K17868N43257K92925M21225j28454k59047j49459k43472l49040p07450
4747a242882M53297n6727K76948Q28164O81276l02663n64089l03514L92787k54794
4737i2197m43746J340135p10786p49252M61503K85664K9607K25719M24663J4227
4727G85537q57505l06288P12015K04249J61440j068363n9295j51714N90091N63248
4717E73415L90269J86368j738347L40641q9691r8357K1498Q6465O48728j41814
$$ plain form
4707 179175 -99655 70932 189863 -384070 531626 -549606 -961385 -790532 -218358 205956
4697 205956 103029 -886140 -754600 -156559 436171 344393 547338 823492 688740 -176890
4687 -176890 280492 844814 992174 426060 -284723 -127373 302029 1288989 16395 13407
4677 13407 320588 502833 130886 611192 141877 742674 547277 68639 281926 91390
4667 91390 790528 516610 413946 460288 494000 1072423 386477 14240 166569 -66633
4657 -66633 990199 1544535 1266621 1903139 2026346 1000182 492551 206989 654046 883364
4647 883364 937761 -203452 -427816 695824 585174 -232970 373500 -566621 -930979 -360439
4637 -360439 160710 606619 239918 564455 1369932 578948 -539359 -1084566 -359740 781391
$$ packed form
4707A79175k78830J70587J18931n73933R15696j081232m11779J70853N72174M24314
4697B05956j02927r89169J31540N98041N92730r1778K02945K76154j34752q65630
4687a76890M57382N64322J47360n66114p10783J57350M29402R86960j272594k988
4677A3407L07181J82245l71947M80306m69315O00797j95397m78638K13287j90536
4667I1390O99138k73918j02664M6342L3712N78423o85946l72237J52329k33202
4657f6633J056832N54336k77914O36518J23207j026164n07631k85562M47057K29318
4647H83364N4397j141213k24364J123640j10650q18144O06470r40121l64358N70540
4637c60439N21149M45909l66701L24537Q05477p90984j118307n45207P24826J141131
$$ plain form
4627 781391 1384049 2247485 1548587 1156220 166178 5358 808486 1194330 547129 14145
4617 14145 91268 129429 608060 302384 151203 1132131 337298 153293 450655 1305140
4607 1305140 1119785 915569 1052272 702163 713765 879536 1172737 1237379 1212149 930744
4597 930744 1456907 1241477 675018 1572720 1504176 1042299 536921 1159259 985424 523166
4587 523166 773887 684863 628549 721157 1668237 2233940 2539748 2256212 1673394 1164818
4577 1164818 1705588 3202161 3091718 1994419 1579357 1683491 2508541 2972222 1496039
4568 1496039 1919633 2545426 3082853 2525655 192152 791525 1495247 1911056 2115878
4559 2115878 1752597 1477958 994521 1190916 1890612 1443244 895005 451848 585192 853328
$$ packed form
4627G81391O02658Q63436o98898l92367r90042j60820Q03128L85844o47201n32984
4617A4145P7123L8161M78631l05676j51181R80928p94833j84005K97362Q54485
4607A305140j85355k04216J36703l50109J1602J65771K93201O4642k5230k81405
4597I30744N26163k15430n66459Q97702o8544m61877n05378O22338j73835m62258
4587E23166K50721q9024n6314R2608R47080N65703L05808k83536n82818n08576
4577A164818N40770J496573j10443j097299m15062J04134Q25050M63681j476183
4568A496039M23594O25793N37427n57198k333503N99373P03722M15809K04822
4559B115878l63281k74639m83437J96395O99696m47368n48239m43157J33344K68136
$$ plain form
4549 853328 612195 1239933 916731 254567 1684527 1702600 1161948 1914032 2008056 1331368
4539 1331368 1818130 2120163 1630652 1996138 2449074 1580969 1821676 1868826 1995545 1604483
4529 1604483 2008743 1779836 1923611 1667429 1410662 2441085 2139042 2521708 1765108
4520 1765108 2894462 1996728 2170223 2996073 3291741 3110697 2595587 3591807 3157155
4511 3157155 2914607 3531153 3398730 3344087 3474093 4581064 4213792 4137775 4286145 4280105
4501 4280105 4814913 3761127 4286610 4588335 4715968 4846446 5001751 4866737 5750468
4492 5750468 6078265 5880669 6015002 7080118 6397172 6265596 6838084 6945191 6980914 6153603
4482 6153603 5448893 5465251 5954162 6439504 6126101 7007574 6900286 7301251 6878229 6231576
$$ packed form
4549H53328k41133O27738l23202o62164J429960J8073n40652P52084R4024o76688
4539A331368M86762L02033m89511L65486M52936q68105K40707M7150J26719l91062
4529A604483M04260k28907J43775k56182k56767J030423l02043L82666p56600
4520A765108J129354q97734J73495Q25850K95668j81044n15110R96220m34652
4511C157155k42548O16546j32423n4643J30006J106971l67272p6017J48370o040
4501D280105N34808j053786N25483L01725J27633J30478J55305j35014Q83731
4492E750468L27797j97596J34333J065116o82946j31576N72488J07107L5723q27311
4482F153603p04710J6358M88911M85342l13403Q81473j07288M00965m23022o46653
$$ plain form
4472 6231576 6199794 5582255 6047382 5953048 5458393 5123743 5276718 5192160 5728307 5828751
4462 5828751 6679990 7021991 6565789 6276358 6162611 6451179 6623129 6734041 7888936
4453 7888936 7613257 7802783 7212385 7426423 6748572 7014477 7162392 7329491 7736080 7113815
4443 7113815 7756650 8783536 8408251 7976929 8985509 9009589 9056415 8923218 9425830 8479660
4433 8479660 7818049 7024318 7138199 7396920 7847004 8540921 8937027 7789791 8260779
4424 8260779 8975549 8384345 8340764 8080250 8267244 7913279 8770660 8508787 8210623 8138168
4414 8138168 8349280 8953499 8751211 9530399 10724153 11325382 11022868 11074559 11886512 11320868
4404 11320868 11371959 11248156 10171349 9908097 10533187 11292298 11416938 11082090 11174470 11317688
$$ packed form
4472F231576l1782o17539M65127r4334m94655l34650J52975q4558N36147J00444
4462E828751Q51239L42001m56202k89431j13747K88568J71950J10912J154895
4453G888936k75679J89526n90398K14038o77851K65905J47915J67099M06589o22265
4443G113815O42835J026886l75285m31322J008580K4080M6826j33197N02612r46170
4433H479660o61611p93731J13881K58721M50084O93917L96106j147236M70988
4424H260779P14770n91204m3581k60514J86994l53965Q57381k61873k98164p2455
4414H138168K11112O04219k02288P79188J193754O01229l02514N1691Q11953n65644
4404A1320868N1091j23803j076807k63252O25090P59111J24640l34848R2380J43218
$$ plain form
4394 11317688 11797929 11634033 10353826 10563467 11128485 11601394 12727548 12734844 12297773
4385 12297773 12429989 11725305 11962072 11744388 12426268 13044617 12942574 14094483 13279459
4376 13279459 13730401 14594631 14269412 14712096 14290469 14033661 14850085 15257853 14954356
4367 14954356 14723296 15100020 15514219 16126364 17485085 18367349 18555948 17649780 17226934
4358 17226934 17570032 18742936 20461846 19943747 19997293 19053859 20211069 20808971 21375573
4349 21375573 21856276 22386245 22708703 22792480 23684008 23917053 24188750 24265245 24768886 24999464
4339 24999464 25291885 26908177 27152190 27293572 28764496 28570260 29151343 29301824 30065478
4330 30065478 30759875 31182796 32233828 32983244 33657355 35357674 36439693 37395181 38274795
$$ packed form
4394A1317688M80241j63896j280207K09641N65018M72909J126154P296m37071
4385A2297773J32216p04684K36767k17684O81880O18349j02043J151909q15024
4376A3279459M50942Q64230l25219M42684m21627k56808Q16424M07768l03497
4367A4954356k31060L76724M14199O12145J358721Q82264J88599r06168m22846
4358A7226934L43098J172904J718910n18099N3546r43434J157210N97902N66602
4349B1375573M80703N29969L22458Q3777Q91528K33045K71697P6495N03641K30578
4339B4999464K92421J616292K44013J41382J470924j94236N81083J50481P63654
4330C0065478O94397M22921J051032P49416O74111J700319J082019R55488Q79614
$$ plain form
4321 38274795 38945789 39676739 40611244 42315456 43291703 44464308 46398391 48624009 49896565
4312 49896565 50417702 52499482 54697990 56146257 58108775 59822475 62199236 63973013
4304 63973013 65737352 67428097 70132280 72380302 74627796 77566850 80390198 83019424
4296 83019424 84482854 86886272 89047404 91063345 92531833 94120688 95202042 96287483
4288 96287483 96034300 96252039 95850946 95027792 94564579 92583025 89170015 86262508 84648436
4279 84648436 83131625 80515212 78321425 75136682 72514224 69833852 66743902 64099018
4271 64099018 62193022 60995787 59031003 57521011 56104688 53993178 52223564 50208586
4263 50208586 48846731 46923618 45169831 43359588 41965678 40757722 39457505 37877310
$$ packed form
4321C8274795O70994P30950R34505J704212R76247J172605J934083K225618J272556
4312D9896565N21137K081780K198508J448267J962518J713700K376761J773777
4304F3973013J764339J690745K704183K248022K247494K939054K823348K629226
4296H3019424J463430K403418K161132K015941J468488J588855J081354J085441
4288I6287483k53183K17739m01093q23154m63213j981554l413010k907507j614072
4279H4648436j516811k616413k193787l184743k622458k680372l089950k644884
4271F4099018j905996j197235j964784j509992j416323k111510j769614k014978
4263E0208586j361855j923113j753787j810243j393910j207956j300217j580195
$$ plain form
4255 37877310 36907883 35812203 34496511 34373109 32903804 31477690 31175181 30648725 29123652
4246 29123652 28934525 28449784 27407631 27675698 27410389 26285678 25489535 25651853 25516312
4237 25516312 25180851 25259953 25290313 25141649 25071552 24299134 24302130 24091558 21462495 22339171
4227 22339171 23047854 23261467 22664067 22682157 21745926 22115837 21525617 20170540 21328894
4218 21328894 20703736 21051412 20698582 19978480 20867252 20154700 20033581 20552182 20477575 20122798
4208 20122798 20714377 20500884 20280292 20625251 20622870 21466490 21157782 20792168 21595003 22024550
4198 22024550 22727766 22526263 22310686 22466574 24000480 23748119 23580199 23029161 22599578
4189 22599578 24015752 23415393 23820975 25300657 25499845 25494566 26491414 26793840 26679633
$$ packed form
4255C7877310r69427j095680j315692j23402j469305j426114l02509n26456j525073
4246B9123652j89127m84741j042153K68067k65309j124711p96143J62318j35541
4237B5516312l35461P9102L0360j48664p0097p72418K996k10572k629063Q76676
4227B2339171P08683K13613n97400J8090r36231L69911n90220j355077J158354
4218B1328894o25158L47676l52830p20102Q88772p12552j21119N18601p4607l54777
4208B0122798N91579k13493k20592L44959k381Q43620l08708l65614Q02835M29547
4198B2024550P03216k01503k15577J55888J533906k52361j67920n51038m29583
4189B2599578J416174o00359M05582J479682J99188n279R96848L02426j14207
$$ plain form
4180 26679633 27515171 27546906 28105947 29494157 30232007 30783017 30582794 30383316 31676965
4171 31676965 33593581 33429475 34226285 34398026 34998869 35464174 36802069 37400257 38593446
4162 38593446 40711992 40955887 40671451 42614766 43784950 44954564 47304339 47821739 49837031
4153 49837031 52227332 53626897 55303325 55857499 58742867 60570052 62251050 63698936
4145 63698936 64929966 66521825 67156702 69151109 71057294 72619170 73598496 74888532
4137 74888532 75857345 77850839 79277437 81180827 83027947 85137963 86532207 87567915
4129 87567915 88883845 90638852 92600888 94030209 95553783 96285513 96308983 97935270 98665610
4120 98665610 99002754 99992398 100277928 99673098 99449351 98971810 98859067 98865913 98995146 97434019
$$ packed form
4180B6679633Q35538L1735N59041J388210P37850N51010k00223j99478J293649
4171C1676965J916616j64106P96810J71741O00843M65305J337895N98188J193189
4162C8593446K118546K43895k84436J943315J170184J169614K349775N17400K015292
4153D9837031K390301J399565J676428N54174K885368J827185J680998J447886
4145F3698936J231030J591859O34877J994407J906185J561876R79326J290036
4137G4888532R68813J993494J426598J903390J847120K110016J394244J035708
4129H7567915J315930J755007J962036J429321J523574P31730K3470J626287P30340
4120I8665610L37144R89644K85530o04830k23747m77541j12743O846J29233j561127
$$ plain form
4110 97434019 97730369 97063337 95459123 93911144 91732574 90011742 87791590 85786821
4102 85786821 84206613 82290789 79959302 79308161 78370362 76890468 74705636 72979357
4094 72979357 71513311 70548094 68765659 67040331 66150826 63788957 61774820 60384013
4086 60384013 58443571 58445977 57992518 56992754 56011232 55612261 54605513 53906764 52854484
4077 52854484 52850311 54221247 55740313 56759062 59411460 62245614 65635618 70082406 76031908
4068 76031908 81008310 84843137 90203629 97664225 103484680 102698613 96343364 86182034
4060 86182034 74754081 65573554 58531204 52728741 47429102 43842580 40369454 38288565
4052 38288565 36888619 35321958 34174808 32869814 31700306 30593701 29476186 27334918
$$ packed form
4110I7434019K96350o67032j604214j547979k178570j720832k220152k004769
4102H5786821j580208j915824k331487o51141r37799j479894k184832j726279
4094G2979357j466046r65217j782435j725328q89505k361869k014137j390807
4086F0384013j940442K406m53459r99764r81522l98971j006748o98749j052280
4077E2854484m173J370936J519066J018749K652398K834154L390004M446788N949502
4068G6031908M976402L834827N360492P460596N820455p86067o355249j0161330
4060H6182034j1427953r180527p042350n802463n299639l586522l473126k080889
4052C8288565j399946j566661j147150j304994j169508j106605j117515k141268
$$ plain form
4044 27334918 26066810 25756288 25522518 25336011 25209404 24524723 23485348 23175472 22980686
4035 22980686 22734412 21826769 22411949 21133091 19637391 19886241 20590548 19806421 19033404
4026 19033404 19211945 19707518 19994157 19237045 18512493 17992204 17365693 16382195 17483090
4017 17483090 17473031 17632765 16352390 17064032 16246181 16111275 16529353 16212693 15921459
4008 15921459 16958842 16826619 17265921 16242608 14934155 14634642 15596474 15978233 15856414
3999 15856414 16009015 15903626 15503164 14336512 14296549 14638900 13229771 14010326 15146731
3990 15146731 14606668 14836624 15067844 14578251 15042431 15101381 15239291 15138652 14803484 16403798
3980 16403798 15323269 15855085 16125383 15224582 15736218 15678098 15261394 15837988 15452275
$$ packed form
4044B7334918j268108l10522k33770j86507j26607o84681j039375l09876j94786
4035B2980686k46274r07643N85180j278858j495700K48850P04307p84127p73017
4026A9033404J78541M95573K86639p57112p24552n20289o26511r83498J100895
4017A7483090j0059J59734j280375P11642q17851j34906M18078l16660k91234
4008A5921459J037383j32223M39302j023313j308453k99513R61832L81759j21819
3999A5856414J52601j05389m00462j166652l9963L42351j409129P80555J136405
3990A5146731n40063K29956K31220m89593M64180N8950J37910j00639l35168J600314
3980A6403798j080529N31816K70298r00801N11636n8120m16704N76594l85713
$$ plain form
3971 15452275 16350642 16314021 15233256 14752614 14733862 14519602 15853238 15580336 16065138
3962 16065138 15798744 15567695 15606736 16142562 16308121 16629298 16462825 16450083 16752697 16828536
3952 16828536 16831827 16469775 17128112 16836505 16820361 16931313 18664841 18723582 18131317 17992869
3942 17992869 18008971 17493479 17748141 17468388 17305441 17845392 17641332 18026285 17897149 17610542
3932 17610542 18294325 19107121 18308874 18429719 18777352 18825646 18022352 19292561 20494731
3923 20494731 19670135 19622569 18845690 19790755 19302395 19294123 18925095 18727549 18711703 19052439
3913 19052439 19075182 18947296 19433442 19858145 18478652 19146510 19085341 19350388 20511648
3904 20511648 20305447 20274483 20652734 20710889 20621042 21377521 22093548 22981985 22413865 22605122
$$ packed form
3971A5452275Q98367l6621j080765m80642j8752k14260J333636k72902M84802
3962A6065138k66394k31049L9041N35826J65559L21177j66473j2742L02614P5839
3952A6828536L291l62052O58337k91607j6144J10952J733528N8741n92265j38448
3942A7992869J6102n15492K54662k79753j62947N39951k04060L84953j29136k86607
3932A7610542O83783Q12796p98247J20845L47633M8294q03294J270209J202170
3923B0494731q24596m7566p76879R45065m88360q272l69028j97546j5846L40736
3913A9052439K2743j27886M86146M24703j379493O67858o1169K65047J161260
3904B0511648k06201l0964L78251N8155q9847P56479P16027Q88437n68120J91257
$$ plain form
3894 22605122 22303875 22498416 23536133 23411763 23441535 23977632 22761230 23239587 23552553
3885 23552553 23487388 24008127 23609016 23607515 23666846 23905781 25005185 25507785 25143731 25691844
3875 25691844 25866736 25967198 26275606 26733359 26787176 26731806 27125507 27520733 27928624 27221242
3865 27221242 27745444 28002935 28437565 29163871 30044303 28976729 28855941 28914008 29875777
3856 29875777 29681573 29348243 30473317 32196640 31817787 31812723 32229685 32624112 32923506
3847 32923506 33352473 33857276 35157758 34860921 33951757 34964826 35086283 35828106 36199713
3838 36199713 36895515 37351643 37544794 38117375 38035072 38316006 39183050 39919599 39520284 40795278
3828 40795278 41578660 42034242 42546619 43314415 44118696 44195412 46265991 46954941 48525142
$$ packed form
3894B2605122l01247J94541J037717j24370K9772N36097j216402M78357L12966
3885B3552553o5165N20739l99111j501N9331K38935J099404N02600l64054N48113
3875B5691844J74892J00462L08408M57753N3817n5370L93701L95226M07891p07382
3865B7221242N24202K57491M34630P26306Q80432j067574j20788N8067R61769
3856B9875777j94204l33330J125074J723323l78853n064M16962L94427K99394
3847C2923506M28967N04803J300482k96837r09164J013069J21457P41823L71607
3838C6199713O95802M56128J93151N72581q2303K80934Q67044P36549l99315J274994
3828D0795278P83382M55582N12377P67796Q04281P6716K070579O88950J570201
$$ plain form
3819 48525142 49954686 50088941 50264150 52331242 53144945 54551973 55063485 56500354 57740769
3810 57740769 58783720 59728890 61007807 63515600 65206781 67879362 70273137 71163982
3802 71163982 71935923 73609931 75139407 76826846 78308001 80846442 82657784 83657299
3794 83657299 87064315 88879556 90028962 91763348 95219134 96400056 98766202 100785111
3786 100785111 103450330 107005105 108272634 110002871 112242957 115645485 118940724 121713408
3778 121713408 124124577 126834050 129839944 131956749 134512943 136743647 139108278 140886858
3770 140886858 142158841 144702387 146204092 146908109 147383948 147939822 147401257 149378148 150754794
3761 150754794 149302721 148353103 147993561 147038841 144784327 144806907 144345744 142156714 140190470
$$ packed form
3819D8525142J429544J34255J75209K067092Q13703J407028N11512J436869J240415
3810E7740769J042951R45170J278917K507793J691181K672581K393775Q90845
3802G1163982P71941J674008J529476J687439J481155K538441J811342R99515
3794H3657299L407016J815241J149406J734386L455786J180922K366146K018909
3786A00785111K665219L554775J267529J730237K240086L402528L295239K772684
3778A21713408K411169K709473L005894K116805K556194K230704K364631J778580
3770A40886858J271983K543546J501705P04017M75839N55874n38565J976891J376646
3761A50754794j452073r49618l59542r54720k254514K2580m61163k189030j966244
$$ plain form
3752 140190470 138208439 135861114 132544199 129311596 127863534 126289821 122841103 119517834
3744 119517834 117946836 116581589 113713607 110711380 108293436 106190802 103640947 101785036
3736 101785036 99505548 96784602 95155909 93197848 91455641 89480160 88405307 87252392
3728 87252392 85959691 84786313 82903440 82606374 81329487 79543531 78563844 78779679 77372388
3719 77372388 76825440 77215343 76445340 76169756 76688332 77230166 76709442 77619043 77757044
3710 77757044 76915713 77100298 77594820 77794767 78269405 77768823 78381236 78978331 78302424
3701 78302424 78676032 79141439 79148712 79155083 78692979 78353399 78965730 79133531 79433684 78531306
3691 78531306 78020313 78440708 79025992 79590411 79611405 78994736 78839860 78403845 79401541 79634414
$$ packed form
3752A40190470j982031k347325l316915l232603j448062j573713l448718l323269
3744A19517834j570998j365247k867982l002227k417944k102634k549855j855911
3736A01785036k279488k720946j628693j958061j742207j975481j074853j152915
3728H7252392j292701j173378j882873k97066j276887j785956r79687K15835j407291
3719G7372388n46948L89903p70003k75584N18576N41834n20724R09601J38001
3710G7757044q41331J84585M94522J99947M74638n00582O12413N97095o75907
3701G8302424L73608M65407P273O371m62104l39580O12331J67801L00153r02378
3691G8531306n10993M20395N85284N64419K0994o16669j54876m36015R97696K32873
$$ plain form
3681 79634414 78335008 78879972 81043956 80474259 81578210 81624245 81514787 81817468 82632175
3672 82632175 84567828 84758133 86051779 87415452 88517493 89771288 91542942 93146488
3664 93146488 94676128 96447675 98572148 99841693 100808860 104429940 106699378 107659769
3656 107659769 109810801 112184766 114234623 116454818 118877366 120599210 121934580 123692613
3648 123692613 125747690 125980266 127291418 128830173 130256709 131010600 131765643 132799586
3640 132799586 133031105 132437512 131800862 132757058 132871379 130892464 129048298 129109308 129426299
3631 129426299 128933210 127499738 126202296 125618360 125095861 124205526 122440127 121041591 120720898
3622 120720898 119685396 119260524 118837400 116875800 115658357 114933380 114606180 114009743 113485590
$$ packed form
3681G9634414j299406N44964K163984n69697J103951M6035j09458L02681Q14707
3672H2632175J935653J90305J293646J363673J102041J253795J771654J603546
3664I3146488J529640J771547K124473J269545R67167L621080K269438R60391
3656A07659769K151032K373965K049857K220195K422548J721844J335370J758033
3648A23692613K055077K32576J311152J538755J426536P53891P55043J033943
3640A32799586K31519n93593o36650R56196J14321j978915j844166O1010L16991
3631A29426299m93089j433472j297442n83936n22499q90335j765399j398536l20693
3622A20720898j035502m24872m23124j961600j217443p24977l27200n96437n24153
$$ plain form
3613 113485590 113136500 112758082 112595222 111842021 111086347 111129986 111430570 110371818 109278756
3604 109278756 109598137 108899339 107225155 106889318 105005374 103275621 101506543 100399585
3596 100399585 99785471 97843252 96721077 95057457 94089333 92305891 91538083 89194142
3588 89194142 87178155 85565133 83414319 81583438 79884792 78009722 76347017 74476542
3580 74476542 72639014 70142990 68140865 66568289 65055475 63584739 62353848 60898976
3572 60898976 58595641 56835107 55408319 54388462 54070490 52802476 51613674 50300400
3564 50300400 50126270 50420332 49533737 48311553 47238670 47068466 46331273 45734118 45005442
3555 45005442 44168024 45663286 45743197 44966111 43989653 43337326 42863196 41764248 42175402
$$ packed form
3613A13485590l49090l78418j62860p53201p55674M3639L00584j058752j093062
3604A09278756L19381o98798j674184l35837j883944j729753j769078j106958
3596A00399585o14114j942219j122175j663620r68124j783442p67808k343941
3588H9194142k015987j613022k150814j830881j698646j875070j662705j870475
3580G4476542j837528k496024k002125j572576j512814j470736j230891j454872
3572F0898976k303335j760534j426788j019857l17972j268014j188802j313274
3564E0300400j74130K94062q86595j222184j072883j70204p37193n97155p28676
3555D5005442q37418J495262P9911p77086r76458o52327m74130j098948M11154
$$ plain form
3546 42175402 42695283 42734788 42399164 41574469 41418724 40782260 40285030 40724400 39703960
3537 39703960 38625235 38022208 38198446 37691093 37228902 36118586 35936994 35206593 33844927
3528 33844927 33156282 32124600 31881597 31061061 29576322 29828140 29654564 29333781 28772106
3519 28772106 28004506 26453553 26077679 25036161 23758815 23474578 23212490 22803671 22019481
3510 22019481 21159235 20659512 20284599 18926721 19131040 19185614 17945610 17738817 17630364
3501 17630364 18423331 17828138 17610809 17102418 17114971 16905663 15341760 15498182 15916634
3492 15916634 16270691 14243809 13301491 13679060 13747917 13346824 13918561 14579781 14630509 14125832
3482 14125832 13574819 13259646 13872512 13478090 12834014 13146337 11906492 11211123 11533758
$$ packed form
3546D2175402N19881L9505l35624q24695j55745o36464m97230M39370j020440
3537C9703960j078725o03027J76238n07353m62191j110316j81592p30401j361666
3528C3844927o88645j031682k43003q20536j484739K51818j73576l20783n61675
3519B8772106p67600j550953l75874j041518j277346k84237k62088m08819p84190
3510B2019481q60246m99723l74913j357878K04319N4574j240004k06793j08453
3501A7630364P92967n95193k17329n08391J2553k09308j563903J56422M18452
3492A5916634L54057k026882r42318L77569O8857m01093N71737O61220N0728n04677
3482A4125832n51013l15173O12866l94422o44076L12323j239845o95369L22635
$$ plain form
3473 11533758 11831562 11324225 10900374 10360033 11710591 11382161 10275124 11085753 11420624
3464 11420624 10075795 10364017 11596090 10901445 8930086 9340144 10262668 10092293 9358376
3455 9358376 9988468 10700262 10081876 10770270 9742104 9601431 10064646 9748858 9853704
3446 9853704 9888588 9321846 9453241 10091834 10466997 9685175 10594911 10293145 9388412 9979790
3436 9979790 9170437 8400142 8733561 7957959 7556329 8441020 8342298 8593791 7929788 7967816
3426 7967816 7258465 6616769 7056156 7418212 7742642 7392460 7535993 7383651 8508831
3417 8508831 8657154 8036657 8174318 7451436 7748422 8653899 8103932 7369968 6989445 6732298
3407 6732298 7738417 7471980 7783936 8276178 9033728 8838713 7812534 7784506 7672668
$$ packed form
3473A1533758K97804n07337m23851n40341J350558l28430j107037Q10629L34871
3464A1420624j344829K88222J232073o94645j971359M10058R22524j70375p33917
3455I358376O30092P11794o18386O88394j028166j40673M63215l15788J04846
3446I853704L4884n66742J31395O38593L75163p81822R09736l01766r04733N91378
3436I979790q09353p70295L33419p75602m01630Q84691r8722K51493o64003L8028
3426G967816p09351o41696M39387L62056L24430l50182J43533j52342J125180
3417H508831J48323o20497J37661p22882K96986R05477n49967p33964l80523k57147
3407F732298J006119k66437L11956M92242P57550j95015j026179k8028j11838
$$ plain form
3398 7672668 7739871 7701777 6873614 6485927 7159096 7549938 7537961 7485293 8001466 7345293
3388 7345293 7179593 7016742 7603460 8622418 8596049 7865248 7090780 7403904 8138983 8118992
3378 8118992 7152834 7591139 8465453 7873847 7242569 7276038 7224394 6539542 6486050 7092476
3368 7092476 8888348 7799948 7554608 7667496 8073661 8466046 7943920 7523632 7210730
3359 7210730 7628785 8626583 8099251 8557671 8826281 9493457 9529598 9039403 9024018 8837149
3349 8837149 8961229 8282005 9326539 8974725 8916168 9891407 9416902 9625247 9238038 8415889
3339 8415889 8351817 8726251 8666818 9067029 9385346 8747350 8663596 9144408 10211376 10577676
3329 10577676 10455359 10740594 11283004 11566187 11462742 9724762 9845347 9900380 10689866
$$ packed form
3398G672668O7203l8094q28163l87687O73169L90842j1977n2668N16173o56173
3388G345293j65700j62851N86718J018958k6369p30801p74468L13124P35079j9991
3378H118992r66158M38305Q74314n91606o31278L3469n1644o84852n3492O06426
3368G092476J795872j088400k45340J12888M06165L92385n22126m20288l12902
3359G210730M18055R97798n27332M58420K68610O67176L6141m90195j5385j86869
3349H837149J24080o79224J044534l51814n8557R75239m74505K08345l87209q22149
3339H415889o4072L74434n9433M00211L18317o37996q3754M80812J066968L66300
3329A0577676j22317K85235N42410K83183j03445j737980J20585N5033P89486
$$ plain form
3320 10689866 11095629 10862817 11541698 12538927 11559850 12149968 12584302 12477883 13592013
3311 13592013 13446353 13662203 14885345 15549341 15363112 15660623 16264163 17873174 18622285
3302 18622285 19326354 19848339 21073392 21750772 22406035 23484420 23726258 23279235 23387042
3293 23387042 24454925 23786616 24516294 24659603 23447085 21993286 21588187 21278752 20745828
3284 20745828 20126189 20667631 19703001 19490591 19886390 19902656 20630414 20511721 21311713 22078675
3274 22078675 22893549 23012066 23888935 24882945 25136563 26226950 27830028 28709652 29069773
3265 29069773 29383300 30218271 31361035 31581765 31506363 32318629 33609435 33000141 32757896
3256 32757896 33313482 32985458 33130628 33286385 32537514 33188739 32629275 33105617 33527065
$$ packed form
3320A0689866M05763k32812O78881R97229r79077N90118M34334j06419J114130
3311A3592013j45660K15850J223142O63996j86229K97511O03540J609011P49111
3302A8622285P04069N21985J225053O77380O55263J078385K41838m47023J07807
3293B3387042J067883o68309P29678J43309j212518j453799m05099l09435n32924
3284B0745828o19639N41442r64630k12410L95799J6266P27758j18693P99992P66962
3274B2078675Q14874J18517Q76869R94010K53618J090387J603078Q79624L60121
3265B9069773L13527Q34971J142764K20730p5402Q12266J290806o09294k42245
3256C2757896N55586l28024J45170J55757p48871O51225n59464M76342M21448
$$ plain form
3247 33527065 33594631 34102027 35418855 37589829 38491385 40543174 41733517 44634284 47310214
3238 47310214 48998726 51143646 54826944 59279616 63560856 67912873 71781029 74882165
3230 74882165 77560123 80205268 82279313 82298804 81603428 79389075 75620399 71179333 66596171
3221 66596171 60384956 55487480 51057981 47470912 45053492 41105592 38462619 36156780
3213 36156780 33892132 30654347 28935562 28040288 26830871 26504274 25428611 23972893
3205 23972893 22675469 22178092 21553932 21397688 20954996 20258675 20007689 19594370 19052724
3196 19052724 17902178 17356549 17108386 17500254 18449680 16947688 16012395 16599013 16689422
3187 16689422 15360637 13724260 13270599 13353342 13367828 13190510 12435548 12507027 12149319 11914632
$$ packed form
3247C3527065O7566N07396J316828K170974R01556K051789J190343K900767K675930
3238D7310214J688512K144920L683298M452672M281240M352017L868156L101136
3230G4882165K677958K645145K074045J9491o95376k214353l768676m441066m583162
3221F6596171o211215m897476m429499l587069k417420l947900k642973k305839
3213C6156780k264648l237785j718785q95274j209417l26597j075663j455718
3205B3972893j297424m97377o24160j56244m42692o96321k50986m13319n41646
3196A9052724j150546n45629k48163L91868R49426j501992r35293N86618R0409
3187A6689422j328785j636377m53661Q2743J4486j77318p54962P1479l57708k34687
$$ plain form
3177 11914632 12046741 11426534 10781528 10124473 10408270 10013120 10271743 9640350 9329649
3168 9329649 8593428 8248832 7790028 7158429 8205970 7570042 7456072 8099617 7723311
3159 7723311 7638799 6706950 7360826 7685361 6906994 7663456 6773924 6464401 5432878 6068709
3149 6068709 7259056 6510536 6525472 5881064 5909219 5640396 5704079 5920997 5642534 5635072
3139 5635072 5811177 5489336 5145062 5600585 4509411 3750618 5001529 5208169 3854073
3130 3854073 5124432 4057011 4190908 5481403 5036063 4969022 4307409 4054007 4206423
3121 4206423 4349294 4302049 3921505 3909650 3880551 3764907 4501775 3928530 2914078 3636246
3111 3636246 4759592 4909611 5005845 4009525 3847690 4253910 3440945 2998784 2277104 2881276
$$ packed form
3177A1914632J32109o20207o45006o57055K83797l95150K58623o31393l10701
3168I329649p36221l44596m58804o31599J047541o35928j13970O43545l76306
3159G723311q4512r31849O53876L24535p78367P56462q89532l09523j031523O35831
3149F068709J190347p48520J4936o44408K8155k68823O3683K16918k78463p462
3139E635072J76105l21841l44274M55523j091174p58793J250911K06640j354096
3130C854073J270359j067421J33897J290495m45340o7041o61613k53402J52416
3121D206423J42871m7245l80544j1855k9099j15644P36868n73245j014452P22168
3111C636246J123346J50019R6234r96320j61835M06220q12965m42161p21680O04172
$$ plain form
3101 2881276 3008499 3298305 3184127 2838486 2965551 2937072 3196646 3740608 3655884 2499884
3091 2499884 3261716 3539910 2846858 1965657 2363273 2550444 2494610 3403197 3236710 2479777
3081 2479777 3026482 3205905 3750706 4026968 3528467 2341829 2021864 2506766 2474181 2342969
3071 2342969 3171236 3992442 4116609 2283456 2366258 2325304 3196299 3215820 2884458 2561377
3061 2561377 2329503 3171987 3140012 2569014 2703550 2803260 2429624 1885686 2277698 2988814
3051 2988814 2805900 2298426 1692300 2052360 1465790 1625338 1688975 2611783 2949999 1754670
3041 1754670 1874279 1818781 1903730 2190240 2332121 2265665 1832348 1834644 2470656 2145000
3031 2145000 2265942 2734550 2793116 2438631 2065381 1582865 1374050 1960755 2092067 2171721
$$ packed form
3101B881276J27223K89806j14178l45641J27065k8479K59574N43962q4724j156000
3091B499884P61832K78194o93052q81201L97616J87171n5834R08587j66487p56933
3081B479777N46705J79423N44801K76262m98501j186638l19965M84902l2585j31212
3071B342969Q28267Q21206J24167j833153Q2802m0954Q70995J9521l31362l23081
3061B561377k31874Q42484l1975n70998J34536R9710l73636n43938L92012P11116
3051B988814j82914n07474o06126L60060n86570J59548O3637R22808L38216j195329
3041A754670J19609n5498Q4949K86510J41881o6456m33317K296O36012l25656
3031B145000J20942M68608N8566l54485l73250m82516k08815N86705J31312P9654
$$ plain form
3021 2171721 1770621 2952267 3149563 3438295 2331675 1988564 2300915 2857355 2770961
3012 2770961 2795248 1826485 1434014 1575221 1721237 2078260 2882761 2492851 2264045 1705033
3002 1705033 2747636 3015486 2672983 3121473 3377308 2762983 1589360 2446309 2765590
2993 2765590 3522263 3091606 3077279 2250535 2282191 2508085 1759736 2714975 2802544 2634740
2983 2634740 2785979 1972719 2847746 2412753 2010171 3167603 3302076 3149227 2299255
2974 2299255 2787097 3053784 2800772 2659915 2198846 2611530 2916204 3217954 3204791 4134325
2964 4134325 3814842 3898180 3737482 3761328 4242203 3870218 4779242 4225087 4613342 4476846
2954 4476846 4342327 4842353 4174759 4131703 3676737 3701647 3997824 4780659 4721476 5882917
$$ packed form
3021B171721m01100J181646J97296K88732j106620l43111L12351N56440q6394
3012B770961K4287r68763l92471J41207J46016L57023Q04501l89910k28806n59012
3002A705033J042603K67850l42503M48490K55835o14325j173623Q56949L19281
2993B765590P56673m30657j4327q26744L1656K25894p48349R55239Q7569j67804
2983B634740J51239q13260Q75027m34993m02582J157432J34473j52849q49972
2974B299255M87842K66687k53012j40857m61069M12684L04674L01750j3163R29534
2964D134325l19483Q3338j60698K3846M80875l71985R09024n54155L88255j36496
2954D476846j34519N00026o67594m3056m54966K4910K96177P82835n9183J161441
$$ plain form
2944 5882917 4964531 4552697 4394531 4701188 4551598 4631704 4480515 4453678 4880509 4853409
2934 4853409 5923810 5832090 5748518 6016457 5426781 5269215 5556267 4828962 4972205 5550614
2924 5550614 5817390 5628625 5624107 6010421 7225146 6799587 7109230 6706107 6568863 6810692
2914 6810692 7582612 7721327 7481015 8049210 9206321 8599057 8580228 6922469 7683679
2905 7683679 7766104 7555416 7454147 7551794 8427323 9151930 9375249 9018112 9133661 8856044
2895 8856044 10076803 10492391 10612310 11066924 11892510 10392747 10939340 11711190 11840173
2886 11840173 12394353 11975119 11719554 11710976 10469034 10214872 10072165 9986264 9613522 9928519
2876 9928519 8674964 8141943 8820884 9021204 8921435 9698959 9621246 9524719 10080174 10360527
$$ packed form
2944E882917r18386m11834j58166L06657j49590Q0106j51189k6837M26831k7100
2934D853409J070401r1720q3572K67939n89676j57566K87052p27305J43243N78409
2924E550614K66776j88765m518L86314J214725m25559L09643m03123j37244K41829
2914F810692P71920J38715k40312N68195J157111o07264j8829j657759P61210
2905G683679Q2425k10688j01269R7647Q75529P24607K23319l57137J15549k77617
2895H856044J220759M15588J19919M54614Q25586j499763N46593P71850J28983
2886A1840173N54180m19234k55565q578j241942k54162j42707q5901l72742L14997
2876I928519j253555n33021O78941K00320r9769P77524p7713r6527N55455K80353
$$ plain form
2866 10360527 9935525 10602004 9137683 9072917 9421314 10233128 10151818 10138065 10631296 9510948
2856 9510948 9257959 9687721 9403016 8487814 7850049 7895378 8600033 7926418 6894656 5732419
2846 5732419 5564995 6226745 7667967 8160662 7550344 6662905 7319500 7218148 7108730
2837 7108730 6826760 6737630 6250735 6079661 5188379 5142102 5182453 4565612 4650565 5043434
2827 5043434 5236071 5434499 5003354 5154485 3425928 2421289 2922746 3205760 3103794
2818 3103794 2561030 2429486 3085227 3291750 3384224 3027747 3161762 3033451 2415589 3045368
2808 3045368 2552063 3665078 2744624 1245784 1110122 2284787 3152695 1975354 1557323
2799 1557323 1843195 2203450 1281836 1730316 1663518 1374447 1707282 542556 1405821 1579863
$$ packed form
2866A0360527m25002O66479j464321o4766L48397Q11814q1310j3753M93231j120348
2856I510948k52989M29762k84705r15202o37765M5329P04655o73615j031762j162237
2846E732419j67424O61750J441222M92695o10318q87439O56595j01352j09418
2837G108730k81970q9130m86895j71074q91282m6277M0351o16841Q4953L92869
2827E043434J92637J98428m31145J51131j728557j004639N01457K83014j01966
2818C103794n42764j31544O55741K06523R2474l56477J34015j28311o17862O29779
2808C045368m93305J113015r20454j498840j35662J174665Q67908j177341m18031
2799A557323K85872L60255r21614M48480o6798k89071L32835j164726Q63265J74042
$$ plain form
2789 1579863 1025075 1231665 814716 114063 513151 949733 234064 307790 634924 317322
2779 317322 1657565 1910503 46687 -260916 26355 28797 1197236 1998195 1183154 1225498
2769 1225498 586692 928361 403137 1270866 1517280 944165 1230747 38905 -522488
2760 -522488 -213463 354362 150320 946616 677538 914572 748453 558967 300731 210450
2750 210450 -374840 -148834 -160073 -1703542 -1182909 -893459 -73685 323516 566143 232844
2740 232844 247012 -270173 -171920 1304025 493066 -329582 -146487 -308137 -635392 -633221
2730 -633221 -711929 447200 466981 -558594 -1192587 181744 1356877 1220123 620176
2721 620176 313881 138029 420594 2172881 2677364 1420678 726645 430943 174138
$$ packed form
2789A579863n54788K06590m16949p00653L99088M36582p15669P3726L27134l17602
2779C17322J340243K52938j863816l07603K87271K442J168439Q00959q15041M2344
2769A225498o38806L41669n25224Q67729K46414n73115K86582j191842n61393
2760e22488L09025N67825k04042P96296k69078K37034j66119j89486k58236r0281
2750B10450n85290K26006j1239j543469N20633K89450Q19774L97201K42627l33299
2740B32844J4168n17185R8253J475945q10959q22648J83095j61650l27255K171
2730f33221p8708J159129J9781j025575o33993J374331J175133j36754n99947
2721F20176l06295j75852K82565J752287N04483j256686o94033k95702k56805
$$ plain form
2712 174138 -116517 -123435 -34982 -449576 -60883 126285 620325 84815 -309176 15632
2702 15632 587983 774164 -920676 -1682626 -1473246 -733145 -357296 -599380 -393430 -660244
2692 -660244 -834183 -1069942 -1094808 -448001 -1205851 -702730 -296634 -958300 -960673 -700788
2682 -700788 -813220 -1363220 -853860 -1178814 -367498 106879 -872607 911932 684857 -448314
2672 -448314 -1018686 -635156 -426928 151570 242766 -575503 12039 -303367 -402142 -621435
2662 -621435 -317934 -442391 -820787 -866440 -845858 275676 581819 511673 674096 587229
2652 587229 947366 -308103 -718017 -571251 -754797 -455846 341287 -132045 106639 20182
2642 20182 -393158 -662029 -728556 -1131351 -119566 -306775 -586369 -776377 -839272 69271
$$ packed form
2712A74138k90655o918Q8453m14594L88693J87168M94040n35510l93991L24808
2702A5632N72351J86181j694840p61950K09380P40101L75849k42084K05950k66814
2692f60244j73939k35759k4866O46807p57850N03121M06096o61666k373K59885
2682g00788j12432n50000N09360l24954Q11316M74377r79486J784539k27075j133171
2672d48314n70372L83530K08228N78498R1196q18269N87542l15406r8775k19293
2662f21435L03501j24457l78396m5653K0582J121534L06143p0146J62423q6867
2652E87229L60137j255469m09914J46766j83546K98951P97133m73332K38684q6457
2642B0182m13340k68871o6527m02795J011785j87209k79594j90008o2895R08543
$$ plain form
2632 69271 564615 92502 580958 75567 -582077 -813398 -874108 -619977 -1030071 -724663
2622 -724663 755225 1209508 268697 -841844 -75989 392269 -89414 -361809 -125889
2613 -125889 1423209 222742 -852508 -709950 -157669 -636353 -219418 144804 -328181
2604 -328181 391474 1022175 8518 98692 -778298 -191885 486213 154467 -323473 659558
2594 659558 -62559 264589 687904 959215 3596 -601845 -288298 583329 936250 100033
2584 100033 622967 627679 435319 434417 -99034 151589 -617732 19940 415507 531162 226053
2573 226053 -128620 -439158 -1363153 -171484 395389 -14319 -556786 -774305 -244903 -580703
2563 -580703 -859540 -680666 -1042585 -1024068 -1340626 -534797 -236745 -1194249 -985081 -1437934
$$ packed form
2632F9271M95344m72113M88456n05391o57644k31321o0710K54131m10094L05408
2622g24663J479888M54283r40811j110541P65855M68258m81683k72395K35920
2613a25889J549098j200467j075250J42558N52281m78684M16935L64222m72985
2604c28181P19655O30701j013657R0174q76990N86413O78098l31746m77940R83031
2594F59558p22117L27148M23315K71311r55619o05441L13547Q71627L52921q36217
2584A00033N22934M712j92360r02n33451K50623p69321O37672L95567J15655l05109
2573B26053l54673l10538r23995J191669N66873m09708n42467k17519N29402l35800
2563e80703k78837J78874l61919J8517l16558Q05829K98052r57504K09168m52853
$$ plain form
2553 -1437934 -1136640 -719597 -173348 462054 -569117 -317711 -492883 -43444 -138463 -374668
2543 -374668 -1148671 -1165997 -1624488 -1607931 -1188258 -749403 -895136 -605772 -872733 -1076576
2533 -1076576 -288826 349618 -92620 -279680 -807071 -118023 -874869 -1493469 -578307 395811
2523 395811 665081 461579 -748914 -1065344 -1060916 -306937 -135268 -845127 -1349265 218365
2513 218365 1127492 493624 -743889 -550808 552311 -672264 -253189 -770071 -509260
2504 -509260 -888219 -818338 -171165 88761 -331230 -686541 -159624 -312867 143778 -410242
2494 -410242 -585686 488152 77110 -760852 -519617 -1185224 -775250 -927863 -1147395 -518886
2484 -518886 -586402 -857637 -895563 -278347 -56605 365613 -202311 -98170 -224062 -1248434
$$ packed form
2553a437934L01294M17043N46249O35402j031171K51406j75172M49439r5019k36205
2543c74668p74003j7326m58491J6557M19673M38855j45733K89364k66961k03843
2533a076576P87750O38444m42238j87060n27391O89048p56846o18600R15162R74118
2523C95811K69270k03502j210493l16430M428P53979J71669p09859n04138J567630
2513B18365R09127o33868j237513J93081J103119j224575M19075n16882K60811
2504e09260l78959O9881O47173K59926m19991l55311N26917j53243M56645n54020
2494d10242j75444J073838m11042q37962K41235o65607M09974j52613k19532O28509
2484e18886o7516k71235l7926O17216K21742M22218n67924J04141j25892j024372
$$ plain form
2474 -1248434 -1783809 -1054454 -767580 -1059095 -1190627 -1311766 -947888 -307643 -416961 -237528
2464 -237528 399855 -133104 -1499073 -1452318 -977426 -641865 -1331105 -722236 -868934 648446
2454 648446 1264047 -518981 -1673678 -1262655 -611034 -1158295 -645346 207828 900378
2445 900378 735520 47670 -102026 -433349 -273753 -61792 428151 370725 -497690 -392106
2435 -392106 -866765 -279011 -584907 -1267257 -1673360 -1389589 -479806 -574676 -78155 -380604
2425 -380604 -1241518 -1515568 -576535 -128360 -440826 192930 -259232 -926258 110325 580280
2415 580280 -565022 -1349324 -1014700 -958018 -152137 -262171 -360356 -235768 -709382 -770943
2405 -770943 -301644 117669 -681188 -1621863 -1341360 -817654 -727574 -836832 -608971 -777682
$$ packed form
2474a248434n35375P29355K86874k91515j31532j21139L63878O40245j09318J79433
2464b37528O37383n32959j365969M6755M74892L35561o89240O08869j46698J517380
2454F48446O15601j783028j154697M11023O51621n47261N12949Q53174O92550
2445I00378j64858o87850j49696l31323J59596K11961M89943n7426q68415J05584
2435c92106m74659N87754l05896o82350m06103K83771R09783r4870M96521l02449
2425c80604q60914k74050R39033M48175l12466O33756m52162o67026J036583M69955
2415E80280j145302p84302L34624N6682Q05881j10034r8185J24588m73614o1561
2405g70943M69299M19313p98857r40675K80503N23706R0080j09258K27861j68711
$$ plain form
2395 -777682 -846613 -329325 330894 -266194 -62157 -847062 -805753 -959482 -1094786 -380934
2385 -380934 -1500147 -484559 207753 -647491 -345481 597148 -120843 -228007 661963
2376 661963 487382 136328 -334368 -574178 -276 -401204 -816034 -1292892 -172151 342788
2366 342788 -154767 -679524 -512687 -499451 -699514 -683215 -981623 -891824 18791 -372042
2356 -372042 779734 1428372 486970 943904 1492536 1622298 897532 579875 783585 -91228
2346 -91228 -1319050 -772074 124374 -372077 35290 254255 646787 1072638 763090 -154210
2336 -154210 -1184203 -831731 -443248 -258182 4621 -251440 -781110 -720980 -1665100 -1883564
2326 -1883564 -871510 -583391 190077 -394102 -923658 232718 511387 -201414 -247767
$$ packed form
2395g77682o8931N17288O60219n97088K04037p84905M1309j53729j35304P13852
2385c80934j119213J015588O92312q55244L02010R42629p17991j07164Q89970
2376F61963j74581l51054m70696k39810N73902m00928m14830m76858J120741N14939
2366C42788m97555n24757J66837J3236k00063J6299k98408Q9799R10615l90833
2356c72042J151776O48638r41402M56934N48632J29762p24766l17657K03710q74813
2346i1228j227822N46976Q96448m96451M07367K18965L92532M25851l09548r17300
2336a54210j029993L52472L88483J85066K62803k56061n29670O0130r44120k18464
2326a883564J012054K88119P73468n84179n29556J156376K78669p12801m6353
$$ plain form
2317 -247767 970087 698552 -705089 -816904 -397097 734795 -494499 -950475 -176354
2308 -176354 -152030 276501 529948 306575 624266 789430 286034 -610687 -744787 -151654
2298 -151654 174912 -179456 412740 474867 277066 24141 -138678 -326491 -832246 -489170
2288 -489170 -799560 -118494 377182 -167724 -821198 -375194 -597723 -22741 -171072 -163954
2278 -163954 97901 -136676 -1344409 -447305 137857 9744 -244887 385572 -777367
2269 -777367 -1083008 -142935 -773039 -505005 -1102527 -338362 29645 310827 243693 -209410
2259 -209410 85305 -449510 372145 1739203 1667249 17803 -282707 -419880 -571001 600024
2249 600024 932400 810553 790822 1284184 962640 720262 723073 1438947 1326126 1100699
$$ packed form
2317b47767J217854k71535j403641j11815M19807J131892j229294m55976P74121
2308a76354K4324M28531K53447k23373L17691J65164n03396q96721j34100N93133
2298a51654L26566l54368N92196O2127j97801k52925j62819j87813n05755L43076
2288d89170l10390O81066M95676n44906o53474M46004k22529N74982j48331P118
2278a63954K61855k34577j207733Q97104N85162j28113k54631O30459j162939
2269g77367l05641R40073o30104K68034n97522P64165L68007K81182o7134m53103
2259b09410K94715n34815Q21655J367058p1954j649446l00510j37173j51121J171025
2249F00024L32376j21847j9731M93362l21544k42378K811P15874j12821k25427
$$ plain form
2239 1100699 358967 420263 1100407 1026549 628530 1021689 86245 527017 1233823 1335392
2229 1335392 1114592 404722 434328 1142621 1054326 -3475 -364459 47046 540134 165241
2219 165241 241237 1106551 1320047 1497572 2862564 2032921 1918242 909651 917651 1083921
2209 1083921 1831222 2247427 1585542 896010 674475 602357 1245515 1250634 1830395 2194827
2199 2194827 1953466 2117040 1803050 2317712 2711563 3250098 2986060 2728155 2456723 2521313
2189 2521313 2922628 3254722 3305211 3481591 3907636 2849311 3383761 3447344 3150846 3784580
2179 3784580 4548070 5054763 4433575 4198405 4101611 4943669 5060420 5138861 5184758 4598918
2169 4598918 5686895 5805923 5925749 5912468 5599912 5690535 5413567 6509793 6526698 6998342
$$ packed form
2239A100699p41732O1296O80144p3858l98019L93159r35444M40772P06806J01569
2229A335392k20800p09870K9606P08293q8295j057801l60984M11505M93088l74893
2219A65241P5996Q65314K13496J77525J364992q29643j14679j008591Q000J66270
2209A083921P47301M16205o61885o89532k21535p2118O43158N119N79761L64432
2199B194827k41361J63574l13990N14662L93851N38535k64038k57905k71432O4590
2189B521313M01315L32094N0489J76380M26045j058325N34450O3583k96498O33734
2179C784580P63490N06693o21188k35170r6794Q42058J16751P8441M5897n85840
2169D598918J087977J19028J19826j3281l12556R0623k76968J096226J6905M71644
$$ plain form
2159 6998342 6180643 5835010 6457263 7086153 7287138 7059439 7563021 8454996 8674794 9262273
2149 9262273 9873056 9688462 9529492 9396608 9548145 10202275 10612303 11478440 11065966 10427355
2139 10427355 10383735 11735025 11962843 11282794 11630568 11093592 11793370 13571194 13592099
2130 13592099 13692301 14091404 15041609 15594623 15642609 16987023 17967054 17996259 17864176 18218714
2120 18218714 20372143 21660854 22897213 24105926 24862809 25772427 27066341 30069063
2112 30069063 30688854 31867529 33705842 36358785 37964662 41112406 44458793 46366706
2104 46366706 50105359 54280490 58603055 63128797 69357995 77338326 85822132 96948565
2096 96948565 110292211 126088915 147046823 173348551 193051499 211539114 234960095
$$ packed form
2159F998342q17699l45633O22253O28890K00985k27699N03582Q91975K19798N87479
2149I262273O10783j84594j58970j32884J51537O54130M10028Q66137m12474o38611
2139A0427355m3620J351290K27818o80049L47774n36976O99778J777824K0905
2130A3592099J00202L99103R50205N53014M7986J344414R80031K9205j32083L54538
2120A8218714K153429J288711J236359J208713P56883R09618J293914L002722
2112C0069063O19791J178675J838313K652943J605877L147744L346387J907913
2104D6366706L738653M175131M322565M525742O229198P980331Q483806J1126433
2096I6948565J3343646J5796704K0957908K6301728J9702948J8487615K3420981
$$ plain form
2089 234960095 263479897 285418813 277965828 250795658 212914038 176638104 148154328
2082 148154328 125820716 106691217 91871642 80410576 71747183 64895373 58574007
2075 58574007 53471716 50185242 47054164 43578852 39873637 36181630 32091753 29848663
2067 29848663 28597676 26700894 25406493 24163348 23225253 20778226 19430218 18498997
2059 18498997 17470174 17666362 16593438 14808496 14650749 13690804 13253703 12424367 12391212
2050 12391212 11686189 11031367 10978684 10779451 10771926 10934598 9822013 8896190 8780644 9097610
2040 9097610 8931282 9265803 8752792 7943112 6855232 6675984 6948605 6589728 6380175
2031 6380175 6123764 6608837 5741113 5157682 5584371 5124633 4765444 4664934 5087604 4389526
$$ packed form
2089B34960095K8519802K1938916p452985k7170170l7881620l6275934k8483776
2082A48154328k2333612j9129499j4819575j1461066q663393o851810o321366
2075E8574007n102291l286474l131078l475312l705215l692007m089877k243090
2067B9848663j250987j896782j294401j243145r38095k447027j348008r31221
2059A8498997j028823J96188j072924j784942j57747r59945m37101q29336l3155
2050A2391212p05023o54822n2683j99233p525J62672j112585r25823j15546L16966
2040I097610j66328L34521n13011q09680j087880j79248K72621l58877k09553
2031F380175k56411M85073q67724n83431M26689m59738l59189j00510M22670o98078
$$ plain form
2021 4389526 3907230 4002202 4909150 4543311 5016765 4953539 4387972 4916820 3999660 3728698
2011 3728698 3135668 3133747 4132157 3519034 2900139 3578037 2628680 1642092 1335585 1951122
2001 1951122 1709162 1393029 657001 426523 956561 1176360 1361921 1751163 1841639 1880077
1991 1880077 1682406 2053190 2868777 2326780 1817311 1746234 2369844 1926371 1535553 1298503
1981 1298503 1389620 1483548 2219985 630299 990818 2373324 1572538 339898 653488
1972 653488 1233987 1281089 1592208 522189 580638 177232 1280258 1557793 1775911 1506922
1962 1506922 1131284 1077643 537975 277506 769289 724761 832555 821091 -6470 229004
1952 229004 546895 595050 794740 -162178 -100143 125682 424629 423920 111062 -1025316
$$ packed form
2021D389526m82296R4972R06948l65839M73454o3226n65567N28848r17160k70962
2011C728698n93030j921R98410o13123o18895O77898r49357r86588l06507O15537
2001A951122k41960l16133p36028k30478N30038K19799J85561L89242R0476L8438
1991A880077j97671L70784Q15587n41997n09469p1077O23610m43473l90818k37050
1981A298503R1117R3928P36437j589686L60519J382506q00786j232640L13590
1972F53488N80499M7102L11119j070019N8449m03406J103026K77535K18118k68989
1962A506922l75638n3641n39668k60469M91783m4528J07794j1464q27561K35474
1952B29004L17891M8155J99690r56918O2035K25825K98947p09l12858j136378
$$ plain form
1942 -1025316 -79579 -494053 -320246 -419070 -1344410 166282 -59016 -89072 803629 618882
1932 618882 1296485 303130 394200 -426182 -423990 522984 37036 449953 676277 151254
1922 151254 -544687 -1041857 141180 301975 -664125 -388526 -370921 73156 -829815 -612362
1912 -612362 459430 373785 -736201 101638 -329108 656996 529443 19804 -409396 -921283
1902 -921283 -805836 -373248 -814049 -938471 352488 730793 424132 141162 -478180 92238
1892 92238 276948 696297 930405 361570 404410 417831 40397 -604440 -363040 278388
1882 278388 661109 -207848 -69099 -373422 -1204587 -689054 -412453 -446018 -167768 160715
1872 160715 -500138 -427813 -787417 -712218 -931127 -132624 213421 619923 -254834 -1306223
$$ packed form
1942a025316R45737m14474J73807r8824r25340J510692k25298l0056Q92701j84747
1932F18882O77603r93355R1070q20382K192R46974m85948M12917K26324n25023
1922A51254o95941m97170J183037J60795r66100K75599J7605M44077r02971K17453
1912f12362J071792q5645j109986Q37839m30746R86104j27553n09639m29200n11887
1902i21283J15447M32588m40801j24422J290959L78305l06661k82970o19342N70418
1892I2238J84710M19349K34108n68835M2840J3421l77434o44837K41400O41428
1882B78388L82721q68957J38749l04323q31165N15533K76601l3565K78250L28483
1872A60715o60853P2325l59604P5199k18909P98503L46045M06502q74757j051389
$$ plain form
1862 -1306223 -1115083 -466052 322826 203095 216987 -173245 352761 -30688 -10800 -208744
1852 -208744 113966 101456 -57839 176728 450337 1177181 53716 -257873 326365 -372074
1842 -372074 -459920 74963 403456 -662924 -101471 1186552 431865 627329 1065693 311315
1832 311315 -54212 -694976 -1249244 -365126 400193 -280478 -695401 103180 614032 355330
1822 355330 80388 1158478 1716786 1499941 2462684 1825444 954082 711693 765165 207398
1812 207398 291340 156605 -57084 -928729 -231915 471427 487758 215905 164695 593126
1802 593126 487963 -581663 -1476000 -1323294 -1121198 -487132 205520 530437 -538105
1793 -538105 -632390 216279 691096 791681 314691 198110 -632562 -1058955 260937 489707
$$ packed form
1862a306223J91140O49031P88878j19731J3892l90232N26006l83449J9888j97944
1852b08744L22710j2510j59295K34567K73609P26844j123465l11589N84238o98439
1842c72074q7846N34883L28493j066380N61453J288023p54687J95464M38364p54378
1832C11315l65527o40764n54268Q84118P65319o80671m14923P98581N10852k58702
1822C55330k74942J078090N58308k16845R62743o37240q71362k42389N3472n57767
1812B07398Q3942j34735k13689q71645O96814P03342J6331k71853n1210M28431
1802E93126j05163j069626q94337J52706K02096O34066O92652L24917j068542
1793e38105r4285Q48669M74817J00585m76990j16581q30672m26393J319892K28770
$$ plain form
1783 489707 -324941 -313695 -117309 111923 505576 -364797 -867269 -1058821 -1090659 -691427
1773 -691427 -282399 432703 1428764 -537809 -700749 574828 994649 822058 158727
1764 158727 -212542 -290537 -238980 21476 449463 561344 372397 -75413 -372658 630312
1754 630312 827886 -56045 14271 -922728 616160 211689 -535722 -374099 -284722 -386992
1744 -386992 -525852 -690643 -1844093 -1165531 81977 85161 -465655 -301076 582361 1041927
1734 1041927 -286723 -273228 518991 16545 171580 1084786 919932 312035 222088 141164
1724 141164 -1371914 -1587547 -1770200 -725587 -353492 -326513 -39519 -306242 -106281 -577429
1714 -577429 -783690 -13750 421458 623367 980650 253725 -1345918 -1161524 -439497 -538424
$$ packed form
1783D89707q14648J1246J96386K29232L93653q70373n02472j91552l1838L99232
1773f91427M09028P15102R96061j966573j62940J275577M19821j72591o63331
1764A58727l71269p7995N1557K60456M27987J11881j88947m47810k97245J002970
1754F30312J97574q83931P0316r36999J538888m04471p47411J61623Q9377j02270
1744c86992j38860j64791j153450O78562J247508L184n50816J64579Q83437M59566
1734A041927j328650J3495P92219n02446J55035R13206j64854o07897q9947q0924
1724A41164j513078k15633j82653J044613L72095K6979K86994k66723J99961m71148
1714e77429k06261P69940M35208K01909L57283p26925j599643J84394P22027r8927
$$ plain form
1704 -538424 -433699 518757 914451 -109893 -568212 -161528 -58904 -378376 -407394 -357187
1694 -357187 13088 532762 -564852 -303021 -412163 -1384335 -1312599 -1266706 -1329247 -1578061
1684 -1578061 -534227 -1406440 -763795 -1218460 -926715 -778823 -1408641 -658509 -453434
1675 -453434 -757108 43598 -525384 -690671 1197256 605601 -74051 -344637 -344443 -1510405
1665 -1510405 -2193675 -1593566 -991457 -397868 -706160 -1199303 -1119663 251933 777614 252835
1655 252835 158154 -248290 -1114052 -224790 -76710 -807326 -831095 -128311 170166 83728
1645 83728 -376670 -869501 -226063 -154567 243484 -200464 -1184823 -527459 155804 -342245
1635 -342245 -1046149 -503021 250022 397459 796902 540075 1140709 772991 685603 442854
$$ packed form
1704e38424J04725R52456L95694j024344m58319M06684J02624l19472k9018N0207
1694c57187L70275N19674j097614K61831j09142r72172P1736M5893o2541k48814
1684a578061J043834q72213O42645m54665K91745J47892o29818P50132K05075
1675d53434l03674Q00706n68982j65287J887927n91655o79652k70586J94j165962
1665a510405o83270O00109O02109N93589l08292m93143P9640J371596N25681n24779
1655B52835r4681m06444q65762Q89262J48080p30616k3769P02784K98477q6438
1645H3728m60398m92831O43438P1496L98051m43948r84359O57364O83263m98049
1635c42245p03904N43128P53043J47437L99443k56827O00634l67718q7388k42749
$$ plain form
1625 442854 1049772 -489629 -1637046 -779223 -1022419 -450039 -350287 462608 338042 393671
1615 393671 466834 -380975 -408254 -598739 -532236 -125046 -561906 -910167 -1153059 189958
1605 189958 318097 232784 378289 -642309 75848 760326 -91208 137653 203742 -345013
1595 -345013 -276245 -94958 52550 -118069 -162776 387416 -275424 763588 1128179 1090472
1585 1090472 -894244 -1278320 294186 -788690 -723736 -41576 778680 228569 -130688
1576 -130688 -436887 -345060 -665941 -992320 -243413 187413 455598 846 -598820 -457586
1566 -457586 -696207 -547076 -342749 122771 607949 559881 360942 807162 496320 287129
1556 287129 477028 951999 686231 575796 -605346 -87879 575284 -1046332 -609626
$$ packed form
1625D42854O06918j539401j147417Q57823k43196N72380R9752Q12895j24566N5629
1615C93671P3163q47809k7279j90485O6503M07190m36860l48261k42892J343017
1605A89958J28139q5313J45505j020598P18157O84478q51534K28861O6089n48755
1595c45013O8768J81287J47508j70619m4707N50192o62840J039012L64591l7707
1585A090472j984716l84076J572506j082876O4954O82160Q20256n50111l59257
1576a30688l06199R1827l20881l26379P48907M30826K68185m54752n99666J41234
1566d57586k38621J49131K04327M65520M85178m8068j98939M46220l10842k09191
1556B87129J89899M74971k65768j10435j181142N17467O63163j621616M36706
$$ plain form
1547 -609626 -508431 -841842 -638932 -597495 -911060 -1270706 -157080 -199397 -1307667 -634306
1537 -634306 -365566 -764153 -659983 -878352 -810820 -524058 -139829 -677019 -1237849 -1112841
1527 -1112841 -46945 761402 -147996 -641424 -614708 -138515 371814 749753 -157881 207835
1517 207835 283431 545288 -259287 -496051 -516921 -550860 -115673 28968 233829 -283074
1507 -283074 -395391 -489023 16558 -227742 -786611 -773674 1395358 468069 4574 -79871
1497 -79871 464585 945538 854259 297050 785109 814451 -141054 122202 312665 232365
1487 232365 -432075 -489507 -597959 -944441 153799 186281 -113836 -686722 -396437 -63477
1477 -63477 -785404 -1061758 -1139718 -126014 -213380 513642 182010 -276099 -292784 251000
$$ packed form
1547f09626J01195l33411K02910M1437l13565l59646J113626m2317j108270O73361
1537f34306K68740l98587J04170k18369O7532K86762L84229n37190n60830J25008
1527a112841J065896Q08347r09398m93428K6716M76193N10329L77939r07634L65716
1517B07835P5596K61857q04575k36764k0870l3939M35187J44641K04861n16903
1507b83074j12317r3632N05581k44300n58869J2937K169032r27289m63495q4445
1497g9871N44456M80953r1279n57209M88059K9342r55505K63256J90463q0300
1487B32365o64440n7432j08452l46482J098240L2482l00117n72886K90285L32960
1477f3477p21927k76354p7960J013704q7366P27022l31632m58109j6685N43784
$$ plain form
1467 251000 -207693 -360317 -127647 -733941 -988450 -471522 -624449 -610979 -189211 510493
1457 510493 271613 898208 619667 1727547 1378171 727438 320450 -322413 460897 564519
1447 564519 504872 595573 469896 -77838 -138755 -432167 -51896 -501394 -1256310 -574905
1437 -574905 194337 -376797 -911572 -1522181 -938302 -531512 327889 380324 -6116 -206847
1427 -206847 -748972 239490 -172248 -649446 -42623 787925 1064841 -196531 -919499 -850513
1417 -850513 -900049 -177998 -814141 468306 -300873 -307640 925042 -801528 -529046 -616989
1407 -616989 -610913 -500628 374136 799305 -167311 39069 -273715 -117669 833687 898333
1397 898333 150384 -256328 44528 433679 710124 415970 373547 -761457 -1241039 -611909
$$ packed form
1467B51000m58693j52624K32670o06294k54509N16928j52927J3470M21768O99704
1457E10493k38880O26595k78541J107880l49376o50733m06988o42863P83310J03622
1447E64519n9647R0701j25677n47734o0917k93412L80271m49498p54916O81405
1437e74905P69242n71134n34775o10609N83879M06790Q59401N2435l86440k00731
1427b06847n42125R88462m11738m77198O06823Q30548K76916j261372p22968O8986
1417h50513m9536P22051o36143J282447p69179o767J232682j726570K72482q7943
1407f16989O076J10285Q74764M25169r66616K06380l12784J56046R51356O4646
1397H98333p47949m06712L00856L89151K76445k94154m2423j135004m79582O29130
$$ plain form
1387 -611909 832513 986843 606821 426728 -783746 -986176 -789713 -1112749 -985206
1378 -985206 165048 343589 -269291 -320217 394984 -380607 -906995 -961155 21420 682201
1368 682201 783225 -182761 -455161 -1035160 -1732206 -695867 353266 -122324 -556368
1359 -556368 433373 -228990 -596541 -90142 97103 -98423 477711 406297 -133071 -933368
1349 -933368 -790813 -1043090 -663600 -501815 -629384 -312334 -78145 -164624 -698711 -370647
1339 -370647 593075 -23121 559712 -55604 -1213422 -1314459 -807233 -1069463 -341393 -459442
1329 -459442 195648 520590 703442 1116350 1378980 1210351 847331 283007 -132096 -950842
1319 -950842 -548543 -199783 272171 507098 -194928 269549 212745 415058 529918 -2366
$$ packed form
1387f11909J444422J54330l80022j80093j210474k02430J96463l23036J27543
1378i85206J150254J78541o12880n0926P15201p75591n26388n4160R82575O60781
1368F82201J01024r65986k72400n79999o97046J036339J049133m75590m34044
1359e56368R89741o62363l67551N06399J87245j95526N76134p1414n39368q00297
1349i33368J42555k52277L79490J61785j27569L17050K34189q6479n34087L28064
1339c70647R63722o16196N82833o15316j157818j01037N07226k62230P28070j18049
1329d59442O55090L24942J82852M12908K62630j68629l63020n64324m15103q18746
1319i50842M02299L48760M71954K34927p02026M64477n6804K02313J14860n32284
$$ plain form
1309 -2366 -40004 -243938 -540053 -385368 -507347 290164 1079842 724173 42797 817004
1299 817004 738669 816758 897297 689250 71069 -186561 283201 -164076 -722332 239216
1289 239216 580299 582654 -458389 -533758 -340289 -562977 -627629 -133673 -56559 968157
1279 968157 27471 132596 -120881 214065 927287 724959 648876 278148 823028 1170708
1269 1170708 1007046 818771 1204237 1427117 615470 843709 625428 -273181 -337005 -229334
1259 -229334 -397796 -271086 -166095 -771630 -116300 -928 -811889 -67625 -236517 -309428
1249 -309428 829142 2082192 935920 340579 575680 455256 -179336 -1103934 -425151
1240 -425151 -273840 -604482 -427173 -831710 -662501 -1032 901249 578859 -19109 -337233
$$ packed form
1309b366l7638k03934k96115J54685j21979P97511P89678l55669o81376P74207
1299H17004p8335P8089Q0539k08047o18181k57630M69762m47277n58256R61548
1289B39216L41083K355j041043p5369J93469k22688o4652M93956P7114J024716
1279I68157r40686J05125k53477L34946P13222k02328p6083l70728N44880L47680
1269A170708j63662j88275L85466K22880q11647K28239k18281q98609o3824J07671
1259b29334j68462J26710J04991o05535O55330J15372q10961P44264j68892p2911
1249c09428J138570J253050j146272n95341K35101j20424o34592r24598O78783
1240d25151J51311l30642J77309m04537J69209O61469R02281l22390n97968l18124
$$ plain form
1230 -337233 -386150 -682936 -647536 -139589 -247818 160482 347050 111184 -713642 250135
1220 250135 -67105 628690 312736 369580 213394 -365790 -10198 -715035 -834472 135799
1210 135799 -367596 -706543 -651082 -367009 -399089 336151 428223 170756 166023 693192 1097499
1199 1097499 1883475 1459633 43548 -197973 101642 595138 -394788 -289270 175289
1190 175289 -354465 305268 221864 -689811 -772274 -921418 -898886 -230137 -306471 261818
1180 261818 1332077 -40984 -1040075 -298963 -607848 -157558 635781 1189349 905315
1171 905315 586349 2063 423246 -128344 -395847 -58588 435050 452462 -98538 215644
1161 215644 155383 -179711 -775972 526006 149647 510059 271713 -7672 -47828 453629
$$ packed form
1230c37233m8917k96786L5400N07947j08229M08300J86568k35866q24826R63777
1220B50135l17240O95795l15954N6844j56186n79184L55592p04837j19437R70271
1210A35799n03395l38947N5461K84073l2080P35240R2072k57467m733N27169M04307
1199A097499P85976m23842j416085k41521K99615M93496r89926J05518M64559
1190A75289n29754O59733q3404r11675q2463j49144K2532O68749p6334N68289
1180B61818J070259j373061r99091P41112l08885M50290P93339N53568k84034
1171I05315l18966n84286M21183n51590k67503L37259M93638J7412n51000L14182
1161B15644o0261l35094n96261J301978l76359L60412k38346k79385m0156N01457
$$ plain form
1151 453629 -333571 -843187 10459 127612 -57359 158392 -23468 214493 -328069 -1237201
1141 -1237201 -920130 223070 867045 1261934 -134660 -319816 -64426 -488622 -1047754
1132 -1047754 -902505 378577 1090475 193457 -345120 -341164 512522 650978 196204 -151615
1122 -151615 -791615 -788725 -257455 37031 -267590 -204673 -230908 -49720 528953 -273
1112 -273 -79447 -164158 -2101653 -809337 -552506 123447 -803759 -784074 -975516 -949468 -288566
1101 -288566 -170144 274 -42472 -252523 -223123 235323 -184303 41914 253371 331453
1091 331453 506216 421381 275149 -115346 -393401 -1022883 -148550 116441 206566 33644
1081 33644 216249 1113645 245305 -206783 -276323 414617 874649 386541 257270 -69857
$$ packed form
1151D53629p87200n09616Q53646J17153j84971K15751j81860K37961n42562r09132
1141a237201L17071J143200O43975L94889j396594j85156K55390m24196n59132
1132a047754J45249J281082P11898q97018n38577L956Q53686J38456m54774l47819
1122a51615o40000K890N31270K94486l04621O2917k6235J81188N78673n29226
1112b73p9174q4711j937495J292316K56831O75953r27206J9685j91442K6048O60902
1101b88566J18422J70418m2746k10051K9400M58446m19626K26217K11457P8082
1091C31453J74763q4835j46232l90495k78055o29482Q74333K64991R0125j72922
1081C3644J82605Q97396q68340m52088o9540O90940M60032m88108j29271l27127
$$ plain form
1071 -69857 -1098908 -1136018 -56725 115534 971132 755038 913578 176134 -1330055 -1226112
1061 -1226112 253803 149683 -302310 -387071 -368007 108967 -305472 -112212 -997791 -1194846
1051 -1194846 -349996 4051 -317910 -292854 594862 1097059 962058 221636 38667 -137569
1041 -137569 -548053 272806 -373199 139116 -290225 180637 502017 235653 439840 682007
1031 682007 531645 106234 65551 862390 323369 19611 -60180 -167716 -855720 -473826
1021 -473826 -150038 -419717 -272275 -226478 352290 1018841 672900 219259 202823 -191761
1011 -191761 43399 -704472 -1554192 -867196 -350323 -94078 409240 562936 601501 164188
1001 164188 -31611 -316191 63618 437076 72351 283606 -89151 407679 237626 -274842
$$ packed form
1071f9857j029051l7110J079293J72259Q55598k16094J58540p37444j506189J03943
1061a226112J479915j04120m51993q4761J9064M76974m14439J93260q85579j97055
1051a194846Q44850L54047l21961K5056Q87716N02197j35001p40422j82969j76236
1041a37569m10484Q20859o46005N12315m29341M70862L21380k66364K04187K42167
1031F82007j50362m25411m0683P96839n39021l03758p9791j07536o88004L81894
1021d73826L23788k69679J47442M5797N78768O66551l45941m53641j6436l94584
1011a91761K35160p47871q49720O86996N16873K56245N03318J53696L8565m37313
1001A64188j95799k84580L79809L73458l64725K11255l72757M96830j70053n12468
$$ plain form
991 -274842 -314003 -431486 683782 1069511 722031 308794 -124269 -322247 -1455420 -739971
981 -739971 -687481 -495906 -186518 -102496 1498230 1051505 321398 -505346 95079 1023913
971 1023913 1117317 844990 929602 624251 439305 392521 157100 102165 96485 -104038 243174
960 243174 257783 58553 485507 -51964 -76154 425010 469554 310162 55194 -599461
950 -599461 -523731 194431 -219283 101569 -43877 472953 440917 628872 -224606 -30535
940 -30535 303609 -237381 -897931 -492935 -2659 -334149 -306234 -1308791 -857835 -321426
930 -321426 -143744 -167554 -490173 -572595 -468758 -162476 -27773 -552193 -1554813 -847189
920 -847189 -510715 -302071 728830 1250282 982811 2367 137524 351934 260014 452365
$$ packed form
991b74842l9161j17483J115268L85729l47480m13237m33063j97978j133173P15449
981g39971N2490J91575L09388Q4022J600726m46725p30107q26744O00425R28834
971A023913R3404k72327Q4612l05351j84946m6784k35421n4935n680k00523L47212
960B43174J4609j99230M26954n37471k4190N01164M4544j59392k54968o54655
950e99461P5730P18162m13714L20852j45446N16830l2036J87955q53478J94071
940c0535L34144n40990o60550M04996M90276l31490K7915j002557M50956N36409
930c21426J77682k3810l22619q2422J03837L06282J34703n24420j002620P07624
920h47189L36474K08644J030901N21452k67471r80444J35157K14410r1920J92351
$$ plain form
910 452365 394646 -638732 -726819 196475 215331 315328 1510896 1969629 221706 -674662
900 -674662 -573032 -79027 111599 497008 749394 462497 -276718 -10412 867463 778741
890 778741 -529637 -937255 -518088 -289003 97768 -513961 -383160 529998 175861 -512760
880 -512760 261017 1133966 684261 -106683 -551542 506967 862500 488465 624716 295990
870 295990 504101 111615 225186 808697 525216 -98106 630118 355638 -431095 -400157
860 -400157 9689 -156212 -308466 97887 -98785 -112132 515875 13452 -183026 690680
850 690680 941322 791577 1214692 582202 881103 -64711 -1606897 -1066542 -339046 23403
840 23403 -200587 -727909 -834170 -765779 -767349 -995441 18825 286871 -274499 -1454058
$$ packed form
910D52365n7719j033378q8087R23294J8856R9997J195568M58733j747923q96368
900f74662J01630M94005J90626L85409K52386k86897p39215K66306Q77875q8722
890G78741j308378m07618M19167K29085L86771o11729J30801R13158l54137o88621
880e12760P73777Q72949m49705p90944m44859J058509L55533l74035J36251l28726
870B95990K08111l92486J13571N83511k83481o23322P28224k74480p86733L0938
860d00157M09846j65901j52254M06353j96672j3347O28007n02423j96478Q73706
850F90680K50642j49745M23115o32490K98901r45814j542186N40355P27496L62449
840B3403k23990n27322j06261O8391j570k28092J014266K68046n61370j179559
$$ plain form
830 -1454058 -1061007 -154157 375643 -1013773 345053 1238815 -243883 -405710 370285
821 370285 -276341 -1107448 -1061951 -397286 110561 -167298 285312 -211376 477093 114287
811 114287 302112 -433269 -19095 295495 481115 359016 -591695 -51087 255905 -589500
801 -589500 -811377 -986116 -668309 301293 -185224 -1063536 -405766 -425037 -912941 -1679907
791 -1679907 -906659 271998 1517766 1323941 639881 470173 187295 -49783 411774
782 411774 -593701 -908616 -272560 1017518 1563730 1030894 436875 266135 -9859 -601000
772 -601000 469554 298155 452341 196742 1135807 972886 457456 416259 15766 -294325
762 -294325 405965 -238732 492595 1189134 771211 1348080 475750 -585996 -376443 -243576
$$ packed form
830a454058L93051R06850N29800j389416J358826Q93762j482698j61827P75995
821C70285o46626q31107M5497O64665N07847k77859M52610m96688O88469l62806
811A14287J87825p35381M14174L14590J85620j22099r50711N40608L06992q45405
801e89500k21877j74739L17807R69602m86517q78312O57770j9271m87904p66966
791a679907P73248J178657J245768j93825o84060j69708k82878k37078M61557
782D11774j005475l14915O36056J290078N46212n32836n94019j70740k75994n91141
772f01000J070554j71399J54186k55599R39065j62921n15430m1197m00493l10091
762b94325P00290o44697P31327O96539m17923N76869q72330j061746K09553J32867
$$ plain form
752 -243576 -267010 -386966 -443280 -396774 369945 889887 493271 731165 -142990 -357386
742 -357386 640263 184104 257586 754389 475138 -160216 118821 -140985 187606 -530753
732 -530753 -460418 323033 481067 1614929 1033702 774188 342109 953851 1035441 688821
722 688821 894682 867723 -505094 371212 -629427 -793755 -56006 -886000 -877850 184554
712 184554 277348 -263931 -88186 -128439 304674 1443171 2010490 1919771 1825818 712257
702 712257 405408 263990 -201724 90274 461435 52525 -222715 640420 1541622 474603
692 474603 767209 229897 -424543 -279429 -218398 -189504 -685481 -757931 -208069 112734
682 112734 1049600 1679642 341955 -596844 -338515 354726 603959 1141255 -147446 -841014
$$ packed form
752b43576k3434j19956n6314M6506P66719N19942l96616K37894q74155k14396
742c57386R97649m56159P3482M96803k79251o35354K79037k59806L28591p18359
732e30753P0335P83451J58034J133862n81227k59514m32079O11742Q1590l46620
722F88821K05861k6959j372817Q76306j000639j64328P37749q29994Q150J062404
712A84554R2794n41279J75745m0253M33113J138497N67319r0719r3953j113561
702G12257l06849j41418m65714K91998L71161m08910k75240Q63135R01202j067019
692D74603K92606n37312o54440J45114O1031K8894m95977p2450N49862L20803
682A12734R36866O30042j337687r38799K58329O93241K49233N37296j288701o93568
$$ plain form
672 -841014 -644356 -191571 535823 631801 194789 558728 213575 569793 295016 -258376
662 -258376 566847 -335261 49294 644583 625255 917554 644275 -12077 578799 517755
652 517755 342196 712766 432440 286929 557938 421468 1057295 -779368 -466159 -177884
642 -177884 -365311 223380 -406823 -437394 4407 -616394 -303211 1367802 398098 -120636
632 -120636 728606 469157 414296 220176 450954 -443024 -213777 -244420 -938937 -473004
622 -473004 -527889 -553538 -823630 1028176 569800 535431 845756 644754 -138729 -173990
612 -173990 39573 621527 1332746 933352 657352 395102 160008 -162133 385391 1050664
602 1050664 1165407 1578061 943137 879473 1017844 -370659 -584478 140774 475923 -489168
$$ packed form
672h41014J96658M52785P27394R5978m37012L63939l45153L56218k74777n53392
662b58376Q25223r02108L84555N95289j9328K92299k73279o56352N90876o1044
652E17755j75559L70570k80326j45511K71009j36470O35827j836663L13209K88275
642a77884j87427N88691o30203l0571M41801o20801L13183J671013r69704n18734
632a20636Q49242k59449n4861j94120K30778q93978K29247l0643o94517M65933
622d73004n4885k5649k70092J851806m58376l4369L10325k01002p83483l5261
612a73990K13563N81954P11219l99394k76000k62250k35094l22141N47524O65273
602A050664J14743M12654o34924o3664J38371j388503k13819P25252L35149r65091
$$ plain form
592 -489168 -117118 -335681 -1481818 -1443365 -736652 177385 -42500 -182428 -355185 -618486
582 -618486 -64554 378734 169849 -113677 277877 791284 675086 355553 -168 836129
572 836129 205958 -114332 90238 -292156 421197 592561 -470062 -717732 1468 -243047
562 -243047 -1011474 -253390 -556739 39070 658529 392123 101951 -70622 200378 23705
552 23705 657706 -1004227 -638500 164748 47626 616047 591046 541620 317802 -110192
542 -110192 569027 -486732 -564617 -108561 -227899 293768 1410636 1745159 1999000 2062403
532 2062403 1168619 1006565 797633 474071 349691 225409 -598410 -779706 -1233544 402052
522 402052 219210 -631056 -479945 -756437 -27414 237240 269789 208824 83290 771684
$$ packed form
592d89168L72050k18563j146137L8453P06713R14037k19885j39928j72757k63301
582f18486N53932M43288k08885k83526L91554N13407j16198l19533l55721Q36297
572H36129o30171l20290K04570l82394P13353J71364j062623k47670P19200k44515
562b43047p68427P58084l03349N95809O19459k66406k90172j72573K71000j76673
552B3705O34001j661933L65727Q03248j17122N68421k5001m9426k23818m27994
542a10192O79219j055759p7885M56056j19338N21667J116868L34523K53841O3403
532B062403q93784j62054k08932l23562j24380j24282q23819j81296m53838J635596
522D02052j82842q50266J51111k76492P29023K64654L2549o0965j25534O88394
$$ plain form
512 771684 870621 594348 1351175 1408738 1099650 -139997 786 -372346 437582 1290478
502 1290478 -257574 204274 -407963 212709 1053432 617295 824505 334743 575235 1281497
492 1281497 1955226 810861 504566 188160 -576875 -485356 186744 -598526 -648781 156552
482 156552 194277 -111770 39725 -760354 -712233 479977 1381385 1399932 290437 215786
472 215786 -901319 63459 308329 57830 148865 -369500 -58144 -24927 -133771 200345
462 200345 440746 454328 754158 1171917 567144 645136 382918 -87866 -802215 182892
452 182892 57499 479294 1141107 591985 862965 252038 719985 1230862 1415894 626888
442 626888 -757866 -780867 891572 537887 507913 -12418 -660224 942567 961620 183838
$$ packed form
512G71684R8937k76273P56827N7563l09088j239647J40783l73132Q09928Q52896
502A290478j548052M61848o12237O20672Q40723m36137K07210m89762K40492P06262
492A281497O73729j144365l06295l16406p65035R1519O72100p85270n0255Q05333
482A56552L7725l06047J51495q00079M8121J192210R01408J8547j109495p4651
472B15786j117105R64778K44870k50499R1035n18365L11356L3217j08844L34116
462B00345K40401J3582K99830M17759o04773P7992k62218m70784p14349R85107
452A82892j25393M21795O61813n49122K70980o10927M67947N10877J85032p89006
442F26888j384754k3001J672439l53685k9974n20331o47806J602791J9053p77782
$$ plain form
432 183838 -1088674 -474540 474568 110674 -795069 -722821 -483745 -117016 -272656 862713
422 862713 1306035 -31309 -146308 29075 487063 906787 69713 -1239921 -1103090 -995176
412 -995176 -1610779 -1276579 -1360505 -945955 -215932 -185504 761221 -36140 326002 573759
402 573759 768979 505297 368071 909921 535600 638119 567212 1166274 1143815 445188
392 445188 -160241 262841 100388 762180 801165 -176133 43812 208790 681544 1547581
382 1547581 520456 637129 559431 536707 783554 1709319 1324330 407499 1384112 210095
372 210095 143781 481169 -110697 -342107 -365745 -32351 23388 -188910 -50590 670193
362 670193 517906 223933 703165 529893 386800 603588 344566 -109039 1001693 1945121
$$ packed form
432A83838j272512O14134R49108l63894r05743P2248K39076L66729j55640J135369
422H62713M43322j337344j14999J75383M57988M19724q37074j309634J36831J07914
412i95176o15603L34200q3926M14550P30023L0428R46725p97361L62142K47757
402E73759J95220k63682j37226N41850l74321J02519p0907N99062k2459o98627
392D45188o05429M23082j62453O61792L8985r77298K19945J64978M72754Q66037
382A547581j027125J16673p7698k2724K46847R25765l84989r16831R76613j174017
372B10095o6314L37388n91866k31410k3638L33394N5739k12298J38320P20783
362F70193j52287k93973M79232j73272j43093K16788k59022m53605J110732R43428
$$ plain form
352 1945121 1369256 1234627 1329893 563086 951091 -432619 -958400 149833 1279628
343 1279628 2125483 1115090 123066 388301 985622 945257 -51786 -157661 -599361 781828
333 781828 706364 305822 -183658 417472 -644595 -100310 254809 657107 -274910 -1056318
323 -1056318 5069 904920 1029999 1516282 815411 -236872 -417606 664070 696804
314 696804 -97957 72933 691054 1429396 915047 1048040 213727 233457 838029 885836
304 885836 913732 839427 -149155 224314 997407 1175982 354947 655112 987724 423531
294 423531 -149387 1818306 917142 430085 121608 -474152 -608198 -109246 -565235 456221
284 456221 525613 337193 -216448 -347751 -873903 -326622 183104 -389912 201701 383692
$$ packed form
352A945121n75865j34629R5266p66807L88005j383710n25781J108233J129795
343A279628Q45855j010393r92024K65235N97321m0365r97043j05875m41700J381189
333G81828p5464m00542m89480O01130j062067N44285L55119M02298r32017p81408
323a056318J061387Q99851J25079M86283p00871j052283j80734J081676L2734
314F96804p94761J70890O18121P38342n14349J32993q34313J9730O04572M7807
304H85836K7896p4305r88582L73469P73093J78575q21035L00165L32612n64193
294D23531n72918J967693r01164m87057l08477n95760j34046M98952m55989J021456
284D56221O9392j88420n53641j31303n26152N47281N09726n73016N91613J81991
$$ plain form
274 383692 687154 841162 317689 601972 2253447 2129207 1208445 -280878 -497729 261028
264 261028 474630 -19353 -391143 -696932 356878 348801 345193 487277 729283 1348741
254 1348741 214560 1143906 1664848 874005 -353599 267589 319462 233171 966337 304362
244 304362 220288 1237126 954674 711791 749492 603490 820866 740449 775204 1142050
234 1142050 746069 303624 -194381 -1168481 -327793 938367 864643 417856 296050 198785
224 198785 302585 796837 394468 -23118 267313 710362 1622965 1871004 1373607 707569
214 707569 183024 23399 830268 409377 476673 450626 432846 190797 288326 500004 -331473
203 -331473 188061 -36399 -495183 23305 1008691 1236359 1322144 993242 503389 -159330
$$ packed form
274C83692L03462J54008n23473K84283J651475j24240r20762j489323k16851P58757
264B61028K13602m93983l71790l05789J053810q077l608J42084K42006O19458
254A348741j134181R29346N20942p90843j227604O21188N1873q6291P33166o61975
244C04362q4074J016838k82452k42883L7701j46002K17376q0417L4755L66846
234A142050l95981m42445m98005r74100Q40688J266160p3724m46787j21806r7265
224A98785J03800M94252m02369m17586K90431M43049R12603K48039m97397o66038
214G07569n24545j59625Q06869m20891O7296k6047j7780k42049R7529K11678q31477
203c31473N19534k24460m58784N18488R85386K27668Q5785l28902m89853o62719
$$ plain form
193 -159330 -489055 575220 1834935 965825 83993 592098 241845 1109157 413372 577132
183 577132 604271 1063828 74168 -224194 251621 402469 86666 556117 -370753 -265732
173 -265732 337193 402780 538972 -297049 -416128 -743842 -357217 -160246 1209 232299
163 232299 476753 852748 1580793 1033301 758504 880505 496895 706264 331048 -400492
153 -400492 580013 696058 1267336 1086215 853795 878652 1059897 451104 -30610 -368305
143 -368305 -499794 17884 296512 688648 -194815 -563570 974464 1224617 1337881 543379
133 543379 383787 1080224 821393 864072 511431 863841 537215 689968 -292210 -72652
123 -72652 977855 988447 556235 713924 316873 -6014 -157062 258444 641380 235203
$$ packed form
193a59330l29725J064275J259715q69110q81832N08105l50253Q67312o95785J63760
183E77132K7139M59557r89660k98362M75815J50848l15803M69451r26870J05021
173b65732O02925O5587J36192q36021j19079l27714L86625J96971J61455K31090
163B32299K44454L75995P28045n47492k74797J22001l83610K09369l75216p31540
153d00492R80505J16045N71278j81121k32420K4857J81245o08793m81714l37695
143c68305j31489N17678K78628L92136q83463l68755J538034K50153J13264p94502
133E43379j59592O96437k58831M2679l52641L52410l26626J52753r82178K19558
123g2652J050507J0592m32212J57689l97051l22887j51048M15506L82936m06177
$$ plain form
113 235203 541930 664974 -555103 -232385 -144059 971998 1273389 1015092 1311166 1215445
103 1215445 53949 -25621 40297 112510 213835 327686 820166 719915 204971 188140
93 188140 1037128 1031478 619284 702543 555672 -322365 458444 -175128 823991 1021149 461300
82 461300 225393 431839 470350 484441 202446 727021 772953 1267254 1125765 719847 756512
71 756512 1253932 1079433 346023 -50868 228894 -398302 -194138 -167467 268770 255602
61 255602 117447 645627 526642 -151808 -322031 129601 -61029 -184373 -637485 -1120909
51 -1120909 -849279 -434309 45247 627559 289875 582137 277042 308028 132362 281377
41 281377 98003 1000492 1188604 556743 1069741 737532 406397 1126330 1098230 1261628
$$ packed form
113B35203L06727J23044j220077L22718Q8326J116057L01391k58297K96074r5721
103A215445j161496p9570O5918P2213J01325J13851M92480j00251n14944j6831
93A88140Q48988n650m12194Q3259j46871q78037P80809o33572R99119J97158n59849
82D61300k35907K06446L8511J4091k81995N24575M5932M94301j41489m05918L6665
71G56512M97420j74499p33410l96891K79762o27196K04164K6671M36237j3168
61B55602j38155N28180j18985o78450j70223M51632j90630j23344m53112m83424
51a120909K71630M14970M79556N82312l37684K92262l05095L0986j75666J49015
41B81377j83374R02489J88112o31861N12998l32209l31135P19933k8100J63398
$$ plain form
31 1261628 1376016 868599 1189390 753691 216964 56099 164309 884352 767833 425560
21 425560 515849 557241 9175 -236764 409348 144900 20073 334228 825695 612819
11 612819 559427 543326 734724 775814 834723 107558 266396 443510 69729 136876 340902
0 340902
$$ packed form
31A261628J14388n07417L20791m35699n36727j60865J08210P20043j16519l42273
21D25560R0289M1392n48066k45939O46112k64448j24827L14155M91467k12876
11F12819n3392j6101J91398M1090N8909p27165J58838J77114l73781O7147K04026
0C40902
$$ Imaginary data points
##PAGE= N=2
##DATA TABLE= (X++(I..I)), XYDATA
$$ plain form
16383 -2976227 -3365127 -2600068 -2401491 -2105756 -2263284 -2829639 -2450553 -2134664 -2586230
16374 -2586230 -2751004 -1662813 -1589660 -2006563 -2545540 -2549006 -2020070 -1371007 -1384097 -1423018
16364 -1423018 -1671741 -1326213 -1467503 -1821475 -1848156 -2045714 -1508627 -2149612 -2702898 -2218197
16354 -2218197 -2465760 -1394231 -1166894 -1183919 -537058 -889457 -1017116 -1625463 -1537461 -1145278
16344 -1145278 -1074474 -1277462 -1118223 -1155272 -1123222 -689268 -424610 -305193 -601153 170
16334 170 -383930 -663596 -566619 98955 -34738 323302 631077 -420457 -192966 82319
16324 82319 677636 473098 877660 561626 313521 -107030 -475678 72176 736014 669554
16314 669554 287614 361737 421241 546017 368025 -98740 531949 922074 313849 991517
$$ packed form
16383b976227l88900P65059J98577K95735j57528n66355L79086L15889m51566
16374b586230j64774J088191P3153m16903n38977l466N28936O49063j3090l8921
16364a423018k48723L45528j41290l53972k6681j97558N37087o40985n53286M84701
16354b218197k47563J071529K27337j7025O46861l52399j27659o08347Q8002L92183
16344a145278P0804k02988J59239l7049L2050M33954K64658J19417k95960O01323
16334A70l84100k79666R6977O65574j33693L58040L07775j051534K27491K75285
16324H2319N95317k04538M04562l16034k48105m20551l68648N47854O63838o6460
16314F69554l81940P4123N9504J24776j77992m66765O30689L90125o08225O77668
$$ plain form
16304 991517 1451136 1295302 899494 1131362 1556269 1316423 1222571 1263348 1356423 604275
16294 604275 1264055 1823988 1538002 1509111 972070 241008 211280 907103 1182490 520165
16284 520165 765783 900691 689909 1497004 2364465 2133796 1444962 1121755 552264 742586
16274 742586 1349650 1671995 1635828 1874869 2307461 1677004 2125407 2232871 2446592 2748467
16264 2748467 2287977 1785373 2266872 2079688 2082501 1829388 2161508 2559986 2250783 1790196
16254 1790196 1825863 1828124 1703604 1886997 2335647 3216860 2408072 1745045 2603164 2336568
16244 2336568 1556364 1290588 1375256 2467539 2219306 1212645 1940317 2118337 2314336
16235 2314336 2415441 2951688 2627558 2322663 2034887 2968859 3343980 3559337 4108489
$$ packed form
16304I91517M59619j55834l95808K31868M24907k39846r3852M0777R3075p52148
16294F04275O59780N59933k85986k8891n37041p31062k9728O95823K75387o62325
16284E20165K45618J34908k10782Q07095Q67461k30669o88834l23207n69491J90322
16274G42586O07064L22345l6167K39041M32592o30457M48403J07464K13721L01875
16264B748467m60490n02604M81499j87184K813k53113L32120L98478l09203m60587
16254A790196L5667K261j24520J83393M48650Q81213q08788o63027Q58119k66596
16244B336568p80204k65776Q4668J092283k48233j006661P27672J78020J95999
16235B314336J01105N36247l24130l04895k87776R33972L75121K15357N49152
$$ plain form
16226 4108489 3343780 3674187 2915939 3288839 2483530 3102741 2951565 2712231 2634407 3105362
16216 3105362 3452809 3393672 2889568 2758459 2575371 2460179 2974747 2655070 2363137 1832887
16206 1832887 2387450 3041457 2758701 3256864 3820233 3152786 3255959 3514295 3971772
16197 3971772 3857448 3801825 3969143 3646647 3133138 3681363 3936317 3859906 4188662 4123306
16187 4123306 4020275 4340053 4822222 4875983 5144304 4648073 4274348 3957359 3778965 4831968
16177 4831968 5088708 4559526 3222079 2637129 3374397 3667420 4244776 4319851 4652639
16168 4652639 4362426 4713947 3987702 2695920 2797749 3421057 3395900 3607524 3961602
16159 3961602 3482967 3085959 3718355 4298457 3716376 3532850 4271660 4676181 4372601
$$ packed form
16226D108489p64709L30407p58248L72900q05309O19211j51176k39334p7824M70955
16216C105362L47447n9137n04104j31109j83088j15192N14568l19677k91933n30250
16206A832887N54563O54007k82756M98163N63369o67447J03173K58336M57477
16197C971772j14324n5623J67318l22496n13509N48225K54954p6411L28756o5356
16187D123306j03031L19778M82169N3761K68321m96231l73725l16989j78394J053003
16177D831968K56740n29182j337447n84950P37268K93023N77356P5075L32788
16168D652639k90213L51521p26245j291782J01829O23308k5157K11624L54078
16159C961602m78635l97008O32396N80102n82081j83526P38810M04521l03580
$$ plain form
16150 4372601 3955840 4726851 4547139 4596248 5112009 3875143 4001027 4251911 3952308
16141 3952308 4112870 3567813 3423749 4076935 3961723 3750415 5481687 5632622 4681187
16132 4681187 5134641 4029108 3482247 4623239 4359845 4193825 4613293 3795860 3422192
16123 3422192 3361170 2858780 3867159 3781302 3261439 2988232 2729863 3330568 4953511
16114 4953511 4920536 4310415 4019923 3720097 3773308 3873568 4532987 3948569 3830693 4051805
16104 4051805 4783101 4344550 4028867 3505818 3742692 3891562 3759714 5000919 5512982
16095 5512982 4860308 5122413 5557201 4899754 4982418 5137156 4953545 5096197 4529672 4492574
16085 4492574 3429890 3247764 3678852 4228939 4727683 4901781 5349228 4510441 3801194
$$ packed form
16150D372601m16761P71011j79712M9109N15761j236866J25884K50884k99603
16141C952308J60562n45057j44064O53186j15212k11308J731272J50935r51435
16132D681187M53454j105533n46861J140992k63394j66020M19468q17433l73668
16123C422192o1022n02390J008379q5857n19863k73207k58369O00705J622943
16114D953511l2975o10121k90492k99826N3211J00260O59419n84418j17876K21112
16104D051805P31296m38551l15683n23049K36874J48870j31848J241205N12063
16095E512982o52674K62105M34788o57447Q2664J54738j83611J42652n66525l7098
16085D492574j062684j82126M31088N50087M98744J74098M47447q38787p09247
$$ plain form
16076 3801194 4695990 4958446 4797971 3976969 3907701 4495612 4971034 5202738 4854292 4533294
16066 4533294 4594210 4039182 3946310 4138055 4308324 4519348 4872183 5203577 5101478 4721359
16056 4721359 4526475 4599045 4870036 4204076 4755092 4664429 3949699 4544727 4422493 4591700
16046 4591700 4017068 3931840 3561702 4085147 4537693 4680626 4124885 4082064 3875612 4013948
16036 4013948 4557858 4848930 4409600 5274697 5241266 4982768 5429623 4701776 4456946 4029639
16026 4029639 4125761 4286478 3635344 3566029 4229270 5091143 5032587 4727771 5597188 5026189
16016 5026189 3844661 4752504 4465483 3248987 2545464 2822060 4966450 4506509 3864574
16007 3864574 4127126 5131168 4082435 3691759 4656897 5349354 5005824 4048314 4400373
$$ packed form
16076C801194Q94796K62456j60475q21002o9268N87911M75422K31704l48446l20998
16066D533294O0916n55028r2872J91745J70269K11024L52835L31394j02099l80119
16056D721359j94884P2570K70991o65960N51016r0663p14730N95028j22234J69207
16046D591700n74632q5228l70138N23445M52546J42933n55741m2821k06452J38336
16036D013948N43910K91072m39330Q65097l3431k58498M46855p27847k44830m27307
16026D029639R6122J60717o51134o9315O63241Q61873n8556l04816Q69417n70999
16016E026189j181528R07843k87021j216496p03523K76596K144390m59941o41935
16007C864574K62552J004042j048733l90676R65138O92457l43530r57510L52059
$$ plain form
15998 4400373 4061223 4908711 4682954 4302299 4225659 3806059 4124304 4753407 4933508 4787358
15988 4787358 4642635 5126158 4030494 3587505 3882481 3510433 4475819 4951426 3843647
15979 3843647 3801308 3280438 3985441 4410580 4932055 5487022 5705584 5443519 4140790
15970 4140790 4748778 4807544 5757332 5324441 4472143 4676553 4102964 3873979 4187156 4418414
15960 4418414 5617933 5517729 4533677 4372114 4670814 4702799 4794823 4164346 3649095 3415432
15950 3415432 2951635 3433230 3392492 3994009 3797604 3650360 3799648 3352393 3903413 4458604
15940 4458604 4628599 4542502 3870949 4123604 4101146 4470107 5336959 4375862 3641434 4068906
15930 4068906 4210201 4855341 4614676 3485428 3920875 4039283 4094464 4737702 4643191 4250593
$$ packed form
15998D400373l39150Q47488k25757l80655p6640m19600L18245O29103J80101j46150
15988D787358j44723M83523j095664m42989K94976l72048R65386M75607j107779
15979C843647m2339n20870P05003M25139N21475N54967K18562k62065j302729
15970D140790O07988N8766R49788m32891q52298K04410n73589k28985L13177K31258
15960D418414J199519j00204r84052j61563K98700L1985R2024o30477n15251k33663
15950C415432m63797M81595m0738O01517j96405j47244J49288m47255N51020N55191
15940D458604J69995q6097o71553K52655k2458L68961Q66852r61097p34428M27472
15930D068906J41295O45140k40665j129248M35447J18408N5181O43238r4511l92598
$$ plain form
15920 4250593 5214734 4442328 4550062 5114666 4446395 5256016 4017305 4067227 4275371
15911 4275371 4583113 5508099 4773404 4341340 5090677 5511928 4748850 4319487 4966820
15902 4966820 5554131 4973588 4657629 3468043 3350812 3528837 4238821 5426331 5470245
15893 5470245 4630831 3943861 4234600 4142156 3815518 3689038 4701049 5193206 4858176
15884 4858176 5384778 5171391 5555628 4933873 5198402 5244861 3512904 4504237 5101163
15875 5101163 4288434 3285866 3627740 4122875 4860034 4867578 4650378 4637845 4595053 4283324
15865 4283324 4085115 3709306 3589170 3622459 4221045 4847555 4906809 4817664 4922131 5811884
15855 5811884 5627861 5211030 4629510 4251856 4632613 5415698 4367042 5547757 4929884
$$ packed form
15920D250593R64141p72406J07734N64604o68271Q09621j238711M9922K08144
15911D275371L07742R24986p34695m32064P49337M21251p63078m29363O47333
15902D966820N87311n80543l15959j189586j17231J78025P09984J187510M3914
15893E470245q39414o86970K90739r2444l26638j26480J012011M92157l35030
15884D858176N26602k13387L84237o21755K64529M6459j731957R91333N96926
15875E101163q12729j002568L41874M95135P37159P544k17200j2533m2792l11729
15865D283324j98209l75809j20136L3289N98586O26510N9254q9145J04467Q89753
15855E811884j84023m16831n81520l77654L80757P83085j048656J180715o17873
$$ plain form
15846 4929884 3623315 4247678 4283396 3995630 5058816 4911961 4700602 4026375 3108727
15837 3108727 3344369 3322893 4185650 3759449 3669935 4071412 4503499 4359171 4638286 4660983
15827 4660983 4841220 4799929 4611290 4665497 4518549 4410950 4871322 4769955 4180143 3818633
15817 3818633 4027681 5089760 4480475 4462855 4674712 4106201 3783937 4167374 4459152
15808 4459152 3500295 3790099 4576520 4657995 4449168 4980994 4703515 4747958 4948681 5145083
15798 5145083 4422175 4302700 3987679 4573047 4672763 4134233 5170716 5111714 5261234 5426990
15788 5426990 5106408 4214053 3773885 5019892 5203836 4770138 5450339 4383358 3138417
15779 3138417 3928663 3883782 3810236 4492778 4577781 4312704 3030396 3699359 4845927 5149201
$$ packed form
15846D929884j306569O24363L5718k87766J063186j46855k11359o74227r17648
15837C108727K35642k1476Q62757m26201q9514M01477M32087j44328K79115K2697
15827D660983J80237m1291j88639N4207j46948j07599M60372j01367n89812l61510
15817C818633K09048J062079o09285j7620K11857n68511l22264L83437K91778
15808D459152r58857K89804P86421Q1475k08827N31826k77479M4443K00723J96402
15798E145083p22908j19475l15021N85368R9716n38530J036483n9002J49520J65756
15788E426990l20582q92355m40168J246007J83944m33698O80201j066981j244941
15779C138417P90246m4881p3546O82542Q5003k65077j282308O68963J146568L03274
$$ plain form
15769 5149201 5683719 5714218 4625153 4008622 4662849 4891050 4639157 4452241 4803128
15760 4803128 5042697 6037745 6048192 4832254 4630764 4925922 4912679 4877382 5025770 4656304
15750 4656304 3682386 3036690 3297293 4176521 3647811 3775532 4282421 3061540 3776658
15741 3776658 3496246 4039210 4429587 4217830 4471174 4291417 3582350 3572155 4896691
15732 4896691 4929700 4592011 4943706 4185950 4081591 3643750 3911933 5494521 6330087
15723 6330087 5558134 5350688 5747257 4538301 4393066 4763007 4356374 4565980 3721230
15714 3721230 3767842 3922153 4355332 4941435 5295083 5484407 5105299 5067084 3912488 4161849
15704 4161849 3932276 4227783 4638197 5061443 4315572 4557673 3191180 3042781 4180874
$$ packed form
15769E149201N34518L0499j089065o16531O54227K28201k51893j86916L50887
15760D803128K39569R95048J0447j215938k01490K95158j3243l5297J48388l69466
15750D656304r73918o45696K60603Q79228n28710J27721N06889j220881P15118
15741C776658k80412N42964L90377k11757K53344j79757p09067j0195J324536
15732D896691L3009l37689L51695p57756j04359m37841K68183J582588Q35566
15723F330087p71953k07446L96569j208956j45235L69941m06633K09606q44750
15714C721230M6612J54311M33179N86103L53648J89324l79108l8215j154596K49361
15704D161849k29573K95507M10414M23246p45871K42101j366493j48399J138093
$$ plain form
15695 4180874 4743350 5518421 5048270 4810338 5043153 4584286 4804355 5294267 5400231
15686 5400231 5447361 4955631 5333301 5337296 4956549 4474662 3696500 3974618 4247393 3616830
15676 3616830 3546415 4649947 3908928 4009364 5726184 5861640 5330997 4850754 5298522
15667 5298522 4146990 3930880 3418655 3069429 3385791 4002763 4874146 5229495 4555530
15658 4555530 4475853 4391822 4311482 4451167 4505588 4713420 4718292 4686748 4306658 3704052 3650019
15647 3650019 4214119 4607260 5339158 5573535 5004255 5129752 5057994 5006696 4877082 4945728
15637 4945728 5407560 4797349 5318928 5194437 5480584 5488681 4840032 4385663 4862436 5193030
15627 5193030 5069018 5531461 4522369 3951722 4583465 4579094 4106603 4585561 4751704 3757178
$$ packed form
15695D180874N62476P75071m70151k37932K32815m58867K20069M89912J05964
15686E400231M7130m91730L77670L995l80747m81887p78162K78118K72775o30563
15676C616830p0415J103532p41019J00436J716820J35456n30643m80243M47768
15667E298522j151532k16110n12225l49226L16362O16972Q71383L55349o73965
15658D555530p9677q4031q0340J39685N4421K07832M872l1544l80090o02606n4033
15647C650019N64100L93141P31898K34377n69280J25497p1758n1298j29614O8646
15637D945728M61832o10211N21579j24491K86147Q097o48649m54369M76773L30594
15627E193030j24012M62443j009092n70647O31743m371m72491M78958J66143r94526
$$ plain form
15617 3757178 4531471 5049012 4932538 5090774 5338352 4243626 4077143 5178981 4525913
15608 4525913 3656695 3902932 5032808 5697758 6068084 5101948 5208691 5427695 5330799
15599 5330799 5393645 4515098 4144151 4454740 4327140 4943575 4697222 5151740 6150768 5413831
$$ packed form
15617C757178P74293N17541j16474J58236K47578j094726j66483J101838o53068
15608D525913q69218K46237J129876O64950L70326r66136J06743K19004r6896
15599E330799O2846q78547l70947L10589j27600O16435k46353M54518R99028p36937
$$ [...]
##END NTUPLES=NMR SPECTRUM
##END=
