##TITLE=1H_CA-9079
 CDCl3
 8 sc, 
 18.10.2022
##JCAMPDX= 6.0         $$ Bruker NMR JCAMP-DX V2.0
##DATA TYPE= NMR SPECTRUM
##DATA CLASS= NTUPLES
##ORIGIN= UXNMR, Bruker Analytische Messtechnik GmbH
##OWNER= root
$$ XWIN-NMR		Version 3.5
$$ Tue Oct 18 16:41:53 2022 Russian Standard Time (UT+4h)  she@DPX200
##.OBSERVE FREQUENCY= 200.1313499994
##.OBSERVE NUCLEUS= ^1H
##.ACQUISITION MODE= SIMULTANEOUS
##.ACQUISITION SCHEME= undefined
##.AVERAGES= 8
##.DIGITISER RES= 18
##SPECTROMETER/DATA SYSTEM= spect
##.PULSE SEQUENCE= zg30
##.SOLVENT NAME= CDCl3
##.SHIFT REFERENCE= (INTERNAL, CDCl3, 0, 15.7954)
##AUDIT TRAIL= $$ (NUMBER, WHEN, WHO, WHERE, WHAT)
$$ ##TITLE= Audit trail, XWIN-NMR		Version 3.5
$$ ##JCAMPDX= 5.01
$$ ##ORIGIN= Bruker BioSpin GmbH
$$ ##OWNER= she
$$ F:/spectra/data/she/nmr/H-F/1/pdata/1/auditp.txt
$$ ##AUDIT TRAIL=  $$ (NUMBER, WHEN, WHO, WHERE, WHAT)
(   1,<2022-10-18 16:40:27.07 +0400>,<she>,<DPX200>,
      <created by zg, POWCHK disabled, PULCHK disabled
       configuration hash MD5:
       00 E9 B6 7A A2 85 ED C7 34 08 36 98 17 FE 4E 26
       data hash MD5: 16K
       A2 B6 DE 2D 7D 9A D3 DF F6 1C 64 42 C5 36 FF 31>)
(   2,<2022-10-18 16:40:33.79 +0400>,<she>,<DPX200>,
      <Start of raw data processing
       efp BC_mod = 2 LB = 0.24 FT_mod = 6 PKNL = 1 PHC0 = -18113.36 PHC1 = 10.2007 SI = 16K 
       data hash MD5: 16K
       C8 CE 9D A1 CD 64 2E EB EE 89 F2 C9 44 7F 87 93>)
(   3,<2022-10-18 16:40:51.45 +0400>,<she>,<DPX200>,
      <pk PHC0 = -83.63454 PHC1 = 7 
       data hash MD5: 16K
       21 0E 09 DA 9B 61 A0 1F 08 F9 3A 7E 71 2B 3B F5>)
(   4,<2022-10-18 16:40:55.32 +0400>,<she>,<DPX200>,
      <abs ABSG = 5 
       data hash MD5: 16K
       57 1F A8 78 78 8B 1F 21 D4 57 51 37 8A 4E D3 A2>)
$$ ##END=
$$ 
$$ hash MD5
$$ CD CE D3 F4 E7 AD DB C2 84 93 E8 7B FF 72 F9 9A
##$RELAX= 
##$RELAX= 
##$RELAX= 
##$RELAX= 
##$RELAX= 
##$RELAX= 
$$ Bruker specific parameters
$$ --------------------------
##$DU= <F:/spectra>
##$EXPNO= 1
##$NAME= <H-F>
##$PROCNO= 1
##$TYPE= <nmr>
##$USER= <she>
##$AMP= (0..31)
100 100 100 100 100 100 100 100 100 100 100 100 100 100 100 100 100 100 
100 100 100 100 100 100 100 100 100 100 100 100 100 100 
##$AQSEQ= 0
##$AQ_mod= 1
##$AUNM= <au_zg>
##$AUTOPOS= <>
##$BF1= 200.13
##$BF2= 200.13
##$BF3= 200.13
##$BF4= 200.13
##$BF5= 200.13
##$BF6= 200.13
##$BF7= 200.13
##$BF8= 200.13
##$BYTORDA= 1
##$CFDGTYP= 0
##$CFRGTYP= 5
##$CHEMSTR= <none>
##$CNST= (0..31)
1 1 145 1 1 1 1 1 1 1 1 1 1 1 1 1 1 1 1 1 1 1 1 1 1 1 1 1 1 1 1 1 
##$CPDPRG= <>
##$CPDPRG1= <>
##$CPDPRG2= <>
##$CPDPRG3= <>
##$CPDPRG4= <mlev>
##$CPDPRG5= <mlev>
##$CPDPRG6= <mlev>
##$CPDPRG7= <mlev>
##$CPDPRG8= <mlev>
##$CPDPRGB= <>
##$CPDPRGT= <>
##$D= (0..31)
0 1.2 0 0 0 0 0 0 0 0.06 0 0.03 0 0 0 0 0.0002 0 0 0 0 0 0 0 0 0 0 0 0 
0 0 0 
##$DATE= 1666096826
##$DBL= (0..7)
120 120 120 120 120 120 120 120 
##$DBP= (0..7)
150 150 150 150 150 150 150 150 
##$DBP07= 0
##$DBPNAM0= <>
##$DBPNAM1= <>
##$DBPNAM2= <>
##$DBPNAM3= <>
##$DBPNAM4= <>
$$ [...]
##$SUBNAM3= <"">
##$SUBNAM4= <"">
##$SUBNAM5= <"">
##$SUBNAM6= <"">
##$SUBNAM7= <"">
##$SUBNAM8= <"">
##$SUBNAM9= <"">
##$SW= 18.0517283424941
##$SWIBOX= (0..15)
0 0 2 0 0 0 0 0 0 0 0 0 0 0 0 0 
##$SW_h= 3612.71676300578
##$TD= 16384
##$TD0= 1
##$TE= 0
##$TE2= 300
##$TE3= 300
##$TEG= 300
##$TL= (0..7)
0 120 120 120 120 120 120 120 
##$TP= (0..7)
150 150 150 150 150 150 150 150 
##$TP07= 0
##$TPNAME0= <>
##$TPNAME1= <>
##$TPNAME2= <>
##$TPNAME3= <>
##$TPNAME4= <>
##$TPNAME5= <>
##$TPNAME6= <>
##$TPNAME7= <>
##$TPOAL= (0..7)
0.5 0.5 0.5 0.5 0.5 0.5 0.5 0.5 
##$TPOFFS= (0..7)
0 0 0 0 0 0 0 0 
##$TUNHIN= 0
##$TUNHOUT= 0
##$TUNXOUT= 0
##$USERA1= <user>
##$USERA2= <user>
##$USERA3= <user>
##$USERA4= <user>
##$USERA5= <user>
##$V9= 5
##$VALIST= <valist>
##$VCLIST= <CCCCCCCCCCCCCCC>
##$VD= 0
##$VDLIST= <DDDDDDDDDDDDDDD>
##$VPLIST= <PPPPPPPPPPPPPPP>
##$VTLIST= <TTTTTTTTTTTTTTT>
##$WBST= 1024
##$WBSW= 4
##$XGAIN= (0..3)
0 0 0 0 
##$XL= 0
##$YL= 0
##$YMAX_a= 454012
##$YMIN_a= -374276
##$ZGOPTNS= <>
##$ZL1= 120
##$ZL2= 120
##$ZL3= 120
##$ZL4= 120
##$ABSF1= 15.73367
##$ABSF2= -2.318179
##$ABSG= 5
##$ABSL= 3
##$ALPHA= 0
##$AQORDER= 0
##$ASSFAC= 0
##$ASSFACI= 0
##$ASSFACX= 0
##$ASSWID= 0
##$AUNMP= <proc_1d>
##$AZFE= 0.1
##$AZFW= 0.1
##$BCFW= 0
##$BC_mod= 2
##$BYTORDP= 0
##$COROFFS= 0
##$CY= -3
##$DATMOD= 1
##$DC= 0
##$DFILT= <>
##$DTYPP= 0
##$F1P= 0
##$F2P= 0
##$FCOR= 1
##$FTSIZE= 16384
##$FT_mod= 6
##$GAMMA= 0
##$GB= 0
##$INTBC= 1
##$INTSCL= 3.70164e-10
##$ISEN= 128
##$LB= 0.24
##$LEV0= 0
##$LPBIN= 0
##$MAXI= 10000
##$MC2= 0
##$MEAN= 0
##$ME_mod= 0
##$MI= 1.114404
##$NCOEF= 0
##$NC_proc= -7
##$NLEV= 6
##$NOISF1= 3.799351
##$NOISF2= 2.8
##$NSP= 0
##$NTH_PI= 0
##$NZP= 0
##$OFFSET= 15.79537
##$PC= 1
##$PHC0= -18196.99
##$PHC1= 17.2007
##$PH_mod= 1
##$PKNL= yes
##$PPARMOD= 0
##$PSCAL= 0
##$PSIGN= 0
##$REVERSE= no
##$SF= 200.129995230812
##$SI= 16384
##$SIGF1= 3
##$SIGF2= 2
##$SINO= 5.538805
##$SIOLD= 16384
##$SREGLST= <1H.CDCl3>
##$SSB= 0
##$STSI= 16384
##$STSR= 0
##$SW_p= 3612.71676300578
##$SYMM= 0
##$S_DEV= 0
##$TDeff= 16384
##$TDoff= 0
##$TI= <>
##$TILT= no
##$TM1= 0
##$TM2= 0
##$TOPLEV= 0
##$USERP1= <user>
##$USERP2= <user>
##$USERP3= <user>
##$USERP4= <user>
##$USERP5= <user>
##$WDW= 1
##$XDIM= 16384
##$YMAX_p= 366008415
##$YMIN_p= -263510
$$ End of Bruker specific parameters
$$ ---------------------------------
##NTUPLES= NMR SPECTRUM
##VAR_NAME=  FREQUENCY,     SPECTRUM/REAL,   SPECTRUM/IMAG
##SYMBOL=    X,             R,               I
##VAR_TYPE=  INDEPENDENT,   DEPENDENT,       DEPENDENT
##VAR_FORM=  AFFN,          ASDF,            ASDF
##VAR_DIM=   16384,         16384,           16384
##UNITS=     HZ,            ARBITRARY UNITS, ARBITRARY UNITS
##FACTOR=    0.220516191357247, 1,           1
##FIRST=     3161.1273431679, 0,             0
##LAST=      -451.589419837877, 0,           0
##MIN=       -451.589419837877, -263510,     0
##MAX=       3161.1273431679, 366008415,     0
$$ Real data points
##PAGE= N=1
##DATA TABLE= (X++(R..R)), XYDATA
$$ [...]
8550 22034006 22008793 22182549 22382630 22625184 22854365 23248505 23515110 23594322 23205788 22377005
8540 22377005 21491638 20582386 19793046 19012705 18004030 16964365 16182407 15584785 15162172
8531 15162172 14858389 14617355 14499488 14483017 14528560 14689061 14769349 14959636 15133634 15417794
8521 15417794 15955307 16635371 17473090 18330500 19170485 19966587 20932255 21998034 23180407
8512 23180407 24394440 25396925 25849300 25529099 24389800 22700269 20858633 19088430
8504 19088430 17559355 16402823 15417655 14562710 13727156 12916662 12149110 11528318 11082584
8495 11082584 10730558 10437072 10195793 10074094 9910491 9844541 9868806 9890644 9911732 10028651
8485 10028651 10238059 10607366 10992476 11421375 11671798 11822884 11987711 12142717 12143610 11939224
8475 11939224 11549166 10848974 10154719 9532386 8924500 8259502 7595309 6878329 6316604
8466 6316604 5836706 5463208 5141064 4851176 4705896 4404303 4142058 3972125 3775659 3680609
8456 3680609 3580671 3432745 3352812 3255425 3134509 3069983 2945097 2918762 2824875 2739047 2729823
8445 2729823 2703926 2724296 2569231 2466768 2339757 2334321 2348153 2264717 2212176 2190777 2177309
8434 2177309 2139756 2081428 2044605 2030706 2029296 2005311 2016365 1959792 2000311 1975797 1845161
8423 1845161 1848072 1869092 1793756 1715725 1732787 1750105 1742805 1719401 1594368 1528276 1558279 1583096
8411 1583096 1517174 1427145 1453694 1476614 1498189 1440100 1390086 1462934 1470443 1418176 1388036 1409564
8399 1409564 1409490 1325748 1299047 1361494 1374302 1286908 1370303 1432553 1467273 1419416 1378737 1361697
8387 1361697 1374624 1345758 1379722 1409314 1380111 1296145 1265528 1261051 1256984 1248175 1209981 1126580
8375 1126580 1148905 1186561 1238226 1139267 1023907 988061 1008900 992334 922196 966533 955633
8364 955633 997082 937881 982654 928022 916485 883732 872690 903044 916724 843968 810362 818633
8352 818633 782558 780866 737679 767393 814408 745877 717780 750200 739551 733251 764876 736004
8340 736004 651180 576219 543161 501427 535752 531809 558107 594188 608317 645402 632451 580074
8328 580074 499463 547300 537598 471077 404409 420215 431994 443600 363476 317220 334035 348228
8316 348228 392755 331898 285385 383617 337464 328309 317305 315147 355407 348171 372757 408372
8304 408372 397634 395119 402596 318215 319598 316034 308729 295537 221601 257522 267885 252280 362678
8291 362678 365803 320937 362088 305729 286206 286209 327987 334357 286245 384474 439089 372031 349940
8278 349940 313553 330649 409606 385443 331523 330486 351308 378146 365216 337021 357565 454560
8266 454560 555219 541190 455860 377727 402242 466443 474323 421527 358312 345682 421283 426806
8254 426806 438302 410893 385892 369033 352802 291720 380513 379544 389682 317863 343101 369507
8242 369507 321575 330709 404915 429703 439343 455128 446564 516394 523407 477801 532756 552502
8230 552502 482269 505413 500133 452604 517072 517244 451387 426899 334002 344635 351900 374166
8218 374166 315748 384804 393951 328891 311965 341646 315441 325887 306567 314129 314428 263089
8206 263089 280199 333386 266020 265968 322999 457383 450409 361170 387055 488726 459693 408839
8194 408839 385952 452433 141383 -70959 188381 81637 94870 209482 213348 221062 258163
8183 258163 177629 127513 199229 276137 252852 295984 278604 234262 243681 285494 267013 238251
8171 238251 222093 230850 247610 192721 234312 297277 260127 249881 238290 304495 300715 285053
8159 285053 238149 206824 215423 225738 200265 199524 177192 145877 187703 233748 272821 275304
8147 275304 215889 206060 179412 230464 266262 247330 224422 237513 238719 185653 241668 249663
8135 249663 307332 289468 252836 205624 213445 194098 180971 197906 243128 275782 226095 127469
8123 127469 103358 106444 89535 49433 168784 189871 146776 130531 229342 251310 197313 137176
8111 137176 176419 208846 199048 258013 169246 174298 197850 172948 168354 186601 199482 170910
8099 170910 212338 195239 146921 172588 85058 172542 212792 127817 170535 249850 219339 243636
8087 243636 215485 163614 163912 190359 190634 123142 139196 191832 180348 101050 155733 211924
8075 211924 197669 256909 177159 128482 169227 120563 102626 105544 172733 140654 138391 130344
8063 130344 51222 100273 155315 166032 153315 90856 112349 218074 155810 158740 128904 111717
8051 111717 131081 73179 44578 35479 60391 70326 65082 88358 64074 66929 97604 101235 111252
8038 111252 122504 139643 118733 105180 108116 106720 54523 103370 115076 60470 109907 66810
8026 66810 25676 11659 58938 28299 -33379 36480 9903 21833 50160 56007 70761 115477
8014 115477 107153 67715 121309 107429 89441 110729 124444 143394 101233 88176 63371 107527
8002 107527 157125 119300 58789 57221 63310 49936 48886 77120 38062 14457 70746 90565
7990 90565 74947 66517 44519 73812 55307 -21596 13580 7226 -1055 10846 53058 28323
7978 28323 15730 -2188 45357 54993 -12405 -38599 -1005 100373 175033 151569 41886 65690
7966 65690 85477 64386 60488 37201 9806 33322 8536 80186 137987 111049 138636 137446
7954 137446 102564 119980 128891 43901 48445 -10018 -4987 -24312 544 39408 43479 32720
7942 32720 75479 18355 20170 -23394 19567 -273 -72171 -12864 -25336 71662 40321 67555
7930 67555 29303 17956 14880 35063 85607 76874 50269 -1517 18066 81118 162041 120514
7918 120514 89623 42175 45413 50480 22218 34760 33360 -32383 3653 34358 43453 84953
7906 84953 17686 45568 -4800 -1979 7499 -28342 19984 16771 -17974 -2395 -207 -1877 -9691
7893 -9691 -13290 32248 22960 -37471 -36979 -66612 -33856 -88474 -4838 45123 70446 39432 -28663
7880 -28663 9490 -6622 51167 77771 57927 73313 91622 67865 62772 55237 72279 41088
7868 41088 63016 74377 60635 120388 93785 74603 98402 57942 8504 64670 81281 39159
7856 39159 -21519 -45124 6623 37454 4891 37684 76995 -12234 18926 22680 -37800 -13617
7844 -13617 1521 -1976 37177 109025 50488 5247 -3401 76320 120201 77598 -48509 -90140
7832 -90140 -58919 -25678 -16723 -25706 -4169 2422 4281 944 -59065 -22730 -4176 -57007 -28537
7819 -28537 -4941 58317 40408 -15100 6888 25599 -57829 -18283 -79625 -16733 -89009 -131990
7807 -131990 -116398 -125513 -174370 150701 516319 184781 167439 198489 177921 69438 15440
7796 15440 13504 27098 80459 57248 3923 31473 82608 67412 52904 20101 87334 16576
7784 16576 -26279 14177 47978 54839 17137 59304 63497 89614 75901 87907 95879 51011
7772 51011 102869 95213 99177 93103 201718 186352 172814 106458 100778 27884 53504 47495 59920
7759 59920 45055 12801 39732 108274 46134 -10318 97403 94304 90357 190429 241706 176645
7747 176645 128647 43962 19026 32721 80325 89093 61847 45348 75879 110236 64223 79353
7735 79353 98183 139153 73608 -43156 52186 32524 -12535 12625 86667 48278 -4291 30176
7723 30176 66638 39325 -3920 6472 20503 31403 106233 99579 22284 -3482 -834 -18367
7711 -18367 -15837 -22343 14040 24375 -22342 -45121 -7418 3866 8316 57995 127593 108983
7699 108983 70045 10392 38394 42178 13809 35366 111449 48635 55405 81679 73607 58033
7687 58033 -5370 100834 121226 97422 59548 128676 174290 108457 108659 118927 157733 87636
7675 87636 86690 67661 30282 116129 121508 119399 125170 88309 135430 183147 104274 42134 56905
7662 56905 47987 39492 67419 24830 -13816 -16021 -30252 7040 17112 39090 87658 50925
7650 50925 51268 -41508 -64464 13308 -8438 31930 56413 35401 64987 75356 43202 11641
7638 11641 -8035 13885 18743 22805 9967 -5019 11429 22060 67277 62239 8085 31243
7626 31243 16084 31059 -11928 1135 5212 -13338 -22019 17592 -4915 27264 61093 9250
7614 9250 6606 -62608 -43146 -33344 22528 16650 43343 -755 -33864 -24745 -43397 -44596 -6859
7601 -6859 16838 65937 59145 15620 -51414 -37034 161 12153 -3465 -15819 -13158 -33820
7589 -33820 -65038 -60955 -7784 -48305 -65607 -101850 -10782 21998 -73144 -28571 -19272 2708
7577 2708 431 20574 -7029 -31875 -13533 28748 -8040 6931 -29554 -16464 -48226 -51897
7565 -51897 -37781 -71822 -6316 38145 51882 23146 2259 17016 7711 -37513 -27911 -35780
7553 -35780 -57824 -52834 -73479 -32617 10453 55127 23193 6253 -13113 19694 94104 -30975
7541 -30975 -14401 -8796 -56990 -17065 25541 -52598 -20038 -48524 -89508 -296 9151 -57620
7529 -57620 -2212 -55715 -113746 -41326 -40071 -76479 -84926 -106288 -99486 -133575 -101392 -37766
7517 -37766 8059 -41518 -57804 -32732 -104017 -263510 -147272 4194 -11609 1119 -17022
7506 -17022 -20754 -94474 -69787 -10304 -23913 -25507 -37346 38092 -29098 -66220 -31771 -40320
7494 -40320 -16548 -46262 -43368 -13168 -25318 -18800 -55507 -120248 -97938 -105192 -61845 -31306
7482 -31306 -28660 -31572 -87625 -66068 8629 -9845 2140 -39764 -48767 -63497 -45981 -29813
7470 -29813 -5732 -36831 -79650 -74409 -38514 -8872 -64979 -101095 -53792 -64781 -945 64827
7458 64827 10758 -6480 23125 699 -39912 -13548 28992 79077 36315 69536 -3489 -67309
7446 -67309 -23684 -100102 -38537 -41034 -26988 -6361 4831 -2340 3189 -121931 -92629 -13150
7434 -13150 16616 44558 -29782 -55907 -26587 -14307 -97277 -85776 -82000 26569 16873 -22909
7422 -22909 -70058 -13395 56256 12545 -18422 7127 16058 -21939 -71084 -102491 -138803 -73973
7410 -73973 -38314 -42271 -63388 -17696 -11561 -41993 -24793 18086 -26122 9405 9281 -37178 12285
7397 12285 58374 40684 -25696 3163 23672 77761 33156 -17689 -32161 26804 79713 1273
7385 1273 20227 -11922 -39798 298 -49900 13013 57054 103284 120268 154614 48859 83510
7373 83510 57901 -25384 7491 44249 57161 -32362 20347 120243 87059 81058 104856 127013
7361 127013 92961 97736 119104 73872 99859 35910 27915 -2046 10729 38449 50567 50172
7349 50172 93859 87791 35790 114755 153375 60276 105914 132932 71309 126256 57497 24383
7337 24383 60692 83186 70365 61549 88798 94052 130575 137085 86589 96768 96006 69423 123150
7324 123150 160042 111912 113019 67299 32099 74396 59529 63841 48996 -19105 24061 -16033
7312 -16033 5209 -4430 13834 89054 82464 126529 59268 81448 80936 178405 151792 166582 194320
7299 194320 244696 204438 200417 133418 153852 244829 274995 252284 168361 318091 375234 389423
7287 389423 458979 484770 448397 485586 402056 383132 392280 349213 214517 203850 216336 193361
7275 193361 185833 199584 136125 103593 118132 105321 112659 203516 171152 160727 131267 135514
7263 135514 126891 24729 8964 70585 85407 23048 78491 160686 157830 82810 41171 75535
7251 75535 133166 112449 67924 -7097 31901 90966 106383 109863 62905 55853 9184 -11549
7239 -11549 44551 -5174 12887 26166 10978 20878 17231 15104 13993 29434 32223 -24234 -6321
7226 -6321 49141 33837 115035 103534 15525 27702 38657 16207 92289 129190 105778 56918
7214 56918 70870 24134 24340 37515 20332 50656 101905 130456 88070 -7034 14202 130705
7202 130705 161244 152929 145147 123020 98355 147850 47970 -16578 40150 85728 -3580 30204
7190 30204 32307 21002 -8773 -5154 -4232 54260 4743 73148 102989 71537 83351 116420 155054
7177 155054 146273 151547 163059 137131 78129 41695 105108 111524 111675 70717 50280 109606 63535
7164 63535 44126 83405 124403 101078 115215 147404 136338 107755 202629 190809 136144 120965
7152 120965 152435 102238 93606 84147 84815 121832 170123 181413 174892 177716 139849 133434 115546
7139 115546 155148 134907 101254 126164 143843 118529 135949 209087 168394 180019 199126 186270
7127 186270 175418 181946 193481 132954 159934 172410 182848 199011 199559 206556 142805 163207
7115 163207 196755 162141 180186 185874 206888 283768 336369 305242 259061 306461 239115 249191
7103 249191 288249 308863 309957 341112 329396 334900 320138 360040 328230 314365 336167 351616
7091 351616 358546 384134 408034 425987 399898 413237 458119 417286 390977 414688 499844 556209
7079 556209 508981 467796 467408 431540 405241 442030 458184 513500 570449 574039 632129 590622
7067 590622 609169 571873 592575 559852 550220 620937 607736 602382 622441 626253 678608 696221
7055 696221 617111 611677 680869 633969 585766 670724 702002 693269 698856 650819 642211 651132 637712
7042 637712 708500 695454 721157 725313 666308 731776 801528 799287 787716 855715 855179 832971
7030 832971 818662 838513 894428 813795 736350 791328 878349 878355 949585 988558 1018357 983864
7018 983864 998867 1101427 1131622 1201487 1234590 1264381 1247468 1262405 1345457 1365078 1427189
7007 1427189 1439067 1448893 1585954 1621362 1667323 1685066 1749348 1808075 1898618 2018361 2123356
6996 2123356 2053066 2043532 2036766 1973330 2037145 2066897 2007046 2019967 1972730 2012383 2111409 2107131
6984 2107131 2162366 2229431 2283826 2323697 2336527 2353660 2382421 2416443 2474031 2531620 2613593
6973 2613593 2675657 2690131 2736585 2856027 2958983 3131227 3226917 3312305 3491817 3632196
6963 3632196 3851485 3888787 4154997 4373443 4579972 4814006 4961895 5219089 5516407 5833427
6953 5833427 6180271 6599984 6990533 7449644 7929944 8620289 9340210 10183639 11114987 12095074
6943 12095074 13234228 14425321 15543106 16473532 17074397 17391581 17394166 17167535 16695273
6934 16695273 15952357 14914624 13839396 12805126 12011892 11310999 10667933 10219321 9920182
6925 9920182 9694320 9528476 9460131 9444329 9474728 9492863 9536539 9716632 9942443 10225744
6915 10225744 10546094 10852712 11280157 11728402 12247922 12834265 13461625 14058152 14782562
6906 14782562 15624245 16683446 17815353 19098939 20614191 22371365 24441410 26860619
6898 26860619 29744271 33240185 37352492 42226450 48180314 55652265 64749911 75054786
6890 75054786 85188953 93024856 96094196 92791496 84131984 72184903 59980335 49419331
6882 49419331 41096698 34722296 30099273 26651988 23992664 21891154 20071953 18512267
6874 18512267 17188015 15988951 14792314 13752264 12854452 12030971 11311949 10688364 10263058
6865 10263058 9810105 9341359 8871347 8381822 7969803 7606404 7272435 7046566 6733844
6856 6733844 6309724 6035506 5693122 5388198 5075792 4724982 4500521 4306578 4127252 4002940
6846 4002940 3769238 3622423 3394371 3283385 3110721 3036153 2926285 2872123 2737697 2730201
6836 2730201 2708764 2562165 2547563 2502974 2447126 2423506 2325384 2191044 2064275 1923796 1935015
6825 1935015 1875867 1779704 1686851 1724035 1688884 1692019 1723346 1717372 1639014 1568621 1496598 1427122
6813 1427122 1400099 1412973 1411268 1318858 1311506 1281419 1267828 1291119 1299916 1213689 1199980 1171473
6801 1171473 1060598 1002192 1019466 983467 953634 932447 844145 873624 842760 824853 803431
6790 803431 787036 824848 863607 862945 815374 753627 780092 783244 765487 695405 689324 687974 661665
6777 661665 678883 705931 698170 700696 627114 595699 621622 689168 672556 694105 650190 620309
6765 620309 620987 606722 598695 583834 696317 645491 659451 639278 635854 612757 571343 557754
6753 557754 601097 631705 649711 615629 613053 595394 520492 513078 522250 441775 417253 365346
6741 365346 416225 405499 368185 350970 384946 374922 324507 242693 275202 299584 258248 301896
6729 301896 290796 297495 344370 321154 338010 416136 316956 296711 276468 280111 279889 298730
6717 298730 248602 280560 314841 290974 239149 260918 187944 248531 351121 248512 157221
6706 157221 173182 280217 309444 316574 250953 222597 127393 146153 209297 229096 218615 222557
6694 222557 256533 211512 209956 183881 211982 211674 273901 330028 329882 266174 181443 252811 304847
6681 304847 268534 277332 263230 263633 279742 295433 338573 291821 293560 205679 240466 329474
6669 329474 330947 313635 242790 235053 286540 296147 278311 188557 254033 287469 267848 232577
6657 232577 228145 272972 201594 228729 211526 203850 193521 227267 249092 261582 302044 278394
6645 278394 255321 288767 360100 305946 226517 292739 273655 292850 361224 377928 412132 469612
6633 469612 484557 476630 406558 385149 422719 485986 491133 486849 446781 410482 421073 476265
6621 476265 420416 359066 335271 376175 465982 527771 540705 542919 531829 486162 441581 491801
6609 491801 538942 587618 631000 620873 576625 641386 658702 648585 616187 541774 556840 552103
6597 552103 564710 469770 512202 547235 529273 511017 564387 612374 646744 602563 557144 566263
6585 566263 586120 562158 589777 614377 599109 599691 608717 565695 554678 571135 596819 614112
6573 614112 635456 655448 610253 515442 509448 526629 497308 508350 586446 598635 582071 574816
6561 574816 520356 514064 568873 560150 618090 618231 589416 569077 619029 624913 585259 599553 599645
6548 599645 555795 548872 640665 706464 792011 787688 807300 791056 823513 816246 841882 818165
6536 818165 877316 926553 923321 944661 901021 901460 906947 938378 929660 889106 911447 885265 868481
6523 868481 862704 920106 894397 915059 932275 878684 929895 944076 946599 984755 991075 1101855
6511 1101855 1121610 1162361 1127271 1128374 1171969 1160916 1201758 1134450 1169858 1154108 1297934
6500 1297934 1281560 1317829 1385923 1427636 1446720 1541893 1605454 1682979 1734199 1807151 1956927
6489 1956927 2037193 2042677 2107894 2147663 2112342 2123197 2198665 2205416 2190368 2286577 2319339 2414314
6477 2414314 2462198 2504151 2493665 2538206 2557534 2519625 2601613 2725844 2728906 2789635 2902133
6466 2902133 3029201 3144002 3211762 3274420 3430862 3541756 3699526 3853789 4027480 4221965
6456 4221965 4427040 4636477 4841804 5137016 5535254 5884141 6222792 6728400 7208289 7720073
6446 7720073 8099408 8337864 8512957 8560013 8556849 8435988 8312710 8308988 8348333 8348036 8415100
6435 8415100 8527107 8717060 9109169 9481315 9951006 10425500 10996500 11669030 12500422 13472454
6425 13472454 14556582 15790193 17246207 18839715 20469777 21929135 22951225 23388592
6417 23388592 23162299 22428937 21319252 20134460 19003136 17973841 17169727 16602222 16166257
6408 16166257 15995226 15991887 16142147 16336543 16718308 17331381 18160931 19112529 20338427 21771378
6398 21771378 23361851 25284397 27327816 29542107 31653898 33223887 33863531 33430435
6390 33430435 32035839 29948464 27620592 25194547 23027115 21229568 19801957 18641384
6382 18641384 17753085 17106132 16640177 16356751 16182569 16139117 16292038 16623379 17148406 17818563
6372 17818563 18625504 19490552 20546643 21644702 22718830 23659359 24159848 23962012 23034789
6363 23034789 21666819 19880247 17953634 16159221 14581771 13298981 12239333 11359835
6355 11359835 10617328 9988042 9542317 9127342 8772251 8488164 8358737 8264836 8121437 8085888
6345 8085888 8176709 8238642 8344538 8451785 8502234 8583764 8498421 8206039 7746044 7148082
6335 7148082 6561189 6008137 5572699 5125629 4751505 4469198 4166931 3916609 3712655 3493964
6325 3493964 3326194 3145028 2979390 2841272 2752800 2660882 2591101 2523094 2358631 2221854
6315 2221854 2195003 2155508 2094191 2071856 1988801 1926463 1859503 1802789 1813170 1781486 1760990
6304 1760990 1684631 1646453 1588541 1512116 1419057 1386342 1385884 1406478 1334923 1263686 1192494 1211428
6292 1211428 1183152 1158293 1176673 1143887 1140888 1119710 1127604 1167329 1101197 1058861 1019731 1026780
6280 1026780 996680 960023 1008335 1035474 944629 895013 919612 868671 856023 824612 876955
6269 876955 785183 765952 837384 831473 849993 822711 828881 778706 799925 787235 740909 747291
6257 747291 714366 774061 763229 798768 788266 862567 878363 900425 929064 951065 1087118
6246 1087118 1166243 1133496 1112470 1050932 1005219 927516 930921 901288 862372 781523 768683 782793
6234 782793 739123 763885 787082 695757 659277 634554 675597 637256 655676 664927 638739 635909
6222 635909 604215 625069 568457 575674 572717 588389 540478 542277 567095 551250 528306 513788
6210 513788 537287 564709 568787 601575 557458 519213 586466 593513 630779 689495 666519 643223
6198 643223 602694 597536 696861 680197 661788 704977 709857 695810 707377 775233 824896 825040
6186 825040 776955 856000 925123 1003329 1091377 1125817 1193867 1197832 1228932 1275652 1377970 1496037
6174 1496037 1572502 1636468 1647170 1689815 1719374 1712440 1691940 1638204 1644534 1643938 1672247 1734678
6162 1734678 1826526 1897318 1861294 1862357 1853487 1883105 1852619 1944880 1997298 2044248 2086573 2166090
6150 2166090 2417131 2454957 2594691 2756417 2822547 3020392 3268986 3508077 3766746 3955646
6140 3955646 4117665 4295777 4276994 4221664 4126029 4028996 3856095 3714733 3560402 3462540
6130 3462540 3376595 3295789 3211314 3303772 3277746 3256469 3306462 3322929 3439266 3560550 3617180
6119 3617180 3813114 3999330 4111824 4240958 4406294 4593936 4744365 5031980 5314584 5559822
6109 5559822 5861154 6166553 6409398 6652457 6827495 6789285 6620359 6403035 6143856 5906296
6099 5906296 5607435 5435436 5235327 5069038 4967294 4975806 4995229 4977083 5090584 5214611
6089 5214611 5235643 5370100 5357025 5272507 5174098 5139402 5127771 5121903 5146198 5119732 5197969
6078 5197969 5241525 5387079 5554046 5730290 5943684 6121567 6241929 6290941 6313863 6334321
6068 6334321 6246511 6063321 5934994 5791427 5758746 5759398 5753030 5706497 5565369 5357018 5134067
6057 5134067 4848853 4609061 4417613 4254289 4083183 3955134 3834478 3687752 3648321 3684485
6047 3684485 3615009 3584690 3581332 3583890 3561800 3652508 3757691 3786220 3926686 3991724 4049949
6036 4049949 4107991 4089278 4109682 4029445 3896145 3723599 3472872 3205645 3040837 2824959
6026 2824959 2650588 2553936 2411817 2283325 2238235 2172221 2132881 2088740 2028640 1972040 1922636
6015 1922636 1954269 1962686 1954163 1838275 1801447 1795929 1840033 1828920 1788825 1739403 1758588 1722853
6003 1722853 1719857 1680098 1558382 1433163 1389933 1321410 1291618 1254034 1221125 1179583 1154115
5992 1154115 1148923 1107381 1095931 1121515 1124958 1123700 1050317 1008093 1015383 1017119 1062215 1024942
5980 1024942 1007455 1042801 1059385 1034787 973887 1006312 980756 1024138 966630 863105 875064
5969 875064 857412 839662 832469 811727 740177 746017 820692 788773 817050 819477 775616 839533
5957 839533 873721 917077 979684 961495 1005914 998200 973314 1004222 912679 855102 848022 840609
5945 840609 755370 700392 716318 722329 715890 721103 781500 790419 761040 751533 744779 734531 756899
5932 756899 768510 730849 735403 678507 682687 678673 672155 757976 787758 751622 756013 707139 692553
5919 692553 725276 768821 807953 805164 746531 760707 703880 727989 765652 731935 711554 683709
5907 683709 706913 710546 690573 737871 693195 701743 667348 650066 655887 668040 629646 612675
5895 612675 636916 630063 630646 693292 716569 693623 733485 726528 666329 681644 709618 718707 706750
5882 706750 700729 725176 744530 725260 730863 808718 813986 770118 818133 803176 789356 790222 841146
5869 841146 827045 785817 798040 750483 756200 776078 850621 868479 912164 930202 979542 1042454
5857 1042454 1033765 1035363 1064834 1156054 1150485 1160743 1203127 1159975 1195711 1211344 1158182 1192956
5845 1192956 1147714 1071055 1070700 1072143 1090470 1086938 1156204 1124451 1145133 1171659 1197770 1185140
5833 1185140 1172548 1190342 1255144 1302636 1347205 1438614 1522429 1498824 1561085 1632922 1738083
5822 1738083 1776164 1738889 1638998 1630669 1621448 1562943 1555295 1581740 1489851 1492822 1490163 1477406
5810 1477406 1485915 1483159 1507354 1489812 1508959 1513583 1505362 1592591 1640506 1674952 1743749 1717463
5798 1717463 1714057 1799859 1935301 1994654 2007183 2009662 1993015 2019050 1966303 1948813 2027057 2145182
5786 2145182 2211068 2254364 2262177 2299132 2442528 2418726 2328842 2293575 2324382 2391770 2417600
5775 2417600 2327648 2373782 2424587 2516336 2500918 2443212 2472747 2566706 2627203 2618277 2657165 2722959
5763 2722959 2747287 2791497 2790021 2815898 2840897 2840334 2916539 2993871 3058779 3108784 3191238 3254304
5751 3254304 3304477 3329968 3360407 3355444 3362543 3419322 3388241 3420172 3451467 3448111 3502435 3547748
5739 3547748 3619495 3676577 3673914 3674994 3796870 3870816 3864097 3987636 3983754 4039885 4109882 4184194
5727 4184194 4241392 4300818 4325789 4431167 4517393 4652813 4765908 4939337 5067541 5122828
5717 5122828 5206563 5193556 5170298 5084045 5026488 4997559 4990337 5071646 5132116 5203648 5222586 5315330
5705 5315330 5477447 5657208 5854743 6002243 6169606 6490734 6847721 7174801 7587867 7968395
5695 7968395 8496179 9116605 9839342 10514897 11148163 11553937 11530104 11059493 10448840 9821723
5685 9821723 9206971 8772939 8536611 8398654 8291790 8242063 8271190 8419956 8608095 8806529
5675 8806529 9103105 9501787 9937310 10549897 11167758 11940124 12930772 14053142 15372552
5666 15372552 16948813 18733209 20486996 21968103 22673912 22268327 20820709 18865695
5658 18865695 17052797 15498760 14234533 13431720 12804143 12354799 12166583 12130901 12029513
5649 12029513 12090725 12334739 12634851 12989769 13500317 14245521 15104999 16110723 17341532
5640 17341532 18741146 20513454 22682235 25055079 27349396 28978279 29444721 28339107
5632 28339107 25934001 23050990 20417108 18273147 16581906 15231104 14332164 13728542
5624 13728542 13180150 12852512 12679961 12638170 12539030 12690271 12892804 13179999 13555477 14085666
5614 14085666 14862530 15776583 16814527 18181199 19698693 21398093 22984147 23838961 23809216
5605 23809216 22582858 20493512 18189453 16179900 14590492 13358781 12459236 11703918
5597 11703918 11066960 10702846 10406278 10147060 9913150 9771014 9714366 9685443 9730824 9834967
5587 9834967 10081227 10398490 10760766 11207583 11720412 12371033 13081880 13657330 13934251 13706729
5577 13706729 13088031 12239539 11335051 10629956 10054745 9634731 9279206 8960568 8809002
5568 8809002 8745855 8601681 8604725 8625759 8674804 8807040 8873546 8983353 9137594 9312202 9550212
5557 9550212 9773043 10091315 10382935 10815174 11286938 11659114 12040825 12445721 12694941 13031036
5547 13031036 13405798 13829371 14340394 14840408 15406488 16115515 16871726 17714604 18519533
5538 18519533 19352775 20226508 21003037 21664015 22126264 22455785 22611380 22741457 22848947
5529 22848947 22923269 23056383 23200153 23352635 23427896 23486388 23582727 23609396 23804487 24007960
5519 24007960 24302434 24744501 25362254 26165254 27067898 28009105 28994555 30067277 31173234
5510 31173234 32194623 33212127 34350293 35377222 36206792 37084183 37661798 37945965 37964575
5501 37964575 37643411 36956873 36060778 35121563 34133084 33111088 32095490 31041606 30035101
5492 30035101 29144610 28226691 27443862 26638840 25936849 25523295 25309653 25098960 25018780 25045301
5482 25045301 25060069 25042780 25000528 24881643 24731503 24622227 24506839 24328353 24201819 24117703
5472 24117703 23769618 23238500 22543051 21676515 20713454 19633196 18556741 17601424 16661431
5463 16661431 15858177 15072570 14284514 13630253 12999080 12398986 11865549 11271587 10808973
5454 10808973 10297165 9865969 9538125 9212736 8996741 8709407 8464700 8347519 8220613
5445 8220613 8087699 7965975 7851021 7766602 7635067 7566179 7484772 7405313 7340057 7292906 7289438
5434 7289438 7357120 7300410 7209026 7186832 7126542 7066456 7000984 6961084 6835360 6678449 6590051
5423 6590051 6488324 6416031 6414021 6423179 6343133 6340059 6347810 6346776 6356247 6385775 6462792 6478340
5411 6478340 6582275 6711457 6823916 7005406 7111258 7245835 7418611 7603220 7820382 7923659
5401 7923659 8068151 8199705 8251334 8319109 8261673 8158896 8082562 7955236 7902391 7723424
5391 7723424 7597644 7536720 7471433 7401899 7384456 7418953 7465795 7476470 7434855 7597340 7655277
5380 7655277 7749244 7918366 8047972 8155503 8337806 8434481 8528856 8679538 8929289 9065378
5370 9065378 9195445 9348909 9450506 9671453 9706681 9762950 9860288 9942950 10032015 10126002 10202669
5359 10202669 10296204 10371248 10547474 10713626 10885208 11108977 11304116 11520832 11818195 12157625
5349 12157625 12546303 12946814 13282219 13735553 14288389 14790080 15363284 16030170 16770601
5340 16770601 17617929 18426062 19386694 20442704 21584661 22922733 24338809 26067289 28069818
5331 28069818 30371117 32842467 35363018 37660821 39471723 40410513 40442773 39852674 39087637
5322 39087637 38356637 37681739 37227952 36802286 36376530 35902336 35398693 34926273 34538929
5313 34538929 34406385 34584122 34952647 35653795 36630096 37964634 39617844 41703764 44237220
5304 44237220 47155980 50571667 54401739 58402854 62241174 65590052 68007469 69602202
5296 69602202 70483636 71032428 71457609 72030069 72764117 73612188 74245630 74163255 72971139
5287 72971139 70386129 66610444 62074364 57663973 53647420 50270994 47619628 45682026
5279 45682026 44252008 43319174 42864167 42731376 42974121 43565640 44387037 45546038 46770176
5270 46770176 47970237 49042136 49927242 50556031 50968206 51512403 52127841 52776655 53029796
5261 53029796 52529346 50967648 48375565 45030558 41436713 37906706 34634373 31759536
5253 31759536 29419259 27471648 25739677 24365276 23055735 22068952 21211362 20432503 19817230
5244 19817230 19251889 18764045 18280599 17982774 17570629 17167195 16911382 16637605 16336331
5235 16336331 16060237 15777507 15522361 15230260 14913863 14642040 14371991 14093871 13828322
5226 13828322 13620610 13359904 13160830 12931338 12682051 12455926 12289458 12208760 12179606 12138996
5216 12138996 12093098 12170700 12216812 12208953 12253161 12276777 12384080 12556287 12747542 12990107 13164967
5205 13164967 13274353 13475667 13684959 13822664 13912381 14063668 14255599 14453709 14582992 14786479
5195 14786479 14963645 15100602 15311395 15515385 15738648 15970038 16169672 16385333 16622983
5186 16622983 16968532 17254840 17602367 18049071 18350994 18790171 19302336 19780903 20193411
5177 20193411 20635687 21097625 21514807 22116785 22705892 23385949 24249114 25289646 26394733
5168 26394733 27770519 29353204 31127198 33366925 35838048 38668197 41839835 45166818
5160 45166818 48485991 51453315 53630581 54763616 54673812 53723868 52236480 50774225 49473778
5151 49473778 48314300 47178826 46094083 45078812 43986449 43013140 42199762 41725428 41614345
5142 41614345 41918461 42684552 43799377 45400732 47498290 50083495 53045081 56306276
5134 56306276 59567910 62494217 64712762 65943995 66372494 66150208 65437557 64606412 63763821
5125 63763821 62901300 61930302 60928804 59788820 58611779 57119085 55230819 52847362
5117 52847362 49864585 46705458 43647764 40836612 38454026 36599846 35151806 34118907
5109 34118907 33501400 33146858 33166734 33354301 33730257 34314232 34937457 35592606 36241490 36742522
5099 36742522 37280169 37743914 38287947 38848477 39161673 39056551 38024644 36232771 33700319
5090 33700319 30994597 28351186 25836234 23735255 22036229 20633541 19421730 18332496
5082 18332496 17454923 16714133 16069976 15554967 15075956 14621290 14198780 13834140 13516331
5073 13516331 13133167 12794403 12502655 12242922 12015062 11753832 11520212 11370722 11129729
5064 11129729 10796419 10585497 10379819 10155751 10026718 9898475 9655053 9469583 9397579 9286849
5054 9286849 9149289 9061548 8959277 8915979 8835168 8706334 8786822 8773704 8659765 8575057 8529966
5043 8529966 8422380 8400135 8377066 8339435 8321589 8264493 8209748 8230471 8142953 8003836 7989036
5032 7989036 7952439 7820786 7700462 7630600 7622350 7546888 7612048 7644617 7667408 7636114 7605869
5021 7605869 7589676 7607677 7688319 7724586 7809013 7894417 7959489 7999800 8156357 8298090 8327866
5010 8327866 8376772 8459992 8643252 8767702 8928272 9074712 9200261 9306073 9339800 9396426
5000 9396426 9467853 9469243 9449860 9429346 9414205 9415605 9411409 9410541 9532092 9649176 9709178 9805469
4988 9805469 9951553 10159649 10426798 10640372 10874292 11136890 11404191 11695495 12040275 12376964
4978 12376964 12681458 13136744 13635241 14184730 14756429 15272613 15740453 16111861 16282165
4969 16282165 16431928 16490525 16482429 16535476 16539167 16538084 16713074 16674284 16746838 16870458 17020831
4958 17020831 17216955 17466722 17793986 18182518 18585006 19093195 19636964 20222838 20911218
4949 20911218 21642061 22194628 22805442 23408651 24027122 24514617 24966545 25434548 25970441
4940 25970441 26629802 27351762 28065905 28640972 29051010 29196772 29194921 28984385 28783906 28575928
4930 28575928 28341920 28114958 27799172 27560960 27345778 27173770 26923831 26716584 26584411
4921 26584411 26476281 26434632 26428517 26436995 26520961 26632728 26797133 27140545 27643748 28258070
4911 28258070 28993095 29889106 30761244 31769840 32908613 34114766 35376665 36707105 37974827
4902 37974827 39142887 40117939 40885820 41598759 42290803 42979599 43625553 44255841 44839123
4893 44839123 45481002 46001442 46418861 46747100 47007377 47188628 47225282 47184253 46978455 46552110
4883 46552110 45962953 45389706 44849123 44345783 43894390 43442874 42967261 42625911 42275467
4874 42275467 41954792 41834031 41901375 42016790 42219196 42444581 42772755 43199863 43550106 43841822
4864 43841822 44074393 44333133 44404373 44344826 44170446 43749680 43351725 42797530 42091300 41186127
4854 41186127 40041612 38758311 37442114 35981531 34524814 33052482 31739537 30562648
4846 30562648 29583440 28561321 27767945 27146381 26565396 26096259 25688856 25400219 25286040
4837 25286040 25301797 25344793 25439449 25831003 26252606 26777025 27390487 28070818 28794616 29508012
4827 29508012 30211266 30865280 31345400 31565212 31527727 31237391 30768906 30113096 29385836 28683434
4817 28683434 28151409 27509003 26884291 26233285 25673318 25207117 24745018 24431912 24314081
4808 24314081 24311416 24489800 24851566 25425637 26167799 26995047 27987989 29154715 30307109
4799 30307109 31569819 32782043 33945491 34943962 35914018 36754999 37328684 37623593 37520646
4790 37520646 36992872 36024385 34779174 33352168 31766472 30161142 28659765 27289349
4782 27289349 25971081 24675080 23535955 22572870 21778875 21079803 20555277 20259662 20037209
4773 20037209 19893968 19960452 20143892 20368549 20635735 20844100 21022996 21269168 21335981 21365822
4763 21365822 21326351 21067380 20880577 20579095 20175486 19598572 18983789 18215191 17311588 16347347
4753 16347347 15413237 14491339 13635052 12921614 12267630 11683670 11207118 10749524 10387647
4744 10387647 10096791 9850228 9571740 9310704 9044135 8800309 8633042 8383926 8183005
4735 8183005 7974511 7791413 7610038 7528905 7355205 7271981 7177199 7062852 6968395 6835157
4725 6835157 6758792 6711317 6595664 6534238 6498014 6362957 6241760 6249574 6216935 6161154 6188700
4714 6188700 6241987 6302577 6386659 6502092 6646070 6726082 6781127 6879340 6941765 7013604 6936780
4703 6936780 6948469 6864075 6847741 6735725 6593823 6526153 6471556 6423631 6431181 6445211 6373173
4692 6373173 6373381 6425476 6429924 6449041 6472920 6419480 6397749 6371799 6328367 6147401 5923440 5751201
4680 5751201 5640327 5481103 5271575 5128680 4935650 4803367 4671543 4497398 4383804 4365652
4670 4365652 4264268 4225111 4162589 4018448 3997464 4045555 4083344 3929579 3879218 3851522 3803509
4659 3803509 3754466 3728961 3647453 3619286 3559892 3449300 3314489 3245477 3155669 3037278 2927473
4648 2927473 2905928 2865312 2801302 2705060 2612745 2620338 2595780 2500434 2455397 2398015 2398316 2393819
4636 2393819 2409223 2403380 2402867 2371906 2319922 2336987 2304164 2248436 2296517 2348894 2304621 2277854
4624 2277854 2173099 2146443 2114131 2074964 1981511 1932062 1909535 1862899 1801671 1812958 1700067
4613 1700067 1623795 1657039 1677677 1637537 1588712 1657521 1635792 1649643 1599005 1573268 1543241
4602 1543241 1553133 1507761 1449362 1457341 1429922 1422658 1389672 1395607 1440640 1534414 1443159 1370922
4590 1370922 1372950 1342490 1347747 1352842 1353695 1335210 1296440 1282678 1315817 1264999 1245898 1284195
4578 1284195 1221489 1205467 1266038 1261132 1245176 1269116 1271991 1242241 1220094 1221262 1207872 1198368
4566 1198368 1259590 1286133 1251783 1203561 1192219 1247151 1254027 1197393 1165891 1208548 1286806 1280056
4554 1280056 1185942 1143171 1184198 1146870 1188123 1186043 1182366 1276685 1237561 1255322 1230454 1213505
4542 1213505 1237401 1217925 1188028 1225524 1231988 1223214 1289691 1298145 1337117 1316580 1333549 1339978
4530 1339978 1330578 1316768 1264471 1283189 1301067 1378778 1306145 1289622 1299537 1292715 1292803 1267150 1267190
4517 1267190 1299832 1226701 1185318 1213262 1225334 1259606 1259752 1289465 1294135 1341226 1319003 1234199
4505 1234199 1308118 1401182 1404180 1377203 1362826 1406739 1419018 1474245 1493205 1560205 1550821 1569694
4493 1569694 1610682 1527401 1558595 1593798 1553924 1501369 1453273 1484390 1480249 1484630 1502901 1467397
4481 1467397 1464435 1488210 1445508 1467528 1536373 1581909 1618366 1638970 1658446 1662406 1743875 1723556
4469 1723556 1761806 1778222 1854111 1894743 1946085 2019929 1978108 2008678 2079707 1999238 1928393
4458 1928393 1909590 1925824 1953083 1955847 1866242 1865859 1890940 1822038 1812777 1819510 1797433 1783352
4446 1783352 1861302 1857191 1853210 1907133 1956332 2044098 2047464 2050939 2102982 2139656 2174289 2176776
4434 2176776 2256544 2270516 2305462 2327887 2383400 2421847 2341744 2247764 2191602 2138832 2128534
4423 2128534 2128841 2097545 2026997 1981452 1952939 1932997 1863393 1859406 1895212 1875527 1833926 1871327
4411 1871327 1881177 1947723 1974653 1982388 1999906 2028556 2108046 2094216 2068308 2004172 2022398 2051536
4399 2051536 2069824 2049385 2057304 2069608 2042557 2053715 2014206 1918607 1875276 1931088 1990779 1934862
4387 1934862 1958635 1953203 2036467 2079358 2013653 2041025 2109672 2227107 2397838 2563198 2671633
4376 2671633 2814089 2953804 2954713 2855032 2683044 2496990 2415257 2273328 2090785 2029739 1953802
4365 1953802 1893650 1909218 1858218 1857832 1816315 1790650 1747465 1780683 1803024 1824142 1803060 1778402
4353 1778402 1799155 1775340 1746586 1729250 1752981 1719293 1680934 1638164 1651933 1644722 1558840 1630399
4341 1630399 1624426 1606070 1572430 1604393 1613600 1537813 1537758 1522259 1555022 1550002 1529943 1564151 1591404
4328 1591404 1547916 1598143 1599089 1604012 1601267 1644982 1683972 1680854 1704461 1696129 1744894 1800643 1796352
4315 1796352 1795551 1811094 1848797 1880638 1912965 1888522 1883701 1926645 1914188 1943193 1950535 1993345
4303 1993345 2012604 2045274 2073990 2056128 2083719 2054617 2033033 1989985 2071964 2149501 2197083
4292 2197083 2249725 2265239 2313432 2320334 2414550 2469302 2535567 2574380 2636434 2650819 2651971 2721140
4280 2721140 2787087 2857895 2940158 3042001 3108411 3135374 3293172 3437902 3437429 3383172 3327475
4269 3327475 3371179 3309776 3329861 3288283 3258626 3171986 3172130 3132299 3170829 3169156 3206765 3247339
4257 3247339 3243258 3279936 3344723 3380697 3381139 3467833 3504524 3493684 3507556 3608637 3697635 3705649
4245 3705649 3706797 3811617 3827366 3813701 3831531 3852563 3890546 3991988 3979761 4097657 4179755
4234 4179755 4216800 4146453 4120668 4192146 4268385 4285777 4228555 4277902 4296972 4333822 4300430
4223 4300430 4407925 4372676 4360722 4448036 4515128 4570007 4718016 4849568 4883894 4902145 4948641
4212 4948641 5043528 5062294 5078153 5155274 5143926 5086456 5268141 5354494 5370020 5398018 5443693
4201 5443693 5496089 5678971 5677901 5702125 5807942 5852659 5906586 6068644 6167387 6210912 6301089
4190 6301089 6454810 6515118 6624833 6774752 6947410 7104139 7292177 7451693 7517587 7612912
4180 7612912 7737729 7889337 8024956 8199596 8347310 8498180 8585892 8729043 8847410 9072204
4170 9072204 9228472 9390069 9673605 10094212 10446643 10708674 10861669 11104487 11438022 11783564
4160 11783564 12076201 12382719 12705652 13035386 13432512 13805231 14191158 14593162 15033811
4151 15033811 15463653 15921730 16406451 16762299 17244605 17813843 18276571 18773705 19268444
4142 19268444 19800456 20426663 21128848 21830789 22656109 23490572 24426100 25284677 26165389
4133 26165389 27211282 28366854 29577709 30964474 32529054 34278513 36296967 38507636
4125 38507636 40912655 43396867 45507088 46742716 47045185 46154425 44705742 43479145
4117 43479145 42671450 42389085 42456267 42875132 43639573 44686901 46141904 47874492 49779906
4108 49779906 51894421 54254728 56846611 59797170 63246023 67020238 71255885 76020008
4100 76020008 81661191 88131687 95884898 104947932 115510489 127894957 142710561 160723658
4092 160723658 183198207 210542266 241441777 271180773 292517742 297394080 282549274
4085 282549274 252542517 216612095 183533994 156255594 135238331 119447957 107567318
4078 107567318 98499377 91602434 86255446 81985097 78558109 75732134 73401027 71562269
4070 71562269 70355254 69774992 69773197 70614489 72353346 74832446 77632450 80303018 81994137
4061 81994137 82302921 81118773 78782717 75511422 71192117 65963922 60847276 56349973
4053 56349973 52535546 49424447 46933164 44811535 43081038 41588294 40392686 39386239
4045 39386239 38562598 37813923 37154858 36656028 36262803 35895649 35706745 35589922 35487717
4036 35487717 35507449 35509785 35674486 35861555 36138599 36480317 36765122 37163572 37588675 37985335
4026 37985335 38542390 39086203 39600179 40088112 40668949 41244587 41982005 42927379 44029532
4017 44029532 45184434 46425701 47893135 49441677 51228644 53074694 55094300 57394764
4009 57394764 59701567 62063547 64462235 67084145 70050056 73288267 76790797 80659069
4001 80659069 84871114 89548776 94745471 100573259 107245223 114735285 123052683 132369578
3993 132369578 143141978 155794879 170717065 187865709 205599651 220257262 227650761
3986 227650761 224585099 211310513 193758833 177048842 163183514 152540542 144626123
3979 144626123 138910443 134781276 131780462 129606437 127966977 126773909 125820486 125026418
3971 125026418 124485703 124190508 124074826 124184596 124583752 125331087 126385002 127619271 128742842
3962 128742842 129669798 130082444 129956462 129544778 128992838 128533490 128212346 128142639 128252773
3953 128252773 128489055 128877207 129373372 129904343 130594141 131275450 132021854 132823555 133503919
3944 133503919 134234228 134965388 135596611 136111506 136768520 137342538 137799223 138279931 138682820
3935 138682820 139070464 139347721 139464145 139256966 138828959 138190980 137370730 136347956 135234851
3926 135234851 133972635 132637749 131216339 129667838 128097490 126455569 124683542 122829369
3918 122829369 120843858 118777089 116498544 114174918 111772904 109263960 106870545 104294483
3910 104294483 101831056 99503950 97195519 94951246 92794557 90616528 88512961 86382513
3902 86382513 84411398 82346268 80300794 78403976 76733603 75051004 73314596 71758184
3894 71758184 70325963 69008564 67690921 66482731 65319011 64359828 63455451 62539907 61727308
3885 61727308 60983874 60181847 59470136 58775846 58060100 57419894 56854520 56266555 55754897
3876 55754897 55315286 54914466 54529976 54129731 53772085 53483174 53061384 52689922 52311639
3867 52311639 51922187 51535319 51156665 50784282 50382950 50046873 49692429 49244587 48854753
3858 48854753 48444990 48091978 47736322 47371624 46921157 46438491 45924650 45310439 44795761
3849 44795761 44300914 43762235 43151719 42602762 42058161 41577659 41106013 40471390 40009873
3840 40009873 39534135 39070773 38776041 38469111 38196455 38018602 38031285 38231458 38442917 38702535
3830 38702535 38955936 39022827 38699866 37745435 36203484 34399632 32514675 30748430 29159131
3821 29159131 27685128 26427267 25283648 24229554 23332728 22570316 21882664 21196991 20603164
3812 20603164 20100986 19526452 19002042 18547161 18181650 17797207 17399726 17019221 16700579
3803 16700579 16473239 16258914 16066198 15884510 15756814 15550681 15297291 15056712 14710028
3794 14710028 14249732 13855858 13581789 13274993 12963972 12670309 12464171 12278803 12164246
3785 12164246 12001608 11789140 11739112 11646008 11543340 11444356 11383010 11340562 11206762 11093477
3775 11093477 10971689 10966806 10882637 10893362 10801848 10697478 10644505 10556903 10475169 10333746 10265425
3764 10265425 10172067 10123979 10054852 10005639 9929786 9839030 9768043 9614312 9543960 9530343 9538372
3753 9538372 9402682 9300140 9272178 9176387 9170479 9153399 9081211 9036903 8971563 8964644 8989385
3742 8989385 8970572 8967313 8992919 8966686 9005426 9053040 9058427 9017182 9072441 9179101 9293005
3731 9293005 9379915 9418753 9572555 9709221 9756605 9848976 10013623 10116375 10120774 10155092 10241212
3720 10241212 10330111 10366984 10495906 10604784 10604270 10669815 10691382 10766134 10833002 10915701 10894106
3709 10894106 10965922 10984887 10972234 11001035 11066919 11188217 11220423 11288099 11360730 11476693 11651964
3698 11651964 11667969 11644987 11577407 11486539 11421315 11379078 11335604 11394243 11518762 11538061 11553288
3687 11553288 11562578 11681845 11792619 11808811 11932936 12058420 12193013 12337586 12481141 12593346
3677 12593346 12727620 12876795 13044708 13285490 13375622 13595514 13837155 13989224 14240160 14474769
3667 14474769 14687388 14887508 15184251 15371332 15647568 15848533 16116285 16500966 16715234
3658 16715234 17061994 17380584 17792674 18108664 18439956 18816267 19264431 19713220 20112111
3649 20112111 20595158 21114347 21607550 22089765 22611089 23272812 23975368 24722325 25387131
3640 25387131 26145881 26889947 27797626 28681834 29536007 30601427 31550823 32536645 33586146
3631 33586146 34730950 35798581 36805675 37839031 38925754 40006706 41038683 42139754
3623 42139754 43275667 44418576 45550062 46739837 47970149 49110652 50230834 51381697
3615 51381697 52591932 53694529 54832391 55884588 57097971 58336672 59611219 61027125
3607 61027125 62476602 64021291 65580889 67194291 68808383 70481097 72143676 73711111
3599 73711111 75441606 77144998 78955910 80783509 82556756 84414286 86432954 88475009
3591 88475009 90582843 92813066 95143638 97495369 99912697 102373869 104887003 107510500
3583 107510500 110140701 112912624 115765280 118794092 122082925 125529928 129285639 133310006
3575 133310006 137600806 141997702 146699406 151762566 157139464 162871157 168947423 175506049
3567 175506049 182668275 190394544 198725569 207625915 217137655 227163455 237524539 248044254
3559 248044254 258366686 268184656 277085977 284943080 291418390 296730519 301063675 304583399
3551 304583399 307619772 310419831 313348382 316442115 319668751 322958388 326076413 328772997
3543 328772997 330844957 332006833 331938326 330506399 327813392 324207397 319927250 315397117
3535 315397117 310889723 306631253 302615228 299057344 295762868 292683829 289650108 286799232
3527 286799232 283877330 280861545 277980962 274979010 271885363 268898588 265862039 262828731
3519 262828731 259884572 256884853 253930120 250991330 248122386 245439700 242920335 240680890
3511 240680890 238646720 236946143 235518385 234521791 233625412 232868118 232327247 231943260 231713098
3502 231713098 231590528 231517781 231497861 231613767 231888644 232193272 232654210 233255711 233906354 234586166
3492 234586166 235296909 235880806 236373033 236657078 236821547 236754979 236276793 235631424 234600848
3483 234600848 233307443 231858525 230201297 228251886 226118418 223821510 221478417 219145333
3475 219145333 216805360 214540343 212325109 210077962 208010138 205931480 203816307 201737899
3467 201737899 199601323 197484702 195527267 193615647 191973823 190638460 189665577 189092780
3459 189092780 189095025 189584592 190617730 192228957 194547101 197543041 201267196 205778666 211133971
3450 211133971 217394413 224526797 232586615 241559206 251591956 262618914 274583825 287341724
3442 287341724 300529046 313667988 326297657 337878929 347778346 355586209 361152863
3435 361152863 364617800 366008415 365944543 364831175 363216546 361291449 359303558 357232031
3427 357232031 354852962 351723706 347653773 342172006 334845990 325400434 314028230 300968213
3419 300968213 286603652 271624441 256515208 241846711 228035088 215192579 203472647
3412 203472647 192903615 183202629 174454987 166607684 159540773 153115299 147216377 141778494
3404 141778494 136869506 132286397 127988285 124055076 120435782 116968141 113729044 110749437
3396 110749437 107887065 105162348 102556318 100177185 97858137 95598333 93472423 91398243
3388 91398243 89328286 87358796 85461005 83788369 82157595 80677606 79359977 78089146
3380 78089146 76952509 75811728 74687456 73623287 72611376 71659380 70697768 69767349 68857242
3371 68857242 67907255 66982236 66077157 65329828 64526945 63681767 62826371 62145431 61359755
3362 61359755 60375684 59267816 58179877 56964935 55765452 54655593 53504279 52356869
3354 52356869 51300119 50204350 49156701 48172423 47297058 46345972 45450105 44616912 43860750
3345 43860750 43125676 42366796 41653368 40977829 40352955 39704644 39049366 38453268 37806919
3336 37806919 37173546 36563542 36095110 35627445 35051516 34552377 34148629 33672781 33280565
3327 33280565 32944431 32605055 32301779 32067807 31837143 31590496 31333425 31202542 31099956
3318 31099956 31000458 31023393 31126677 31378479 31706480 32132664 32725549 33341280 34069404 34890602
3308 34890602 35777716 36726062 37875317 38976958 40075632 41108646 42031384 42895843 43483572
3299 43483572 43942995 44111528 44233504 44243853 44277133 44284854 44209158 44107424 43902081 43703262
3289 43703262 43338608 42919652 42498530 41859683 40977584 39955224 38858224 37758973 36594234
3280 36594234 35388155 34226791 33177345 32223526 31309422 30591420 29971792 29446565 29077002
3271 29077002 28755186 28482024 28296323 28113100 28091113 27980738 27991193 27974493 27887214 27855168
3261 27855168 27780282 27728101 27731029 27795660 28062693 28262502 28534711 28917968 29294014 29789235
3251 29789235 30404626 31083557 31828493 32616407 33564383 34605058 35884887 37283701 38916173
3242 38916173 40715485 42716743 44972721 47329511 49963815 52696090 55480201 58305992
3234 58305992 61061208 63576833 65889303 67807633 69425893 70696059 71802674 72747005
3226 72747005 73325115 73769243 73948813 73876797 73664736 73480214 73205766 72765260 72001858 70957197
3216 70957197 69531776 67760872 65825531 63583062 61252321 58929428 56433900 54098070
3208 54098070 51976996 50040383 48282195 46854064 45626293 44518788 43606452 42898350
3200 42898350 42405530 42177488 42063448 41967886 41789556 41471090 41355714 41405229 41542586 41760361
3190 41760361 41991401 42182064 41907900 41199306 40067350 38552819 36736954 35009357 33520401
3181 33520401 32110621 30957842 30060540 29332551 28728304 28228331 27798045 27450621 27047553
3172 27047553 26652323 26387065 26103783 25908760 25789167 25642365 25553406 25479546 25432440 25407850
3162 25407850 25483403 25623647 25832349 25969175 26175337 26404620 26599934 26758031 27060923 27316151
3152 27316151 27569224 27954142 28313159 28610574 29011673 29528168 29998833 30352811 30711046
3143 30711046 31109022 31562005 32115581 32685969 33327702 34133172 34981936 36017550 37105117
3134 37105117 38285484 39561213 40948371 42466427 44159341 45883931 47834172 49941337
3126 49941337 52321940 54951702 57999638 61425910 65374103 69924380 75473318 82074137
3118 82074137 89745044 98453784 108616505 120521407 135101536 153543558 177693112
3111 177693112 207790313 241591264 270863157 286485428 279693595 249849764 213376606
3104 213376606 181018188 155796421 137526725 124586799 115707309 109644112 105648412
3097 105648412 103091564 101622999 100944016 101060585 102019465 104146620 107780317 112921159
3089 112921159 119459915 127685184 137870309 151193293 168759192 192064999 220761473
3082 220761473 251480044 275034115 283276134 268010402 233187764 195598950 163335959
3075 163335959 138475470 120165756 106832606 96634093 88517810 81676474 75758507
3068 75758507 70306029 65494958 61067687 57059445 53408789 50261992 47590363 45379434
3060 45379434 43356253 41533418 39944189 38601350 37334980 36109079 34989501 33885806
3052 33885806 32878494 31932217 31166170 30511901 29769214 29189446 28682479 28198372 27451729
3043 27451729 26330342 24949445 23618332 22437232 21345085 20304675 19455700 18702817
3035 18702817 18041763 17463904 17010040 16549557 16116345 15696218 15300595 14998259 14772063
3026 14772063 14525288 14210580 13882473 13495950 13155563 12803084 12478452 12153906 11793771
3017 11793771 11551659 11351149 10988427 10763452 10628379 10416831 10328403 10205976 9996703 9757028
3007 9757028 9574007 9383131 9222331 9117597 9024423 8909859 8780099 8690160 8602636 8455482
2997 8455482 8306692 8151420 7948522 7778721 7610018 7410684 7257488 7182738 7084433 6892906
2987 6892906 6823365 6784647 6717734 6650120 6499713 6530400 6533914 6486794 6320776 6262581 6140700
2976 6140700 5997777 5859090 5882669 5864704 5771362 5650453 5560540 5429557 5341909 5269893 5268390
2965 5268390 5160866 5071800 5049615 5011369 4951601 4877474 4835555 4810227 4904284 4861740 4817588
2954 4817588 4841897 4755239 4799121 4730884 4688770 4585727 4523068 4566308 4544747 4460981 4492071
2943 4492071 4485073 4478312 4346346 4264925 4127076 4016731 3975112 3952215 3959292 3880942 3812120
2932 3812120 3756663 3792159 3844470 3748082 3714243 3725355 3701030 3664260 3644725 3658700 3648143
2921 3648143 3646268 3642680 3687211 3624220 3622215 3634657 3610934 3603753 3565090 3559901 3483662 3422646
2909 3422646 3382834 3274214 3284417 3298870 3230912 3157509 3169556 3125659 3097869 3019549 3063767
2898 3063767 3051798 3037368 3112373 3127247 3203437 3275822 3238076 3290720 3198542 3216514 3261560
2887 3261560 3262900 3231808 3251470 3280571 3272211 3322100 3316432 3330358 3367390 3453849 3543574 3566041
2875 3566041 3604276 3637804 3663386 3585692 3532618 3561467 3520885 3510011 3453852 3456654 3553511 3545699
2863 3545699 3531107 3519067 3551491 3589033 3545470 3538989 3496586 3551303 3647437 3745592 3791977 3833352
2851 3833352 3929654 3943837 4094284 4197504 4265342 4347902 4408872 4414389 4432999 4375741 4213557
2840 4213557 4131166 4055624 4002760 3974063 3913324 3915588 3964378 4019054 4017400 4156808 4231776 4314076
2828 4314076 4353690 4513153 4666561 4704038 4870352 4999336 4978649 4813815 4648716 4463496
2818 4463496 4425722 4305527 4151418 3974540 3907294 3820982 3700281 3668017 3599444 3555981 3512078
2807 3512078 3453966 3440232 3370130 3409948 3512500 3397527 3481203 3597650 3622274 3704707 3762956
2796 3762956 3785813 3741228 3692818 3539152 3334285 3129577 2974424 2827675 2691353 2677987
2786 2677987 2581255 2431745 2367695 2372507 2207513 2161067 2071986 2021282 1997281 1959035 1889073
2775 1889073 1837582 1821869 1798775 1777025 1721110 1674193 1667041 1650466 1543686 1541028 1538583 1480257
2763 1480257 1461136 1444264 1380031 1397839 1360401 1369523 1245966 1210519 1269271 1304570 1257193
2752 1257193 1267677 1235864 1119238 1133449 1149504 1154433 1131197 1072456 945052 914126 974747
2741 974747 1000003 1051913 973329 973740 1027841 970333 889796 920299 963500 1020925 979412 926579
2729 926579 888719 936263 893635 882469 884252 833745 807870 804730 819081 799934 843441 906243
2717 906243 890612 811007 843919 889401 785659 800936 770886 771333 756223 744606 769399 726806
2705 726806 724123 778643 779996 773212 758700 732659 707548 744897 769215 669114 635829 609149
2693 609149 638907 652599 654400 597817 594629 598882 589026 619277 528563 475416 523278 500390
2681 500390 527321 491378 508236 552478 553409 538060 562121 601755 523969 525005 523109 477299
2669 477299 529268 527545 507635 487595 445204 572577 567648 494862 487700 494163 438468 473707
2657 473707 457481 449179 514021 392025 405663 422506 417843 446367 403208 410512 501845 491656
2645 491656 514437 472706 438631 437112 477318 461653 461652 413198 473921 444100 399619 369263 414127
2632 414127 431170 434603 448459 352628 362427 439732 417880 406279 354091 399619 393324 408111
2620 408111 445061 420792 416819 385003 421020 389358 367192 362118 393115 410243 411543 402582
2608 402582 451602 495031 446053 372223 289791 295327 346662 392422 365116 294876 312553 368296
2596 368296 405167 385443 420585 374305 328881 385646 402776 405496 423113 330276 269353 322181
2584 322181 406954 486043 473053 421080 423007 416706 424371 434546 446636 416286 466115 434443
2572 434443 436869 447247 401261 380457 431402 431784 392694 376912 375647 391200 346750 329789
2560 329789 244988 340093 412128 356201 370282 396532 413280 411553 398459 418115 389546 447810
2548 447810 416345 399126 452353 445329 441802 415891 431217 438757 394953 416653 421813 409932
2536 409932 361367 359402 392000 354950 347661 325922 352827 332376 348406 327486 316212 274009
2524 274009 323208 338782 358671 356638 362240 345923 315563 340786 359593 357043 357959 355585 357201
2511 357201 364144 356701 259336 197486 212431 277954 291365 269207 243329 217627 235560 243559
2499 243559 214751 204662 242382 240160 264342 224058 189300 232273 277200 253794 210754 191395
2487 191395 210859 225936 273493 264530 185395 196427 128773 139122 150743 90488 86520 165635
2475 165635 195606 148234 131465 141474 152706 196251 237429 248183 242472 235132 258435 234182
2463 234182 173338 182447 218163 218240 172835 199121 244235 193411 193987 171357 142411 191362 186441
2450 186441 177163 152599 148618 183746 193587 181717 136703 96608 132247 134171 119539 107601
2438 107601 132659 116926 103851 151889 118671 150631 105311 142951 95333 74466 89535 69856
2426 69856 114486 137468 112260 139684 217541 210537 187160 138125 108186 98299 47120 136352
2414 136352 111131 91349 124755 109614 135486 100660 51447 31217 73652 45825 23112 6970
2402 6970 62213 126405 146496 160499 172106 149692 41840 -11427 -50482 72597 43805 26069
2390 26069 16374 58961 45714 73665 82255 107568 78057 55644 99488 154704 88518 57516
2378 57516 91098 116067 92296 49341 61186 101135 155401 105110 93322 163328 93061 108574
2366 108574 185647 138769 117665 109755 150571 108709 84411 77611 122773 118775 80250 56798
2354 56798 22369 26370 68926 83246 105243 92687 51218 29668 118012 107514 148696 69068
2342 69068 91020 47157 104479 116806 65249 83619 9508 60060 90795 36394 68285 111202
2330 111202 67588 63222 70965 38440 7176 100966 83202 40966 64555 56787 -20524 30507
2318 30507 107584 127581 157802 148112 104393 96711 140470 148664 144243 64230 19503 22276 33369
2305 33369 934 92752 74729 64170 78463 43786 48955 64439 147785 159876 104707 77936
2293 77936 69682 124144 126058 147346 112005 119801 154019 115242 98337 112176 116432 94289 123046
2280 123046 97681 82607 67408 67153 102608 106918 100848 75251 74185 112011 107680 72944 106219
2267 106219 30834 84250 118825 90164 80984 126488 90716 24666 50490 56635 20149 -23698
2255 -23698 73702 94560 35459 86763 78289 83805 48701 35446 110454 96367 37849 -11103
2243 -11103 43371 89252 96958 75671 63679 47260 77540 97125 93978 82945 97408 57926
2231 57926 63619 81431 84886 91340 85671 27544 51203 60970 46968 79289 116564 77516 59629
2218 59629 38020 48353 78437 49762 44094 168227 134125 9657 20057 106975 151827 140963
2206 140963 44429 33519 100376 121897 138493 86518 11709 54985 98413 138613 169340 152477
2194 152477 75078 112725 144905 94689 6936 -41724 -1894 52304 51256 55121 54190 77524
2182 77524 78758 42656 80979 104500 89342 106340 52183 78741 89077 90729 114180 53542
2170 53542 21538 133610 113399 91081 110788 129564 90426 22429 140080 135076 85241 54803
2158 54803 109740 102304 60094 114097 104778 61276 114864 89787 81118 119074 122522 133671 101791
2145 101791 58736 107485 86254 107098 93727 95686 120037 113150 89912 187894 215842 242116
2133 242116 193372 194247 182121 196179 183913 196490 267158 262904 323628 272663 285254 263335
2121 263335 242647 193362 136245 153216 114017 164716 198784 206934 201159 264058 336009 321495
2109 321495 357983 369331 427466 377952 372028 337089 290343 346565 380616 425482 412468 533344
2097 533344 606122 577465 513957 505409 504749 558346 536744 491309 506702 528328 544343 524739
2085 524739 579518 545680 522707 560188 702419 801681 799290 773729 789663 852314 925502 981353
2073 981353 1019025 1101169 1191416 1311954 1380280 1507126 1550822 1679154 1825231 1910155 1997095
2062 1997095 2178089 2283300 2449252 2652224 2981146 3351107 3816082 4270779 4925369 5723458
2052 5723458 6771597 8230909 10110881 11828940 12796689 12495243 10593279 8495843 6681416
2043 6681416 5432227 4523485 3870421 3373978 2983026 2684961 2529819 2433432 2354750 2212371
2033 2212371 2067914 1962802 1802790 1580261 1469888 1389258 1297538 1295908 1262849 1178527 1148202
2022 1148202 1067012 958237 919434 976028 904538 840474 742258 741044 787315 726662 694821
2011 694821 643915 587650 560949 523651 516098 480170 438688 470384 445076 435446 456666 418551
1999 418551 358688 309787 337309 360254 372558 390609 391129 313868 240461 234885 219171 225701
1987 225701 232343 298004 335529 289973 247557 230728 212981 185906 133642 186058 232136 197768
1975 197768 258421 180540 66585 98763 121967 97186 123095 152420 162234 200631 160526 132696
1963 132696 167831 198283 229964 133185 123102 119843 133135 160915 165129 173620 125596 131614
1951 131614 164739 155825 179430 140803 124343 77103 50473 150115 136494 145495 88324 118942
1939 118942 126935 194960 176310 170678 197648 100299 101938 113196 152305 142151 83195 45146
1927 45146 45839 26985 -1323 19137 49149 59143 110091 143024 128593 157030 220640 220070 186369
1914 186369 232158 159125 126288 126745 109356 5837 -10373 47277 38232 85640 73310 38748
1902 38748 76670 29708 53568 26513 29658 54752 85239 30465 -10146 11217 -26806 -58121
1890 -58121 27184 78127 69461 21698 -100383 -95468 -28428 76110 79299 29131 55133 57279
1878 57279 9049 -4186 64959 57948 50578 -20746 1552 22242 -25260 1361 30508 14095
1866 14095 1961 56254 89528 115730 35429 7564 -20346 -89710 -58340 14455 -182 30421
1854 30421 79243 90901 49935 4891 -29093 -14625 26507 41478 90882 50224 59104 35993
1842 35993 28898 3519 -41025 -16970 55315 53255 7125 -5034 -92426 11576 25032 8586
1830 8586 20161 66398 57734 -11843 -6323 58755 38001 3983 7352 -23745 14069 28502 -54691
1817 -54691 -35381 -19033 21661 62664 43944 22750 31142 -5822 -59740 -31135 -8636 -9386
1805 -9386 -46605 -1295 78907 151632 39677 -37305 -10935 14019 42201 25451 12707 25634
1793 25634 8956 -8737 -756 -22880 -9104 -35244 108 -3542 103428 67365 9983 -10489
1781 -10489 1240 38237 70939 65679 79761 1963 -22383 51509 39924 3045 13709 -13990
1769 -13990 564 28922 -6466 -9515 -24791 7400 27782 61746 66938 51228 45570 27332
1757 27332 -8257 -76319 -8554 32784 -13305 -27166 -51853 -2525 -21944 -53438 15951 61093
1745 61093 36873 8849 -47220 -14459 25861 24607 -6858 -18606 -38280 -64246 -82896 9750
1733 9750 -42359 -76430 -26674 -6253 -42245 52468 -1760 13181 43951 11446 38247 65565
1721 65565 94399 33092 -60645 -80367 28018 1202 -55675 -66760 -104994 -39050 -36208 -22076
1709 -22076 5101 -91352 -109712 -46614 -30785 -52569 -59700 -18010 -50950 -71315 -66634 -46226
1697 -46226 -10285 -28495 -7481 11955 71104 60610 37623 13199 20276 24490 -587 -25253
1685 -25253 -17848 55326 -2283 -19437 -35448 -3215 -24982 -20154 58466 70727 -6543 -32028
1673 -32028 -4717 -27296 13497 -19429 -60721 -49827 -69045 -30765 -43045 -58592 -26766 -49501
1661 -49501 -62709 -20453 19264 -12697 95756 40916 -20585 -34875 -32620 4118 -5995 -73857
1649 -73857 -23484 34324 -26045 38706 66271 -33758 19989 66449 36386 14269 35314 3327
1637 3327 -40813 -16905 62942 29729 13661 67835 39525 17398 -30922 -10365 37006 3495
1625 3495 21335 45047 20130 -18986 -41554 -56993 -62089 -87450 -77024 -96709 -85217 -83076
1613 -83076 -68065 36959 22851 -12381 -51679 -77874 -30363 -68114 -58874 -36413 -23679 48345
1601 48345 12133 -70683 -49783 -7642 15305 41021 -50833 -6796 -58406 -61575 -27489 -5546
1589 -5546 12606 -87796 -73887 -19767 -23847 5379 66292 38166 48137 20616 -42757 -39767
1577 -39767 30330 13858 -46786 -19915 21181 -6757 -33924 10311 -10521 831 32526 -6012
1565 -6012 -43918 -20652 12468 6653 -31792 -33637 5847 -6807 4670 82142 61207 18436
1553 18436 -45450 -108383 -102965 -44976 -75599 -60151 -76998 -62448 -76126 -141794 -100500 -41186
1541 -41186 36733 -20461 -12225 -9294 -18327 -70940 -57993 -29433 -37764 -56449 -76065 -36881 -28962
1528 -28962 -109269 -97950 -69012 -102655 -10914 16823 -27746 9928 34715 45077 17705 7227
1516 7227 41165 -37630 -27545 1660 -24053 5969 15561 -34110 26122 -11733 -89636 -75639
1504 -75639 -43104 -7074 24587 9405 5261 11114 27193 15624 -389 -4906 9906 2227 5915
1491 5915 9909 -49376 -91179 -53731 -12413 1100 -8854 -52829 -17241 -60153 -74558 -19498
1479 -19498 46787 686 37103 20519 34171 4138 -34307 -28428 -39901 -53544 -73280 -63812
1467 -63812 -22129 24693 -7264 29035 -6346 -4781 -7855 -36523 417 54960 31136 8553
1455 8553 -7946 17283 109 -58887 -59277 5680 -4647 -26095 27776 -28412 -51565 14681
1443 14681 -18967 4073 12313 7954 -92223 -76170 -37719 -3775 1348 15354 8708 26408
1431 26408 76321 7693 14553 34022 -19739 -12161 12879 29684 -36859 -32730 -45262 -94718
1419 -94718 -100180 -87716 5275 -28092 -8936 47212 -3763 -63488 -37249 -82848 -20649 -21515
1407 -21515 -41166 -27847 1240 25163 1151 7589 -2253 -46758 -43189 -52756 26908 -2187 -38913
1394 -38913 -51171 15954 -24106 -10326 -33032 2587 4727 -67156 -106717 -36442 -65399 -86364
1382 -86364 -64180 -47543 -71897 -64000 -14982 -15705 19137 -15343 -56382 -37709 23612 57192
1370 57192 70355 1041 19861 -2355 -5317 20783 12464 -22941 -57347 -87980 -13979 44012
1358 44012 71229 127551 123320 60701 46317 34044 31527 23119 7455 -25296 -1460 10671
1346 10671 -28718 -32144 -50006 -54460 -58025 -74745 1759 -3040 1256 32988 41302 7275 41203
1333 41203 72239 12876 -75391 18211 11273 -4464 -35733 -83593 -92609 -58522 -34492 -44822
1321 -44822 -1882 -42092 -62358 -93491 -95641 -120619 -97398 -40994 -12931 13364 -25698 -4773
1309 -4773 -63805 -16381 -3791 -16654 -52076 -84151 -110525 -18703 -9818 -27771 -21685 -35044
1297 -35044 22079 5629 -24005 -1928 -11373 14361 -43946 -57641 -7570 -6860 15164 -49184
1285 -49184 -23718 37585 73714 -59068 -9378 -18503 -31432 -52011 -9766 -23179 7059 -83268
1273 -83268 -126575 -93975 -75617 -63582 -62131 -54521 -78640 -87890 16018 116308 29962 -38411
1261 -38411 -78402 -100862 -19180 13666 -4416 2972 -3899 -19013 17996 -18729 -44502 -77505
1249 -77505 -89647 2422 33689 31330 27860 62431 36838 -835 -20334 77815 71186 -11085
1237 -11085 -48266 -43133 -35266 -7470 -87569 -70183 -18411 37287 47911 -17946 52586 49505
1225 49505 -22145 -30397 -1526 -7677 -29202 -3792 -62417 -96139 -92093 -83934 -50006 3533 23483
1212 23483 14444 -15403 -4697 4579 -15511 -66751 51650 88943 -7059 5340 -16555 6150
1200 6150 -61668 -12026 14557 6158 -33461 -23608 -20654 -46650 -15591 41041 -58652 -80541 -49236
1187 -49236 -83227 -74632 -9909 -48155 -132490 -91004 -44790 -33266 -25819 25257 44566 40209
1175 40209 16754 32178 9605 -43941 -41528 38767 82261 27395 18914 -11214 17449 50076
1163 50076 26005 48198 -16866 -45780 -5425 -12956 -16643 21514 -111230 -92700 -14640 14250
1151 14250 -35802 -42030 -51202 -8420 69820 78898 55879 29059 36204 25519 -29498 -12427 65959
1138 65959 5516 31975 55839 65617 31995 17982 -2467 -15595 -30327 -36355 -12477 -3161
1126 -3161 -40776 -9266 -38811 -29609 -32061 81750 50447 -27370 -35531 -94494 -77798 -78704 -60055
1113 -60055 41083 -5441 -29220 56067 8582 28864 -64095 -76519 -89549 -82091 -49567 -23870
1101 -23870 -44203 12893 17444 1123 -36434 -48693 -42487 -23123 -13845 8801 60836 57112 -6467
1088 -6467 -62233 -43812 93454 24955 -64697 -63998 -68017 -43614 35263 109184 85319 35982
1076 35982 16526 -1289 -18409 47153 130 30428 31741 -3134 -56651 -60082 39937 -25875
1064 -25875 11387 65175 43512 87958 27944 -4218 -41413 -103794 -58182 -11585 4694 59754
1052 59754 -3770 -25725 -17183 -46711 -21043 4749 65730 56938 -29370 14478 7921 -30684
1040 -30684 -58565 -75843 16500 87757 32723 31129 31770 36096 57499 -5854 21848 41308 28365
1027 28365 -13857 4895 45929 -24417 -2565 11596 -32241 -82823 -69791 2585 52235 -13875
1015 -13875 6402 -11247 -24653 -55814 -12074 10974 26287 36455 36930 37844 -13158 -6718 -9031
1002 -9031 -83114 -121533 -163250 -110015 -28698 17185 49125 84558 71030 19660 89243 48337
990 48337 49413 -43039 -106782 -72765 -34010 37985 69293 104106 35070 -45794 -75097 -31481
978 -31481 34764 9830 44990 5604 -39545 -34082 -76769 -84823 -18862 -13768 -14637 -49031 3484
965 3484 23969 -7883 -30161 11349 -32243 -21513 38193 -4648 6670 35792 -35608 -24677
953 -24677 -15758 1208 -16404 -14435 30477 782 -27578 -44835 -50483 -24691 62 1655 28138
940 28138 56011 18882 -35304 -55607 -88644 1974 70616 88817 70068 -19272 -78419 -44333
928 -44333 -20855 34796 -4020 -29295 -43221 -17787 25727 46158 -18990 4549 37401 -4036
916 -4036 16696 13938 38011 44651 43267 20405 63751 12067 -5368 20613 31127 -59658 -11425
903 -11425 23026 37754 9463 -29936 -13060 3314 -9089 -51668 2612 96113 75145 40318
891 40318 40805 38229 96194 23699 52542 34709 -29542 -55385 24959 -1349 -14514 -15946 -24514
878 -24514 -67546 -71769 -58296 24549 33446 28025 22616 35746 28102 84694 38202 -37061 18620
865 18620 51872 44380 64123 26380 16007 1888 39710 85164 -35244 14343 36069 -43719
853 -43719 -16614 117072 43115 61789 57463 3175 -56056 -22711 -42000 -16288 -5270 13767
841 13767 100493 41778 15681 -19040 -52119 -10623 15288 44035 47547 50798 55970 63691 97046
828 97046 40885 -37258 -16964 -54094 -59064 -60788 -63632 -71002 -143131 -89116 -12420 -35025 -659
815 -659 27655 -14449 -81114 -60867 -89952 -81625 -25541 -23167 6445 34814 56335 67461 32173
802 32173 65159 119619 87160 48802 -44855 -31095 -32065 38731 64410 16535 -24950 -7944
790 -7944 32868 -9017 46752 18956 -27993 -32019 2088 -4409 30250 64641 44346 -15790 -801
777 -801 -1199 -26988 16938 2618 48700 -21371 -14858 43356 49675 60177 87313 37383 7703
764 7703 -106013 -52058 -33179 13969 2522 -9705 31495 -60126 -50004 -50506 -87766 -62046
752 -62046 12972 51407 90991 39225 26843 37101 39415 -20258 2309 -20671 -6790 32917
740 32917 29039 -7846 -34071 -30713 34722 8512 8452 63488 52948 42042 21661 43733 33694
727 33694 4834 -14802 50454 77477 31266 34882 31349 -29579 17491 948 -42982 -56488
715 -56488 -49350 -29156 -9219 1761 42139 29995 -60056 -61269 -53249 -27662 -83513 -39763 -33201
702 -33201 -100602 -10350 -5699 -43719 -46070 -9571 -46179 -4100 -14023 -36842 -38393 -8950 -56704
689 -56704 -31154 -18921 -15048 52002 16267 -6942 -32128 -14865 -68612 -11896 36784 -8951
677 -8951 -15521 -53441 -59849 -33071 -38100 -66587 -16368 -38169 -76422 -38965 19481 26818 -32937
664 -32937 2068 -13289 52952 36846 40538 3134 -48905 -52368 -19460 -29714 25667 18817 20366
651 20366 -19465 -54641 -61911 14015 29996 20664 -272 53262 113138 68289 -1377 23167
639 23167 71946 58895 56513 56411 53823 -608 36786 1155 6155 -15407 -10149 28998 5755
626 5755 -7438 -28532 1802 56206 49274 76671 10162 -28107 9648 40861 -12968 -24896
614 -24896 -5593 33240 12230 -34392 -36257 44392 492 -55236 -115054 -94688 -61535 648
602 648 -75283 -51377 1893 -19467 -55135 -10351 -13263 -42163 3859 -39226 42455 23266 34056
589 34056 36734 -33449 4110 29463 -17115 -5878 -8954 36818 49424 -21674 -18342 56312 59795
576 59795 87539 -10898 3430 44787 -24915 4894 37469 58497 93475 137505 97265 33391
564 33391 -20816 15116 15719 -12681 -24380 -62478 -45847 -42304 29991 26755 -17063 -20134 21512
551 21512 1605 -44188 30250 -10498 -38493 -62724 -46697 -26980 -44354 -47839 5009 19692
539 19692 -33261 -21118 -22025 35118 45290 3702 -16073 -54174 -64773 -70647 -66318 -17457 -54608
526 -54608 -28372 -56905 -70486 -89873 -7383 41258 -54838 -67682 -77226 -39459 -11262 -27759
514 -27759 -54454 -47636 2744 -41977 -71231 -55043 8813 -13863 -52960 27674 -3722 -29580
502 -29580 11577 31163 20571 -51007 -11081 1279 -16433 -11678 -92149 -79433 -3953 90234
490 90234 155984 30372 -48704 -62209 -42616 -7564 -69156 -70880 -41297 -30062 56887 40604
478 40604 -28309 -19408 -35541 -74910 -29040 64847 -13300 -22202 44112 52964 71289 58992 54574
465 54574 -18756 -12170 -29877 53594 109545 63647 87536 52191 47504 6771 -32880 -3353
453 -3353 11840 10321 -16055 -140193 -57787 -35679 -73031 -46972 -6972 -54483 -76419 -47327
441 -47327 -8009 -33232 -27463 -34393 -51756 -32475 -46191 -53434 -26475 -27616 29265 -6627 25848
428 25848 52547 81387 29820 4367 -11431 -6118 13208 29581 70525 17958 31765 -19223
416 -19223 19638 26511 -12853 10269 43592 -4123 -78479 -68888 -63008 -82221 -67294 -19960 -1131
403 -1131 -9955 -32905 -30782 -5662 -34065 -31822 5450 14208 -2315 82188 42588 16486 49778
390 49778 17388 -15943 -53033 -55701 -1496 32500 56576 -4415 -33446 -20696 16796 326
378 326 -15628 -1894 -50747 -12329 53039 -12550 -20331 -9696 -29520 3067 -4642 -41829 -87903
365 -87903 -41663 3531 889 -68042 -75121 -37611 -88353 -88985 -23826 40590 17277 -6438 -44746
352 -44746 -95278 -81517 -54050 1715 57260 24201 -20874 -17427 7748 -28980 -32098 -12657
340 -12657 31905 10407 26934 26321 35018 -9236 -1952 -14910 -57119 -28367 -2319 1299 -37682
327 -37682 -10741 -28749 -58429 -87824 -45691 9194 -55403 -70828 -40328 -60731 -77305 -32735
315 -32735 -50054 13635 47133 -41661 -5429 -24295 -63502 -20099 10942 13069 -80973 -64846
303 -64846 -49764 -21283 28972 45463 52189 9767 -35752 -41414 -85030 -80973 -77082 -92413 -18590
290 -18590 -83679 -54606 -75285 -53696 -770 4339 3377 39414 2042 -456 8251 48742 11582
277 11582 30087 54946 14553 -36434 -56311 -68259 -22351 -12942 -746 21471 -24965 -42276
265 -42276 -19424 -20541 -105234 -39836 32018 -20105 6370 -42574 -32202 -12262 -57297 -35957
253 -35957 -7427 22422 -101 2556 -9809 17321 60506 -10181 -52593 -65415 -55476 -58134 -51977
240 -51977 -1549 -6303 4357 34035 12580 70138 44779 9780 14199 3380 -14503 -91445
228 -91445 -81112 -84240 85 -5922 -51324 -77365 -56531 -55092 -52021 -73005 -7962 -4830 -26183
215 -26183 -54106 -26711 29857 1773 -16880 -15582 -16384 -56356 -7540 -21600 23778 49295 40379
202 40379 24655 -9109 45236 33236 -8826 2970 -53979 -25224 -19795 -51244 -50973 -64202 -44919
189 -44919 -65106 -65083 -29344 -31325 -70771 -42967 6881 -13248 -5783 7546 -24985 -29517 -31285
176 -31285 -8611 -10128 -8754 -46411 -50152 -31548 -62072 -13540 18222 -117876 -132926 -108002
164 -108002 -108409 1346 16889 23886 37184 27586 3050 -49905 -64177 -34975 70640 52841
152 52841 -43231 -101948 -123444 -75300 -73820 -83868 -40379 -14982 13807 14527 -46272 -55095 -55442
139 -55442 -90862 -93730 -21946 298 -42135 -83222 -79575 -64716 -93120 -33290 5929 -29567
127 -29567 -28288 27805 11900 -11641 4271 -2953 -67935 -4334 52725 58914 61300 52468 46613
114 46613 33726 12728 -29069 -58435 -76219 -28344 -34237 -55411 -30138 -26695 -66554 -84516
102 -84516 -64062 -42988 -30044 -28131 5059 26892 4609 31944 -12479 -3654 24221 8056
90 8056 27130 -56613 -54495 -17164 -21995 -10010 -2947 -1020 -65201 -110367 -119164 -60802 -23623
77 -23623 -12103 6352 15451 -14660 -31111 -71401 -82073 -28501 14434 -3087 -11164 -20843 -24410
64 -24410 -67205 2407 14265 -9192 17460 -61016 -26370 -16984 -62914 -63003 -54252 -35438 -49857
51 -49857 -28541 -36299 -3245 -2241 -27063 25112 31681 -711 -13386 -31578 -77567 -76979 -51453
38 -51453 -37896 -31800 -23708 -22241 -35000 -50622 -61954 -30640 -27866 -82835 -54456 -63140 -57388
25 -57388 -41510 -13007 -17725 -14847 -14021 -43411 -12221 16302 -29133 -23795 -42247 -4181 12669
12 12669 -5728 -27679 -77379 -77959 -35003 3551 -42581 -20895 -7748 5354 -31717 -39381
0 -39381
$$ Imaginary data points
##PAGE= N=2
##DATA TABLE= (X++(I..I)), XYDATA
16383 -3247118 -3222321 -3163281 -3127014 -3061652 -2949974 -2891015 -2865211 -2842623 -2815824 -2739549 -2652787
16372 -2652787 -2629708 -2585686 -2510005 -2445047 -2397693 -2332316 -2297252 -2298437 -2251552 -2214844 -2178226
16361 -2178226 -2084419 -2031273 -1974016 -1958478 -1972834 -1908255 -1777211 -1742243 -1643209 -1648516 -1644418
16350 -1644418 -1592866 -1562864 -1507550 -1369991 -1341967 -1298103 -1243848 -1196880 -1192592 -1098193 -1050098
16339 -1050098 -1027431 -999304 -971645 -878537 -807834 -747520 -748142 -696325 -667973 -632279 -570780 -467139
16327 -467139 -418542 -368981 -383174 -390730 -317334 -236706 -182419 -93528 -63050 -68507 -5048 44272
16315 44272 99016 172638 235733 235906 260752 278453 333163 341312 399982 468760 474481 529925
16303 529925 572765 659850 688437 697400 701974 769394 854796 899526 933830 948572 975945 1039329
16291 1039329 1084641 1080299 1166112 1238140 1232672 1278334 1274634 1279413 1365843 1425161 1421501 1474679
16279 1474679 1530215 1635052 1700060 1663341 1740161 1824760 1794464 1866555 1850676 1877852 1937608
16268 1937608 1994570 2061181 2052766 2005339 2055294 2080701 2156256 2151881 2166197 2191650 2202285 2264253
16256 2264253 2368492 2399599 2341460 2385745 2427727 2468095 2435596 2460341 2501009 2546865 2604090
16245 2604090 2680535 2680464 2684008 2651933 2615780 2664416 2698332 2742149 2798830 2852141 2900132 2907746
16233 2907746 2937490 2996153 2959897 2956651 2993159 3110163 3213399 3123885 3133281 3162910 3151497
16222 3151497 3208268 3244497 3260731 3282191 3283711 3307824 3332451 3390850 3407726 3423947 3455753
16211 3455753 3467355 3517043 3510401 3512401 3572894 3551534 3574810 3615163 3632958 3625173 3599758 3653595
16199 3653595 3631011 3675572 3723596 3700315 3738549 3664802 3675047 3766498 3813512 3834693 3838868
16188 3838868 3841704 3888603 3898031 3917620 3956051 3929935 3909819 3968908 4003141 4071309 4073876 4072306
16176 4072306 4119342 4114577 4143574 4125694 4147616 4107646 4104277 4163720 4125014 4125136 4186026 4280712
16164 4280712 4342888 4278834 4253182 4263822 4209371 4258286 4357920 4317163 4298775 4327474 4354138
16153 4354138 4319748 4338068 4347390 4378965 4386172 4388495 4333604 4371021 4449566 4399409 4376675 4439646
16141 4439646 4463607 4490762 4493875 4482561 4470066 4472527 4498329 4466035 4428579 4395871 4516870
16130 4516870 4537299 4493010 4496110 4503625 4520840 4514812 4579565 4630970 4595838 4636205 4631546 4584669
16118 4584669 4578931 4647936 4582760 4542555 4541403 4568020 4606390 4630606 4676119 4621525 4593638 4613894
16106 4613894 4638291 4692317 4660948 4667880 4642516 4688453 4683901 4714365 4779674 4738216 4721113 4671920
16094 4671920 4697299 4707330 4719721 4718253 4713052 4653354 4733354 4731051 4695028 4725745 4734975 4689939
16082 4689939 4710748 4773451 4723216 4791836 4761442 4736762 4749555 4738813 4702286 4732630 4769240
16071 4769240 4796272 4845293 4833927 4838840 4844728 4830961 4857975 4811424 4797429 4810667 4831767 4883046
16059 4883046 4828471 4845775 4871920 4831166 4778491 4787100 4752168 4827181 4897797 4860664 4845198
16048 4845198 4816996 4771775 4825313 4781651 4739867 4708099 4706117 4776566 4860248 4931728 4939306 4856344
16036 4856344 4906941 4840393 4764861 4830364 4824712 4786104 4810852 4892047 4846363 4867295 4948946
16025 4948946 4947957 4919797 4942535 4841382 4867189 4834185 4854060 4861929 4795178 4802266 4897939 4865750
16013 4865750 4871570 4894774 4831620 4894737 4865667 4849544 4883270 4851835 4903455 4910137 4844428 4837818
16001 4837818 4879282 4912342 4911294 4894873 4832940 4798629 4818932 4852859 4803432 4809959 4779277 4864024
15989 4864024 4961728 4972011 4870126 4880873 4875585 4902783 4903051 4864057 4833909 4791829 4864430 4964632
15977 4964632 4983834 4967820 4913047 4856263 4876619 4866023 4818473 4816097 4783723 4795466 4867233
15966 4867233 4888008 4893035 4872257 4885795 4880866 4849185 4837532 4858365 4897157 4882279 4816781 4849235
15954 4849235 4866451 4898025 4875741 4841033 4801871 4792693 4806754 4819266 4865385 4857322 4876999 4868695
15942 4868695 4866947 4866297 4795298 4812208 4821005 4857243 4891739 4875851 4844265 4838883 4812590 4890997
15930 4890997 4932816 4857821 4816650 4804007 4807676 4849278 4884856 4919817 4953362 4884355 4892890 4862110
15918 4862110 4873902 4842625 4797814 4804716 4859824 4911881 4942460 4937834 4943083 4892549 4929964 4918427
15906 4918427 4861659 4867331 4829131 4881558 4915410 4942204 4950190 4942228 4910220 4878666 4856236 4909520
15894 4909520 4853997 4843329 4814552 4793958 4819600 4877197 4862611 4898336 4877968 4873032 4895932
15883 4895932 4887381 4841059 4875498 4946082 4891402 4920084 4871536 4852700 4868960 4857707 4882582
15872 4882582 4931415 5004164 4929010 4905352 4947956 4947071 4915351 4924202 4879176 4922756 4886014 4895393
15860 4895393 4943106 4925673 4870657 4904032 4891920 4859384 4902295 4900757 5021902 4965894 4972788
15849 4972788 4974227 4958053 4984474 4979765 4902797 4872813 4935001 4905174 4948861 4956248 4900021 4865767
15837 4865767 4891906 4925823 4916439 4978403 4948720 4941859 4954255 4954669 4951121 4978017 4926934 4894281
15825 4894281 4950058 4897879 4827030 4862026 4921248 4960504 4921245 4931824 4983536 4971850 4933159
15814 4933159 4928292 4886604 4804217 4851219 4981418 4968647 4929252 4918841 4977718 4995030 4997035
15803 4997035 4919585 4946955 4968818 4961299 5018438 5041564 4971762 5025252 4987395 4918150 4926737 4981981
15791 4981981 4970973 4907807 4885018 4900198 4945378 4931637 4930772 4916426 4910887 4871527 4846202 4939802
15779 4939802 5021203 5031233 5004808 4980854 4920808 4922225 4936443 4944675 4973675 4977849 5017870 5003972
15767 5003972 5015479 5008801 4974616 4994849 5002444 5006583 5026121 5007277 4982381 4937748 4960327 4938921
15755 4938921 5007383 5042379 5026274 4995956 4993798 4993277 4986822 5017529 4992707 4941947 4955984 4979353
15743 4979353 4951222 4930544 4951303 4938239 4940236 4916739 4922834 4964917 4926433 4980672 4995522 4988671
15731 4988671 5036278 5030191 5006257 4962490 5040689 5029661 5034607 4943394 4895347 5014736 5064956
15720 5064956 4965771 4978891 4980058 4936598 4922513 4945021 4979690 4982734 5005227 5012054 4994656 4941749
15708 4941749 4968393 5069790 5045522 4971646 4982561 5000736 4995296 4992736 5023290 5026583 5056309 4994521
15696 4994521 4972627 5005902 5023122 5025627 5005671 5044602 5059924 5049838 5060367 5057068 5023127 5003292
15684 5003292 4997330 5072863 5058248 5032041 5032639 5023591 4989327 5002147 5033925 5026429 5026100 5008349 4968657
15671 4968657 4963710 5000226 5018684 5001241 5010896 5063800 5083842 5040199 5022405 5033125 5004934 5053424
15659 5053424 4991760 4959279 5019438 4983067 4962909 4946466 4957744 5035256 5029582 5014646 4963548
15648 4963548 5049371 5069559 5065496 5065020 5077318 5040561 5049272 5081444 5075334 5053112 5016900 5002111
15636 5002111 5059198 5080227 5034369 5080054 5028644 4986680 5057588 5005852 4990171 5027586 5022024
15625 5022024 4994518 5021174 5050301 5044284 5047940 5034554 5080278 5105908 5082457 5088650 5037543 5025564
15613 5025564 5042228 5024760 5047951 4985084 4998432 5066150 5067935 5067210 5049894 5047123 5119856 5106940
15601 5106940 5076248 5030391 5043320 5047172 5048925 5008848 5007399 4987488 5020047 5055849 4991082 5012541
15589 5012541 5056021 5036192 5009187 4971027 4951876 4985052 5027739 5091711 5034737 5038350 5059371
15578 5059371 5056265 5062270 5051233 5062003 5098077 5115325 5103808 5119892 5138140 5152476 5127016 5069559
15566 5069559 5116143 5075421 5016492 4979634 5012306 5043080 5074949 5151269 5126320 5049579 5051051
15555 5051051 5092832 5119404 5112244 5041178 5033977 5073817 5109160 5042803 5075873 5113786 5111356 5143486
15543 5143486 5119341 5096035 5108054 5143098 5133477 5070544 5103465 5137844 5098803 5088110 5118952
15532 5118952 5104238 5044701 5018833 5048760 5107287 5111964 5136822 5159563 5186365 5187172 5177821 5112534
15520 5112534 5144420 5117249 5128651 5179129 5181513 5084528 5020379 5078686 5073439 5076240 5030946 5061298
15508 5061298 5111238 5064039 5015829 5023183 5031561 5005553 5068573 5140463 5129366 5177172 5211853 5163392
15496 5163392 5129140 5129739 5143740 5178260 5116545 5197842 5090757 5045365 5099622 5083611 5158311
15485 5158311 5129542 5133682 5109321 5035302 5094568 5126363 5163995 5164996 5104069 5082501 5109758 5123985
15473 5123985 5108336 5141885 5133381 5128727 5167060 5149408 5156701 5144828 5163577 5160022 5128409 5145182
15461 5145182 5199466 5199850 5197814 5245118 5134815 5124070 5075022 5073389 5101238 5075295 5067894 5072586
15449 5072586 5095166 5048961 5048603 5022141 5063559 5083755 5053859 5063913 5136824 5187472 5137648 5049769
15437 5049769 5115965 5135119 5186002 5182879 5159699 5115358 5090846 5128837 5115291 5130617 5136752 5160497
15425 5160497 5197270 5190522 5202416 5173635 5135420 5180125 5145415 5158814 5100446 5088468 5084699 5097654
15413 5097654 5093185 5079943 5149833 5151454 5020738 5090868 5144699 5170870 5130496 5150241 5140753 5130382
15401 5130382 5117686 5108606 5148209 5132309 5153419 5130783 5157881 5114950 5086581 5084287 5161108 5150566
15389 5150566 5215924 5259498 5209309 5224157 5187948 5093519 5115589 5178560 5154324 5170558 5207442
15378 5207442 5179901 5138530 5151667 5187933 5202813 5207865 5178905 5156894 5194300 5128750 5195427
15367 5195427 5237676 5220666 5215249 5280196 5199110 5170859 5145730 5154153 5170985 5160821 5169106 5133247
15355 5133247 5224465 5237282 5205505 5200227 5183295 5138351 5097156 5102006 5090301 5092530 5188587 5199907
15343 5199907 5154162 5121890 5218653 5194757 5132344 5143284 5189022 5255192 5205570 5188913 5155898
15332 5155898 5126652 5151103 5175252 5157115 5201990 5270157 5281563 5186356 5086181 5103859 5156233
15321 5156233 5159354 5189018 5174200 5190815 5277409 5287295 5316165 5245365 5241304 5194950 5204092 5139264
15309 5139264 5131644 5211975 5214828 5171481 5124993 5171484 5183298 5213773 5272452 5270968 5233662 5164868
15297 5164868 5160337 5159921 5238082 5292003 5243215 5254768 5259755 5258213 5235931 5259190 5272598 5245348
15285 5245348 5250069 5252342 5174451 5170896 5224533 5231189 5233472 5198399 5232018 5214393 5228746 5254989
15273 5254989 5263962 5261854 5222430 5243498 5180464 5201358 5230219 5285660 5313326 5295448 5311898 5278750
15261 5278750 5257741 5255630 5234792 5224926 5279754 5305877 5292161 5217615 5195592 5166639 5191993 5243861
15249 5243861 5272099 5225350 5176979 5215992 5196823 5191707 5216116 5234771 5221973 5255419 5242457
15238 5242457 5238602 5294532 5224799 5231312 5292963 5249180 5251872 5268889 5263098 5272778 5252620 5234166
15226 5234166 5246389 5238098 5229757 5285562 5319381 5344919 5316702 5242898 5289662 5248123 5270464 5240960
15214 5240960 5209047 5281377 5279879 5224531 5234871 5249954 5221213 5252402 5262631 5277929 5306673
15203 5306673 5318178 5284004 5279586 5233343 5213148 5199968 5273317 5292476 5249476 5247895 5303556 5386669
15191 5386669 5316274 5278664 5211655 5275465 5318501 5282364 5278314 5297310 5289416 5195825 5204822 5229684
15179 5229684 5242353 5270734 5324394 5242619 5203932 5282370 5303252 5307988 5298552 5326888 5316433 5325241
15167 5325241 5323690 5270719 5275547 5296199 5308948 5334045 5303634 5339143 5322149 5292327 5273136 5269298
15155 5269298 5263787 5262834 5255851 5266573 5294031 5318943 5301633 5274337 5246765 5213889 5196692 5244011
15143 5244011 5288716 5301386 5284128 5300736 5296671 5257861 5344585 5378783 5364522 5403287 5321713
15132 5321713 5285023 5262074 5257064 5355057 5311548 5278152 5286263 5311346 5303740 5270178 5248755 5243131
15120 5243131 5247980 5287544 5318671 5280516 5298574 5405068 5369341 5365362 5379201 5306925 5299851 5334884
15108 5334884 5355014 5372421 5323264 5294353 5346972 5392985 5328084 5332515 5338851 5385732 5397754 5356443
15096 5356443 5362299 5296309 5262056 5305658 5360913 5307613 5262490 5331000 5279161 5272774 5322512 5311411
15084 5311411 5336277 5396045 5427779 5390041 5356345 5332404 5277387 5309081 5373618 5378602 5365331
15073 5365331 5391401 5384342 5348503 5347433 5300049 5313110 5332251 5316250 5311869 5311587 5289499 5239021
15061 5239021 5258910 5379865 5314713 5298209 5349770 5327170 5362941 5290766 5327179 5425480 5428456
15050 5428456 5370661 5352839 5337020 5388546 5375943 5416354 5383379 5346985 5353571 5337306 5332938 5291379
15038 5291379 5316592 5304367 5293093 5352183 5361146 5341391 5347362 5367599 5356310 5367287 5334555 5298094
15026 5298094 5309107 5359607 5406275 5399384 5345038 5293169 5340203 5375249 5387412 5408919 5430025
15015 5430025 5356064 5351490 5323075 5343455 5345337 5345550 5326615 5347614 5335812 5367759 5358126 5341075
15003 5341075 5365864 5400066 5368238 5393238 5366529 5362304 5421014 5431888 5428915 5483560 5399038 5397421
14991 5397421 5394370 5382058 5368936 5399276 5442992 5467843 5399620 5429157 5373573 5335030 5384768
14980 5384768 5423667 5414296 5434743 5424651 5401615 5412546 5402030 5415460 5406228 5459173 5392208 5387773
14968 5387773 5334683 5354865 5393519 5438987 5431854 5392173 5424501 5416537 5371567 5378256 5419283 5425637
14956 5425637 5433864 5441533 5417303 5427687 5422696 5411507 5369571 5454874 5400983 5429024 5390398 5383248
14944 5383248 5400516 5413691 5377643 5365714 5408201 5445083 5410993 5437819 5464826 5413486 5356770
14933 5356770 5388157 5429167 5479268 5438607 5435026 5405469 5376724 5381608 5421880 5404945 5411209 5407878
14921 5407878 5374939 5463525 5405756 5409879 5441510 5461668 5479745 5521692 5505558 5421321 5426387 5410774
14909 5410774 5441053 5445861 5466788 5469724 5433517 5373762 5426667 5436945 5448788 5456092 5478866 5438531
14897 5438531 5423421 5464808 5438059 5397966 5460069 5470428 5427851 5444028 5408637 5436998 5461184
14886 5461184 5422168 5426339 5492439 5375220 5464643 5418822 5394683 5442980 5390097 5467092 5500341
14875 5500341 5491840 5489458 5429052 5363173 5406253 5401472 5397705 5402327 5343932 5408821 5405580 5415760
14863 5415760 5464046 5461808 5418068 5514210 5504233 5441264 5450533 5507919 5460414 5457667 5463641 5473097
14851 5473097 5429387 5512282 5552322 5607340 5599826 5520128 5467604 5527186 5507383 5475097 5462438
14840 5462438 5474460 5430224 5472973 5494625 5532203 5462597 5501672 5527652 5442680 5492023 5478595
14829 5478595 5452490 5531000 5555494 5486917 5474041 5471729 5518646 5485937 5510159 5494549 5479937
14818 5479937 5497839 5519022 5419994 5433386 5415712 5512670 5545779 5573486 5619254 5656025 5622078
14807 5622078 5567247 5511543 5435737 5442997 5421923 5472017 5488384 5535855 5521145 5417693 5387086
14796 5387086 5404239 5383139 5364139 5475421 5444588 5493762 5545361 5597982 5582350 5466104 5464140
14785 5464140 5479877 5561699 5585108 5539374 5559348 5507543 5530280 5481826 5451697 5504485 5560224
14774 5560224 5596939 5627493 5563214 5556948 5503873 5521477 5554659 5477303 5540662 5544374 5453725 5512080
14762 5512080 5516932 5584549 5580405 5507511 5507278 5466549 5475178 5494137 5481271 5481647 5567274 5580486 5504037
14749 5504037 5515112 5558107 5525032 5541279 5498624 5495547 5506339 5551648 5498956 5506142 5552799 5522040
14737 5522040 5555818 5533364 5519840 5551277 5551101 5559528 5502230 5472090 5492371 5536784 5511456 5456793
14725 5456793 5524837 5535761 5566606 5564780 5549271 5552487 5552734 5613247 5601990 5526095 5578890 5547959
14713 5547959 5609103 5590974 5581631 5515755 5480954 5552569 5566953 5562125 5565918 5571991 5602600 5567053
14701 5567053 5631132 5658443 5576142 5586882 5598903 5610561 5629433 5661936 5603149 5637650 5598455
14690 5598455 5562752 5539005 5503969 5513732 5573237 5571582 5644270 5619073 5609054 5590037 5648084 5559931
14678 5559931 5578307 5639502 5537758 5502699 5571039 5601527 5616589 5587103 5575737 5551699 5645066
14667 5645066 5689485 5604869 5574080 5571083 5503046 5536113 5466003 5548825 5614166 5533327 5558740
14656 5558740 5614462 5639819 5593171 5603262 5605528 5625556 5592442 5609024 5613696 5642256 5598479 5653551
14644 5653551 5647406 5621469 5610916 5589814 5563276 5583066 5518778 5515387 5573492 5559518 5588630 5597882
14632 5597882 5570987 5535474 5529671 5547555 5584348 5545498 5528921 5518841 5543615 5566418 5619197
14621 5619197 5571826 5507741 5562710 5595825 5638605 5700997 5731803 5677089 5662914 5663320 5710203 5668050
14609 5668050 5605285 5613825 5608090 5583217 5533345 5580263 5614345 5626780 5619075 5548713 5619070 5657950
14597 5657950 5661957 5587398 5564619 5614730 5610527 5615054 5640521 5611845 5622989 5669419 5656667 5650100
14585 5650100 5596129 5600950 5645871 5655544 5635871 5593398 5594357 5617784 5690737 5668247 5724713 5719782
14573 5719782 5648294 5605101 5639511 5636752 5601616 5595192 5581708 5531956 5609632 5656133 5647703 5667144
14561 5667144 5616841 5627466 5729178 5699636 5674572 5669197 5690248 5686894 5665248 5650906 5605846
14550 5605846 5648938 5667656 5710020 5695490 5681486 5640202 5726832 5675645 5661888 5664376 5656385 5636198
14538 5636198 5676430 5666643 5708670 5683004 5616444 5644315 5650811 5693141 5737057 5727802 5670126 5665024
14526 5665024 5664918 5672396 5772178 5812466 5763674 5656477 5589856 5630694 5649492 5687887 5718202 5735419
14514 5735419 5719560 5725843 5743627 5717224 5619199 5618210 5620490 5586916 5646376 5713041 5668228 5753278
14502 5753278 5826527 5688564 5655337 5702087 5677193 5664036 5664089 5707563 5690370 5646565 5674225 5635223
14490 5635223 5657250 5681361 5665707 5704759 5687693 5618861 5587519 5676858 5688903 5734804 5693279
14479 5693279 5719252 5667726 5639115 5729340 5753227 5761274 5739992 5694662 5631753 5681166 5708016
14468 5708016 5666129 5686160 5713056 5683243 5767455 5808981 5800473 5789731 5823243 5804204 5779456
14457 5779456 5749646 5742097 5718834 5773762 5766344 5755257 5796415 5778154 5778280 5739201 5752666 5753899
14445 5753899 5696424 5658109 5728008 5748892 5767891 5799299 5759489 5797619 5843685 5772462 5730380
14434 5730380 5743787 5647535 5728843 5724934 5694591 5683530 5701706 5726705 5716532 5755644 5819451
14423 5819451 5727327 5739701 5756493 5768270 5803797 5708930 5716130 5755224 5759868 5784247 5733946 5714405
14411 5714405 5798996 5710222 5653856 5625557 5667920 5672432 5705842 5742739 5724174 5732625 5711248 5732092
14399 5732092 5720241 5717268 5743670 5727947 5728204 5749962 5781263 5726856 5755858 5770623 5691092 5731700
14387 5731700 5835363 5881337 5842260 5847642 5864754 5866975 5823973 5766384 5764447 5685876 5760716 5786235
14375 5786235 5805695 5729359 5741085 5753682 5738782 5747759 5766897 5730600 5765344 5780600 5750912
14364 5750912 5800434 5780636 5799707 5818835 5775676 5715403 5764477 5750739 5786242 5783727 5773339
14353 5773339 5787527 5814848 5799704 5840457 5835830 5837434 5776170 5800446 5872500 5837982 5818817 5839938
14341 5839938 5865406 5755783 5806964 5778424 5747470 5799200 5832553 5879852 5877225 5816607 5826337
14330 5826337 5849325 5779567 5833318 5882237 5889314 5902469 5850721 5778315 5754075 5785069 5783209 5759177
14318 5759177 5800419 5889471 5879279 5846233 5854342 5826404 5804240 5850746 5859648 5892666 5872114 5869301
14306 5869301 5833257 5844932 5887460 5849125 5858820 5823114 5838024 5763787 5771795 5808761 5845014 5899366
14294 5899366 5877485 5792528 5841792 5888541 5874206 5864371 5837838 5842811 5858904 5801667 5815618 5849804
14282 5849804 5886990 5856554 5849559 5827650 5822944 5883390 5867535 5833255 5855166 5839537 5844686 5830824
14270 5830824 5939671 5934479 5882121 5843432 5815178 5892989 5833234 5894613 5879664 5876437 5885349 5901718
14258 5901718 5841057 5804686 5787467 5799191 5837335 5861632 5876405 5869614 5878670 5854551 5881091 5854493
$$ [...]
##END NTUPLES=NMR SPECTRUM
##END=
