##TITLE=1H_CA-9079-3x2
 CDCl3
 8 sc, 
 25.10.2022
##JCAMPDX= 6.0         $$ Bruker NMR JCAMP-DX V2.0
##DATA TYPE= NMR SPECTRUM
##DATA CLASS= NTUPLES
##ORIGIN= UXNMR, Bruker Analytische Messtechnik GmbH
##OWNER= root
$$ XWIN-NMR		Version 3.5
$$ Tue Oct 25 14:02:45 2022 Russian Standard Time (UT+4h)  she@DPX200
##.OBSERVE FREQUENCY= 200.1313499994
##.OBSERVE NUCLEUS= ^1H
##.ACQUISITION MODE= SIMULTANEOUS
##.ACQUISITION SCHEME= undefined
##.AVERAGES= 8
##.DIGITISER RES= 18
##SPECTROMETER/DATA SYSTEM= spect
##.PULSE SEQUENCE= zg30
##.SOLVENT NAME= CDCl3
##.SHIFT REFERENCE= (INTERNAL, CDCl3, 0, 15.7403)
##AUDIT TRAIL= $$ (NUMBER, WHEN, WHO, WHERE, WHAT)
$$ ##TITLE= Audit trail, XWIN-NMR		Version 3.5
$$ ##JCAMPDX= 5.01
$$ ##ORIGIN= Bruker BioSpin GmbH
$$ ##OWNER= she
$$ F:/spectra/data/she/nmr/H-F/1/pdata/1/auditp.txt
$$ ##AUDIT TRAIL=  $$ (NUMBER, WHEN, WHO, WHERE, WHAT)
(   1,<2022-10-25 14:01:27.73 +0400>,<she>,<DPX200>,
      <created by zg, POWCHK disabled, PULCHK disabled
       configuration hash MD5:
       00 E9 B6 7A A2 85 ED C7 34 08 36 98 17 FE 4E 26
       data hash MD5: 16K
       FC 5C A6 A9 E9 96 29 B9 18 12 32 82 E1 D4 CB D7>)
(   2,<2022-10-25 14:01:30.53 +0400>,<she>,<DPX200>,
      <Start of raw data processing
       efp BC_mod = 2 LB = 0.24 FT_mod = 6 PKNL = 1 PHC0 = -18191.26 PHC1 = 9.4007 SI = 16K 
       data hash MD5: 16K
       40 04 A2 AA DA 01 94 AE 76 89 2C 95 03 B3 A8 A6>)
(   3,<2022-10-25 14:01:45.68 +0400>,<she>,<DPX200>,
      <pk PHC0 = 158.0214 PHC1 = 0.5999998 
       data hash MD5: 16K
       54 F6 C4 13 4A DE C2 03 BD 02 41 6D BF 68 C1 54>)
(   4,<2022-10-25 14:01:48.96 +0400>,<she>,<DPX200>,
      <abs ABSG = 5 
       data hash MD5: 16K
       06 31 94 0B 35 79 9D FD 6C A7 EE 95 8C 0C 2E F3>)
$$ ##END=
$$ 
$$ hash MD5
$$ 32 93 2C 04 57 30 C4 81 7F E0 0A CB 47 DC DE 56
##$RELAX= 
##$RELAX= 
##$RELAX= 
##$RELAX= 
##$RELAX= 
##$RELAX= 
$$ Bruker specific parameters
$$ --------------------------
##$DU= <F:/spectra>
##$EXPNO= 1
##$NAME= <H-F>
##$PROCNO= 1
##$TYPE= <nmr>
##$USER= <she>
##$AMP= (0..31)
100 100 100 100 100 100 100 100 100 100 100 100 100 100 100 100 100 100 
100 100 100 100 100 100 100 100 100 100 100 100 100 100 
##$AQSEQ= 0
##$AQ_mod= 1
##$AUNM= <au_zg>
##$AUTOPOS= <>
##$BF1= 200.13
##$BF2= 200.13
##$BF3= 200.13
##$BF4= 200.13
##$BF5= 200.13
##$BF6= 200.13
##$BF7= 200.13
##$BF8= 200.13
##$BYTORDA= 1
##$CFDGTYP= 0
##$CFRGTYP= 5
##$CHEMSTR= <none>
##$CNST= (0..31)
1 1 145 1 1 1 1 1 1 1 1 1 1 1 1 1 1 1 1 1 1 1 1 1 1 1 1 1 1 1 1 1 
##$CPDPRG= <>
##$CPDPRG1= <>
##$CPDPRG2= <>
##$CPDPRG3= <>
##$CPDPRG4= <mlev>
##$CPDPRG5= <mlev>
##$CPDPRG6= <mlev>
##$CPDPRG7= <mlev>
##$CPDPRG8= <mlev>
##$CPDPRGB= <>
##$CPDPRGT= <>
##$D= (0..31)
0 1.2 0 0 0 0 0 0 0 0.06 0 0.03 0 0 0 0 0.0002 0 0 0 0 0 0 0 0 0 0 0 0 
0 0 0 
##$DATE= 1666692087
##$DBL= (0..7)
120 120 120 120 120 120 120 120 
##$DBP= (0..7)
150 150 150 150 150 150 150 150 
##$DBP07= 0
##$DBPNAM0= <>
##$DBPNAM1= <>
##$DBPNAM2= <>
##$DBPNAM3= <>
##$DBPNAM4= <>
$$ [...]
##$SUBNAM3= <"">
##$SUBNAM4= <"">
##$SUBNAM5= <"">
##$SUBNAM6= <"">
##$SUBNAM7= <"">
##$SUBNAM8= <"">
##$SUBNAM9= <"">
##$SW= 18.0517283424941
##$SWIBOX= (0..15)
0 0 2 0 0 0 0 0 0 0 0 0 0 0 0 0 
##$SW_h= 3612.71676300578
##$TD= 16384
##$TD0= 1
##$TE= 0
##$TE2= 300
##$TE3= 300
##$TEG= 300
##$TL= (0..7)
0 120 120 120 120 120 120 120 
##$TP= (0..7)
150 150 150 150 150 150 150 150 
##$TP07= 0
##$TPNAME0= <>
##$TPNAME1= <>
##$TPNAME2= <>
##$TPNAME3= <>
##$TPNAME4= <>
##$TPNAME5= <>
##$TPNAME6= <>
##$TPNAME7= <>
##$TPOAL= (0..7)
0.5 0.5 0.5 0.5 0.5 0.5 0.5 0.5 
##$TPOFFS= (0..7)
0 0 0 0 0 0 0 0 
##$TUNHIN= 0
##$TUNHOUT= 0
##$TUNXOUT= 0
##$USERA1= <user>
##$USERA2= <user>
##$USERA3= <user>
##$USERA4= <user>
##$USERA5= <user>
##$V9= 5
##$VALIST= <valist>
##$VCLIST= <CCCCCCCCCCCCCCC>
##$VD= 0
##$VDLIST= <DDDDDDDDDDDDDDD>
##$VPLIST= <PPPPPPPPPPPPPPP>
##$VTLIST= <TTTTTTTTTTTTTTT>
##$WBST= 1024
##$WBSW= 4
##$XGAIN= (0..3)
0 0 0 0 
##$XL= 0
##$YL= 0
##$YMAX_a= 60117
##$YMIN_a= -99767
##$ZGOPTNS= <>
##$ZL1= 120
##$ZL2= 120
##$ZL3= 120
##$ZL4= 120
##$ABSF1= 15.79427
##$ABSF2= -2.257582
##$ABSG= 5
##$ABSL= 3
##$ALPHA= 0
##$AQORDER= 0
##$ASSFAC= 0
##$ASSFACI= 0
##$ASSFACX= 0
##$ASSWID= 0
##$AUNMP= <proc_1d>
##$AZFE= 0.1
##$AZFW= 0.1
##$BCFW= 0
##$BC_mod= 2
##$BYTORDP= 0
##$COROFFS= 0
##$CY= -3
##$DATMOD= 1
##$DC= 0
##$DFILT= <>
##$DTYPP= 0
##$F1P= 0
##$F2P= 0
##$FCOR= 1
##$FTSIZE= 16384
##$FT_mod= 6
##$GAMMA= 0
##$GB= 0
##$INTBC= 1
##$INTSCL= 3.70164e-10
##$ISEN= 128
##$LB= 0.24
##$LEV0= 0
##$LPBIN= 0
##$MAXI= 10000
##$MC2= 0
##$MEAN= 0
##$ME_mod= 0
##$MI= 1.114404
##$NCOEF= 0
##$NC_proc= -9
##$NLEV= 6
##$NOISF1= 3.799351
##$NOISF2= 2.8
##$NSP= 0
##$NTH_PI= 0
##$NZP= 0
##$OFFSET= 15.74028
##$PC= 1
##$PHC0= -18033.24
##$PHC1= 10.0007
##$PH_mod= 1
##$PKNL= yes
##$PPARMOD= 0
##$PSCAL= 0
##$PSIGN= 0
##$REVERSE= no
##$SF= 200.130006255237
##$SI= 16384
##$SIGF1= 3
##$SIGF2= 2
##$SINO= 5.538805
##$SIOLD= 16384
##$SREGLST= <1H.CDCl3>
##$SSB= 0
##$STSI= 16384
##$STSR= 0
##$SW_p= 3612.71676300578
##$SYMM= 0
##$S_DEV= 0
##$TDeff= 16384
##$TDoff= 0
##$TI= <>
##$TILT= no
##$TM1= 0
##$TM2= 0
##$TOPLEV= 0
##$USERP1= <user>
##$USERP2= <user>
##$USERP3= <user>
##$USERP4= <user>
##$USERP5= <user>
##$WDW= 1
##$XDIM= 16384
##$YMAX_p= 395655677
##$YMIN_p= -4305420
$$ End of Bruker specific parameters
$$ ---------------------------------
##NTUPLES= NMR SPECTRUM
##VAR_NAME=  FREQUENCY,     SPECTRUM/REAL,   SPECTRUM/IMAG
##SYMBOL=    X,             R,               I
##VAR_TYPE=  INDEPENDENT,   DEPENDENT,       DEPENDENT
##VAR_FORM=  AFFN,          ASDF,            ASDF
##VAR_DIM=   16384,         16384,           16384
##UNITS=     HZ,            ARBITRARY UNITS, ARBITRARY UNITS
##FACTOR=    0.220516191357247, 1,           1
##FIRST=     3150.1023651523, 0,             0
##LAST=      -462.614397853482, 0,           0
##MIN=       -462.614397853482, -4305420,    0
##MAX=       3150.1023651523, 395655677,     0
$$ Real data points
##PAGE= N=1
##DATA TABLE= (X++(R..R)), XYDATA
$$ [...]
4841e17839l30084k28109k67399K29383O76955J56498l48460q14300O01832J39607
4831g01916N44780o7983K98750l46398L84980l08895n84124l09655k08512n42851
4821a841824J2592R97711K95268m65282O45796K69895k01085p39843P07Q32815
4811a93250k92828R65109j22466J32466j189057l07860m2258J540971N7969J43224
4801F92020k1246q40152J05471M91309J30186Q11478l14698J94598K03423K30627
4791A683016j243934j375038M67273l89660k92053R38404J121119n80404m34299
4782a05576j83940q05059q55694L23926J046463k10706O00620l98509R95329l73964
4772C2890m09182J23694n10442r48427k6305Q65860k53705N89798Q14757o36051
$$ plain form
4841 -517839 -847923 -1076032 -1343431 -1114048 -437093 -280595 -629055 -1443355 -841523 -701916
4831 -701916 -157136 -225119 73631 -272767 112213 -196682 -780806 -1090461 -1298973 -1841824
4821 -1841824 -1829232 -831521 -536253 -1001535 -355739 -85844 -286929 -1026772 -1026065 -193250
4811 -193250 -486078 479031 356565 489031 -700026 -1007886 -1050144 490827 548796 692020
4801 692020 670774 -169378 -63907 427402 557588 1369066 1054368 1248966 1452389 1683016
4791 1683016 439082 -935956 -468683 -858343 -1150396 -211992 909127 328723 -105576
4782 -105576 -289516 -1094575 -1950269 -1626343 -579880 -790586 -189966 -588475 406854 32890
4772 32890 -376292 -252598 -763040 -1711467 -1737772 -871912 -1125617 -535819 278938 -357113
4762c57113j654457k31956N4874K235280o02606M41139J376709p83144n33441
4753e4715K60042j458241J052176m19949l74367K77277L56201l04891J385094
4744G18627q23217j901927M80059K131876j018008j29213R98832R17093r06672
4735D67450r30155R10611J320534L75009m19471n75280p52307N24019r5027m65393
4725C59990M68506l95027q19221K83033o68143J473058K33916j58082j009387
4716b31357Q09561M55260N04679k84878p02960J71099q5642o89315l28557L36664
4706d5446L94148n06877J37157n12240M36423J41494R29575k1636J36932r92320
4696I7210L95999j3909l3900L72806j332385j494836J417464N31277k02971O50534
$$ plain form
4762 -357113 -2011570 -2243526 -2188652 46628 -555978 -114839 1261870 478726 -54715
4753 -54715 205327 -1252914 -200738 -620687 -995054 -717777 -361576 -666467 718627
4744 718627 -104590 -2006517 -1526458 605418 -412590 -541803 457029 1374122 467450
4735 467450 -462705 447906 1768440 2143449 1723978 1148698 396391 920410 825383 359990
4725 359990 828496 433469 -385752 -102719 -770862 702196 936112 778030 -231357
4716 -231357 578204 1033464 1538143 1253265 550305 721404 635762 -53553 -382110 -45446
4706 -45446 348702 -158175 -21018 -533258 -96835 44659 974234 952598 1089530 97210
4696 97210 493209 479300 445400 818206 -514179 -2009015 -591551 -60274 -263245 387289
4686C87289r04331q3983J086825Q55708r13012n58710o3941Q1850J0608j369360
4676a471057J871271J162247o04104Q21069j264140o39103J307027l90384q16452
4667b3626L53401P59779j00270l14542J60178n91439P9381K98421L24914j9344
4657I26853K93210j99604j42790J310701j4135l52126j077965R0400j04598J170167
4647A900113o46999p3909L40239k21260j96896q34778l653m04058n90996L91348
4637c40849K611024K40806K72935N36884k40074j374240j30285l39724P5253j122396
4627A89334N18283j88985Q68348l91260k98876o62410P23967J243576q81754j037793
4617H2430P3560j09561K44021Q30495L16876j388079K4792o0787J314057k00916
$$ plain form
4686 387289 -517042 -601025 485800 1341508 428496 -130214 -194155 -112305 -101697 -1471057
4676 -1471057 400214 1562461 958357 1779426 515286 -123817 1183210 792826 -23626
4667 -23626 329775 1089554 989284 674742 834920 243481 322862 621283 946197 926853
4657 926853 1220063 1020459 877669 2188370 2174235 1822109 744144 834544 729946 1900113
4647 1900113 1253114 1179205 1519444 1298184 1101288 266510 262857 -141201 -732197 -340849
4637 -340849 2270175 2510981 2783916 3320800 3080726 1706486 1576201 1236477 1311730 189334
4627 189334 707617 518632 1386980 995720 696844 34434 758401 2001977 1120223 82430
4617 82430 155990 46429 290450 1120945 1437821 49742 74534 13747 1327804 1126888
4607A126888J27453m40693K55001J88484L74727P42436L8770r84334p19207Q1457
4597G90982r45115J403863P71079m29590J532508J8309j091096j133552R52962
4588A870350j49338m33463K18334l02121M17115k09669L40676l09510N3696n30110
4578I65960N99423n54175k32594q2160O96804J029855j25859p79068l81211o99971
4568D37004O88480R23830j131198n77631M90746K69366p41767k34776Q40122p69484
4558A94692P66426j010291M35323P96951R39126P61528l93448J2053k71080o7799
4548B163481j85145l12386J282885q43849o8038J67470J223871J47438p36285
4539B839442j265847P57717R6399P16806Q0976o24132o0678L19307O99630o76085
$$ plain form
4607 1126888 1254341 813648 1068649 1257133 1631860 2374296 2413066 1428732 709525 790982
4597 790982 -154133 1249730 2020809 1591219 3123727 3142036 2050940 917388 1870350
4588 1870350 1721012 1287549 1505883 1203762 1620877 1411208 1751884 1442374 1496070 965960
4578 965960 1565383 1011208 778614 696454 1393258 2423113 2297254 1518186 1136975 437004
4568 437004 1125484 2049314 918116 340485 831231 1100597 358830 124054 964176 194692
4558 194692 961118 -49173 386150 1183101 2122227 2883755 2490307 2502360 2231280 2163481
4548 2163481 1978336 1665950 2948835 2104986 2036948 2204418 3428289 3575727 2839442
4539 2839442 1573595 2331312 2427711 3144517 3225493 2601361 2540683 2859990 3559620 2883535
4529B883535j234646M30236J235582p90143O69407l82025r79440k7461J644008
4520C449053p24891p56031P31002l4295p63714l58921Q97762J769666m70848j120593
4510B618190J657128O09397R07726J039372l32863r82855l68643l25558L21765
4501E143659J96514o25336N43026R53425J336532o75186k230440l30421J875370
4492F187143j171463m11973P10957N12466J67319M13178q48844j111522J46785
4483D594046J354113J249070r93807o87965j12363O56527k54528n53256k85973
4474D965864J025380N79049n23541P31292k22159J85628j48484m29464M31528
4465F595093K31363k53293k53401M70577P40113Q82370o12161k70168Q00231J57746
$$ plain form
4529 2883535 1648889 2079125 3314707 2524564 3193971 2811946 1832506 1805045 3449053
4520 3449053 2724162 1968131 2699133 2664838 1901124 1542203 2439965 4209631 3738783 2618190
4510 2618190 4275318 4884715 5792441 6831813 6498950 5516095 5147452 4821894 5143659
4501 5143659 5340173 4714837 5257863 6211288 7547820 6872634 4642194 4311773 6187143
4492 6187143 5015680 4603707 5314664 5827130 5994449 6407627 5558783 4447261 4594046
4483 4594046 5948159 7197229 6203422 5515457 5403094 6059621 5805093 5251837 4965864
4474 4965864 5991244 6570293 6046752 6778044 6555885 6741513 6593029 6163565 6595093
4465 6595093 6826456 6573163 6319762 6790339 7530452 8412822 7800661 7530493 8330724 8488470
4455H488470k45133P55925n0712O62845p6942L04670j339403L89925O53003j089084
4445H453564r206M19558J783994L6471k30620O52321k26301m98181n32041m2376
4435I807183K359211N09037k65147l3390K49261M35018J118538n2125J076611
4426A5204197L88214j219942N71126J259250n55519L44928L24975n17170Q07980
4417A6608039O17718N00016L59896N32430l3114j79744K90991P28881K055959
4408B1481072k77664J581152R83119o7509p1549R44067R21935J15043J310592
4399B6920258J317158R59465N06232Q74414J262200j07469J488571J139420K765149
4390C7125398J187349N90810J079509l04876J250863K102699K519971J282549
$$ plain form
4455 8488470 8243337 8999262 8948550 9611395 9534453 9839123 8499720 8889645 9542648 8453564
4445 8453564 8444358 8863916 10647910 10684381 10453761 11106082 10879781 10381600 9849559 9807183
4435 9807183 12166394 12675431 12410284 12376894 12626155 13061173 14179711 14127586 15204197
4426 15204197 15592411 14372469 14943595 16202845 15647326 15992254 16317229 15800059 16608039
4417 16608039 17225757 17725773 18085669 18618099 18584985 18405241 18696232 19425113 21481072
4408 21481072 21203408 22784560 23767679 23700170 23628621 24572688 25494623 25609666 26920258
4399 26920258 28237416 29196881 29703113 30577527 31839727 31732258 33220829 34360249 37125398
4390 37125398 38312747 38903557 39983066 39678190 40929053 43031752 45551723 46834272
4382D6834272j46463L698498L766945J603777K117011K172375K603597K562328
4374F5212340M120154K512598L031529K878017L815189M267150K916666L486614
4366I2240257L846583N667473N375829M602050M543921M980214M965392M650739
4358A30872458M951751M148629K914207J370523J039079O41259j97818k006416
4350A43733672k589212l562392k048341m174748n326011n694453n543917n771660
4342A09022938k805930l581846m517231m231843m746832n275859j301750l134988
4334G9426659k470969l402697l039140k631312l848066j030287j801877k762044
4326E8440267j825129j982357j469747o41989j492597j810935k403191j318912
$$ plain form
4382 46834272 46687809 50386307 54153252 55757029 57874040 60046415 62650012 65212340
4374 65212340 69332494 71845092 74876621 77754638 81569827 85836977 88753643 92240257
4366 92240257 96086840 101754313 107130142 111732192 116276113 121256327 126221719 130872458
4358 130872458 135824209 139972838 142887045 144257568 145296647 145937906 145740088 143733672
4350 143733672 141144460 137582068 135533727 131358979 126032968 120338515 114794598 109022938
4342 109022938 106217008 102635162 98117931 93886088 89139256 83863397 82561647 79426659
4334 79426659 76955690 73552993 70513853 67882541 64034475 63004188 61202311 58440267
4326 58440267 56615138 54632781 53163034 52521045 51028448 49217513 46814322 45495410
4318D5495410j945986P5274j095729k350824j078131k54771j955932r29111m70418
4309C5489782r5012N15549j780011m72801m50787j077326m02330r14612m57135
4300C0355317m32466k021417n66451L98162j152419j583496j244157j86872J47185
4291B3713386n37635j875928M49868M45762j633900O49551J382397j033515j060141
4282B0499845J188601j069480j532417O6808k89864j96044n66187k95027k07466
4273A7598769J03389R74123j47455j92670j493300j523685r1595o98498R06295
4264A5435373P0008O48657J44413j310759m48901l95689j50381M08050M66585
4255A4867356p72628L66474o10468l4920k95763j48665M73124k175496J39403
$$ plain form
4318 45495410 43549424 43624698 42528969 40178145 39100014 38845243 36889311 35960200 35489782
4309 35489782 35394770 35910319 34130308 33657507 33206720 32129394 31727064 30812452 30355317
4300 30355317 29922851 27901434 27334983 27733145 26580726 24997230 23753073 23566201 23713386
4291 23713386 23175751 21299823 21749691 22195453 20561553 21211104 22593501 21559986 20499845
4282 20499845 21688446 20618966 19086549 19153357 18863493 18667449 18101262 17806235 17598769
4273 17598769 17702158 18676281 18528826 18336156 16842856 15319171 15227576 14529078 15435373
4264 15435373 15505381 16154038 16298451 14987692 14538791 14143102 13992721 14400771 14867356
4255 14867356 14094728 14461202 13850734 13815814 13520051 13371386 13844510 11669014 11808417
4246A1808417R845J028987l97137j33968O66407j27780k92020L00757m16932J038847
4236A3485423k24881k75591n78756M46739K04903o30444j00219L58643O88429
4227A3374246R0910m32802j345013Q49052Q32226N85409m30432j07109J21175
4218A3537662N64871L52993L35009o7384n42588L96132l5712q54111o27480J351609
4208A4411001O70622k80491P62463P53687k9091J278050l79968k76470M68667
4199A7378470o904Q97409j630331L74276J666878M17865J170098P68368j57953
4190B0878176J38735N57084O69393J086864k7361P08161N21255L00843M80212
4181B5313362n44976J425782J786728O30056J349953L64788J619912J403181o5097
$$ plain form
4246 11808417 11818262 12847249 12450112 12316144 12982551 12854771 12562751 12863508 12446576 13485423
4236 13485423 13260542 12984951 12406195 12852934 13057837 12427393 12327174 12685817 13374246
4227 13374246 13465156 13032354 11687341 12536393 13368619 13954028 13523596 13416487 13537662
4218 13537662 14102533 14455526 14790535 14723151 14180563 14576695 14540983 13686872 13059392 14411001
4208 14411001 15081623 14801132 15563595 16317282 16288191 17566241 17186273 16909803 17378470
4199 17378470 17371566 18268975 16638644 17012920 18679798 19097663 20267761 21036129 20878176
4190 20878176 21016911 21573995 22243388 23330252 23302891 24011052 24532307 24833150 25313362
4181 25313362 24768386 26194168 27980896 28610952 29960905 30325693 31945605 33348786 33283689
4172C3283689R56882K71084J261147J483637R76095M62941K996295J774875J160067
4163D4626712J960257J329920J431119K514684L212865J938862M54307K317000
4155E9785726J441826J938605K402243J241709K930631K966201P45808K631232
4147G6083981M184845J990803K521214K962994K744958K792065K991068J948912
4139I8220840K781151L128763J687247K209966L085722K917470K862133J177974
4131A18071266K616886K219976J725732J548937K408234K656707l83795J508675
4123A32372618M09683O6041R79976J110483R45673P03843j029391r92805q00226
4114A33765895o54303k396379j554862n24971k352604j079765j085266j578732
$$ plain form
4172 33283689 34240571 34511655 35772802 37256439 38232534 38695475 41691770 43466645 44626712
4163 44626712 46586969 47916889 49348008 51862692 55075557 57014419 57468726 59785726
4155 59785726 61227552 63166157 65568400 66810109 69740740 72706941 73452749 76083981
4147 76083981 80268826 82259629 84780843 87743837 90488795 93280860 96271928 98220840
4139 98220840 101001991 104130754 105818001 108027967 111113689 114031159 116893292 118071266
4131 118071266 120688152 122908128 124633860 126182797 128591031 131247738 130863943 132372618
4123 132372618 132782301 132848342 133828318 134938801 135884474 136588317 135558926 134566121 133765895
4114 133765895 133111592 130715213 129160351 128635380 126282776 125203011 124117745 122539013
4106A22539013k421644l253542k694880j387640j571636l060016j787371k539352
4098A03822932j548043k366260k928550j75613k766361l331052j613615j111183
4090H7982255n00221q9452L19266R83235M01211O79052J315189K075429M672797
4081I7838761P309513Q726006J3000119J3776951J2488764J4971089J7034247
4074A85145450J1977321q337887k3514587k4171737k4315200j7216428j2578612
4067H6988320j0283773p068594n009554l910949n419097k686814j792422k958627
4059D7858490k649572k033146j182540k204244j852058j680538n18762n30093
4051C5207537j824956j699813j291490N4865j002265r47092N23935j551933K29997
$$ plain form
4106 122539013 120117369 116863827 114168947 112781307 111209671 108149655 106362284 103822932
4098 103822932 102274889 99908629 96980079 96804466 94038105 90707053 89093438 87982255
4090 87982255 87482034 87392582 87711848 88695083 89096294 89775346 91090535 93165964 97838761
4081 97838761 105148274 113874280 126874399 140651350 153140114 168111203 185145450
4074 185145450 197122771 188784884 165270297 141098560 116783360 99566932 86988320
4067 86988320 76704547 69635953 64626399 60715450 55296353 52609539 50817117 47858490
4059 47858490 45208918 43175772 41993232 39788988 37936930 36256392 35737630 35207537
4051 35207537 33382581 31682768 30391278 30446143 29443878 28496786 29020721 27468788 27698785
4042B7698785j406102m62001o3215j340368K80260j415045j168576n16151l20179
4033B1287408j44112n68250J444418k49097j098165M64657n28018j975176q12654
4024A7821011N63065p25003J201256O57563m72915n10720o01413q97190q61748
4015A6173906M00988J651645r63574L16368m36736k239061J10356j002990J079923
4006A5090825O46006j285855J297678Q34935k319405Q13895M46485L00807J089457
3997A6914828j339119N24070k72615m73060m94734Q21956P75931n0391J53376
3988A6560242J575315o18642j059049n75935j256632n88666m28088J019690L35979
3979A4964214J6860K54177p515n00030J57786n99030N84309M60154m0840j15866
$$ plain form
4042 27698785 26292683 25830682 25767467 24427099 24707359 23292314 22123738 21607587 21287408
4033 21287408 21143296 20575046 22019464 21770367 20672202 21136859 20608841 18633665 17821011
4024 17821011 18384076 17659073 18860329 19517892 19044977 18534257 17932844 17035654 16173906
4015 16173906 16574894 18226539 17262965 17579333 17142597 14903536 15013892 14010902 15090825
4006 15090825 15736831 14450976 15748654 16583589 14264184 15078079 15524564 15825371 16914828
3997 16914828 15575709 16099779 15827164 15354104 14859370 15681326 16457257 16406866 16560242
3988 16560242 18135557 17516915 16457866 15881931 14625299 14036633 13608545 14628235 14964214
3979 14964214 14981074 15235251 15227736 14727706 14885492 14286462 14870771 15330925 15290085 15174219
3969A5174219n1279Q9668Q29954j53195p71307O95093L32927j69865N01031j31450
3959A6345796k9252K46355j480889K00726J052751L67043j314733L81893O50237
3950A6419927j183110K05848J170431M07962j88675r36421p62338r7221k0828
3941A5015575l20818O87374J118237Q78231m40387j216584o30534P65856Q88618
3932A6745568K43019k08081L47711J401573M16671N29803P02327m45536j012236
3923A8720819l00618R75925l82595k08012L0920M11909N49830l6303Q57259l86497
3913B0232637k21922L56129R86127P08558l29958L72165P71855M39916m83504
3904B2832003N35251L54918M9123O77767N78389o15274r1473M40938J718862J225540
$$ plain form
3969 15174219 15122940 15212608 16042562 15889367 15118060 15813153 16146080 15976215 16477246 16345796
3959 16345796 16316544 16562899 15082010 15282736 16335487 16702530 15387797 15769690 16419927
3950 16419927 15236817 15442665 16613096 17021058 16832383 15895962 15133624 15036403 15015575
3941 15015575 14694757 15382131 16500368 17378599 16938212 15721628 15091094 15856950 16745568
3932 16745568 16988587 16780506 17128217 18529790 18946461 19476264 20178591 19733055 18720819
3923 18720819 18420201 19396126 19013531 18805519 18836439 19248348 19798178 19761875 20619134 20232637
3913 20232637 20010715 20366844 21352971 22061529 21731571 22103736 22875591 23315507 22832003
3904 22832003 23367254 23722172 23771295 24449062 25027451 24412177 24320704 24761642 26480504 27706044
3894B7706044m7737P07762m8826P04033M7238o17138J066662J453118J090j47092
3884C0825154l00599P66366K73099J532647J238757J096914l89581l86146n79362
3875C4077249L05648K386960Q8546o37785J386025n5312m7227L33909J063138
3866C8901151M11727j033540J34564J513832J931403j35452O43851O9097j218151
3857D1218482J473424R83904n9645N05594K86108M41357j088193k53415J127973
3848D4635589R60431J860598m81896r42851O49552Q78222K38222K70800M90317
3839D8558984O89779L39690J8460m1421R06116J294238M80562K53950j10250J117910
3829E3508018N56807j162525J146417J759437M49442J171771J213212J92175M76398
$$ plain form
3894 27706044 27658307 28366069 28317243 29021276 29068514 28451376 29518038 30971156 30972246 30825154
3884 30825154 30524555 31290921 31564020 33096667 34335424 35432338 35042757 34656611 34077249
3875 34077249 34382897 36769857 36858403 36220618 37606643 37551331 37504104 37838013 38901151
3866 38901151 39312878 38279338 38413902 39927734 41859137 41723685 42367536 42436633 41218482
3857 41218482 42691906 43675810 43616165 44121759 44407867 44849224 43761031 43507616 44635589
3848 44635589 45596020 47456618 46974722 46031871 46681423 47559645 47797867 48068667 48558984
3839 48558984 49248763 49588453 49606913 49565492 50471608 51765846 52246408 52500358 52390108 53508018
3829 53508018 54064825 52902300 54048717 55808154 56257596 57429367 58642579 58834754 59311152
3820E9311152K573057J200392Q44847J188742J844513J582558K056985J188734
3812G1790980M19596J399139K804120J731773J031894J930193K196078J767693
3804H5071466L064952K346890K901870K377095K540197K424387K641686L141245
3796A06509788M270230L907513L086259M115689L178093L671956M259533N447443
3788A38446504N564339M463385M967839L922464M589958N904781N573897N174739
3780A78607906M504801P557775N355536L830411M267142L893681L844123M042300
3772B15903675L909290K690995K802150K94769J226280J10914j471952m19733
3764B25046388j247008j199694j742996k600641k613701l698685n169467n267017
$$ plain form
3820 59311152 61884209 63084601 63929448 65118190 66962703 68545261 70602246 71790980
3812 71790980 72210576 73609715 76413835 78145608 79177502 81107695 83303773 85071466
3804 85071466 88136418 90483308 93385178 95762273 98302470 100726857 103368543 106509788
3796 106509788 110780018 114687531 117773790 121889479 125067572 128739528 132999061 138446504
3788 138446504 144010843 148474228 153442067 157364531 161954489 167859270 173433167 178607906
3780 178607906 183112707 190670482 196026018 199856429 204123571 208017252 211861375 215903675
3772 215903675 219812965 222503960 225306110 225600879 226827159 226938073 225466121 225046388
3764 225046388 223799380 222599686 220856690 218256049 215642348 211943663 206774196 201507179
3756B01507179n382485n119902n455366m178702m889739n985418n819894n061029
3748A59614644n772552o098111l840324m455512m718718l669922l996632l555337
3740A23507536l573101m556077k984471l740365k772142k593780k038379j242734
3732A00006487k501281j364055j752258p47711j775792m05329k022555j309212
3724H8128294q38921m35147j72181j181833J306136M66463k03021l97998O7540
3715H6739332p54973J6311M84735L48486L09895L80465M30026J99300j42898M72551
3705H8483230J83686o19683k01055k49548Q43622l86316q65765N69736m39929
3696H7317978j689170J097028K4460j29120j76483J10567K1691j638705k7844
$$ plain form
3756 201507179 196124694 191004792 185549426 181370724 176480985 170495567 164675673 159614644
3748 159614644 153842092 147743981 143903657 139448145 134729427 131059505 127062873 123507536
3740 123507536 119934435 115378358 112393887 108653522 105881380 103287600 101249221 100006487
3732 100006487 97505206 96141151 94388893 93641182 91865390 91460061 89437506 88128294
3724 88128294 87289373 86854226 86682045 85500212 86806348 87272811 87069790 86671792 86739332
3715 86739332 85984359 86000670 86485405 86833891 87143786 87524251 87954277 88153577 88010679 88483230
3705 88483230 88666916 88047233 87846178 87596630 88440252 88053936 87188171 87757907 87317978
3696 87317978 85628808 86725836 86750296 86621176 86444693 86555260 86576951 84938246 84910402
3687H4910402L23075m26117K4555M20975O54621P00124N34397p37974J098007
3678H7502065J574110R20858J289393J283172K114229K035262J780438J987972
3670A00487499K704476K424189K754650K967564J857187K901629K312437L303147
3662A21712778L640758L486870L094534M427984M175891L250991M104505L639921
3654A51534232L587786L134279L635292K978331J901775K428336J107627K573820
3646A72881478K233256R6940L64831N27640K182722k34542j11715j322569j076199
3637A75541842m28504m42774j864224k125526j160019o52079j389814p32419k634448
3628A64112035k552856p24639j258040j122590j040132k001683l35564q6211j652994
$$ plain form
3687 84910402 85233477 84807360 84831915 85252890 85907511 86607635 87142032 86404058 87502065
3678 87502065 89076175 89997033 91286426 92569598 94683827 96719089 98499527 100487499
3670 100487499 103191975 105616164 108370814 111338378 113195565 116097194 118409631 121712778
3662 121712778 125353536 128840406 131934940 136362924 140538815 143789806 147894311 151534232
3654 151534232 155122018 158256297 161891589 164869920 166771695 169200031 170307658 172881478
3646 172881478 175114734 175211674 175576505 176104145 178286867 178052325 177940610 176618041 175541842
3637 175541842 175113338 174670564 172806340 170680814 169520795 168868716 167478902 166746483 164112035
3628 164112035 161559179 160834540 159576500 158453910 157413778 155412095 155076531 154990320 153337326
3619A53337326o18640j200748j947555o79636k5721K38488o05898p17013j395789
3610A46384814q02785k017605j64941J32063k242724k38472m97262l084625k090085
3601A35378378j371266r14906k188515l161201l468977l145849k547529l449499
3593A15130636l028998j698654k754049l162159k878568k033020l169053l388801
3585I3017334l639287k559428j438881l472750k795672k075458j368000k216619
3577G3451239k781482k268809k657711j369400m55152k189939j186611j069201
3569E9472934J41575j453605k22622j09229K68231j002676J02659j081832j290270
3560E4825165p3124R85540j009974r8426N69684r35583j008506j501940L71616
$$ plain form
3619 153337326 152718686 151517938 149570383 148890747 148865026 149103514 148497616 147780603 146384814
3610 146384814 145582029 143564424 143399483 143531546 141288822 141050350 140553088 137468463 135378378
3601 135378378 134007112 133092206 130903691 127742490 124273513 121127664 118580135 115130636
3593 115130636 112101638 110402984 107648935 104486776 101608208 99575188 96406135 93017334
3585 93017334 89378047 86818619 85379738 81906988 79111316 77035858 75667858 73451239
3577 73451239 70669757 68400948 65743237 64373837 63918685 61728746 60542135 59472934
3569 59472934 59614509 58160904 57938282 57829053 58097284 57094608 57197267 56115435 54825165
3560 54825165 54752041 55737581 54727607 54629181 55198865 54263282 53254776 51752836 52124452
3551E2124452j79471r6584n31560N34425R6586j626865m89950J83210r93751r40992
3541D8079500r9640n3103j462448j460226n65793k193759j152419Q7745j76207
3532D1003650j147484k531969r62621j76846l30276j693352k540721p90259N9989
3523C0890111K62848q04694j439271j287790J63562l08564j468811j859263l6696
3514B4111432N0750r61195J25547j187210l23910l93733m09124k20158j71902
3505B0620497m19387j328872N18338N55554J59154k983052K57431L07302N42590
3496A8229555l15243m62086O17988q15387p83188k049164L00049J182400k0386
3487A5884538o97464J218320r82555j27383p07289k45681k32761o11293J019126
$$ plain form
3551 52124452 51944981 51848397 51316837 51851262 51947848 50320983 49831033 50014243 49020492 48079500
3541 48079500 47979860 47926757 46464309 45004083 44438290 42244531 41092112 41179857 41003650
3532 41003650 39856166 37324197 36361576 36184730 35854454 34161102 31620381 30830122 30890111
3523 30890111 31152959 30348265 28908994 27621204 27784766 27476202 26007391 24148128 24111432
3514 24111432 24162182 23200987 23326534 22139324 21815414 21421681 21012557 20792399 20620497
3505 20620497 20201110 18872238 19390576 19946130 20105284 17122232 17379663 17686965 18229555
3496 18229555 17914312 17452226 18070214 17254827 16471639 14422475 14722524 15904924 15884538
3487 15884538 15187074 16405394 15422839 15295456 14588167 14342486 14109725 13498432 14517558
3478A4517558J435007m15310K18427j773077j689968q45605J564457L79756j342196
3469A2049049J40121O51355Q99484P37952j8760q29889M75967j35458j939651
3460A2030170p78904K08208q43035j33751J02317P63248o11375P03770n86421
3451A0854227j386268K95755J932402M09165j648443m21408R81884P90763j060705
3442A0747372p09594R07913n14700r42586J026687j209122j63834R6660j441285
3433G797511K19088J937149k38380m17085J164387M1354j081478m49474l31289
3424H641783j98409k73280j084466J472132L49549l93539k9269l36592M991J32500
3414H285400n90186p59011J592452K44830j417657j137123l05575n8193J547747
$$ plain form
3478 14517558 15952565 15537255 15755682 13982605 12292637 11447032 13011489 13391245 12049049
3469 12049049 12189170 12840525 13740009 14477961 14459201 13629312 14105279 13969821 12030170
3460 12030170 11251266 11459474 10616439 10482688 10585005 11348253 10736878 11440648 10854227
3451 10854227 9467959 9763714 11696116 12105281 10456838 10035430 11017314 11808077 10747372
3442 10747372 10037778 10945691 10430991 9488405 10515092 9305970 9142136 9238796 7797511
3433 7797511 8016599 9953748 9715368 9298283 10462670 10504024 9422546 8973072 8641783
3424 8641783 8443374 8170094 7085628 8557760 8907309 8513770 8484501 8147909 8152900 8285400
3414 8285400 7695214 6936203 8528655 8773485 7355828 6218705 5913130 5854937 7402684
3405G402684M86489j66352N517L84345k57457P07449M2944n30424M76817r66290
3395G585722j159475m98993N71807j78812N58738j15292l25241K24090k22582
3386F439962N18130J75352J317010M54461L76557q98436N90353J007793k326251
3377G654931O83312q0002q63397O7749j26930m35028P39176L05846j180639O17802
3367G382820Q1978J98426L64193J95579J045626j044093j285m51268j001762M95332
3357G265546P39816L30073K61145k11018m062K00582p62479l973K33905K58684
3347H308219L73186r52851J227776j068034m78590J96128Q56931K85257l85383
3338H362639R60675N61933r05498L46024l59826J355953P7917o37750m2367m98224
$$ plain form
3405 7402684 7889173 7722821 7728338 8112683 7855226 8562675 8605619 8075195 8552012 7585722
3395 7585722 6426247 5927254 6499061 6320249 6878987 6763695 6438454 6662544 6439962
3386 6439962 6958092 7133444 8450454 8904915 9281472 8383036 8973389 9981182 7654931
3377 7654931 8338243 8258241 7394844 7462593 7335663 6900635 7639811 7945657 6765018 7382820
3367 7382820 7464798 7663224 8027417 8222996 9268622 8224529 8223244 7771976 6770214 7265546
3357 7265546 8005362 8335435 8596580 8385562 8381500 8582082 7819603 7815630 8049535 8308219
3347 8308219 8681405 7728554 8956330 7888296 7409706 7605834 8462765 8748022 8362639
3338 8362639 9323314 9885247 8979749 9325773 8965947 10321900 10399817 9762067 9719700 9221476
3328I221476J010191J45933j52941M51893O39684K04844j85809j603546J269113
3319A1000838J434945K18353M1925l82329J161872P76218P65042J645540J227221
3310A7889625J297787k39311J551805J016014K107063K144044J114857J582940
3302B8464824m34038o36624k053705k607875j140782q42175M944o92521j347004
3293A8715044o58530P89516q03509q95704J405676j299687m00230J082166L12262
3284A8247004J170J896385J443419L48785K12357J399002L407173J558046J955592
3275C0468933J442794J240304k05198j171761k866142k018516q70243m10456k0286
3266B5589429l64619m34235R03618J74281o79753n47535o63226J6697Q55338K86302
$$ plain form
3328 9221476 10231667 10377600 10224659 10676552 11316236 11521080 11335271 9731725 11000838
3319 11000838 12435783 12654136 12696061 12313732 13475604 14251822 15016864 16662404 17889625
3310 17889625 19187412 18948101 20499906 21515920 23622983 25767027 26881884 28464824
3302 28464824 28030786 27394162 25340457 22732582 21591800 20749625 20754569 20062048 18715044
3293 18715044 18056514 18846030 18042521 17146817 18552493 17252806 16852576 17934742 18247004
3284 18247004 18248174 20144559 21587978 21936763 22149120 23548122 26955295 28513341 30468933
3275 30468933 31911727 33152031 32946833 31775072 28908930 26890414 26020171 25609715 25589429
3266 25589429 25224810 24790575 25694193 25868474 25188721 24641186 23977960 23994657 24849995 25136297
3256B5136297K47771J246733J081379n0910j9341M28719J979297K590023J283778
3247C3923746K770673L144662R73740L010662K772927K016767K581555L570086
3239E4764818L567638K749395J34608k62863l356333l035075k580114n553629
3231D6428445m423927l943545l745669k469376l113668k331994j530427j298936
3223B3570903r60209j054385o5169j746389m64762o10512j277009n35840J23229
3214A6979857n61727p65714p08859J55457n42585O34503k09686j328837k8738
3205A3623671K20916j342727j81819N9599o62600O24343j071273k90153J068893
3196A2048850j291977p91025Q45299L3313q33502N046J36965M87270j621070j44249
$$ plain form
3256 25136297 25384068 26630801 27712180 27661270 27641929 28070648 30049945 32639968 33923746
3247 33923746 36694419 39839081 40812821 43823483 46596410 48613177 51194732 54764818
3239 54764818 58332456 61081851 61216459 60953596 57597263 54562188 51982074 46428445
3231 46428445 42004518 38060973 34315304 31845928 28732260 26400266 24869839 23570903
3223 23570903 22610694 21556309 21491140 19744751 19279989 18669477 17392468 16856628 16979857
3214 16979857 16418130 15652416 14943557 15099014 14556429 15190932 14981246 13652409 13623671
3205 13623671 13844587 12501860 12320041 12379640 11717040 12341383 11270110 10979957 12048850
3196 12048850 10756873 9965848 10811147 10844460 10010958 10016004 10152969 10640239 9019169 8874920
3186H874920k20904j646730j204510Q35619R00238n17730J443759j03585j444783
3177F916294n33206p43347M93095M88857Q55793P51488o22754k108282j98947
3168E298991j771N68192N10025n9975j032574K20709P66274j44972P9635J82289
3158F386823j200617j47544J082946j084184m24480n31960m47627L43543J059976
3149E036876r49961N18438j9873r0099r23348P4827n88806j6457K18371J83675
3139C443643J115337J98321p0550j289522L32425N56365p49402n51683N35927
3130C520861q71773m600M49525K51421n81347k63690R20355R34616n78051N68571
3120D345888l59086j059981n07624m2142Q42285J170002j140721L74915L55245
$$ plain form
3186 8874920 8654016 7007286 5802776 6638395 7538633 7020903 8464662 8361077 6916294
3177 6916294 6383088 5639741 6132836 6621693 7477486 8228974 7606220 5497938 5298991
3168 5298991 5297220 5865412 6375437 6315462 5282888 5503597 6269871 6124899 6204534 6386823
3158 6386823 5186206 5038662 6121608 5037424 4612944 4080984 3633357 3976900 5036876
3149 5036876 4086915 4605353 4585480 4495381 3572033 3646860 3058054 3041597 3259968 3443643
3139 3443643 4558980 4757301 4686751 3397229 3729654 4286019 3536617 2984934 3520861
3130 3520861 2649088 2644488 3094013 3345434 2764087 2500397 3420752 4355368 3777317 4345888
3120 4345888 3986802 2926821 2419197 2377055 3219340 4389342 3248621 3623536 3978781
3111C978781M37133m67055n88585n88946j759294J488881J74198L04530o89598
3102B290045K87072R2420Q44705O00755r56312K54331m29221r91885J25219l43119
3092A774010O24356m01314O27469j01143O09867j81928n36376o41914l81577J473922
3082B865372m17612j061623K449571q25481j682075L22860J85422J64489M32359
3073B433282n06984J240236M43653j181484m21195Q913O9020j08737m05680l76688
3063A194336j97591M0225R47196M17499o19851K80143m47053J04329P85069l49091
3053B155211j0781j416827K84935M67885K45400N59453O12251k94333n404l17141
3043B280649Q54991k27340n91189M80855j161897L0745K67538J19642K22806j296810
$$ plain form
3111 3978781 4415914 3948859 3360274 2771328 1012034 2500915 2675113 2979643 2290045
3102 2290045 2577117 2669537 3514242 4114997 3158685 3413016 2983795 1991910 2117129 1774010
3092 1774010 2398366 1997052 2624521 2523378 3133245 2951317 2414941 1773027 1391450 2865372
3082 2865372 2447760 1386137 3835708 3010227 1328152 1651012 1836434 2000923 2433282
3073 2433282 1926298 3166534 3610187 2428703 2007508 2016421 2085441 1976704 1571024 1194336
3063 1194336 996745 1036970 1984166 2401665 1781814 2061957 1614904 1719233 2504302 2155211
3053 2155211 2144430 727603 1012538 1480423 1725823 2285276 2897527 2603194 2597790 2280649
3043 2280649 3135640 2908300 2317111 2797966 1636069 1666814 1934352 2053994 2276800 979990
3033I79990l12243L96032J308621K67345j045383O30301O15764N98831l76961
3024C062297r49788p4826l47884j76728J29122J341125k3483q02650j052483n10933
3014E93769L26502Q79848Q76875k45826n67432l17941k91370N01205N60127J452315
3004C768072o77453j238856J574076J77092p82913r48232l03229K66924K22086
2995B057567n00000j76113O20261P00767n22757p48583J195763o60587N06464
2986B472782r4968Q2809L43199j350616k85732N47689O26125p02808k04829J183211
2976B616862n5714J535537L51386j69383q18912r62254j094282L80680N54784
2967B338704Q59567O05489k10404j769398l0221J771523m78834n56574n37474
$$ plain form
3033 979990 667747 1063779 2372400 2639745 1594362 2224663 2840427 3439258 3062297
3024 3062297 2112509 2037683 1689799 1513071 1642193 2983318 2959835 2157185 1104702 593769
3014 593769 920271 1800119 2676994 2431168 1863736 1545795 1254425 1755630 2315757 3768072
3004 3768072 3090619 1851763 3425839 3602931 2820018 1871786 1568557 1835481 2057567
2995 2057567 1557567 1381454 2001715 2702482 2179725 1431142 2626905 1966318 2472782
2986 2472782 2377814 2460623 2803822 1453206 1167474 1715163 2341288 1638480 1433651 2616862
2976 2616862 2561148 4096685 4448071 4278688 3459776 2497522 1403240 1783920 2338704
2967 2338704 3198271 3803760 3593356 1823958 1793737 3565260 3086426 2529852 1992378
2958A992378R0844N21740N53373R90311Q08352J13371j27981o86537m63089j045072
2948B747690J22630j03353k39479n4844k43360K93429N44621J216447j085834
2939C197947n87860J458264K91178M48L09447P92009j105614L69725j206240m75594
2929C043710J128915n16602q85906J706671J035444o8028J124942j974225Q13000
2920E407921P61322j072801K12112J269579k83293j202104N42637j158346J291259
2911E768286M65003j08838j167221q16881J516201l91015L41243J429846j724968
2902E311656q6303Q21907K63738R9124J558453L61339p27247o50132O0362p02423
2892F310474q07730k05342O54934j0442R09128n56473n4761J49134r46813j46203
$$ plain form
2958 1992378 2083222 2604962 3158335 4148646 4956998 5070369 4942388 4255851 3792762 2747690
2948 2747690 2870320 2766967 2527488 2472644 2229284 2522713 3067334 4283781 3197947
2939 3197947 2610087 4068351 4359529 4359977 4669424 5461433 4355819 4725544 3519304 3043710
2929 3043710 4172625 3656023 2770117 4476788 5512232 5444204 6569146 4594921 5407921
2920 5407921 6169243 5096442 5308554 6578133 6294840 5092736 5635373 4477027 5768286
2911 5768286 6233289 6124451 4957230 4140349 5656550 5265535 5606778 7036624 5311656
2902 5311656 5225353 6047260 6310998 6410122 7968575 8329914 7602667 6952535 7012897 6310474
2892 6310474 5502744 5297402 5952336 5941894 6851022 6294549 6239788 6388922 5442109 5295906
2882E295906n60988N31182k47902N87259P42088j08613J803580j016543j005391
2873F020578j33793P66418o38196Q1295K97585r11359L55365p54453L10110J183423
2863F576973J53764q33845q7712n14914J137865l35450l39912j196318M50938
2854E011389L05878O25485K96257j059582j769307N94939J022896l68477m45342
2845D214136R19427j104671O57681p91619O32453q7988j262567q8185K34244p86430
2835B536481o62419J4978J315737J065344j728270J02632J32320l15326o94854
2826A766623k68870R3518M3500P6160Q18017r61373J84054J288250r82930q10799
2816A246150J180945p76117J46609m9720p68622o21594m4785P86729m00853m41850
$$ plain form
2882 5295906 4734918 5266100 5018198 5605457 6347545 6238932 8042512 7025969 6020578
2873 6020578 5886785 6653203 6015007 6096302 6393887 5482528 5837893 5083440 5393550 6576973
2863 6576973 6730737 5896892 5809180 5294266 6432131 6096681 5756769 4560451 5011389
2854 5011389 5317267 5942752 6239009 5179427 3410120 4005059 5027955 4659478 4214136
2845 4214136 5133563 4028892 4686573 3894954 4527407 4439419 3176852 3088667 3322911 2536481
2835 2536481 1874062 1889040 3204777 4270121 2541851 2644483 2776803 2461477 1766623
2826 1766623 1497753 1591271 1634771 1710931 2528948 1567575 1751629 3039879 2056949 1246150
2816 1246150 2427095 1650978 1797587 1747867 979245 357651 312866 1099595 698742 256892
2806B56892J294924O2978q13201N72588J68564l63013p82013M08957O22410q17585
2796F11501k10488R4183k42264O52435M31387j017291o19523N62425J273899J254467
2786B790731r65634n18580R81413J135615k352697l77016O60354j48175l08954
2777H97057l42176M69713k62878k58894j53041o89598J24867q05422l71900L53723
2767a038549n7222N30981l79763j5740R64918P66364n60025O61066m03149l63955
2757A04926n59165Q02203r72201J309668P10378N0896o83221j193044o43202K50873
2747h21889M26386L93394k59676l18202J074164k50184M47390o81059O25851J59911
2737G96086j61476k95746j644635J582645p42748K04861K81096n87517P07623
$$ plain form
2806 256892 1551816 1614794 801593 1374181 1542745 1179732 397719 806676 1429086 611501
2796 611501 401013 495196 252932 905367 1336754 319463 -300060 262365 1536264 2790731
2786 2790731 1825097 1306517 2287930 3423545 1070848 693832 1354186 1206011 897057
2777 897057 554881 1024594 761716 502822 349781 -339817 -214950 -1020372 -1392272 -1038549
2767 -1038549 -1095771 -564790 -944553 -960293 4625 770989 210964 872030 468881 104926
2757 104926 -454239 347964 -624237 685431 1395809 1446705 763484 -429560 -1072762 -821889
2747 -821889 -395503 -2109 -261785 -579987 494177 243993 691383 10324 636175 796086
2737 796086 634610 338864 -1305771 276874 -465874 -261013 20083 -567434 140189
2728A40189o87369J750633r66284j005020m75997K53952j018690J317473J219422
2719E28309j96968p38282N11717l12024j624853J146745J866317J49252j071108
2710B59105L67038J94192m14731q88071J13508K167670m23304j903746o8105O66286
2700F9842N93603j355276O85465K00617n08691l94620R11589q47337O8085J26670
2690d50053N47288M99229n16251J29737l84974k670p37679j8521K37991K17509
2680d78394P26437l36866o17864m22872O99687J068770J04521m97088J81880P41849
2670A170060r56659o68712j9042O23127n25030M06105q66273J169657r0582n39308
2660b96657J402690n29271l18081r96367J53653l04703n00364j4132j81762J565400
$$ plain form
2728 140189 -547180 1203453 237169 -767851 -1243848 -989896 -2008586 -691113 528309
2719 528309 331341 -406941 104776 -207248 -1832101 -685356 1180961 1330213 259105
2710 259105 626143 820335 405604 -482467 -368959 1798711 1375407 -528339 -596444 69842
2700 69842 663445 -691831 -6366 194251 -314440 -709060 202529 -644808 -576723 -450053
2690 -450053 97235 596464 80213 209950 -175024 -177694 -915373 -933894 -695903 -478394
2680 -478394 248043 -88823 -706687 -1129559 -429872 638898 743419 246331 428211 1170060
2670 1170060 213401 -455311 -474353 148774 -376256 29849 -836424 333233 242651 -296657
2660 -296657 1106033 576762 258681 -737686 -584033 -888736 -1389100 -1403232 -1584994 -19594
2650a9594P71598j72607R50168j403134m43805O20188P60030m07260k70774j203294
2640h18484l78504K98535m07575k1875Q14487j39983k33080l37977n82168J160752
2630f45872p7057m52661M03272M2996k56013J034678L03375k58287K17102n13033
2620b01500j362805P76647K17379N4707M22454j173784k7432O57241L60174O14122
2610C37203j167648o17902K07650J335183O41597q19801p59901o2246L09152r631
2600f06344Q9330l0365K10027R85574J12585j65717L49885K83905j070216r37236
2590g78572p92539l13589O95551L78212J09767J262700J3860J86734L92866p6305
2580A078685K1536n15327j64172l70730q57023P3768K29094Q41665L35014m20916
$$ plain form
2650 -19594 752004 579397 1529565 126431 -317374 302814 1062844 655584 384810 -818484
2640 -818484 -1196988 -898453 -1306028 -1327903 -513416 -653399 -886479 -1224456 -1806624 -645872
2630 -645872 -722929 -1175590 -772318 -729322 -985335 49343 352718 94431 311533 -201500
2620 -201500 -1564305 -787658 -570279 -515572 -93118 -1266902 -1294334 -637093 -276919 337203
2610 337203 -830445 -1448347 -1240697 94486 736083 -83718 -843619 -905865 -596713 -606344
2600 -606344 -517014 -547379 -337352 648222 760807 595090 944975 1228880 158664 -778572
2590 -778572 -1571111 -1884700 -1189149 -810937 -701170 561530 575390 762124 1154990 1078685
2580 1078685 1100221 584894 420722 49992 -807031 -733263 -504169 337496 672510 251594
2570B51594q18464n66872M60428k33959q18815m91189M01088J14805O07426j64899
2560a258857J46874J871060m88077m00807K95131M60390p01031j159792L60153
2551h74956J89412J362437J020990p31733j332985N74283r21173Q0813K66198
2542c66714J142804N7581j144072N18236p02842k40130L08770m11555k65384L15505
2532g87801p0948Q7112r3039M33000Q40826m59815K58493q96644J104330M02360
2522H17874j382688n29845K32587R19371j083333j83874R94485N8597Q21668j058382
2512c93540O97030p37573j96775O51073m74301J93974m77485K03757m30584J076857
2502A12433n27266Q9874J038005o92150j000321K69302M02700n93265k33618J40178
$$ plain form
2570 251594 -566870 -1133742 -673314 -907273 -1726088 -2217277 -1816189 -1701384 -1093958 -1258857
2560 -1258857 -1111983 759077 271000 -129807 165324 625714 -75317 -1235109 -874956
2551 -874956 -685544 676893 1697883 966150 -366835 207448 -713725 -632912 -366714
2542 -366714 776090 833671 -310401 207835 -495007 -735137 -426367 -837922 -1103306 -787801
2532 -787801 -858749 -771637 -864676 -431676 409150 -50665 207828 -688816 415514 817874
2522 817874 -564814 -1094659 -862072 57299 -1026034 -1209908 -215423 -156826 664842 -393540
2512 -393540 303490 -434083 -630858 20215 -454086 -260112 -737597 -533840 -964424 112433
2502 112433 -414833 -324959 713046 20896 -979425 -710123 -307423 -900688 -1134306 -994128
2492i94128p40027K523Q60870M32816q1816L89614K65987J69744j17788m21503
2482b33708P00851K89989m74382r42840O39839R90118j121469q44813L83198l2059
2472f45276M02750j71093o48404N27644L3091j575995k41925J759433K01345N46895
2462A88465j79899J7311L32151p20517l14859J25738K07870R19715Q59161j877930
2452d42794l07111J87056r41015K28032j02859k7779J224993j94976o24813p67442
2442a768708J291278n03120q88503J047920j76256M96905J52415L38629m44807
2433d54247K72055j215596m08163N60161p3748K886J559995K91620n95061j19560
2423a79658n62978M50911P35739n59008p50002M39758O38535j41444r6135p68622
$$ plain form
2492 -994128 -1734155 -1731632 -870762 -437946 -519762 -130148 135839 305583 187795 -233708
2482 -233708 467143 757132 282750 -660090 -20251 969867 -151602 -996415 -613217 -645276
2472 -645276 -242526 -413619 -1062023 -534379 -501288 -2077283 -2319208 -559775 -358430 188465
2462 188465 8566 25877 358028 -362489 -677348 -551610 -343740 575975 1435136 -442794
2452 -442794 -749905 -562849 -1503864 -1275832 -1378691 -1406470 -181477 -376453 -1001266 -1768708
2442 -1768708 -477430 -980550 -1869053 -821133 -997389 -500484 -348069 -9440 -454247
2433 -454247 -182192 -1397788 -1805951 -1245790 -1319538 -1316652 243343 534963 -60098 -179658
2423 -179658 -742636 -291725 444014 -114994 -864996 -425238 213297 71853 -24282 -792904
2413g92904k72481j65986J196226L60390p13036M28106P87249N75208j298431
2404A04341k32679o85725k09947Q99706o46002k48824J002930j53545j404627
2395a574372J272449J425286j83094j259615o3005O73213M23444n64479j31574
2386A8253K16526l97905M82819O24795n65386l83756P10574q46355L33223M35001
2376F27789o45063J60724O94566l43128j5507R5116J418157r91894j039305O49401
2366F10856J470598k92740q26545j61600n48123K35546k67002j41911M46196L21638
2356H46913J63531j482574p42737J526022N72566N74138o14245j964644L60487
2347g60543J006513q94491L02747n39491K60716R14515l20693l2931l17277P92959
$$ plain form
2413 -792904 -1065385 -1231371 -35145 325245 -387791 40315 827564 1402772 104341
2404 104341 -128338 -814063 -1024010 -124304 -770306 -1019130 -16200 -169745 -1574372
2395 -1574372 -301923 1123363 940269 -319346 -382351 290862 714306 149827 18253
2386 18253 234779 -163126 319693 944488 379102 -4654 705920 -140435 192788 627789
2376 627789 -17274 143450 838016 494888 479381 574497 1992654 1000760 -38545 610856
2366 610856 2081454 1788714 962169 800569 252446 487992 220990 79079 525275 846913
2356 846913 1010444 -472130 -1214867 311155 883721 1457859 843614 -1121030 -760543
2347 -760543 245970 -648521 -345774 -885265 -624549 289966 -30727 -63658 -380935 412024
2337D12024p73814r25547n38314J1662M43103J215614l08653l32158l09022M79981
2327f25124K50107p87832J94063J822156O63297j429333M04006N10843j047140
2318d4957r57355J117832J228505J75240j211296L76653j164441J11696J070461
2309G02338l77839r26262J85152K34371J069020M73686q15423l56638K25636m74292
2299f0251J466220K53711j228819l22576j48947q34915l94162N33862L63577O15033
2289B42733N93001q39641n77418m16460l29546J660617K56329n75546k23636P51136
2279E41569P77977m3447o87896j401417J37326J315860n39310N37692L8705J37423
2269H14482l92902p20845r7728R50369L4603r07659Q38494K3465j292393l44658
$$ plain form
2337 412024 -361790 -1287337 -1825651 -1813989 -1370886 -155272 -463925 -796083 -1105105 -625124
2327 -625124 -375017 -1162849 -968786 853370 1516667 87334 491340 1002183 -44957
2318 -44957 -1002312 115520 1344025 1519265 307969 684622 -479819 -368123 702338
2309 702338 324499 -601763 -416611 -182240 886780 1360466 545043 188405 414041 -60251
2299 -60251 1405969 1659680 430861 108285 -40662 -875577 -1269739 -735877 -372300 242733
2289 242733 835734 -3907 -581325 -997785 -1327331 333286 589615 14069 -209567 541569
2279 541569 1319546 1276099 588203 -813214 -675888 639972 100662 638354 677059 814482
2269 814482 421580 -299265 -396993 553376 587979 -319680 518814 542279 -750114 -1094772
2259a094772M05451R43548L66854N99164L218m12122L58540j394758N55412M56299
2249G86834L83280O19956p88158J721l2835M35768q17121J88531N80533p67599
2239E90910L06717N64649o64787l38750j22527n03401l37148M90945o04133J162539
2229E45014K66632J03770M640k48206Q95088N87343j193794J21622n69045N91203
2219A104267J305988j718123M08183J141190M99829j803292o08041J494653k73526
2210A551128k04824M98729R92088n37205l85448L58573n3389O7439J20245l72586
2200B034750l15880K38517j08375q0934J379732J77619o30865j1225O49931j070771
2190B262499r76980J065251J18221r1099L00916K027467k79186N81180j365808
$$ plain form
2259 -1094772 -689321 254227 621081 1220245 1223463 811341 1169881 -224877 330535 786834
2249 786834 1170114 1790070 1001912 1003633 970798 1406566 589445 777976 1358509 590910
2239 590910 897627 1462276 797489 458739 336212 -167189 -504337 -13392 -617525 545014
2229 545014 811646 915416 920056 671850 1566938 2154281 960487 1082109 513064 1104267
2219 1104267 2410255 692132 1100315 2241505 2741334 938042 330001 1824654 1551128
2210 1551128 1346304 1845033 2837121 2299916 1914468 2273041 2219652 2287091 2407336 2034750
2200 2034750 1718870 1957387 1849012 1768078 3147810 3325429 2694564 2683339 3333270 2262499
2190 2262499 1285519 2350770 2468991 2377892 2678808 4706275 4427089 5008269 3642461
2181C642461J054775o2008J28876o17378P48261J09196q1979O39951L48354r18345
2171D992164M7583P6786l51500J780143M24829r05190n09223Q66231J725806K12022
2161H359651M43314l98948J012337M9509j096124M63556J738347N86092n58679
2152A0599055P3761Q4572J008866o94499M26266O8390K254933R68179M17931J38941
2142A5346395J706742j03217l53227L41437P76482K92732R97950K760320L95235
2133B2160849M20911R86592O39715K276130J585084K026746J717821K386881J334170
2124C5534899J61404J863805K611930L020506M45573J563589M558787K821204
2116E2581697M672828L975115M023069M737222L109074M451754P364019P468361
$$ plain form
2181 3642461 4697236 4635228 4764104 4146726 4894987 5004183 4922204 5562155 5910509 4992164
2171 4992164 5039747 5116533 4765033 6545176 6970005 6064815 5555592 6421823 8147629 8359651
2161 8359651 8802965 8404017 9416354 9465863 8369739 8833295 10571642 11157734 10599055
2152 10599055 10672816 10757388 11766254 11071755 11498021 11566411 13821344 14789523 15207454 15346395
2142 15346395 17053137 16949920 16596693 16938130 17714612 18007344 19005294 21765614 22160849
2133 22160849 22581760 23568352 24208067 26484197 28069281 30096027 31813848 34200729 35534899
2124 35534899 35696303 37560108 40172038 43192544 43638117 45201706 49760493 52581697
2116 52581697 57254525 61229640 65252709 69989931 73099005 77550759 84914778 92383139
2108I2383139R444978J3250449J7392905K2290577K8696091L4879561L5038895
2101B53376595L6007071L8210828M6639809K1421374l2016250n5671858n7453533
2094B50514036n1281220l6499227k7242048k0118441j4336769j1422618p917941
2087H1695772p260426o771786l029798l489039m895863l175976n445478l906405
2079D3721001k838657l474888l472618r27213l132992j043457j454160j412422
2071B5964594p39385j229757j546577p65207j310960j133119l60291n22304M45823
2062A8802817j600022j700357n51192M65433j268372j617763J87118l61473j979192
2053A0376997J606498m51595q3198n61578m89416J89630l72734j212201p94211
$$ plain form
2108 92383139 101828117 115078566 132471471 154762048 183458139 218337700 253376595
2101 253376595 289383666 327594494 374234303 395655677 363639427 307967569 250514036
2094 250514036 199232816 162733589 135491541 115373100 101036331 89613713 81695772
2087 81695772 74435346 67663560 64633762 61144723 56248860 53072884 47627406 43721001
2079 43721001 40882344 37407456 33934838 33007625 29874633 28831176 27377016 25964594
2071 25964594 25225209 23995452 22448875 21683668 20372708 19239589 18879298 18356994 18802817
2062 18802817 17202795 15502438 14951246 15416679 14148307 12530544 12717662 12356189 10376997
2053 10376997 11983495 11531900 11448702 10887124 10397708 10587338 10214604 9002403 8208192
2044H208192J26792L41016J53821M84307j044178O0151l49981j275901l71623
2035F332596Q64248R89550n58073m94418j511481q73761O35563p21425J32985
2026D795784l6477Q01860q22887j627390J477264q874n4067P13981o75798m91068
2016D072328j138877K62754K7906o86278J094417j51829r84219k22541R2380J340282
2006C706323M7095l61385n71746P797N56645o96049N1552P8068l40071l81057
1996B097172L65111n02455J171622Q0814r88211n48873Q16676P04567j023776
1987B172647n95347N52923p31961m42397O12811k13868r9426P77757m57555m73820
1977A101764K49273q85733J238636Q90385j129505K36501j0909k96593n72174
$$ plain form
2044 8208192 8334984 8676000 8829821 9314128 8269950 8330101 7980120 6704219 6332596
2035 6332596 7196844 8186394 7628321 7133903 5622422 4748661 5384224 4662799 4795784
2026 4795784 4759307 5561167 4738280 3110890 4588154 4579280 4525213 5239194 4563396 4072328
2016 4072328 2933451 3196205 3224111 2537833 3632250 3480421 2496202 2273661 2366041 3706323
2006 3706323 3753418 3392033 2820287 2828084 3384729 2688680 2740232 2818300 2478229 2097172
1996 2097172 2462283 1959828 3131450 3212264 2224053 1675180 2491856 3196423 2172647
1987 2172647 1577300 2130223 1398262 955865 1568676 1354808 1255382 2033139 1575584 1101764
1977 1101764 1351037 465304 1703940 2594325 1464820 1701321 1690412 1393819 821645
1968H21645M27531j2841m29772o74879J326887P88780n29139r4021l66650r33783
1958C23758q20933p46810P02471J353330o90512O0637p28167P44162m5405K27630
1948C80161R05983L36354m00219l59153J166023J83092K56397j436001k69097
1939G63540k1120O05561n13816J313067j49672j130043j067513R0342Q63842J08057
1929H62245L79432M54529K16025j427681k17304R58520o56807p43226J823908
1920A649641o75279j064672l91548K94744J2928p62502O5068K49098O6468M76688
1910g9366K08545p48752n53078J020251p955J46954L09731J064484J97367m12284
1900A145897j155315J73799K40307P0222l92569o5128r4414J0146Q61311q39129
$$ plain form
1968 821645 1249176 1236335 806563 131684 1458571 2247351 1718212 1624191 1257541 323758
1958 323758 -497175 -1243985 -541514 811816 121304 181941 -546226 197936 152531 380161
1948 380161 1286144 1622498 1222279 863126 2029149 2212241 2468638 1032637 763540
1939 763540 742420 1347981 834165 2147232 1997560 867517 -199996 -109654 754188 862245
1929 862245 1241677 1696206 1912231 484550 267246 1225766 568959 -174267 1649641
1920 1649641 974362 -90310 -481858 -187114 -174186 -936688 -871620 -622522 -556054 -79366
1910 -79366 129179 -619573 -1172651 -152400 -160355 -13401 296330 1360814 1558181 1145897
1900 1145897 -9418 164381 404688 474910 82341 17213 -77201 -67055 794256 -44873
1890d4873M17195K38121M58415P7745j552289l02409Q7441p94308k52661J929403
1880B61780N39479q18988k91183P13012O2756p9193r94406j005367J087300J234952
1870G10142n70605q09006l31942J02215O11574J54345L57947r40040n05498R80916
1860b39952J17985q75376p19187Q44077K68013l53523j79976P34315N64548K75175
1850D36099J09850j075090O89186j93009j534819P03596J2591J002423L87734
1841E38561J52406J636341Q1631j219648m34161n53556N50073Q6236p72691K59329
1831C24521J021700K24272j12427q40716j409743J049006M72873p5644O50901
1822A304743K0198q97283P36402j178104m8791m6982q3881J662898o21831j661332
$$ plain form
1890 -44873 372322 610443 1068858 1146603 -405686 -708095 -620654 -1414962 -1667623 261780
1880 261780 801259 -17729 -308912 404100 466856 387663 -606743 -1612110 -524810 710142
1870 710142 139537 -669469 -1001411 -899196 -287622 -133277 224670 -715370 -1220868 -239952
1860 -239952 -121967 -997343 -1716530 -872453 -604440 -957963 -1137939 -403624 160924 436099
1850 436099 545949 -529141 160045 -32964 -1567783 -864187 -851596 150827 538561
1841 538561 690967 2327308 2408939 1189291 755130 201574 751647 837883 65192 324521
1831 324521 1346221 1570493 1458066 617350 -792393 256613 729486 653842 1304743
1822 1304743 1324941 427658 1164060 -14044 -62835 -109817 -193698 1469200 847369 -813963
1812h13963J720119L39575p07137q64141m28166m13741N46084P316K59777J216485
1802H62208j38100j863653P74480l59360J227757L3710q23787J125973p89384
1793D9844l89034O78290q95661j351470J315065L19367M62037l84051l87563J530757
1783I47581r41378j029214j47294O03045l91231J181863Q6677K5126p4393j029750
1773g68968J668226j42411p16033P1730M3433n21883l7185L56198k04644O74844
1763D23307m95289r18709J05333K57448l25780M81632j14469r68854P69479J101364
1753C15462O78919j187093L28932Q2726j18848m33917J570853m95098J15336j025871
1743a68599K03049J90517r71201n76725M94132k04245Q45891q1936m38407Q06081
$$ plain form
1812 -813963 906156 1245731 538594 -325547 -753713 -1167454 -621370 -614054 -354277 862208
1802 862208 724108 -1139545 -365065 -724425 503332 537042 -286745 839228 49844
1793 49844 -339190 339100 -556561 -1908031 -592966 -273599 188438 -195613 -583176 947581
1783 947581 6203 -1023011 -1170305 -567260 -958491 223372 310049 335175 260782 -768968
1773 -768968 899258 756847 40814 112544 155977 -365906 -403091 -46893 -251537 423307
1763 423307 -71982 -990691 -885358 -627910 -953690 -472058 -586527 -1555381 -785902 315462
1753 315462 994381 -192712 136220 218946 100098 -333819 1237034 741936 857272 -168599
1743 -168599 34450 224967 -746234 -1322959 -828827 -1033072 -187181 -269117 -707524 98557
1733I8557m11129j11096P15826R78187J51852l0975j590730r80265J429573N60052
1723H09852K15904j703232o9571K37675K75187k04679k010k48763o65037O74668
1713f80006L02026O9589J111443j98909p77219M87370k98304m92810l42710n83968
1703a403498L98338O27045L806j82540n00613M71434J065796P15547j297343Q46316
1693G44288j03863J583l31684j462412o16277J571770K66610p37883J07864J63797
1683c96207l4236j115530L22967J937567j138818M56008J151987o2257j819774
1674f98293j08257J239933q50539o16220q4629m07555n61178P12221L56170P28299
1664b90048J535213o03534k29643O1936j101520j03186n25987K02649o59588k32967
$$ plain form
1733 98557 -312572 -423668 292158 1270345 1422197 1391222 -199508 -1179773 249800 809852
1723 809852 1025756 -677476 -747047 -509372 -234185 -438864 -440874 -689637 -1354674 -680006
1713 -680006 -377980 -308391 803052 604143 -173076 314294 15990 -476820 -819530 -1403498
1703 -1403498 -1005160 -378115 -374309 -556849 -1057462 -586028 479768 1195315 -102028 744288
1693 744288 640425 642008 310324 -1152088 -1768365 -196595 70015 -667868 -560004 -396207
1683 -396207 -430443 -1545973 -1223006 714561 -424257 31751 1183738 1121481 -698293
1674 -698293 -806550 433383 -417156 -1033376 -1118005 -1525560 -2086738 -1374517 -1018347 -290048
1664 -290048 1245165 641631 411988 473924 -627596 -730782 -1256769 -1054120 -1713708 -1946675
1654a946675K250683O78757j475026j05251R59754j0483j580792m5104N60120
1645g14017J92380j54492O87021M93021K73068l95090L64853M17458o89206m99428
1635b4432j962205P84938j71315J293754L21847n98551n006J411028j078341k167080
1625b195363R62292O80456Q32306K91224K70611q15065n46667j89165L87973O65276
1615C43878O76514r82179j902817J603720J374906j037090l31179N21075j306262
1606a039434K63784Q79019l82378j20381N55064m05195N59108k78531l92058r49599
1596a310601K10520O38313l85685K59761J83140n19983R14444M27118p52736p17768
1586a053477o87803j4385R59210R48187l35296K18693m23309k28089n0252L81952
$$ plain form
1654 -1946675 304008 982765 -492261 -597512 362242 351759 -1229033 -1274137 -714017
1645 -714017 -521637 -676129 10892 503913 776981 381891 746744 1164202 474996 -24432
1635 -24432 -1986637 -1201699 -1373014 -79260 242587 -355964 -360970 1050058 -28283 -2195363
1625 -2195363 -1233071 -552615 279691 570915 841526 26461 -520206 -709371 -321398 343878
1615 343878 1020392 38213 -1864604 -260884 1114022 76932 -254247 266828 -1039434
1606 -1039434 -775650 103369 -279009 -399390 155674 -249521 309587 31056 -361002 -1310601
1596 -1310601 -1100081 -461768 -847453 -587692 -404552 -924535 -10091 417027 -335709 -1053477
1586 -1053477 -1741280 -1755665 -796455 151732 -183564 35129 -388180 -616269 -666521 -284569
1576b84569L43321N78903N28732J342573j33012m89233k346198k42550N56407
1567a45626M76917k70320q4031j96363j440125P07097J151860J33165J34680p58417
1557b91163o90339J87209J279754L62005l46856j264835n91434N06069J126965
1548B77375K43812k01873l24330L08891l31182m91447K59106J11462P03256q5779
1538D69291n65417L36836J77404n0363j009076N50006L72383j376774N86339M51720
1528e7651J091065n23482M02p83979p46966l00153K27599N34596L4231R8675j525671
1517a951334J56008L1874J404180N49521p15171o13356j52097L23707j083415
1508b050083J83612M10859O03144P02146j59345j435321M15844J53767J55656
$$ plain form
1576 -284569 58752 637655 1166387 2508960 2375948 1886715 -459483 -702033 -145626
1567 -145626 331291 60971 -23060 -219423 -1659548 -952451 199409 332574 467254 -291163
1557 -291163 -981502 -794293 485461 847466 500610 -764225 -1355659 -849590 277375
1548 277375 521187 319314 -5016 303875 -27307 -518754 -259648 -148186 555070 469291
1538 469291 -96126 240710 418114 367751 -641325 -91319 281064 -1095710 -509371 -57651
1528 -57651 1033414 509932 510334 -273645 -1020611 -1320764 -1093165 -558569 -524338 -425663 -1951334
1517 -1951334 -1795326 -1763452 -359272 190249 -524922 -1138278 -1290375 -966668 -2050083
1508 -2050083 -1866471 -1455612 -852468 -150322 -309667 -1744988 -1329144 -1175377 -1019721
1499a019721O19461O93590O02623p40078j531389M19674J328068m7660m54567
1490a29999l95119m9289M4786L05958l65132k15073m70988O19480P68736J573471
1480A686831o88281j503938R10203n74002j360623J253927l93026L4838j64635
1471g98706M4746L97660M37927J174273j988396n90406l43146m14182J078602
1462a001628M76175P71067j240626p28399P96618M183n20235k44582Q23764j448370
1452b312033J400013K02704l49460O37475Q80954o3610J10045k50618j7354m60602
1442b22486n61452L06047r21211P37866J87772j94797K09305j84238p69865L01125
1432a111934R97458P38717M12354M12127j025494r17803L29861K66808m49287
$$ plain form
1499 -1019721 -400260 293330 895953 155875 -1375514 -955840 372228 324568 -129999
1490 -129999 -525118 -574407 -529621 -223663 -588795 -803868 -1274856 -655376 113360 1686831
1480 1686831 998550 -505388 404815 -169187 -1529810 -275883 -668909 -634071 -798706
1471 -798706 -753960 -356300 81627 1255900 -732496 -1322902 -1666048 -2080230 -1001628
1462 -1001628 -525453 245614 -995012 -1723411 -926793 -922610 -1442845 -1687427 -863663 -2312033
1452 -2312033 -912020 -709316 -1058776 -421301 459653 396043 506088 255470 238116 -222486
1442 -222486 -783938 -477891 -1399102 -661236 -473464 -668261 -458956 -643194 -1413059 -1111934
1432 -1111934 -114476 624241 1036595 1448722 423228 -494575 -164714 102094 -347193
1423c47193o59217n88950j57993P07746j78911N39986j021823o6541Q95596m54368
1413a331668n99184J934241o8021j56144O53205p5372L88823J67757M86717j381753
1403A8601j261570l5028J073985k26468o64727J279763M02641K93432M16492q29906
1393D67215N38671R7263K87441q02072o43872O06578l35136K08740k33547M44968
1383F36249j054238L31955L58987q04990N20789M25922M22150q01034q04791k59112
1373a028113L92708m07837K83120Q20187k76415o62676L58426k65744P07357J635777
1363A556790K80945O5769o15039N01777j156833j394810L72698J472828p38850
1354C45275J23312M89879J14532q31822m75958J84319p21341o24634p7523M09759
$$ plain form
1423 -347193 -1006410 -1595360 -1753353 -1045607 -1224518 -684532 -1706355 -1772896 -877300 -1331668
1413 -1331668 -1930852 3389 -64632 -220776 432429 357057 745880 913637 1400354 18601
1403 18601 -1242969 -1277997 -204012 -430480 -1095207 184556 587197 880629 1297121 467215
1393 467215 1005886 1103149 1390590 588518 -55354 551224 216088 424828 191281 636249
1383 636249 -417989 -86034 272953 -532037 -11248 414674 836824 35790 -769001 -1028113
1373 -1028113 -635405 -1043242 -760122 60065 -216350 -879026 -520600 -786344 -78987 1556790
1363 1556790 1837735 1903504 1288465 1790242 633409 -761401 -388703 1084125 345275
1354 345275 468587 958466 1072998 241176 -234782 -50463 -771804 -1396438 -1473961 -1064202
1344a064202j92502k09412J41271N7145N30230J56684j0055l62389L84721M18710
1334a49799N25424K5320j77187J569k138202R54372J37686Q9201J26007P21675
1324A16066N36812j127098j65156J452334L84357n75650j95564J40754j696024
1315a129169J805900n49962j102250j345863O95111M61095L72444k57914N35262
1306e15346j92755j07199R0473J945752r3258k259574Q92424j36570K75518k67003
1296c67538J364761O51421j059516Q63368m91324r65024j115831J60967J188351
1287B29635M7203k59746l19712M09649l39012J83713j99551L88790j004040k77034
1277a140105R84563l10083m30799j96927J91036N75565r5984J113408K94265j155163
$$ plain form
1344 -1064202 -1256704 -1466116 -1324845 -1267700 -737470 -580786 -590841 -953230 -568509 -149799
1334 -149799 375625 400945 223758 225327 -1912875 -958503 -820817 -731616 -605609 116066
1324 116066 652878 -474220 -639376 812958 1197315 621665 426101 566855 -1129169
1315 -1129169 676731 126769 -975481 -2321344 -1626233 -1165138 -792694 -1050608 -515346
1306 -515346 -708101 -815300 -724827 1220925 1127667 -1131907 -239483 -376053 -100535 -367538
1296 -367538 997223 1648644 589128 1452496 961172 -3852 -1119683 -958716 229635
1287 229635 276838 17092 -302620 107029 -231983 -48270 -247821 140969 -863071 -1140105
1277 -1140105 -155542 -465625 -896424 -1093351 -902315 -326750 -422734 690674 984939 -170224
1267a70224M0012N80260L47147K52199r6141p66712q79877M85722k40713k57396
1257g05723N00793n04799p0449J678409m68728p20810l06064l86624m428J021884
1247C3461k29128J543065j154875m85028j10393M41583K26124O31735q29300p33514
1237f66270J198615j40749m55665o49475O09824J87798M82674m10470o06679Q44510
1227C94113k11079n40132m54643P73965j399583o93184J206499Q25510j30153
1218b28687j9715l49535N18937j163866m93385Q46744n39339J397271L09971l43135
1208f4739K86595m56511P44585r75693j007951j68448k64225L41619J398282J85398
1198A8912n93761M42728p08514R79888l26089Q29723m85614l44365O11075n83422
$$ plain form
1267 -170224 -130212 450048 797195 1049394 953253 186541 -693336 -207614 -448327 -705723
1257 -705723 -204930 -709729 -780178 898231 429503 -291307 -597371 -983995 -988423 33461
1247 33461 -195667 1347398 192523 -292505 -402898 38685 264809 896544 67244 -666270
1237 -666270 532345 391596 -64069 -713544 -103720 84078 566752 156282 -450397 394113
1227 394113 183034 -357098 -811741 -37776 -1437359 -2130543 -924044 -98534 -228687
1218 -228687 -248402 -597937 -79000 -1242866 -1736251 -889507 -1428846 -31575 278396 -64739
1208 -64739 221856 -234655 509930 -465763 -1473714 -1642162 -1906387 -1564768 -166486 18912
1198 18912 -574849 -132121 -840635 139253 -186836 642887 157273 -187092 423983 -159439
1188a59439o86224J31250M79368M50763K29378j0065j968K21297j461888Q24975
1178A7447J05455n02733J900361k05859j511720n56353J83514j384552Q04015
1169a150425K61131j084748P79968N07599K52180m62555P33676q40447n42257
1160a545878J45464O03899K97555J83102M28649r70435P29480J035380j108553
1151b01337P46472n51920L93656O20476k61644q54733p17650J299517n5659m10106
1141G072J025969o43121p36003L17704K62557n21623K87525M00660O36291m82195
1131E54836J54191n78692q57064k14276Q15087J170900m28829K56389m78183j149263
1121g54904J311128P4445J28899j58449q48462J663324J64162j912100j035291
$$ plain form
1188 -159439 -845663 -714413 -235045 215718 445096 435031 433063 654360 -807528 17447
1178 17447 122902 -379831 1520530 1314671 -197049 -753402 -569888 -1954440 -1150425
1169 -1150425 -889294 -1974042 -1194074 -686475 -434295 -896850 -163174 -1003621 -1545878
1160 -1545878 -1400414 -796515 -498960 -315858 112791 -857644 -128164 907216 -201337
1151 -201337 545135 -6785 386871 1007347 745703 -109030 -826680 472837 417178 7072
1141 7072 1033041 389920 -346083 -28379 234178 -287445 80 400740 1037031 554836
1131 554836 709027 130335 -726729 -941005 -125918 1044982 616153 872542 394359 -754904
1121 -754904 556224 630669 759568 601119 -247343 1415981 1580143 -331957 -1367248
1112a367248L08865O00578J092704K97711N91655q76588l85314K58291o57692
1103a37038m70915J029002n45030L71098j251091j24475Q14450j46413K52714
1094b07698L11968n19575j50412J71747k98396p22501M0896j30981Q82311O89385
1084F6744P23792j78221j272397M71124l78894P9585j4295r22691N43552Q77460
1074d241M4354K95551j034018m63436m92997P05113O41585p5560o29843J384536
1064C71044L28776q04671n9968k62429l2968j179671J293750O11631n16949r93810
1054a245265K67043J026538P24236j76666j283556J69729M69335J5795K13731
1045A80920k81656j50137M52210L08581P8429m30126l72599Q20211M38721q05520
$$ plain form
1112 -1367248 -1058383 -457805 634899 932610 1524265 647677 262363 520654 -137038
1103 -137038 -607953 421049 -123981 247117 -1003974 -1128449 -313999 -460412 -207698
1094 -207698 104270 -415305 -565717 -393970 -692366 -1414867 -1373971 -1504952 -622641 66744
1084 66744 790536 612315 -660082 -188958 -567852 -488267 -502562 -1425253 -881701 -4241
1074 -4241 40113 335664 -698354 -1161790 -1654787 -949674 -308089 -383649 -1013492 371044
1064 371044 699820 -104851 -164819 -427248 -460216 -1639887 -346137 265494 -251455 -1245265
1054 -1245265 -978222 48316 772552 595886 -687670 -517941 -48606 -32811 180920
1045 180920 -100736 -250873 201337 509918 588347 158221 -214378 605833 1044554 239034
1035B39034j690196K02004J513937K38543o60707j31430n95262Q26534O61896
1026F04353m13417j30626l26021N54289r51430n10130J50926J53500J12576O21735
1016a34245J97189q95753l03468Q80688J168582L06254k24648n06887r59305l46527
1006h18120J384033J64245P8129P16730l44420r57720j097858l49082o72062J066015
996h30110M03228R23916O92495q50965j23175R6431J30439N21576l7326n36493
986C90016o77935j43986M50187m45782L10966l19818J002432N89389O18157n36106
976A237520q63072J08135o5359J012951n94822o00200l92027l04953k93150n77814
966a332791P72084Q88078L17663k57117j03071j13510n92401L54850N83868P54856
$$ plain form
1035 239034 -1451162 -1249158 264779 503322 -157385 -288815 -884077 -57543 604353
1026 604353 190936 60310 -265711 288578 -662852 -1172982 -1022056 -868556 -755980 -134245
1016 -134245 62944 -832809 -1136277 -255589 912993 1219247 994599 487712 -471593 -818120
1006 -818120 565913 730158 808287 1525017 1180597 222877 -874981 -1224063 -1896125 -830110
996 -830110 -426882 497034 1189529 338564 215389 311820 442259 963835 926509 390016
986 390016 -287919 -431905 18282 -427500 -116534 -436352 566080 1155469 1773626 1237520
976 1237520 374448 482583 417224 1430175 835353 235153 -156874 -461827 -754977 -1332791
966 -1332791 -560707 327371 645034 387917 284846 171336 -421065 -66215 517653 1272509
956A272509r57512P69284n77291O45487Q30588m83658o24418J08127n169j990600
946a012653l37983J355489O68531j144626P7315K26644N78988l74883L19373l17685
936C8510J73381J32706J98234j67350L9102N72268n43917K70700o9417K83624
926I27841l53936m97979P16182j142782J08339N82137K3004J62092o02804p30167
916h08073L74810M95375j40615r07086Q09950M04132P7173M44393L09018r73752
906H5325m98613J151514j036222p91787J359469N44119j435289L11014K033078
897A722608N95075j113932p23507n03924n20839l2368J300333j09482J8532j59732
887D72764m41704O74644N12453M03450j184203o46764l93401j056616Q48033l0043
$$ plain form
956 1272509 314997 1084281 506990 1152477 1983065 1499407 874989 983116 977947 -1012653
946 -1012653 -1350636 4853 673384 -471242 -393927 -167283 411705 36822 356195 38510
936 38510 211891 344597 542831 375481 414583 986851 442934 713634 644217 927841
926 927841 573905 75926 792108 -350674 -242335 339802 362806 524898 -77906 -808073
916 -808073 -433263 62112 -78503 -985589 -175639 228493 305666 750059 1059077 85325
906 85325 -413288 738226 -297996 -1089783 269686 813805 -621484 -310470 1722608
897 1722608 2317683 1203751 480244 -23680 -544519 -576887 723446 613964 632496 472764
887 472764 31060 705704 1218157 1621607 437404 -209360 -602761 -1659377 -811344 -841387
877h41387N00243n90620l19729j197150J247966J678780l65324j59995k37992
868b85208K21662p71270o52282J507900J334235j451052K70494j9163m33482j299820
858a577986P21682Q87873K37971N17977J2261R28443j539512k64000q97535J484674
848E11848K40003j53059M53660q95470K23325N99933l20451r8381o04021L91245
838C48632P1377l51111L22701J013124o62895j67873j43650k61190N05379k00138
828D74356n93155p34816j89112R20492R6257k11030R81348j180582J248473l97065
818D15166N08989K87785q2471r62302p9307O8548J046338o15124k37799P62160
808A111983l98342M32838m99483L77578p46422L81362r00328o27950Q61525L64670
$$ plain form
877 -841387 -341144 -931764 -1251493 -2448643 -1200677 478103 112779 -47216 -285208
868 -285208 -63546 -834816 -1487098 20802 1355037 -96015 174479 155316 -278166 -1577986
858 -1577986 -856304 31569 269540 787517 799778 1728221 188709 -75291 -972826 511848
848 511848 751851 598792 1052452 156982 380307 980240 659789 561408 -42613 348632
838 348632 420009 68898 391599 1404723 741828 573955 430305 169115 674494 474356
828 474356 -118799 -853615 -1042727 -122235 -25978 -237008 744340 -436242 812231 415166
818 415166 924155 1211940 1129469 167167 87860 156408 1202746 587622 349823 1111983
808 1111983 713641 1146479 646996 1024574 278152 659514 -240814 -868764 -7239 357431
798C57431N00528l41998p97688R7113M79120r655P1261j302630m27828N12834
788h61512J413750j074244o87314P76022N26053m57823J47243K06380k36324l27274
778e75043J018420k89976J11606o73761J59242R7224J58653n22662Q6140J35471
768b94686L22186k89854K82719J864594j370398k86903K97401j337249R27959
759A15769O56244j206717J99247O38833j81017p92397Q24182r1344m99431J59618
749a77013L77422q58639N75939o52799J413007p49057M5085j21198j260721n3792
739a461766P61471J762979n15128p60530m22161O74652N53200j636096M99008
730e44371P57681P12954m48764p1383n65114M37398P75255m10094j08816j523158
$$ plain form
798 357431 857959 515961 -281727 -184614 294506 284851 356112 -946518 -1374346 -861512
788 -861512 552238 -522006 -1209320 -433298 92755 -365068 -217825 -11445 -247769 -575043
778 -575043 443377 153401 265007 -408754 -249512 -152288 6365 -516297 -430157 -294686
768 -294686 27500 -262354 20365 1884959 514561 227658 525059 -812190 115769
759 115769 772013 -434704 -235457 403376 222359 -570038 254144 162800 -336631 -177013
749 -177013 200409 -658230 -82291 -735090 677917 -71140 -26055 -147253 -1407974 -1461766
739 -1461766 -700295 1062684 547556 -212974 -635135 39517 592717 -1043379 -544371
730 -544371 213310 926264 477500 406117 -158997 278401 1053656 643562 534746 -988412
720i88412j083838M87236J564499K0570J20755N7918p27317n35955L99427m7069
710g32186M77658O5881j95438p58641J249533J407640J86001j770787p0921k19366
700c60626n79546J363106P81288p52300r24645R07214m19271q3443n18732J481122
690H94167O41053q19280k35394n60596J4122l42809J265666J125520j519835m94504
680c1890j343249k88353J147994R85152k0680O69784M3234m37987l49728K62834
670F37111l24654p99689R48548L67601m15112Q79870q88762k51786M65424L91003
660A009554n21535j175634J217361j601191M76087M81337q61184L21063j45902
651h00044K3709J952579j25862k94890o72722l65717K05730M08047o93169L15078
$$ plain form
720 -988412 -2072250 -1585014 -20515 55 120810 178728 -548589 -1084544 -685117 -732186
710 -732186 -254528 -188647 -384085 -1142726 106807 1514447 1700448 -70339 -141260 -360626
700 -360626 -940172 422934 1204222 451922 -472723 434491 15220 -68223 -586955 894167
690 894167 1535220 715940 480546 -80050 -65928 -408737 856929 1982449 462614 -31890
680 -31890 -1375139 -1663492 -515498 469654 448974 1118758 1161992 724005 374277 637111
670 637111 312457 -487232 461316 828917 413805 1293675 404913 153127 618551 1009554
660 1009554 488019 -687615 529746 -1071445 -595358 -114021 -975205 -654142 -800044
651 -800044 -776335 1176244 1050382 755492 82770 -282947 -77217 330830 -362339 -47261
641d7261J60790l73032N61598l88688k50788J67243J026447m46267m69874l14460
631c74292P96317o88885Q32730Q00580o9143R7636j025834n34985M99423l27728
621E819n52128L1303R0931J43838l7038K60701k23851q16430k04866J512445j42046
610F8678p93885M63817K98088l50989J452083l3316p09278Q10354r97302K9923
600B38173K47330j29785L5308m67383J331958p61954k03364m38426K82310Q66699
590A000866j469542j331428J008451O19257p84721o03812J358190J036090j022261
581a88910N93073j046432m5925k22135P35351P49679p32067j17880j18359l88981
571g82586M81420l79875k89676L64944P96597m80988l52438Q46515J248133j38981
$$ plain form
641 -47261 113529 -259503 302095 -86593 -337381 -170138 856309 410042 -59832 -374292
631 -374292 422025 -266860 565870 1366450 1297307 1394943 369109 -165876 333547 5819
621 5819 -546309 -515006 -424075 -280237 -317275 -56574 -280425 -1096855 -1301721 210724 68678
610 68678 -725207 -261390 36698 -314291 1137792 1104476 395198 1205552 208250 238173
600 238173 485503 355718 391026 -76357 1255601 493647 290283 -148143 134167 1000866
590 1000866 -468676 -1800104 -791653 -172396 -957117 -1560929 -202739 833351 -188910
581 -188910 404163 -642269 -688194 -910329 -174978 574701 -157366 -275246 -393605 -782586
571 -782586 -301166 -681041 -970717 -605773 190824 -290164 -642602 203913 1452046 1313065
561A313065j851229P10521J361207J43796n04604K30802l42120j513805L1087
552d21280J096212q09922M12788k01215q74376J28595J36332O32094Q365n5778
542E1815n8454m00644j16468R64718Q64914K83057j338529r4862J27372m1632
532B41287o7824q82319N60862r2183J145064l18256M2124K51887J71045n01883
522E49804k22080k50664N74344o02330K31706J009121j121315r12617J181768
513D37737k44028m09185P90806L14572j204583l46920l45817K05684R25591P07975
503H31832L55057p84174j30114J80384p20071R7925O14875P78297r67038j089875
493h32902J001880J55807L49523j79760o4861l1558J38450j234759O13897J181655
$$ plain form
561 1313065 -538164 172357 1533564 1677360 1172756 1403558 1061438 -452367 -421280
552 -421280 674932 -134990 277798 76583 -797793 -669198 -532866 99228 107593 51815
542 51815 -6639 -407283 -523751 440967 1305881 1588938 250409 155547 282919 241287
532 241287 173463 -708856 -147994 -240177 904887 586631 628755 880642 1051687 549804
522 549804 327724 77060 651404 49074 280780 1289901 168586 -744031 437737
513 437737 193709 -215476 575330 889902 -314681 -661601 -1007418 -801734 123857 831832
503 831832 1186889 402715 272601 452985 -267086 -169161 445714 1224011 256973 -832902
493 -832902 168978 324785 674308 494548 429687 398129 536579 -698180 -84283 1097372
483A097372o79205o44749J468001j083099M9504J468356l62899k37700M29051
474A504632j38453n20262Q7173n51612J70796l05414j843287N31346J594326J920125
464B449370n6655R53595p45273j124017r65091o25675N38930k74204k7017J209869
454A333832j095792j59043K96016L68257l17921p5089j000678j26081M97016k68953
444e48436J10586r9637O77013j082970j64824R31237J65678m75979N64429k56416
434a79319k57755J7565J471463K07590j173951Q18120Q91094l33006j161068J091263
424A391996Q4036j246046Q18683j020141l29487Q37947j105604k04425M0772J483254
414G50985M75529j737004J049058o4223L77729P05049o32479r50116N02985J44851
$$ plain form
483 1097372 418167 -226582 1241419 158320 207824 1676180 1313281 1075581 1504632
474 1504632 1366179 845917 933090 381478 552274 246860 -1596427 -1065081 529245 2449370
464 2449370 2392715 3346310 2601037 1477020 511929 -113746 425184 150980 123963 1333832
454 1333832 238040 78997 375013 743270 425349 350260 -650418 -776499 -279483 -548436
444 -548436 -437850 -537487 139526 -943444 -1108268 -177031 -11353 -487332 77097 -179319
434 -179319 -437074 -419509 1051954 1259544 85593 903713 1794807 1461801 300733 1391996
424 1391996 1476032 229986 1048669 28528 -300959 536988 -568616 -773041 -732269 750985
414 750985 1226514 -510490 538568 474345 852074 1557123 924644 -25472 477513 622364
404F22364l34475p81374K8027N71438K87617J3006k92776M12390L42860M22960
394A292037P32393M16233p98818o62110k40150L7213K11690o73799K83264n48872
384D9081J503677P8023r44872n39774m65020J131694j3098r313l75109J29860
374E45149m4295J17166m66338J15960L16775N24801L29342j50495l60223j530765
364f02923l4960J999480p42674j033049k58117N68797J853051k06498J70784j40191
354A573700r52515m41648M20641O86645K824n51995L64137m81525m71269N89316
344G38311J248683j46126m70294l29973J141204k418237P36053J111718L97855
335B009194q45644j185673M33792n01877Q33629L8091k4795J91779o88603M26234
$$ plain form
404 622364 287889 -493485 -465458 105980 393597 406603 113827 526217 869077 1292037
394 1292037 2024430 2440663 1641845 979735 739585 776798 988488 314689 597953 49081
384 49081 1552758 1630781 685909 146135 -318885 812809 799711 790398 415289 545149
374 545149 500854 618020 151682 267642 584417 1109218 1438560 1288065 927842 -602923
364 -602923 -637883 1361597 618923 -414126 -672243 -103446 1749605 1543107 1713891 1573700
354 1573700 621185 179537 600178 1286823 1289647 737652 1101789 620264 148995 738311
344 738311 1986994 1840868 1370574 1040601 2181805 -236432 499621 1611339 2009194
335 2009194 1163550 -22123 411669 -90208 743421 781512 756717 948496 259893 686127
325F86127n25543j084472P80249R04503J243120n59556r8821O32613j957939k79478
315b59197Q36262J41762L55368k05966J670604P64246j636621k078792l0179m93495
305i36008j70938L14785R66845J651194j492794L43813J98491r31569J23931n3635
295A4115J401737m40180J22404k93786Q74675j81526n28436k85748J247297q83700
285A046852J96976j59435l09486o88677j20846J68650O15049m45287j425537l23236
275a444977N76034J126935k64952L38325N33328k03066K0606j171017J16407J007505
265F35128j491381K48775M03761l61513J667169N23756j077736J067246J71336
256A786541n88276j383502j42267Q21501L16386O37415O25909j124715M05954
$$ plain form
325 686127 160584 -923888 -143639 760864 2003984 1444428 1345607 1978220 20281 -259197
315 -259197 577065 718827 1074195 868229 2538833 3303079 1666458 -412334 -442513 -936008
305 -936008 -1106946 -792161 174684 1825878 333084 676897 875388 -56181 67750 14115
295 14115 1415852 975672 1098076 804290 1678965 1497439 969003 683255 1930552 1046852
285 1046852 1243828 1084393 774907 86230 -34616 134034 749083 303796 -1121741 -1444977
275 -1444977 -868943 257992 -6960 331365 864693 661627 682233 -488784 -372377 635128
265 635128 -856253 -607478 -203717 -565230 1101939 1625695 547959 1615205 1786541
256 1786541 1198265 -185237 -327504 493997 810383 1447798 2073707 948992 1354946
247A354946M71023M47126j76185l24790p96391P05782j60618j216989R04412j29311
237A079005O10828k274251p0227N82972J205629N70431j534878K38627l67207
228D0929K69654R03545o74787J047963J088811o3243q6206q70027j741573K82249
218A97315N48450m93867J041629k77792o69932K15580n43570J081496J180136
209B279445p77320n43358k4414O52623O8000j12939k70742j262441j47873J076693
199I37674L94356J296468n00247k73831l653p69010p13436R35886q30491O97763
189A171479m51461l1765N07298m72560j25380l39906L52909l86119L88410r6011
179E16894o80494o77817L12066O8083M095L17901m41299O43389Q27416J07848
$$ plain form
247 1354946 1825969 2273095 2096910 1772120 975729 1681511 1520893 303904 1208316 1079005
237 1079005 1689833 -584418 -654645 -71673 1133956 1704387 169509 408136 40929
228 40929 310583 1214128 539341 1587304 2676115 2612872 2526666 1656639 -84934 197315
218 197315 745765 251898 1293527 1015735 345803 561383 17813 1099309 2279445
209 2279445 1502125 958767 934353 1586976 1654976 1542037 1271295 8854 -139019 937674
199 937674 1332030 2628498 2128251 1854420 1850767 1081757 368321 1304207 473716 1171479
189 1171479 720018 688253 1195551 722991 597611 257705 610614 224495 612905 516894
179 516894 -163600 -841417 -529351 -461268 -457173 -139272 -580571 62818 890234 998082
169I98082P77202N89322j247684n97534m63707N95914J270428K00383l53333o60260
159A108813p22208l93063K78245k02289N91332p32366j55182M20650q5889M88843
149E96886n8275P33200Q73545k97115r06270j009r12564m5954K96015R27385K83946
138A489790r57856O36119K92281K04989j006028L0657N92095p03273P12642o4374
128A227042m48485N90344o5703j219625P1936J032650l3272L94890k82311q9273
118A178193m92809j55980Q84789J11265n73096k60947R3182o14199O54303K04700
108A029401P0544M85769p61766q15842O65726m67040N75536K18931l67823O41716
98A275152o79778J347283j90642j475336l56539K60930O39618J41615k59884M55
$$ plain form
169 998082 1775284 2364606 1116922 519388 55681 651595 1922023 2122406 1769073 1108813
159 1108813 386605 -6458 271787 69498 660830 -71536 -226718 193932 108043 596886
149 596886 538611 1271811 2145356 1848241 941971 940962 28398 -17556 278459 1205844 1489790
138 1489790 531934 1168053 1460334 1665323 659295 689952 1282047 578774 1291416 1227042
128 1227042 778557 1368901 1303198 83573 155509 1188159 1154887 1549777 1267466 1178193
118 1178193 685384 529404 1414193 1525458 952362 691415 784597 170398 824701 1029401
108 1029401 1099945 1585714 823948 8106 673832 206792 782328 1001259 633436 1275152
98 1275152 595374 1942657 1752015 276679 -79860 181070 820688 962303 702419 702874
88G02874j021152P62235k38615K08811q2152l03429M87334k55752k90745J034792
78A004201R58347j260045J60997J63652j068886K05827L73001O46781J99998Q9834
68A473707k67239J9888m18665j41072P45718p00459J03350M04093l24317j53024
58G41980j9250N38442J87214k22617o79143K24862p35280J143749M35412l69621
48A245748n6192j63357P01327k27282n29425k88144M42083m69433j34850P83164
38A303639j52609m23055Q45610j69281o86804m24237L26450N94077L22402m78106
28A058086j14747j86017j61128R43520Q20222o69878O0965j286451j33527K51928
18E82973o83958M28992M28252n3803k47772j52128N31446m14398o5208M45222
$$ plain form
88 702874 -318278 443957 205342 414153 332001 28572 515906 260154 -30591 1004201
78 1004201 1962548 702503 863500 1027152 -41734 164093 537094 1183875 1383873 1473707
68 1473707 1206468 1226356 807691 666619 1412337 711878 815228 1219321 895004 741980
58 741980 722730 1261172 1448386 1225769 546626 771488 36208 1179957 1615369 1245748
48 1245748 1189556 1026199 1727526 1500244 970819 682675 1124758 655325 520475 1303639
38 1303639 1151030 727975 1573585 1404304 717500 293263 619713 1213790 1536192 1058086
28 1058086 943339 757322 596194 1539714 2359936 1690058 1751023 464572 331045 582973
18 582973 -100985 328007 756259 702456 454684 302556 834002 419604 354396 799618
8G99618j68817m763N06981N24106j73978m29454n54479L78555
0H77769
$$ plain form
8 799618 630801 626038 1133019 1657125 1483147 1053693 499214 877769
0 877769
$$ Imaginary data points
##PAGE= N=2
##DATA TABLE= (X++(I..I)), XYDATA
16383b485707m71623m92292N21170L87152k56309r26572Q98264L03521J33371
16374b389025Q4552o35411N09014P95656j61422r10640M30919j075578O73564
16365b678371Q06792P95555O97556j494639r6553p4450q27269P73182J457033
16356f41164p1871l17690J10348k7065j561294N4706J23120N79435J246970q51884
16346a356389j116191k70773P97678K96944P15442j50393J79769L05528N83951
16337a4434M43162k24474n6756p80956n42947M61727k01292J96324M62408k06896
16327d64134P42157l01896n76584P35060K734n8260J06649n36696M69227O14489
16317G32746p85902l44450M98252k72454J46479P60157P81930n59570M08385q86641
$$ plain form
16383 -2485707 -2957330 -3449622 -2928452 -2541300 -2797609 -3724181 -2825917 -2522396 -2389025
16374 -2389025 -2304473 -2939884 -2430870 -1635214 -1796636 -2707276 -2276357 -3351935 -2678371
16365 -2678371 -1871579 -1076024 -378468 -1873107 -1969660 -2044110 -2871379 -2098197 -641164
16356 -641164 -713035 -1030725 -920377 -947442 -2508736 -2454030 -2330910 -1751475 -504505 -1356389
16346 -1356389 -2472580 -2743353 -1945675 -1648731 -933289 -1083682 -903913 -598385 -14434
16337 -14434 428728 204254 147498 -633458 -1176405 -714678 -915970 -719646 -257238 -464134
16327 -464134 278023 -23873 -600457 134603 137337 79077 185726 -350970 118257 732746
16317 732746 -53156 -397606 100646 -171808 -25329 734828 1516758 957188 1365573 478932
16307D78932k52725M1122j44864J043486k02242o19257J43982R62393l33887k5929
16297A091011l78828P32158j5074Q81337N01957q94033o4554l95985M80561J83275
16287B121825j4241j73597p42199N01720o06737n22635J325735M66907n94597
16278A762181p17714q85223J222021L79133n13823P73255M06927J95048l92124
16269B229681l39138j04328J13670k5522n28015L02415N57789R4200k51012J090604
16259C140344M65733j208889p21860R3137Q0723K37478R56180L6250m31363o73635
16249A974098p89500J619992J207791j37254J92867P1653k36098l64622k56152
16240C282775L36939J003075j277741N57165l85866j426119K76100M49979M57514
$$ plain form
16307 478932 226207 267329 122465 1165951 963709 344452 488434 1450827 1116940 1091011
16297 1091011 712183 1444341 1429267 2310604 2812561 1918528 1853974 1457989 1938550 2121825
16287 2121825 2107584 1933987 1191788 1693508 1086771 564136 1889871 2356778 1762181
16278 1762181 1044467 159244 1381265 1760398 1246575 2019830 2426757 2621805 2229681
16269 2229681 1890543 1786215 1899885 1874363 1346348 1648763 2206552 2300752 2049740 3140344
16259 3140344 3606077 2397188 1675328 1768465 1849188 2086666 3042846 3079096 2647733 1974098
16249 1974098 1184598 2804590 4012381 3875127 4067994 4139647 3903549 3538927 3282775
16240 3282775 3619714 4622789 3345048 3902213 3516347 2090228 2366328 2816307 3273821
16231C273821O20860P06243l66771j93364K21991k5161n72994q34477j3430o8039
16221B748679Q57801P2782N27059M19141n5676M60254k10463m59031J03640J78616
16211D642802m23953p29924n00349n80475L3124J448339N91477o08352m28210
16202C444479k38180k34699Q03542m33589n6478J481974j067614L71187L11280
16193D381902l5844J96601j91015J21826r75265J014081J43401k66643p0102J67006
16183D485948j45969k83174k38169j197391N87771R72584M84834r3556P89669
16174E362547j340735K77331J057029j051587M30250Q40821l97100q81055k56721
16165D040780k14009R22601q03367p45907J115225J168936q84137k92685M95904
$$ plain form
16231 3273821 3894681 4600924 4234153 4040789 4262780 4237619 3664625 2830148 2816718 2748679
16221 2748679 3606480 3679262 4206321 4625462 4569786 5030040 4819577 4360546 4464186 4642802
16211 4642802 4218849 3488925 2988576 2408101 2441225 3889564 4481041 3872689 3444479
16202 3444479 3206299 2971600 3775142 3341553 3285075 4767049 3699435 4070622 4381902
16193 4381902 4346058 4542659 4351644 4473470 3498205 4512286 4655687 4389044 4318942 4485948
16183 4485948 4339979 4056805 3818636 2621245 3209016 4181600 4666434 4572878 5362547
16174 5362547 4021812 4299143 5356172 4304585 4734835 5575656 5178556 4297501 4040780
16165 4040780 3826771 4749372 3946005 3200098 4315323 5484259 4600122 4307437 4803341
16156D803341P49611r70491n4976j0904J77972l41884Q1340P36158K31164J94792
16146E596123j62921l91232N83648n5368n68813o12535m85892o9111L3612J41765
16136D009276J170282K16742j237991L74407N97680N40052m53954K16763m05486
16127E027771j65345m51616K18329N96340j51209R44407k74921J93545j017693
16118D919608l10474Q89682n79393P68890L39919j174678r65019O64549p81675
16109C771409J039454r05229M21808J233867m32109q44713Q52871O83342J09025
16100E929725j058814J37603M09980p58822J025420O9054k22609k83878j64615
16091E083044O70675m80590p41816n19640N94910k18572N291M34707o76998M14426
$$ plain form
16156 4803341 5552952 4582461 4527485 4516581 4694553 4352669 4434009 5170167 5401331 5596123
16146 5596123 5433202 5041970 5625618 5570250 5001437 4388902 3903010 3833899 3867511 4009276
16136 4009276 5179558 5396300 4158309 4532716 5130396 5670448 5216494 5433257 5027771
16127 5027771 4862426 4410810 4629139 5225479 5074270 6018677 5743756 5937301 4919608
16118 4919608 4609134 5498816 4919423 5688313 6028232 4853554 3888535 4553084 3771409
16109 3771409 4810863 3905634 4327442 5561309 5129200 4284487 5137358 5820700 5929725
16100 5929725 4870911 5008514 5418494 4659672 5685092 5754146 5531537 5247659 5083044
16091 5083044 5753719 5273129 4531313 4011673 4606583 4388011 4393302 4828009 4151011 4565437
16081D565437j07044P18138J319081q13184n36468j24273k53652j198136r7426
16072C472473R02364L07766L86489l30858l15798Q07376q6870O54975J141932
16063F939849j35921q98861p3089m7031k152781p92190k34019J914880o52402
16054C868435O57404M28160o49489q54079J856361L48754r02712j180219J172171
16045D744786J50341R9283q16771R2728P92782m48495l19579k40579J42050P26242
16035D922788M03458r74368m80120P66016j2766k9905p59961O07119R13401r68136
16025D387526J206364O73504j55133j03639J30326j579167j3431M68018l65994
16016D648374J336028J4496r45898L12491k16982j8427n64690l98962j178938
$$ plain form
16081 4565437 4458393 5176531 6495612 5682428 5145960 5021687 4768035 3569899 3472473
16072 3472473 4374837 4682603 5069092 4738234 4422436 5229812 5142942 5797917 6939849
16063 6939849 6803928 5905067 5831978 5784947 3632166 2839976 2605957 4520837 3868435
16054 3868435 4525839 4953999 4304510 3450431 5306792 5655546 4752834 3572615 4744786
16045 4744786 4895127 4994410 4177639 4270367 5063149 4614654 4295075 4054496 4196546 4922788
16035 4922788 5326246 4351878 3871758 4637774 4625008 4595103 3835142 4442261 5355662 4387526
16025 4387526 5593890 6267394 6112261 6008622 6138948 4559781 4546350 5014368 4648374
16016 4648374 5984402 5998898 5053000 5365491 5148509 5130082 4565392 4166430 2987492
16007B987492J318346J779574L23544r62097k76558k44913J571896M02750o5739
15998F834295j77371n35049O81963m25841j450364m21903O50946o5243K18897
15989E310330L05770n52211m28712j8710R06192N52293j301357L09090M9350M27008
15979E559043J08995q47287P57388r34500L37382P53064L10581j228485l91719
15970D424462j92389l98050J57593O17982l35053k85196K215342l04233j685717
15961D214741l22796K65736M98188K56084J195387j072857j203578O10834N42351
15952D984090j099430K42376R02342J18267M29805k13398J71535R3571l5818l98805
15942E194535p90022l01119Q98662R19109l16874n52851O27802j89442N70219
$$ plain form
16007 2987492 4305838 6085412 6408956 5446859 5170301 4925388 6497284 6900034 6834295
15998 6834295 6656924 6121875 6803838 6377997 4927633 4505730 5156676 5091433 5310330
15989 5310330 5616100 5063889 4635177 4616467 5522659 6074952 4773595 5082685 5132035 5559043
15979 5559043 5668038 4820751 5578139 4643639 4981021 5734085 6044666 4816181 4424462
15970 4424462 4232073 3834023 3991616 4609598 4274545 3989349 6204691 5900458 4214741
15961 4214741 3891945 4157681 4655869 4911953 6107340 5034483 3830905 4441739 4984090
15952 4984090 3884660 4127036 5029378 5147645 5577450 5364052 5535587 5629158 5593340 5194535
15942 5194535 4404513 4103394 5002056 5921165 5604291 5051440 5679242 5489800 6060019
15933F060019o24194l44165O78052k68229p37390N36592k54614n24207J327745
15924E849609k82592j67872k21653l19954o77602j30900n17536j010167J767888
15915D289221J030774p44412n06996L65398j29812L46377M77965o01180L34177
15906D861512m80864m54057J180224n9160L90295n93837M6613o87343n90096N08183
15896D121470J123862P0842j204816n7238o6324J278773N61509n86987M38351
15887E679442P31280q59479q95193K16999J46580L71263J020432p43544r16437
15878D751343O45904K49177M46766q49385J078867j028740j562529O43029Q08783
15869E183215M90988Q02029p22877n42914j235083O90418J55744J252066J87268
$$ plain form
15933 6060019 5435825 5091660 5769712 5501483 4764093 5300685 5046071 4521864 5849609
15924 5849609 5567017 5399145 5177492 4857538 4179936 4049036 3531500 2521333 4289221
15915 4289221 5319995 4575583 4068587 4433985 4304173 4650550 5128515 4527335 4861512
15906 4861512 4380648 3926591 5106815 5047655 5437950 4844113 4890726 4203383 3613287 4121470
15896 4121470 5245332 5316174 4111358 4054120 3987796 5266569 5828078 5241091 5679442
15887 5679442 6410722 5551243 4656050 4873049 5019629 5390892 6411324 5667780 4751343
15878 4751343 5397247 5646424 6093190 5243805 6322672 5293932 3731403 4374432 5183215
15869 5183215 5674203 6476232 5753355 5210441 3975358 4665776 4821520 6073586 6260854
15860F260854j146183R83683j5818k072410j68748J280287J83008J39141l61784
15851E082030N78663k31185J025647j408042j072612L10920M77274Q47795K38111
15842E848601n6832j72690K77678J2707j104215n12685Q01972K49897k15782N76224
15832E704875l10084n09035O35058J064206L53755j769332l07316J416040j286597
15823D991570J71748m19306M7869K89051J813485k98951l66249Q6902J65828o39455
15813E842492j4418J25655r43373Q4761m32906K99545L28229L26700j97240K72083
15803E691528N65728K20054l41383L46368J69283l05817M5980n74412k53430r12524
15793D651375L91500P65657r21010J35148P63768P91966r02569J89910q01440
$$ plain form
15860 6260854 5114671 6098354 6082536 4010126 3841378 5121665 5304673 5443814 5082030
15851 5082030 5660693 5429508 6455155 5047113 3974501 4285421 4762695 5610490 5848601
15842 5848601 5791769 5619079 5896757 5909464 4805249 4292564 5094536 5344433 5128651 5704875
15832 5704875 5394791 4885756 5520814 6585020 6938775 5169443 4862127 6278167 4991570
15823 4991570 5163318 4744012 4791881 5080932 6894417 6595466 6229217 6316119 6481947 5842492
15813 5842492 5828074 5953729 5010356 5095117 4662211 4961756 5289985 5616685 5419445 5691528
15803 5691528 6257256 6477310 6135927 6482295 6651578 6345761 6391741 5817329 5563899 4651375
15793 4651375 5042875 5808532 4887522 5022670 5786438 6578404 5675835 5865745 5064305
15784E064305Q90575J19351m82372m30661q21968J38572J496502j66199j064828
15775D743277L61578N55065k36603o47317J286820o41954j606904J010590J121469
15766E946021j743512Q66642L7992M32850N34499O524m70165J28678J76109O48208
15756F563846r82684L27544k23132K16376J18451l30370k18763R14873Q66798
15747G252939n79311j167524n97850J015478k8819q0546P21036l16356p64449
15738E454598l20224R36325j491537j245430J364916J581633M73676j875254L79772
15729E258475M35968K67467L03978o23222j397425k55878J164135J531466j780612
15720D904352n05245m48263O15635P86690K88639j093349K86701L51284J4674
$$ plain form
15784 5064305 5954880 6074231 5591859 5161198 4339230 4477802 5974304 5808105 4743277
15775 4743277 5104855 5659920 5423317 4776000 6062820 5420866 3813962 4824552 5946021
15766 5946021 4202509 5069151 5107143 5539993 6074492 6081016 5610851 5739529 5915638 6563846
15756 6563846 5581162 5908706 5685574 5901950 6020401 5690031 5471268 6386141 7252939
15747 7252939 6673628 5506104 4908254 5923732 5894913 5814367 6535403 6219047 5454598
15738 5454598 5134374 6070699 4579162 3333732 4698648 6280281 6753957 4878703 5258475
15729 5258475 5694443 5961910 6265888 5642666 4245241 3989363 5153498 6684964 4904352
15720 4904352 4399107 3950844 4566479 5353169 5641808 4548459 4835160 5186444 5201118
15711E201118L2451P59927q66681M41027k99568J333732L97404j121843M74318
15702F351885j57215n52086n56085q7483J252668k11603l71154o14964p20784
15693D333179J351589n984j185193K05954Q99278M59238j036337o63680N31301
15684D889345J144032O34972q42775j072386o88892J088540L58515p54176L67363
15675E124538K20394o38827O2218k34531M94425R90272O61824o96597j688722
15666D294994r33547L0626J054420O58195Q73117M97716j543423O52417J054809
15657F639324j027610j050260J205666r05834P79381j78829M34690p01351N46901
$$ plain form
15711 5201118 5233569 5993496 5126815 5567842 5268274 6602006 6999410 5877567 6351885
15702 6351885 6194670 5642584 5086499 4999016 6251684 6040081 5668927 5053963 4333179
15693 4333179 5684768 5678784 4493591 4699545 5598823 6058061 5021724 4358044 4889345
15684 4889345 6033377 6668349 5825574 4753188 4064296 5152836 5511351 4757175 5124538
15675 5124538 5344932 4706105 4768323 4533792 5028217 6018489 6680313 5983716 4294994
15666 4294994 3361447 3392073 4446493 5104688 5977805 6475521 4932098 5584515 6639324
15657 6639324 5611714 4561454 5767120 4861286 5640667 5461838 5896528 5195177 5742078
$$ [...]
##END NTUPLES=NMR SPECTRUM
##END=
