##TITLE=1H_CA-9079-2
 CDCl3
 8 sc, 
 24.10.2022
##JCAMPDX= 6.0         $$ Bruker NMR JCAMP-DX V2.0
##DATA TYPE= NMR SPECTRUM
##DATA CLASS= NTUPLES
##ORIGIN= UXNMR, Bruker Analytische Messtechnik GmbH
##OWNER= root
$$ XWIN-NMR		Version 3.5
$$ Mon Oct 24 13:50:34 2022 Russian Standard Time (UT+4h)  she@DPX200
##.OBSERVE FREQUENCY= 200.1313499994
##.OBSERVE NUCLEUS= ^1H
##.ACQUISITION MODE= SIMULTANEOUS
##.ACQUISITION SCHEME= undefined
##.AVERAGES= 8
##.DIGITISER RES= 18
##SPECTROMETER/DATA SYSTEM= spect
##.PULSE SEQUENCE= zg30
##.SOLVENT NAME= CDCl3
##.SHIFT REFERENCE= (INTERNAL, CDCl3, 0, 15.7414)
##AUDIT TRAIL= $$ (NUMBER, WHEN, WHO, WHERE, WHAT)
$$ ##TITLE= Audit trail, XWIN-NMR		Version 3.5
$$ ##JCAMPDX= 5.01
$$ ##ORIGIN= Bruker BioSpin GmbH
$$ ##OWNER= she
$$ F:/spectra/data/she/nmr/H-F/1/pdata/1/auditp.txt
$$ ##AUDIT TRAIL=  $$ (NUMBER, WHEN, WHO, WHERE, WHAT)
(   1,<2022-10-24 13:49:14.14 +0400>,<she>,<DPX200>,
      <created by zg, POWCHK disabled, PULCHK disabled
       configuration hash MD5:
       00 E9 B6 7A A2 85 ED C7 34 08 36 98 17 FE 4E 26
       data hash MD5: 16K
       32 06 EC C0 57 F0 C7 84 B4 BB C9 AA 5A 53 19 00>)
(   2,<2022-10-24 13:49:16.46 +0400>,<she>,<DPX200>,
      <Start of raw data processing
       efp BC_mod = 2 LB = 0.24 FT_mod = 6 PKNL = 1 PHC0 = -18030.86 PHC1 = 7.0007 SI = 16K 
       data hash MD5: 16K
       B8 77 41 CF 60 E3 62 64 E1 4B 8A C9 A8 4D 26 3C>)
(   3,<2022-10-24 13:49:39.14 +0400>,<she>,<DPX200>,
      <pk PHC0 = -9.046806 PHC1 = 16.2 
       data hash MD5: 16K
       D4 35 6C 1C B0 78 EE CE F3 6D DA 90 62 D9 C5 C1>)
(   4,<2022-10-24 13:49:43.29 +0400>,<she>,<DPX200>,
      <abs ABSG = 5 
       data hash MD5: 16K
       76 EF DF A6 BF 7C A8 7E 69 8E 81 94 FC 0D 1F 1C>)
(   5,<2022-10-24 13:50:12.37 +0400>,<she>,<DPX200>,
      <pk PHC0 = 1.922907 PHC1 = -4.6 
       data hash MD5: 16K
       AD AC 9E 8B D2 3F A9 9A E9 5E 13 6D B1 16 CE 44>)
$$ ##END=
$$ 
$$ hash MD5
$$ 17 C0 5A 04 99 A6 D0 65 0A A2 B6 4C 40 BA 2B E2
##$RELAX= 
##$RELAX= 
##$RELAX= 
##$RELAX= 
##$RELAX= 
##$RELAX= 
$$ Bruker specific parameters
$$ --------------------------
##$DU= <F:/spectra>
##$EXPNO= 1
##$NAME= <H-F>
##$PROCNO= 1
##$TYPE= <nmr>
##$USER= <she>
##$AMP= (0..31)
100 100 100 100 100 100 100 100 100 100 100 100 100 100 100 100 100 100 
100 100 100 100 100 100 100 100 100 100 100 100 100 100 
##$AQSEQ= 0
##$AQ_mod= 1
##$AUNM= <au_zg>
##$AUTOPOS= <>
##$BF1= 200.13
##$BF2= 200.13
##$BF3= 200.13
##$BF4= 200.13
##$BF5= 200.13
##$BF6= 200.13
##$BF7= 200.13
##$BF8= 200.13
##$BYTORDA= 1
##$CFDGTYP= 0
##$CFRGTYP= 5
##$CHEMSTR= <none>
##$CNST= (0..31)
1 1 145 1 1 1 1 1 1 1 1 1 1 1 1 1 1 1 1 1 1 1 1 1 1 1 1 1 1 1 1 1 
##$CPDPRG= <>
##$CPDPRG1= <>
##$CPDPRG2= <>
##$CPDPRG3= <>
##$CPDPRG4= <mlev>
##$CPDPRG5= <mlev>
##$CPDPRG6= <mlev>
##$CPDPRG7= <mlev>
##$CPDPRG8= <mlev>
##$CPDPRGB= <>
##$CPDPRGT= <>
##$D= (0..31)
0 1.2 0 0 0 0 0 0 0 0.06 0 0.03 0 0 0 0 0.0002 0 0 0 0 0 0 0 0 0 0 0 0 
0 0 0 
##$DATE= 1666604953
##$DBL= (0..7)
$$ [...]
##$SUBNAM3= <"">
##$SUBNAM4= <"">
##$SUBNAM5= <"">
##$SUBNAM6= <"">
##$SUBNAM7= <"">
##$SUBNAM8= <"">
##$SUBNAM9= <"">
##$SW= 18.0517283424941
##$SWIBOX= (0..15)
0 0 2 0 0 0 0 0 0 0 0 0 0 0 0 0 
##$SW_h= 3612.71676300578
##$TD= 16384
##$TD0= 1
##$TE= 0
##$TE2= 300
##$TE3= 300
##$TEG= 300
##$TL= (0..7)
0 120 120 120 120 120 120 120 
##$TP= (0..7)
150 150 150 150 150 150 150 150 
##$TP07= 0
##$TPNAME0= <>
##$TPNAME1= <>
##$TPNAME2= <>
##$TPNAME3= <>
##$TPNAME4= <>
##$TPNAME5= <>
##$TPNAME6= <>
##$TPNAME7= <>
##$TPOAL= (0..7)
0.5 0.5 0.5 0.5 0.5 0.5 0.5 0.5 
##$TPOFFS= (0..7)
0 0 0 0 0 0 0 0 
##$TUNHIN= 0
##$TUNHOUT= 0
##$TUNXOUT= 0
##$USERA1= <user>
##$USERA2= <user>
##$USERA3= <user>
##$USERA4= <user>
##$USERA5= <user>
##$V9= 5
##$VALIST= <valist>
##$VCLIST= <CCCCCCCCCCCCCCC>
##$VD= 0
##$VDLIST= <DDDDDDDDDDDDDDD>
##$VPLIST= <PPPPPPPPPPPPPPP>
##$VTLIST= <TTTTTTTTTTTTTTT>
##$WBST= 1024
##$WBSW= 4
##$XGAIN= (0..3)
0 0 0 0 
##$XL= 0
##$YL= 0
##$YMAX_a= 93995
##$YMIN_a= -132283
##$ZGOPTNS= <>
##$ZL1= 120
##$ZL2= 120
##$ZL3= 120
##$ZL4= 120
##$ABSF1= 15.6962
##$ABSF2= -2.355649
##$ABSG= 5
##$ABSL= 3
##$ALPHA= 0
##$AQORDER= 0
##$ASSFAC= 0
##$ASSFACI= 0
##$ASSFACX= 0
##$ASSWID= 0
##$AUNMP= <proc_1d>
##$AZFE= 0.1
##$AZFW= 0.1
##$BCFW= 0
##$BC_mod= 2
##$BYTORDP= 0
##$COROFFS= 0
##$CY= -3
##$DATMOD= 1
##$DC= 0
##$DFILT= <>
##$DTYPP= 0
##$F1P= 0
##$F2P= 0
##$FCOR= 1
##$FTSIZE= 16384
##$FT_mod= 6
##$GAMMA= 0
##$GB= 0
##$INTBC= 1
##$INTSCL= 3.70164e-10
##$ISEN= 128
##$LB= 0.24
##$LEV0= 0
##$LPBIN= 0
##$MAXI= 10000
##$MC2= 0
##$MEAN= 0
##$ME_mod= 0
##$MI= 1.114404
##$NCOEF= 0
##$NC_proc= -8
##$NLEV= 6
##$NOISF1= 3.799351
##$NOISF2= 2.8
##$NSP= 0
##$NTH_PI= 0
##$NZP= 0
##$OFFSET= 15.74138
##$PC= 1
##$PHC0= -18037.99
##$PHC1= 18.6007
##$PH_mod= 1
##$PKNL= yes
##$PPARMOD= 0
##$PSCAL= 0
##$PSIGN= 0
##$REVERSE= no
##$SF= 200.130006034809
##$SI= 16384
##$SIGF1= 3
##$SIGF2= 2
##$SINO= 5.538805
##$SIOLD= 16384
##$SREGLST= <1H.CDCl3>
##$SSB= 0
##$STSI= 16384
##$STSR= 0
##$SW_p= 3612.71676300578
##$SYMM= 0
##$S_DEV= 0
##$TDeff= 16384
##$TDoff= 0
##$TI= <>
##$TILT= no
##$TM1= 0
##$TM2= 0
##$TOPLEV= 0
##$USERP1= <user>
##$USERP2= <user>
##$USERP3= <user>
##$USERP4= <user>
##$USERP5= <user>
##$WDW= 1
##$XDIM= 16384
##$YMAX_p= 278690828
##$YMIN_p= -3308674
$$ End of Bruker specific parameters
$$ ---------------------------------
##NTUPLES= NMR SPECTRUM
##VAR_NAME=  FREQUENCY,     SPECTRUM/REAL,   SPECTRUM/IMAG
##SYMBOL=    X,             R,               I
##VAR_TYPE=  INDEPENDENT,   DEPENDENT,       DEPENDENT
##VAR_FORM=  AFFN,          ASDF,            ASDF
##VAR_DIM=   16384,         16384,           16384
##UNITS=     HZ,            ARBITRARY UNITS, ARBITRARY UNITS
##FACTOR=    0.220516191357247, 1,           1
##FIRST=     3150.32242193294, 0,            0
##LAST=      -462.394341072838, 0,           0
##MIN=       -462.394341072838, -3308674,    0
##MAX=       3150.32242193294, 278690828,    0
$$ Real data points
##PAGE= N=1
##DATA TABLE= (X++(R..R)), XYDATA
$$ [...]
7017E3023845R728375Q612548N835476J064558n079745q686474r958201r807868
7009D4732514q095135o244374m680040l564538l030457k410435k028744j027069
7001A3651722q98871q97498q19913j102754o78316p53925j86511o51747n03732
6992G158455k81632o14642n90197J67099j63164k12993k31737l80042l82532l48393
6982D120222N5342m04821K43117n54053l36243L14170j34105l63554j03670p8771
6972B757634P5092k24103K66298m01771J80497j85560m00585m317K8577k5029
6962B066733O4725R7949k48401n4502l3529k4298J95619J56028n67311J3184n7963
6951A608234L75468m605j30987k5137R243k16188N4720n2267M5319L59019j83757
$$ plain form
7017 53023845 62752220 71364768 77200244 78264802 73185057 64498583 54540382 44732514
7009 44732514 36637379 30393005 25712965 22148427 19117970 16707535 14678791 13651722
7001 13651722 12752851 11855353 11035440 9932686 9254370 8500445 8313934 7662187 7158455
6992 7158455 6876823 6262181 5671984 5839083 5675919 5462926 5231189 4851147 4468615 4120222
6982 4120222 4175564 3770743 4013860 3459807 3123564 3437734 3303629 2940075 2836405 2757634
6972 2757634 2832726 2608623 2874921 2473150 2653647 2468087 2067502 2063185 2091762 2066733
6962 2066733 2131458 2229407 1981006 1926504 1892975 1868677 2064296 2220324 1653013 1666197 1608234
6951 1608234 1983702 1979097 1848110 1822973 1832216 1616028 1670748 1618481 1663800 2022819 1839062
6940A839062n0602l16485J81314K17321L19226o55784m76642N0593M8690M8079
6930A204772J64090j88657J95145M60700j74425k50344l16019L91863L69551l31893
6920A524783K35603k73886k00056K5143O8027O19441k62859K39046l67027l37597
6910A270618Q2801k5694l8023K86807K48306k36084l56034l71605j48081O42817
6900A355828K84426n3364j49030k89504K16391P98970r6725n55738L97762l69402
6890A539614J05678N4014k50099P6111L13830r3847l53646N9570J35884j50173
6880A436936q2650K63472j1001p4465k89103Q441J82584M35161q6968q3520m16588
6869A282299l10314O34599M68372l55243O5309M48842m17445k74897l05980M21641
$$ plain form
6940 1839062 1788460 1471975 1653289 1870610 2189836 1534052 1057410 1108003 1156693 1204772
6930 1204772 1368862 1180205 1375350 1836050 1661625 1411281 1095262 1487125 1856676 1524783
6920 1524783 1760386 1486500 1286444 1311587 1379614 1999055 1736196 1975242 1608215 1270618
6910 1270618 1353419 1327725 1289702 1576509 1824815 1588731 1232697 861092 713011 1355828
6900 1355828 1640254 1586890 1437860 1148356 1364747 2163717 2066992 1511254 1909016 1539614
6890 1539614 1645292 1699306 1449207 1525318 1839148 1745301 1391655 1451225 1587109 1436936
6880 1436936 1354286 1617758 1606757 1532292 1243189 1251630 1434214 1869375 1782407 1698887 1282299
6869 1282299 971985 1606584 2074956 1719713 1785022 2233864 1816419 1541522 1235542 1657183
6859A657183n16030J30935J66292l9988M1544k0122K04619m2503n25066j98646
6849H58218L59505o7432j62904M15144K28782K79299j70163q8238L45129k10991
6839A786349L18517j40238J72594n96301j28800M27283M32622j2034l20916J99332
6829B138408K93822L85642k96624j81700K55986K10849P7727k57768n38840L24406
6819B411908R36625q0088J10857k51202N49532k9005J26662M10959L06248j61506
6809D330990k52442K93195P45960L44101j15792O29276N77146N66770O4143m88531
6799F694816r083K8413K43331k9633n02512K74931m3029K37077J8730M59789L59774
6788G732604J79529L33383N67840K33901O04891P95192J005820K11404J543188
$$ plain form
6859 1657183 1141153 1272088 1438380 1398392 1439936 1419814 1624433 1581930 1056864 858218
6849 858218 1217723 1150291 987387 1402531 1631313 1910612 1740449 1652211 1997340 1786349
6839 1786349 2104866 1964628 2137222 1540921 1412121 1839404 2272026 2259992 1939076 2138408
6829 2138408 2432230 2817872 2521248 2339548 2595534 2806383 2884110 2626342 2087502 2411908
6819 2411908 3348533 3268445 3379302 3128100 3677632 3648627 3775289 4186248 4492496 4330990
6809 4330990 4078548 4371743 5117703 5461804 5346012 5975288 6552434 7119204 7183347 6694816
6799 6694816 6685733 6714146 6957477 6927844 6425332 6700263 6657234 6894311 6913041 7372830 7732604
6788 7732604 7912133 8245516 8813356 9047257 9652148 10447340 11453160 11664564 13207752
6779A3207752O02673J77076Q78762M08113N80910L93201j90879m64098j16329
6770A5477181j70365k89724p63800m62701P4268J4345q36782m39085j63440N58660
6760A2998557N15630M75790K97490P16674L73807O00160P48380J034906J538050
6751A9299444J298481J595983R89476L89543p6748m96377r02823p40405m84953
6742B0871621j324586j135392j065142j203628q10727o78075q21908l78472n3346
6733A3400345J10937j73459l92113k35720M26751L75559K86884R08603K32448
6724A4940235J163513P05053J06323N18102k32885q33391o28181q58768j94447
6715A4685554n68827j195608j237018q12896p96790o95100k29062p84707q21595
$$ plain form
6779 13207752 13810425 13987501 14866263 15274376 15855286 16248487 16057608 15593510 15477181
6770 15477181 15306816 15017092 14253292 13790591 13864859 13879204 13042422 12603337 12439897 12998557
6760 12998557 13514187 13989977 14287467 15004141 15377948 15978108 16726488 17761394 19299444
6751 19299444 20597925 22193908 23183384 23572927 23496179 22999802 22096979 21356574 20871621
6742 20871621 19547035 18411643 17346501 16142873 15332146 14654071 13832163 13453691 13400345
6733 13400345 13511282 13337823 12945710 12709990 13136741 13512300 13799184 14707787 14940235
6724 14940235 16103748 16808801 16915124 17433226 17200341 16366950 15738769 14880001 14685554
6715 14685554 14116727 12921119 11684101 10871205 10074415 9379315 9150253 8365546 7543951
6706G543951l65966L8582n34443j4747m4437j40759k54387k77020J98694K62419
6696F411887K94815k85661p3180J100k42670k71889j74489p8136m65690p60900
6686D355187l63413m67482J93020K21270J60517n47083o28720n1592p9677P8307
6676B870334l51130M9249L33491j81501m21924M62178n51104J57622l15538O2423
6666B114100L28625l01382j3403j33824M55525L37663o03766j1836k51070l78419
6656A542213L54807m52715j51942k15790J67386J55604l50602J92084k04031j69851
6646H67163k60941r3894N8449J46143K39860K37526M16860K35635k96988l12254
6636A237559k0475j219j60071J60766k84787J55615M0202j55193K71632J83829
$$ plain form
6706 7543951 7177985 7216567 6682124 6667377 6622940 6482181 6227794 5950774 6149468 6411887
6696 6411887 6706702 6421041 6347861 6348961 6106291 5834402 5659913 5581777 5116087 4355187
6686 4355187 3991774 3524292 3717312 3938582 4099099 3552016 2923296 2871704 2792027 2870334
6676 2870334 2519204 2568453 2901944 2720443 2298519 2760697 2209593 2367215 2051677 2114100
6666 2114100 2442725 2141343 2127940 1994116 2449641 2787304 2183538 2171702 1920632 1542213
6656 1542213 1897020 1444305 1292363 1076573 1243959 1399563 1048961 1241045 1037014 867163
6646 867163 606222 512328 570777 716920 956780 1194306 1611166 1846801 1549813 1237559
6636 1237559 1217084 1215865 1055794 1216560 931773 1087388 1127590 972397 1244029 1427858
6626A427858k5600k39857K32925k4795n1756m91921J33589J54097P0162M7422
6616A232124L69429K26646O473q267n4473n10612M75738M1293k79454l21684Q10088
6605A987301k24806J66392K75474l15515l15386K46773O95128L94728M50563O1958
6595C422610m9244k8899l5835K32555j88398J74011k62582j97892Q8871J67883
6585C323080j19608l49075J53968o95456l37235J7943N27904J06074J77621J35333
6575B940549N6329M5479L64857m536N49899J75789Q12255P27118N32000l19128
6565E880611o78052p81702l52423J50412n33154J5713r4335n76234r7411P5484
6555C008909L71704m69342J76884k31328L32356M15519l32653l52170K75469P29092
$$ plain form
6626 1427858 1402258 1162401 1395326 1370531 1318775 826854 960443 1114540 1184702 1232124
6616 1232124 1601553 1828199 1834672 1826405 1771932 1261320 1737058 1778351 1498897 1177213 1987301
6605 1987301 1762495 1928887 2204361 1888846 1573460 1820233 2515361 2910089 3360652 3422610
6595 3422610 3373366 3344467 3308632 3541187 3352789 3526800 3264218 3066326 3155197 3323080
6585 3323080 3203472 2854397 3008365 2312909 1975674 1993617 2521521 2627595 2805216 2940549
6575 2940549 2996878 3042357 3407214 3402678 3952577 4128366 4940621 5667739 6199739 5880611
6565 5880611 5202559 4420857 4068434 4218846 3685692 3701405 3607070 3030836 2933425 3008909
6555 3008909 3380613 2911271 3088155 2856827 3189183 3604702 3272049 2919879 3195348 3924440
6545C924440J43564J11756L46850O58396J097367Q45998N11761j24681q22047
6536F693404n49000p97458l11954o92396r9068K6590o36126n64341j12390m59340
6526B497921l40928L53581J27609j27819J767O388k74432k46713L37725N36778
6516B871877R8090R7740L57221Q61659R07577P14089l10367k11282k69785n36832
6506D579987p33412q45847l22856r4738L8787L84846n0461o55598L7281k1170
6496B316819R7084o47118M7516m8944m36064L9723K76286j42137J46055k22670
6486A426550l4920L79127M30160J59323L99247L84159q76588l25891j66541N4430
6476A829056r7856Q2175k46858J6977L51516l18303o83586o9631J95115P2050
$$ plain form
6545 3924440 4068004 4179760 4526610 5185006 6282373 7128371 7640132 7515451 6693404
6536 6693404 6144404 5346946 5034992 4342596 4243528 4270118 3633992 3069651 2957261 2497921
6526 2497921 2156993 2510574 2638183 2510364 2512131 2518519 2244087 1997374 2335099 2871877
6516 2871877 2969967 3067707 3424928 4286587 5194164 5908253 5597886 5386604 5116819 4579987
6506 4579987 3846575 3000728 2677872 2583134 2621921 3006767 2956306 2300708 2337989 2316819
6496 2316819 2413903 1766785 1814301 1765357 1329293 1369016 1645302 1503165 1649220 1426550
6486 1426550 1391630 1770757 2200917 2360240 2759487 3143646 2267058 1941167 1774626 1829056
6476 1829056 1731200 1813375 1566517 1583494 1935010 1616707 933121 863490 1058605 1130655
6466A130655J96604m20621j91112j07631M01109j2240K43400o5272m22509O2908
6456H15291q309N80434J88296L20597o59866k70943n49497M19550N50617j59590
6446A226580L31586j55356l09915j83148L9476n89116J64860L26799K5369l51185
6436E25950L24509O9592l63369k55120L26482l72271L12999K90651j27405m83024
6426B48994k0877M10965K41347N74341N945p91726l96449K13791J74689L79337
6416A040357o35928k65988L01841L19495L21803l65928m0838L13474p6342o59303
6406B52643O97704J94234j52300j55827l4008l59428M75423k56843n24873O30477
6396G67202J47340N2917m27217K4214M96347k47769m23222L20150n4840J88300
$$ plain form
6466 1130655 1327259 906638 715526 607895 1009004 996764 1240164 1174892 752383 815291
6456 815291 806982 1387416 1575712 1896309 1236443 965500 416003 835553 1386170 1226580
6446 1226580 1558166 1402810 1092895 909747 949223 360107 524967 851766 877135 525950
6436 525950 850459 920051 556682 301562 628044 255773 568772 859423 732018 248994
6426 248994 228117 639082 880429 1454770 1460715 668989 272540 486331 661020 1040357
6416 1040357 404429 138441 440282 759777 1081580 715652 674814 988288 911946 252643
6406 252643 950347 1144581 992281 836454 802446 443018 918441 661598 136725 767202
6396 767202 914542 967459 540242 564456 1060803 813034 389812 709962 655122 843422
6386H43422j22997J72559k87141l233n0407J74279L4649O3590j03937N87849L74998
6375A683631K41692K37956l61942k91880N88783M04792m64217j51044j88377j5053
6365A684341L6226n16199M17122o49040j97156J98605l19105J74246J99575L83219
6355A411834j65884n71696k61733j98809J38479J5563N9055L25513l8451k92442
6345D21429K94207L5704j701o71546n73424P41423P93873l5813n62805n3190J34984
6334E23141l30007M8305J76923r0247K47541L9852r3549K46191K18736j60883
6324H26003j62605K0933k51619J38162R4492K4549k16673j41945K59167m713K92
6313E86043j94529J19427r4103L19965o1441L53326k62060j29024M07038j61685
$$ plain form
6386 843422 720425 892984 605843 602610 552203 726482 761131 824721 720784 1308633 1683631
6375 1683631 1925323 2163279 1801337 1509457 2098240 2503032 2038815 1887771 1699394 1684341
6365 1684341 1720567 1204368 1621490 972450 775294 973899 654794 829040 1028615 1411834
6355 1411834 1245950 674254 412521 213712 352191 367754 426809 752322 713871 421429
6345 421429 715636 751340 749639 78093 -495331 246092 1039965 1004152 441347 388157 523141
6334 523141 193134 241439 418362 328115 575656 615508 521959 768150 986886 826003
6324 826003 663398 684331 432712 570874 665366 689915 473242 331297 590464 585751 586043
6313 586043 391514 510941 416838 736803 675362 1028688 766628 637604 1044642 882957
6303H82957j85119j37883N00045K9623m08783p7412J80858j79553K74972j08344
6293G71361L58874M3524m17636L67351j67708l60926N6917K51375j46554O51380
6283A407958j18231j53780k18082j51848j3433L96387M3454r90196J16321N56191
6273H74741j60920K96091m82059K18686P07021k06178K99787J78443o15546J72122
6263A282188J62481M1668J26595k23473j43244M5192K2063Q11499j64260j49822
6253A810887J4951r9540j0065L32150r8825K37989L2485k97338m254O44800K97785
6242B861025o58462o0059J39089L18772Q5137k27121O8176l4507k24435L27421
6232B595036M8252K74046K92965K38005J10693M69369K25787j14536M31659l2186
$$ plain form
6303 882957 697838 559955 1060000 1089623 680840 603428 784286 604733 879705 771361
6293 771361 1130235 1173759 756123 1123474 955766 594840 651757 903132 756578 1407958
6283 1407958 1289727 1135947 917865 766017 752584 1148971 1192425 202229 318550 874741
6273 874741 713821 1009912 527853 746539 1453560 1247382 1547169 1725612 1110066 1282188
6263 1282188 1444669 1486337 1612932 1389459 1246215 1291407 1313470 2124969 1960709 1810887
6253 1810887 1825838 1726298 1716233 2048383 1949558 2187547 2220032 1922694 1918440 2563240 2861025
6242 2861025 2202563 2142504 2281593 2600365 2685502 2458381 2526557 2492050 2267615 2595036
6232 2595036 2643288 2917334 3210299 3448304 3558997 4028366 4254153 4139617 4571276 4539090
6222D539090J2749J02314M46727N49515K9793J54027O75802R72538J499360J714133
6212A0696048J865792K709752L529142K761438R15867j991353l963826l003915
6204A3518945k143547j845094j352205p63507j192711p0464m37679k70569m1894
6195E401275l41088n65542j62491o09940L18856K10211K02973K17331k77929k82604
6185D111052p5850l13397P62569k07292j39287Q2861j27867K71184m49226k37534
6175C677213M94502K81078M05692O1361K48431k10372j95649L0609N5258r087
6165D839036L06466L66841j10353l49176j13151K31509Q1290O14655O0611L98252
6155F325980p6130N41987J48690k04232j78688K75637M61510O96520N30973L5076
$$ plain form
6222 4539090 4551839 4654153 5100880 5650395 5680188 5834215 6510017 7482555 8981915 10696048
6212 10696048 12561840 15271592 18800734 21562172 22478039 20486686 16522860 13518945
6204 13518945 11375398 9530304 8178099 7414592 6221881 6151417 5713738 5443169 5401275
6195 5401275 5060187 4494645 4332154 3722214 4041070 4251281 4454254 4671585 4393656 4111052
6185 4111052 4035202 3721805 4484374 4277082 4137795 4220656 4092789 4363973 3914747 3677213
6175 3677213 4171715 4452793 4858485 4919846 5168277 4957905 4762256 4792865 4848123 4839036
6165 4839036 5145502 5512343 5401990 5052814 4939663 5171172 5252462 5867117 5927728 6325980
6155 6325980 6249850 6791837 6940527 6736295 6557607 6833244 7294754 7991274 8522247 8557323
6145H557323k41114J64010J119819P90483J05511P5789N51669P83258J004782
6136A2911530J052507R00088J774942J156709J349542J599100J226411J541312
6128B3512141J878318J191118L25442j9604N8630n18345r46011L441l69344N7245
6118B5173031o3445q29746p24240p36873n73321m98375j63433l11779k31053M7854
6108B1088620j92032L31069M50220L20979R26003O21447J678076P21159J302262
6099B7247803K303506J424100M18985P71415P59039o53647n69588j24667K48094
6090C1825040l85821j08473l6479O13995O79221O80303J18009R5948L91718M13728
6080C4287189j17658R9550L53294N62290Q46908Q57038L25157k3208l18763q67901
$$ plain form
6145 8557323 8316209 8480219 9600038 10390521 10496032 10571821 11123490 11906748 12911530
6136 12911530 13964037 14864125 16639067 17795776 19145318 20744418 21970829 23512141
6128 23512141 25390459 26581577 26907019 26887415 26946045 26427700 25481689 25485130 25115786 25173031
6118 25173031 25109586 24279840 23555600 22818727 22245406 21747031 21583598 21271819 21040766 21088620
6108 21088620 20896588 21227657 21677877 21998856 22924859 23546306 25224382 25945541 27247803
6099 27247803 29551309 30975409 31394394 32165809 32924848 32271201 31701613 31576946 31825040
6090 31825040 31439219 31330746 31294267 31908262 32587483 33267786 33385795 33481743 33873461 34287189
6080 34287189 34169531 34269081 34622375 35184665 36031573 36888611 37213768 37190560 36871797 36003896
6070C6003896j306312j851485k130175k033128j117006j074129n74087j292668
6062B4624906m36929o18027k28708L99855N26602J65554L80055L92767P95545
6053B6001620N62596R06566Q12995O01810m69446K70588Q55148L45530L38168
6044C0225575K3303p60947p33545k33102j686924j889382j505257j751979j620030
6035B0067712j086020k176577p14484j278807j361214j33443l84374j168067n46168
6026A1218558j85323j050530m19417k31981L3932N2905o20933N1215k90650N0338
6016H608114l75579j66222l8436m87506J73818N75763J76117o37332k67430L72862
6006G934169P3472p71304J01959L80732l82413q0157Q964m66693k83397L21877
$$ plain form
6070 36003896 34697584 32846099 30715924 28682796 27565790 26491661 25917574 24624906
6062 24624906 24187977 23569950 23341242 23741097 24267699 24433253 24813308 25206075 26001620
6053 26001620 26564216 27470782 28283777 28885587 28416141 28686729 29541877 29887407 30225575
6044 30225575 30248878 29487931 28754386 28521284 26834360 24944978 23439721 21687742 20067712
6035 20067712 18981692 16805115 16090631 14811824 13450610 13317167 12932793 11764726 11218558
6026 11218558 11033235 9982705 9563288 9331307 9365239 9418144 8797211 8848426 8557776 8608114
6016 8608114 8232535 8066313 8027877 7540371 7714189 8289952 8466069 7828737 7561307 7934169
6006 7934169 8007641 7236337 7338296 7719028 7336615 7256458 7265422 6798729 6515332 6837209
5996F837209j26548n64709L26818K35302k23500O83020L12763O7906Q9290L22366
5986G959917L64723P25824L17382Q05590J189249P90692J369005J332199N85093
5977A5439674J5813r02458o52840r64907q79138p83365l64054J53645J94622M29487
5967A1686479O48026l1540K34546O28479N07701Q28775R15113P50753N62773N33622
5957A7264727l32002j262175j081874q05072q71537k6309L4123j76074q9963k96931
5947A2356913p96279k93513p48596l35289J061814K28332j35091P44539N82884
5938A2665714J238135J127629M14101j078967j547744k188725j805609j311945
5930G512589n47223l88838l34878m36483m91541r0572m19199j55674J97260k00594
$$ plain form
5996 6837209 6710661 6145952 6472770 6708072 6484572 7167592 7480355 7548261 7637551 7959917
5986 7959917 8324640 9050464 9367846 10173436 11362685 12153377 13522382 14854581 15439674
5977 15439674 15455487 14553029 13900189 12935282 12056144 11272779 10908725 11062370 11256992 11686479
5967 11686479 12334505 12302965 12537511 13165990 13673691 14502466 15417579 16168332 16731105 17264727
5957 17264727 16932725 15670550 14588676 13783604 12912067 12885758 12919881 12743807 12653844 12356913
5947 12356913 11560634 11267121 10518525 10183236 11245050 11473382 11338291 12082830 12665714
5938 12665714 13903849 15031478 15445579 14366612 12818868 10630143 8824534 7512589
5930 7512589 6965366 6576528 6241650 5805167 5313626 5223054 4803855 4648181 4845441 4644847
5920D644847j82093j809l66889l63255k95214M45438l1512j00112M4985M8668
5910C843054k70495k57143K23621J56191l6969k57924K605j32817K40717K04807
5900C715647J20747k90050m44879K59408J54393k02007K11477L47616m31749l29445
5890C111158l01657K54700O33990k66148r47609J48261j69955j97820N23670j6307
5880B772283l32234l63535N33889N56113l04835N07369M93016N67858K49036o35378
5870D043582n3117k49179o34657p8473j25580J38172k74471l78141j40172n9222
5860B188742K91982n46135R6771O30832j70073Q7866K49324j9877l2683K49672
5850C026421l61746m06687K40763l6629l49410K54295M98399P02512O69013J4748
$$ plain form
5920 4644847 4462754 4460945 4094056 3730801 3435587 3881025 3849513 3749401 3794386 3843054
5910 3843054 3572559 3315416 3539037 3695228 3658259 3400335 3402940 3270123 3510840 3715647
5900 3715647 3836394 3546344 3101465 3360873 3515266 3313259 3524736 3872352 3440603 3111158
5890 3111158 2809501 3064201 3698191 3432043 2484434 2632695 2462740 2264920 2788590 2772283
5880 2772283 2440049 2076514 2610403 3166516 2861681 3369050 3862066 4429924 4678960 4043582
5870 4043582 3990465 3741286 3106629 3028156 2902576 3040748 2766277 2388136 2247964 2188742
5860 2188742 2480724 1934589 2031360 2662192 2492119 2579985 2829309 2809432 2776749 3026421
5850 3026421 2664675 2257988 2498751 2462122 2112712 2367007 2865406 3567918 4236931 4251679
5840D251679L12622k35877n31773p10490k20582Q6102O7825q74111k98667Q0624
5830A927352L83198j77029N32543j07835L20514J47046n76210k7754j1928j51141
5820B258756m59634n75539J25635O12211O03611m66146O9419Q97743M16297m9199
5810C433154m39015M85667j89860J87772K44753m03315n36222o370k54886K78214
5800B799892J39681N3840l53750l61264K76326j09450k96664O38079K66786J44982
5790C198458K51967m09564m10325L06004l7671J59435p9525k86418J67483N02248
5780C362092k7478J07469p6195K89194L079m58333L30504J20043M14899k42294
5770C822980l57484O2446K17427N82538L9420j72449l40219M29514L71333r1023
$$ plain form
5840 4251679 4564301 4328424 3796651 3086161 2865579 2951681 3019506 2145395 1846728 1927352
5830 1927352 2310550 2133521 2666064 2558229 2878743 3025789 2449579 2421825 2409897 2258756
5820 2258756 1799122 1223583 1349218 1961429 2565040 2098894 2168313 3066056 3482353 3433154
5810 3433154 2994139 3479806 3289946 3477718 3722471 3319156 2782934 2776564 2521678 2799892
5800 2799892 2939573 2993413 2639663 2278399 2554725 2445275 2148611 2786690 3053476 3198458
5790 3198458 3450425 3040861 2630536 2936540 2898869 3058304 2978779 2692361 2859844 3362092
5780 3362092 3334614 3442083 3365888 3655082 3658161 3199828 3530332 3650375 4065274 3822980
5770 3822980 3465496 3527942 3745369 4327907 4367327 4194878 3854659 4284173 4655506 4564483
5760D564483k20388j55975N0718L80933j77264j15314K09752O7950M51047M14833
5750E470775J62568j79056M67619M22088k11096M830J72897P7202J86423L46456
5740F920706K10094J57264L17262L38688N46569J39585k47289k35479L88143P68440
5730I303983N69848O26557K1774L4862P62659N63689M10895L88756R23636K22704
5720A3829363J11915J056118J516433J131959J336918J070090Q64649J698610
5712B2616055J810435J222606J308742K057923J412740O03713O84003L5339p58
5703C1750798J65300m79074Q0584l49100m76735k24127l60982j00515j46285j86989
5693B9672875J8036L50757n71634J93343R32127R7918R39869R30067J079363K35180
$$ plain form
5760 4564483 4344095 4188120 4238838 4619771 4442507 4327193 4536945 4604895 5055942 5470775
5750 5470775 5633343 5454287 5921906 6343994 6132898 6137728 6310625 6387827 6574250 6920706
5740 6920706 7130800 7288064 7605326 7944014 8490583 8630168 8382879 8147400 8535543 9303983
5730 9303983 9873831 10500388 10522162 10557024 11319683 11883372 12294267 12683023 13606659 13829363
5720 13829363 13941278 14997396 16513829 17645788 18982706 20052796 20917445 22616055
5712 22616055 24426490 25649096 26957838 29015761 30428501 31032214 31716217 31751556 31750798
5703 31750798 31916098 31437024 31517608 31168508 30691773 30467646 30106664 30006149 29859864 29672875
5693 29672875 29690911 30041668 29470034 29663377 30595504 30693422 31633291 32563358 33642721 33877901
5683C3877901P19265O95222K58827J53134k62904o21139o03800m44862p76254
5674C2995390o71148n14206j46194r7527k45121j261800l86666l57309K87814
5665B9603233Q02601Q2817l6228l9342L62287N27342N50739m4660k46913N74469
5655C2136345K65037j15109p09603l4855l07759o97344j710802j139962k70968
5646B7414980P8310o74336k79751j35655M4609K03803m9113O36476J29871J13798
5636B7482992Q3467m4573L92163M9960O9723K11565O78768M61926j31602q14639
5626B8439750j137986o28531n60132p53928m41241l50576M95719O34998j07308
5617B5590765K19622q38732j235068k222024j579887j001504l27103q50000k26044
$$ plain form
5683 33877901 34597166 35292388 35551215 35704349 35441445 34820306 34216506 33771644 32995390
5674 32995390 32324242 31810036 31663842 31566315 31321194 30059394 29672728 29315419 29603233
5665 29603233 30405834 30488651 30452423 30413081 30775368 31302710 31853449 31808789 31561876 32136345
5655 32136345 32401382 32286273 31576670 31541815 31234056 30536712 28825910 27685948 27414980
5646 27414980 27493290 26818954 26539203 26403548 26448157 26651960 26602847 27239323 27369194 27482992
5636 27482992 27566459 27521886 27914049 27964009 28033732 28245297 28924065 29385991 29254389 28439750
5626 28439750 27301764 26673233 26113101 25359173 24917932 24567356 25063075 25698073 25590765
5617 25590765 25810387 24971655 23736587 21514563 19934676 18933172 18606069 17756069 17530025
5608A7530025k53821n1683J92514q20484M3735J71737L9829K28842K66113L57624
5598A7704431L70158J66315M67021J15774m58175r83192j376250m60476n76887
5589A4968719p74338r80428m40778K61612m89394m15259p34318n17290j42411
5580A0736115q0732J260690Q17686Q9601J59885N6612q48780q44526j003848r42739
5570I399964j170376r92810l26321n63106q08363n50764k72490l9042J62028K84886
5560E123606o96773j06706L38682j03580o94510L30965k52984k85246J08446m0729
5550C721171j39931n50777l57777J41436P9346M0788K90984l59376K05720N4121
5540C125705k14138m11767k07574L24716Q1643j33084l49457J87438J86916m51220
$$ plain form
5608 17530025 17276204 17224521 17417035 16596551 16640286 16812023 16851852 17080694 17346807 17704431
5598 17704431 18074589 18240904 18707925 18823699 18365524 17382332 16006082 15545606 14968719
5589 14968719 14194381 13213953 12773175 13034787 12545393 12130134 11395816 10878526 10736115
5580 10736115 10655383 11916073 12733759 12823360 12983245 13039857 12191077 11346551 10342703 9399964
5570 9399964 8229588 7236778 6910457 6347351 5538988 4988224 4715734 4676692 4838720 5123606
5560 5123606 4426833 4320127 4658809 4555229 3860719 4191684 3938700 3653454 3761900 3721171
5550 3721171 3581240 3030463 2672686 2814122 2893468 2934256 3225240 2865864 3071584 3125705
5540 3125705 2911567 2499800 2292226 2616942 2698585 2565501 2216044 2403482 2590398 2139178
5530B139178K62922l39560M51822j15566j87704P387J92436k66304k24844j07721
5520A812046M747L57098J84096j05961K2426o7582n99363N22451j40961m61397
5510A527600j59510J90361O8879J62002K10017k46932m93945n09179M68806J61576
5500A379675m32272K26649J73442k27142N23838K49476l34369N4765j67260k76223
5490A170579n7152j44794j34817k31127N38459L42609N4736l30689L3197l1915
5480A209086L3808K4658r2664K57620J30007k99706k95568J45860m4945k36739
5470H31417k47739J45603N22842K91540j91773r3661M28632l08338m2777m254
5460A331492M189L89345j18700l9957Q1901l96353K87736l42548M7276L52392
$$ plain form
5530 2139178 2402100 2062540 2514362 2398796 2211092 2218479 2410915 2144611 1919767 1812046
5520 1812046 1816793 2173891 2357987 2252026 2274452 2206870 1607507 2129958 1988997 1527600
5510 1527600 1368090 1558451 1627330 1789332 1999349 1752417 1258472 749293 1218099 1379675
5500 1379675 947403 1174052 1347494 1120352 1644190 1893666 1559297 1614062 1446802 1170579
5490 1170579 1113427 968633 833816 602689 1141148 1483757 1538493 1207804 1241001 1209086
5480 1209086 1242894 1267552 1174888 1432508 1562515 1262809 967241 1113101 1068156 831417
5470 831417 583678 729281 1252123 1543663 1351890 1258229 1686861 1378523 1335746 1331492
5460 1331492 1335681 1725026 1606326 1566369 1648270 1251917 1539653 1197105 1244381 1596773
5450A596773j14267j09468n8630j270J70769K91068l74402K69395J01188Q2821
5440A853977j93869K93785k28979J8449j15722j7731k11862l62610O25513J02244
5430A763195M18588M5646l01574j79597K97643R9339k28573K9218l96121l06524
5420A241240k6484K56641L213o2287k35692j24084J53253o25170L59036K77709
5410A217375P0096K04765m0494j27705K0354o9164k34907K45031J41681M08421
5400A835453J66405k50872l58031J02178m78105j99076K31065J50715K29138K8288
5390A457158j89674l41910L28301j66414o676q854m88021j37728L2235M95945
5380I74362L78Q4548M63640k01059m85485k7409K41827L04382l02818K5006l17975
$$ plain form
5450 1596773 1482506 1373038 1314408 1313138 1483907 1774975 1400573 1669968 1771156 1853977
5440 1853977 1660108 1953893 1724914 1743363 1627641 1609910 1398048 1035438 1660951 1763195
5430 1763195 2181783 2227429 1925855 1746258 2043901 2143240 1914667 1943885 1547764 1241240
5420 1241240 1214756 1471397 1474610 1412323 1176631 1052547 1205800 580630 939666 1217375
5410 1217375 1287471 1492236 1451742 1324037 1344391 1275227 1040320 1285351 1427032 1835453
5400 1835453 2001858 1750986 1392955 1495133 1017028 817952 1049017 1199732 1428870 1457158
5390 1457158 1267484 925574 1253875 1087461 1080785 1071931 583910 446182 478417 974362
5380 974362 974740 1059288 1522928 1321869 836384 808975 1050802 1355184 1052366 1077372 759397
5369G59397K03941m62075J09257K09177j31241J58878K00165l6814j24933M86039
5359A371791J89227l99142j53263O1856K33125j87103m08119K43746j86073J6176
5349G82221N34498m0630K82460r4847J44559k1004K36208o41497J11833J00044
5339A393845p34342N45981J07549k9887m46374m194K74228m51911K43941J95551
5329A094387J15299K22103n66592k70474j02483K00835J63484J55688n51986M48653
5319I08914j77729l55989K80847M74383l7301k4079N8117j36393j47900k08112
5309F34758k07355P91864j63923j27837O6065k16842j63814r2910N48220q3721
5299I84505J39072j28436J32456K71382r0622P0912q5192j60103k57573K48880
$$ plain form
5369 759397 963338 501263 610520 819697 688456 847334 1047499 1010685 885752 1371791
5359 1371791 1561018 1161876 1008613 1070469 1303594 1116491 708372 952118 766045 782221
5349 782221 1316719 1276089 1558549 1463702 1608261 1587257 1823465 1181968 1293801 1393845
5339 1393845 659503 1205484 1313033 1283146 836772 832578 1106806 654895 898836 1094387
5329 1094387 1209686 1431789 865197 594723 492240 693075 856559 1012247 460261 908914
5319 908914 731185 375196 656043 1130426 1093125 1069046 1127163 990770 842870 634758
5309 634758 427403 1219267 1055344 927507 993572 776730 612916 520006 1068226 984505
5299 984505 1123577 995141 1127597 1398979 1308357 1379269 1294077 1133974 876401 1125281
5289A125281j55607J90947j88041M57128l43105k06525l68017j19650o720P1448
5279D57139K69426K36693K28192n35260j29434l06343k93430P64279N0139n60409
5269A80992N32434L23370j60149L5632l33453k12798M22904n50325J4311J92913
5259D45831J45254M7665K86167j56536o4291J52324o23981q3658L24449M0056
5249E13280M52953l092n639L591L1740k60408l83507k94172O1213K44816J26582
5238D87357j78995N04138J89632m48197J47127k96741M7732M42584J86825l44168
5228G37294o12068K27702J78071J01727L68607n98988k23921K21489j84782j77492
5218C7639J35788J97003l98012J47977M72658L7627j55521L24879n82483O5161
$$ plain form
5289 1125281 969674 1160621 972580 1429708 1086603 880078 512061 392411 385691 457139
5279 457139 726565 963258 1191450 656190 526756 220413 -73017 691262 741401 180992
5269 180992 713426 1036796 876647 912279 578826 366028 788932 238607 252918 445831
5259 445831 591085 638750 924917 768381 704090 856414 232433 148775 473224 513280
5249 513280 966233 963141 957502 961093 992833 732425 348918 54746 115959 360775 487357
5238 487357 308362 812500 1002132 553935 701062 404321 452053 894637 1081462 737294
5228 737294 125226 352928 530999 632726 1001333 402345 178424 399913 215131 37639
5218 37639 173427 370430 -27582 120395 593053 630680 475159 800038 217555 282716
5208B82716K83920J34296k65915P552j42541J27534j20610K07455Q4475m67018
5198A31864J04342J80384J62781j09322J10322K14922o21528j11125J60796K61938
5188D85374l50756l90969R90357j15042l53691M1230L02363j79182l20304m99799
5178c90419O61799J36660k04492J23063J63L2801K54418k50326l88226L35478
5168C10919n4013k07847K25932k34699N0980K71385N47493M67112o37003m15489
5158C24770K33062J35523j00969j28780n94090J41461N06299k75408Q3390k5883
5148B99375K30127L87814J11752n33915Q9591k7520K30891l60618n10168N6856
5138b5815j01140N00525N44227n05320j66121J73805k14627K80892k58937J08944
$$ plain form
5208 282716 566636 700932 435017 442569 300028 427562 306952 514407 598882 131864
5198 131864 236206 416590 579371 470049 580371 795293 173765 62640 223436 485374
5188 485374 134618 -256351 734006 618964 265273 306503 608866 429684 109380 -390419
5178 -390419 271380 408040 203548 326611 326774 359575 613993 363667 -24559 310919
5168 310919 256906 49059 274991 40292 91272 362657 910150 1377262 740259 324770
5158 324770 557832 693355 592386 463606 -130484 10977 517276 241868 325258 299375
5148 299375 529502 917316 1029068 495153 584744 557224 788115 427497 -82671 -25815
5138 -25815 -126955 373570 917797 412477 246356 420161 205534 486426 227489 336433
5128C36433k80712J72596O89412R4657l73909j68548j9195j74004o7625N32144
5118G41249m01340K34683J69292L6979k37337k53579K31942k71237K5292m19701
5108a43757J14685L06634j7550P02325j1969m07267k59996j29417J22778J94287
5098D70753M6418l1540L99428k77467K71132r0254k74552L53029l16476k32799
5088C17672L28196k97182K66796q0272M4898l2847K49430J34794n10287j79922
5078B41276k49725J23342J43663J16063j40027L29901K11520j03889m9102p6031
5068E46991p83019M86795N49109k86995m02093J71912L57232K4722m87993L14379
5058D91040L92427j41987O7426l78779O93015j60607K6941J26369m35669O8564
$$ plain form
5128 336433 55721 228317 917729 1012386 638477 469929 450734 276730 209105 741249
5118 741249 339909 574592 743884 780863 543526 289947 521889 250652 275944 -143757
5108 -143757 -29072 277562 260012 962337 950368 543101 283105 153688 276466 470753
5098 470753 517171 485631 885059 607592 878724 788470 513918 866947 550471 317672
5088 317672 645868 348686 615482 535210 580108 547261 796691 931485 421198 241276
5078 241276 -8449 114893 258556 374619 234592 564493 776013 672124 623022 546991
5068 546991 -236028 250767 799876 512881 110788 282700 639932 664654 176661 491040
5058 491040 883467 741480 808906 430127 1123142 962535 989476 1115845 680176 748740
5048G48740l83679j26735K88350l5937K5953n83450J4099K68186M41253n4557
5038F02223p8212k76580j39857M55729l04387N19879O03424r3202P6170R681k62367
5027A112501l26899k06798j42514p1686k30885O01630N1611R6255k77949l51958
5017B53308j87941K44084P40595L48526p10032k48203J99395O0879k01840j31370
5007C67401M74266p66151O6530K3538q5414m961j9351O8069L11175j49396j71625
4996A14081j61519K0572M05999L4606m2986L70245M2943o1974L474J03778l05521
4985E23698J95644k26754J41514K74040N1195l89977Q7662j63057k34022J39361
4975C99304l3550J7207r6842L42584l90136m0106J96655p8101K49737J12313k15727
$$ plain form
5048 748740 365061 238326 526676 490739 516692 -66758 -52659 215527 656780 602223
5038 602223 524011 247431 107574 563303 258916 778795 1382219 1289017 1365187 1374868 1112501
5027 1112501 785602 578804 436290 364604 133719 735349 786960 883215 605266 253308
5017 253308 65367 309451 1050046 1398572 688540 440337 639732 700611 498771 367401
5007 367401 841667 75516 142046 165584 80170 75209 55858 123927 435102 285706 114081
4996 114081 -47438 -26866 379133 413739 370753 740998 783941 721967 725441 829219 523698
4985 523698 719342 492588 634102 908142 959337 569360 657022 493965 259943 399304
4975 399304 365754 382961 286119 628703 238567 198461 395116 317015 566752 679065 463338
4964D63338L59762o6717l77452o6219K21746J7564J43302k06160L19069O5478
4954H73711l54043k04035j92966K80319J38933k44459O2053L23761o0116j53309
4944D69849k70360K90534k73809r3808j98644L96050j44816l62694L95175L6540
4934B44017l14868L75744q5604N02743M56273p14795l34333J65124O1404m44677
4924h8972j4738k26152K86163l4850L04692K91198j50974q236J58478l24307K0333
4913B12635J64892l02857K14459L05092k71693m49006N9315K1501K24193L84153
4903E62684p6128o46007P092M92844o9029o5438m32036M91970l1550Q1804o18441
4892c02235k87801j2009Q20398K55461k98540j50498m28350N72284K70489K9695
$$ plain form
4964 463338 823100 756383 378931 312712 534458 552022 695324 489164 808233 873711
4954 873711 519668 315633 122667 402986 541919 297460 359513 683274 623158 469849
4944 469849 199489 490023 216214 122406 -76238 319812 174996 -187698 207477 244017
4934 244017 -70851 304893 219289 722032 1178305 463510 129177 294301 355705 -88972
4924 -88972 -103710 -329862 -43699 -78549 226143 517341 366367 358131 516609 192302 212635
4913 212635 377527 74670 289129 594221 322528 -126478 -67163 -45662 178531 562684
4903 562684 486556 -159451 -152359 340485 271456 206018 -226018 265952 234402 316206 -302235
4892 -302235 -590036 -602045 218353 473814 175274 24776 -403574 168710 439199 468894
4882D68894j60880J35367J77462l2960o6135M6635j96632J11242P4068J75201
4872G32262k37546K02802J29430k80870L30209J33033J46798j02167m41589L72371
4862I84733j13920l10585L44030K3112N84741j47690J60380m18667l98790l17211
4852C90133p9828k01589P4948N02178l63387J52125m641o9498j77064J55447l06983
4841G1841N58303K86800l55774l5762l304J7742m8702l91613J51045j21207j28367
4830A002N86645m2916l36466M7046j74073K28752K02216n15192l44587J09739
4820b37834M85093K44163J99135n3718k04718L80665k87802j8263K7440j99842
4810C34319r3295J7646k19872M3049L12949l27541K84623K20653m19376J79380
$$ plain form
4882 468894 308014 443381 620843 587883 521748 568383 371751 482993 557061 732262
4872 732262 494716 697518 826948 546078 876287 1009320 1156118 1053951 612362 984733
4862 984733 870813 560228 904258 927370 1512111 1364421 1524801 1106134 707344 390133
4852 390133 310305 108716 183664 685842 322455 474580 469939 400441 223377 378824 71841
4841 71841 630144 916944 561170 525408 522104 539846 491144 99531 250576 129369 1002
4830 1002 587647 544731 208265 255311 81238 309990 512206 -2986 -347573 -237834
4820 -237834 247259 491422 690557 636839 432121 812786 524984 506721 534161 334319
4810 334319 241024 258670 38798 81847 394796 67255 351878 572531 153155 332535
4800C32535N61645j40293k6504l1762l47954j56707N96766J73844q8219M6231
4790I19582M4736l04315J58119K75970Q810p1932q3678m4697j20451k8391k90357
4779D63396L40531Q4518n76470m29233O71052J9068M9544J72104L84660j08127
4769A071043p9046J34404l18286j52704j71332k13670K33847J19559k24649j45622
4759B53544m64598J22176J15172Q223L30155L92850J03977o58500n89475O77145
4749B90669J15223j46331j71016M48631N7720j3886J33098k41308J20520K94556
4739H87876j57829J98045l04168k16200k33585j89682N878K08006J6887K09164
4729D24392j52647K58531n78704m00980L93063l35813O54932j01659n7829j47443
$$ plain form
4800 332535 894180 753887 727383 695621 347667 190960 787726 961570 873351 919582
4790 919582 964318 660003 818122 1094092 1102902 1030970 947292 902595 782144 753753 463396
4779 463396 803927 888445 311975 -117258 553794 572862 622406 794510 1179170 1071043
4769 1071043 991997 1126401 808115 655411 484079 270409 504256 623815 399166 253544
4759 253544 -211054 -88878 26294 34517 364672 757522 861499 202999 -386476 290669
4749 290669 405892 259561 88545 537176 594896 581010 714108 472800 593320 887876
4739 887876 730047 928092 623924 407724 174139 -15543 -9665 198341 215228 424392
4729 424392 271745 530276 -48428 -449408 -56345 -392158 262774 161115 103286 -44157
4719d4157J1830L47610O78010m11727j5128J52813K5487j30700k92984J84348
4709E05402O8441m99882j93676p7775L06558L88104n582K14102K59863p40553
4699B25002Q6200j03522L39180J74807m63922r7981k7055J35656J37679J02290
4689E08334q8207R0382J42505k54745n03774L57837j19368M5908K06785L32255
4679G17912P4899m77841k46275N10166j32208l11445j69408r7633J83729K02570
4669B54466M7086M90310m8375k33255N32256n06950m69660j2477m7571K90133
4659B95963q1993j66521k87624N98809O15501k89436j83951j84534L14551J4316
4649F45081l28815J46294k74082J43109J03307N8305n38922m878J98879P1418
$$ plain form
4719 -44157 -32327 315283 993293 581566 566438 719251 744738 614038 321054 505402
4709 505402 573843 73961 -119715 -197490 109068 497172 491590 705692 965555 225002
4699 225002 311202 207680 546860 721667 257745 159764 132709 268365 406044 508334
4689 508334 420127 510509 653014 398269 -105505 252332 132964 178872 385657 717912
4679 717912 792811 314970 68695 578861 446653 135208 -34200 -131833 51896 254466
4669 254466 301552 791862 743487 510232 1042488 535538 65878 53401 5830 295963
4659 295963 213970 47449 -240175 358634 974135 684699 500748 316214 630765 645081
4649 645081 316266 462560 188478 331587 434894 493199 -45723 -50601 148278 219696
4639B19696N1621j70553k08541J8986O29964j15317l03083L66393m52966R2046
4629A28246K68387p3500k45108k91662K20280J91870J34748o5250m69009K3872
4619a77126L4364Q5169L88616J88650J03943K9871p2001k42330l4551j58756K72434
4608D18283Q5700n0700J48005m02061L50579K66890o87961Q3937L86327O9257
4598F68256k63414K35043n84481L75697p1913j90580q8068J53999K08109m84952
4588d2304m50456O98334K85532k66752l48171N5765l1310K77558k73681m26331
4578e21816P54352J49799j95281j06954K9686L78526J58979l70962J37993l24604
4568H9718J25124L07141K31860o42635l31488N0407J2589N55750j81575m57026
$$ plain form
4639 219696 271317 100764 -107777 -88791 541173 425856 122773 489166 36200 128246
4629 128246 396633 323133 78025 -213637 6643 198513 333261 268011 -200998 -177126
4619 -177126 -142762 -57593 331023 519673 623616 653487 581486 339156 304605 145849 418283
4608 418283 503983 453283 601288 199227 549806 816696 128735 212672 598999 668256
4598 668256 404842 639885 55404 431101 359188 168608 80540 234539 442648 -42304
4588 -42304 -492760 205574 491106 224354 -123817 -68052 -99362 178196 -95485 -521816
4578 -521816 232536 382335 187054 80100 109786 488312 647291 276329 414322 89718
4568 89718 214842 521983 753843 111208 -220280 -169873 -157284 398466 216891 -240135
4558b40135N37061k06230P92229K9966l01599O30015l62767P9348m33967k35244
4548B88677P10690r0415k67515L6472n51688M53246K64755o6962k7911l4049l42419
4537C72881K76025l02976K44890L31064l04301q5072L6111R2537n9940l8260k49552
4526C13407o4795J09165j47182K83169O47501n20060j57359j24212J43748M31472
4516I14854k87016O680j02523k70104J31586J09844m04295L4046M77045n7875
4506E52242J14346j44949K58321m7654J69924j66273J12474K02584j18695k34
4496I32086k03340j05137J86795J83424K347Q4680n1893j20784m9263o54582j0084
4485A94249M53505L33381j0803J06273J91197k9986R2808L97620m57643l8501
$$ plain form
4558 -240135 296926 90696 882925 912891 611292 1241307 878540 957888 523921 288677
4548 288677 999367 908952 641437 677909 126221 579467 844222 777260 749349 715300 372881
4537 372881 648906 345930 590820 921884 617583 532511 568622 661159 601219 562959 313407
4526 313407 248612 357777 210595 493764 1141265 621205 463846 339634 483382 914854
4516 914854 627838 634518 531995 261891 393477 503321 99026 133072 610117 552242
4506 552242 666588 521639 779960 732306 902230 735957 848431 1051015 932320 932086
4496 932086 728746 623609 810404 993828 996175 1080855 1028962 908178 858915 204333 194249
4485 194249 647754 981135 970332 1076605 1267802 1237816 1330624 1728244 1270601 1232100
4475A232100j15638P1849J20343j13835l90599L539O39609L06110k43714k35520
4465A274244J80138k55536L28708j3613j30618l98968L38350o1249J88664J73075
4455A623195n3368m81064k97793K83345K65565L08501O7152n95005o8288J65547
4445A217787L83473K62818k19293K10800O19442K4127k86548K50173j534j41181
4435B320064O3436j69961J70605J63166k26457k39715j97921O6106q8156j91407
4425A669760n72949J12004J55447R0665M69911L04457j63700m37014j65213L32282
4415A795650j0201l1539K46231k25807K97773l56427j73318J15215O66k48568
4405A409675m3784M63325l02309k74041R596M17618L09971j86544O0892k64392
$$ plain form
4475 1232100 1116462 1188311 1308654 1194819 804220 807759 1447368 1753478 1509764 1274244
4465 1274244 1454382 1198846 1527554 1513941 1383323 984355 1322705 1261456 1450120 1623195
4455 1623195 1569827 1088763 790970 1074315 1339880 1648381 1715533 1120528 1052240 1217787
4445 1217787 1601260 1864078 1644785 1855585 2475027 2499154 2212606 2462779 2461245 2320064
4435 2320064 2383500 2213539 2384144 2547310 2320853 2081138 1883217 1949323 1861167 1669760
4425 1669760 1096811 1208815 1364262 1454927 1924838 2229295 2065595 1628581 1463368 1795650
4415 1795650 1785449 1753910 2000141 1774334 2072107 1715680 1542362 1657577 1658243 1409675
4405 1409675 1365891 1829216 1526907 1252866 1262462 1680080 1990051 1803507 1864399 1600007
4395A600007l45666L37036k392O46247Q2734m32264K29505M6632l51721K96805
4385B106923o1386K69951k04233m41508Q2850j35860o9568L00338K3111J7245
4375A887863j17901l22956r3320K05699j18758P7341M24904k06790J06682j09072
4365A733692J10201j18377K25467O18j30593n04697K07169L42702n27261Q8776
4355A427697K85436L32741K21107l24903l93408N52949L84296o45203n4238J44913
4345A931387k9067m11574K45933K20542J12209l67946r35N10685j19131J74185
4335B266288j3121n54770K25087k15223l46543N38434j58391o6764Q8403K95925
4325B059325K6J43621p2490m90480K91270K73723M75510J28137L1946L60898O275
$$ plain form
4395 1600007 1254341 1591377 1588985 2235232 2317966 1885702 2115207 2161839 1810118 2106923
4385 2106923 2045537 2315488 2111255 1669747 1752597 1616737 1547169 1847507 1870618 1887863
4375 1887863 1769962 1447006 1353686 1559385 1440627 1517968 1942872 1736082 1842764 1733692
4365 1733692 1843893 1725516 1950983 1951601 1821008 1316311 1523480 1866182 1338921 1427697
4355 1427697 1713133 2045874 2266981 1942078 1548670 2101619 2485915 1840712 1786474 1931387
4345 1931387 1902320 1490746 1736679 1957221 2069430 1701484 1700549 2211234 2092103 2266288
4335 2266288 2253167 1698397 1923484 1708261 1361718 1900152 1741761 1674997 1763400 2059325
4325 2059325 2059351 2202972 2130482 1640002 1931272 2204995 2680505 2808642 2840588 3201486 3207761
4314C207761R3903l79811n64257J56705M88309j23599n7673L12746J2193j10091
4304C036186k65362k40837K85553L42152j33384k75747M50012L8237M56164L46210
4294D039184m6995K1133m70469j14690K95162L28076N13855l96791j39293L34126
4284D363298M19857K36233k25166k53869P5360J06794K27651M53756L19478O5951
4274E789343J52766O56284O21875L84379M48314Q10794M71950R95429k13796o08829
4264I508509q98168o88327m12000o34702K7441m03666j29586Q8171j58983P2378
4254F371067L48570J16983k64323K31013K20704k80948k11315j54864N92515J65677
4244G135079J82229J47329Q6619M78361k00670K08883l9148n5162K003J64932
$$ plain form
4314 3207761 3301664 2921853 2357596 2514301 3002610 2879011 2821338 3134084 3146277 3036186
4304 3036186 2770824 2529987 2815540 3157692 3024308 2748561 3198573 3236810 3692974 4039184
4294 4039184 3992189 4013322 3542853 3428163 3723325 4051401 4565256 4168465 4029172 4363298
4284 4363298 4783155 5019388 4794222 4540353 4615713 4722507 4950158 5403914 5723392 5789343
4274 5789343 5942109 6598393 7220268 7604647 8052961 8863755 9335705 10331134 10117338 9508509
4264 9508509 8610341 7922014 7510014 6875312 6902753 6499087 6369501 6457672 6298689 6371067
4254 6371067 6719637 6836620 6572297 6803310 7024014 6743066 6531751 6376887 6969402 7135079
4244 7135079 7317308 7464637 7551256 8029617 7828947 8037830 7998682 7943520 7945523 8110455
4234H110455L06735j44156K85134j04470J44247M65051M71845k8302k17151l51685
4224H937703L64172P30756K39937k27106L31691N14469K21157J32823m87009O95669
4214A1454262K36304l51909P41309M36559K29426m0479M68266n6371M14431M79153
4204A4010951j19685M46885O45310O34826L90055N72417N52589J82136k43665
4195A7071819J02557Q01245J053599Q27822j35664P12948P36379K70768R60829
4186B2402302O19069O42619O70213J089949Q97908J690364J017395J099023J598908
4177C1727750J417417J077529J462614K359526J854779J749747K348008K044141
4169D6041511K175551K654247L768266L603177M296362M364560N706067N779753
$$ plain form
4234 8110455 8417190 8273034 8558168 8453698 8597945 9062996 9534841 9506539 9289388 8937703
4224 8937703 9301875 10032631 10272568 10045462 10377153 10891622 11112779 11245602 10758593 11454262
4214 11454262 11690566 11338657 12079966 12516525 12745951 12705472 13173738 13117367 13531798 14010951
4204 14010951 13891266 14338151 14983461 15618287 16008342 16580759 17133348 17315484 17071819
4195 17071819 17174376 17975621 19029220 19857042 19721378 20434326 21170705 21441473 22402302
4186 22402302 23021371 23663990 24334203 25424152 26322060 28012424 29029819 30128842 31727750
4177 31727750 33145167 34222696 35685310 38044836 39899615 41649362 43997370 46041511
4169 46041511 48217062 50871309 54639575 58242752 62539114 66903674 72609741 78389494
4161G8389494N782973N832907O087687P498493R141134J2825192J7241818K2540621
4153A65340319K7353344L1949873L1437569K1404730J204993k0266852l2924491
4146B25499485l4016041k8109643k1847708j5702577j1312289q341995o557374
4139I9611858m524496l325135k114150k013692j029129m06819o10674j50411n12431
4130H4924921k48619N22744K60134K81616R16125L58630O60071P89206N09409
4121H8974237P12108P67653K85940R40561j15843O19893J15561r1478j4640m46144
4111I1747848R4179k20940j520439o00004m35762r16317j375719j824978j235907
4102H3711961j358801j316902j199725j388764j890829k242067k087001k332165
$$ plain form
4161 78389494 84172467 90005374 96093061 103591554 112732688 125557880 142799698 165340319
4153 165340319 192693663 224643536 256081105 277485835 278690828 258423976 225499485
4146 225499485 191483444 163373801 141526093 125823516 114511227 106169232 99611858
4139 99611858 95087362 91762227 89648077 87634385 86605256 86198437 85587763 85437352 84924921
4130 84924921 84676302 85199046 85459180 85740796 86656921 87015551 87675622 88464828 88974237
4121 88974237 89686345 90453998 90739938 91680499 91564656 92184549 92300110 92208632 92193992 91747848
4111 91747848 91842027 91621087 90100648 89500644 89064882 88148565 86772846 84947868 83711961
4102 83711961 82353160 81036258 79836533 78447769 76556940 74314873 72227872 69895707
4094F9895707j720810k220715j603741k489554k572034k012369k099244k305965
4086E2871275k259675j956653j912296j564065j822847j751337j677913j744282
4078C8182207j283137j854273j247054j693814j735311j471869j363381j258765
4070B6274603p07237p25667j367619o20019j102483l92439p88887j074726r19518
4061A8576008k55897m35557m04154m64824j32604r36425p88371k78241n5898j87499
4051A4636538p79242j46657J1308k43972l61892k57065K84773k92988m55524k47206
4041A2148073m9498K03639k60833n58266l32425p02663k51952n5661k53485O89783
4031A0576712k97270o57257J76495l12673K52723N3427m62976J78073P780m46274
$$ plain form
4094 69895707 68174897 65954182 64350441 61860887 59288853 57276484 55177240 52871275
4086 52871275 50611600 48654947 46742651 45178586 43355739 41604402 39926489 38182207
4078 38182207 36899070 35044797 33797743 32103929 30368618 28896749 27533368 26274603
4070 26274603 25567366 24841699 23474080 22854061 21751578 21359139 20570252 19495526 18576008
4061 18576008 18320111 17884554 17480400 17015576 16882972 15946547 15158176 14879935 14824037 14636538
4051 14636538 13857296 13710639 13721947 13477975 13116083 12859018 13143791 12850803 12395279 12148073
4041 12148073 12098575 12302214 12041381 11483115 11150690 10448027 10196075 10140414 9886929 10576712
4031 10576712 10279442 9622185 9798680 9486007 9738730 9792157 9329181 9507254 9515034 9068760
4021I068760L11724m97826p92427J34876R0055K73901Q4816p55079M08261K8040
4011H355101K80607m531l85104q34118K20121K81006J37571j16597L32040K08946
4001H475042l80382K6625q3631J3858k03680K26613j56313J79466O3824k74150
3991G887272r0488J68428P63479J36028n58886J2071k02215k13140k4137l29071
3981G549341j26665L50807J12252K41402L07210m23316J51637J60587m64767J76988
3971H035476P3816J50689K3765k14017m6451n41491k232N09745j83942L71309
3961H176667m74506L43468J56097J0101R0430j81312k85184K741n7851k95542
3951G485109K38829j24732m28885M19876l04L4652N40276J76540j98515j85695
$$ plain form
4021 9068760 9380484 8882658 8090231 8225107 8315162 8589063 8673879 7918800 8327061 8355101
4011 8355101 8635708 8631177 8246073 7411955 7632076 7913082 8050653 7934056 8266096 8475042
4001 8475042 8094660 8121285 8037654 8051512 7847832 8074445 7918132 8097598 8161422 7887272
3991 7887272 7796784 7965212 8728691 8864719 8305833 8317904 8115689 7902549 7878412 7549341
3981 7549341 7422676 7773483 7885735 8127137 8434347 8011031 8162668 8323255 7858488 8035476
3971 8035476 8109292 8259981 8283746 8069729 8023278 7481787 7479555 7989300 7805358 8176667
3961 8176667 7702161 8045629 8201726 8211827 8302257 8120945 7835761 7838502 7780651 7485109
3951 7485109 7723938 7599206 7170321 7590197 7589893 7624545 8164821 8341361 8142846 7957151
3941G957151k62752p911P1185J36100J90618J29074j21856R9741j71829M25511
3931H445032k79022l21898l19113j11920j14456P68535J49273k64543j53359n60827
3921G237702J82114O16011j60002M9940K95501N8808k22995J85965M55387j20891
3911H577540J5591n34337K69795O8110M74016N63361j33146n98331M2725L13306
3901I058630K62004N38056j15120q3874M87927l99778M12278R7758M41409K71841
3891A0971131j26355N08834Q3504k77832L39552l37107k69576l32483l47281Q7236
3881A0299623J86081m56848M1465N46052k6067l31887J5915J51344m18096j22877
3871I884705j2111J2792M97912l24639K64350m15963k2228N57250R5290M63162
$$ plain form
3941 7957151 7694399 7686488 7757673 7893773 8084391 8213465 8091609 8191350 8019521 8445032
3931 8445032 8166010 7844112 7524999 7413079 7298623 8067158 8216431 7951888 7798529 7237702
3921 7237702 7419816 8035827 7875825 7925765 8221266 8280074 8057079 8243044 8698431 8577540
3911 8577540 8593131 8058794 8328589 8396699 8870715 9434076 9300930 8702599 8745324 9058630
3901 9058630 9320634 9858690 9743570 9659696 10147623 9747845 10160123 10257881 10699290 10971131
3891 10971131 10844776 11353610 11437114 11159282 11498834 11161727 10892151 10559668 10212387 10299623
3881 10299623 10485704 10028856 10070321 10616373 10590306 10258419 10274334 10425678 10007582 9884705
3871 9884705 9872594 9885386 10383298 10058659 10323009 9907046 9884818 10442068 10537358 11000520
3861A1000520O7623l62164J74952L51983k51923n632o3777j30665R3886J16745
3851A0991548L8494K00205o74684Q646K16651J81675j14532L77687j80341M52800
3841A1498149J30716k13273P79750l42775L14273J68527Q95951O99066p2012m39882
3831A3418490J9196J83136Q58811J74597J90205O76066j90627L53410O87043N81133
3821A6951460Q53074M4741k00022P77142L94681P7416R49537K13488L05734P66567
3811B1133818P06062Q14183K38772J180176J180061N60985Q22814J398129J190262
3802B9225262Q58778M87296Q99704P43660P08387O75256J323299Q22663P51708
3793C6496013M50799J014278J436012J292625Q41609Q31269R70353J008776J258137
$$ plain form
3861 11000520 11068143 10705979 10880931 11232914 10980991 10975359 10911582 10780917 10874803 10991548
3851 10991548 11030042 11230247 10555563 10564209 10780860 10962535 10848003 11225690 11045349 11498149
3841 11498149 11628865 11415592 12195342 11852567 12166840 12335367 13231318 13930384 13858372 13418490
3831 13418490 13437686 13620822 14479633 14654230 14844435 15520501 15329874 15683284 16370327 16951460
3821 16951460 17804534 17849275 17649253 18426395 18821076 18898492 19848029 20061517 20367251 21133818
3811 21133818 21839880 22654063 22892835 24073011 25253072 25814057 26636871 28035000 29225262
3802 29225262 30084040 30571336 31471040 32214700 32923087 33598343 34921642 35744305 36496013
3793 36496013 36946812 37961090 39397102 40689727 41531336 42362605 43332958 44341734 45599871
3784D5599871J358443J189364J343941J655092J249900J694741K252418K053845
3776E8397615K601238K659501K994503L610473L708551L780341N208647N921121
3768H8881990O746856O762625P715818Q579102R720315J0870002J0783254J1677872
3760A61737834J2091241J1554718J0200050Q528104O194202M755011K626599K28191
3752B17915950p0610p17053o34888j124919n81671k15503j272994j013459j392810
3743B10892043k836617m591144n872721q396153r217553j0654084j1027058j0977428
3735A47319285j0765181j0530860r602012q298174p147026o989157n441029m947733
3727H3598113l868991l107649k878012k354775k125135k458392j340959r31167
$$ plain form
3784 45599871 46958314 48147678 49491619 51146711 52396611 54091352 56343770 58397615
3776 58397615 60998853 63658354 66652857 70263330 73971881 77752222 82960869 88881990
3768 88881990 95628846 102391471 110107289 118686391 128406706 139276708 150059962 161737834
3760 161737834 173829075 185383793 195583843 204111947 210306149 215061160 217687759 217915950
3752 217915950 217845340 217128287 216493399 215368480 214786809 214571306 213298312 212284853 210892043
3743 210892043 208055426 203464282 197591561 189195408 179977855 169323771 158296713 147319285
3735 147319285 136554104 126023244 116421232 108123058 100976032 93986875 88545846 83598113
3727 83598113 79729122 76621473 73743461 71388686 69263551 66805159 65464200 64533033
3719F4533033j190123q28543j130865q07454r59402q80444o37071j68747j47097
3710E7783287J37553j01804k90797m69548K39549j4083k92707m0059l53239p41733
3700E5856419k55508l21571l90928p90312p94550k80479j83065k58425j099855
3691E1481726p94816k12805j74302l35110o79108m68398l36183j329652j53899
3682D6997453K37660n55082m09885J55071K58272M1839P63344P51754M28268K99006
3672D8967700N76897P59361J378547J393851J513830J901355J968946J890020
3664F0350507K308491L208484K567395K549395K463301K037427K536258K320879
3656H0342137K273176K297342K198452K127314J636782J702756J926255K417686
$$ plain form
3719 64533033 63342910 62514367 61383502 60576048 59616646 58736202 58099131 57930384 57783287
3710 57783287 57920840 57819036 57528239 57058691 57298240 57284157 56991450 56951391 56598152 55856419
3700 55856419 55600911 55279340 54888412 54098100 53303550 53023071 52840006 52581581 51481726
3691 51481726 50686910 50474105 50299803 49964693 49285585 48817187 48481004 47151352 46997453
3682 46997453 47235113 46680031 46270146 46425217 46683489 46725328 47488672 48240426 48668694 48967700
3672 48967700 49544597 50303958 51682505 53076356 54590186 56491541 58460487 60350507
3664 60350507 62658998 65867482 68434877 70984272 73447573 75485000 78021258 80342137
3656 80342137 82615313 84912655 87111107 89238421 90875203 92577959 94504214 96921900
3648I6921900J740679J156651J377535R30485N26207L5239j087970j088816q90682
3639I9621228q29214j692226j575420r63779k124497j619804j007647r51869j691077
3630H7165695j311870j880034j747439j231226j028270j237239r05271K8824l64748
3621G7488422l25818N34725K04709O02077N58173J194777J445116J499451J352309
3612H4553941J156440J073047J070017J233728J200342N94652J207441J131130
3604I3220738O34106Q79343L71930R25789M91088K08077q97689q02873m59671
3595I4570838j306040j464053j612968j960859j850201k438444k088163k052186
3587G9797924k453392k315634k037475k510647k315537k397542k346887k118428
$$ plain form
3648 96921900 98662579 99819230 101196765 102127250 102653457 102688696 101600726 100511910 99621228
3639 99621228 98792014 97099788 95524368 94560589 92436092 90816288 89808641 88856772 87165695
3630 87165695 85853825 83973791 82226352 80995126 79966856 78729617 77824346 77853170 77488422
3621 77488422 77162604 77697329 77902038 78504115 79062288 80257065 81702181 83201632 84553941
3612 84553941 85710381 86783428 87853445 89087173 90287515 90882167 92089608 93220738
3604 93220738 93854844 94734187 95106117 96031906 96522994 96731071 95833382 95030509 94570838
3595 94570838 93264798 91800745 90187777 88226918 86376717 83938273 81850110 79797924
3587 79797924 77344532 75028898 72991423 70480776 68165239 65767697 63420810 61302382
3579F1302382k702621k009923k120168k300166k318642j848580j587191k104260
3571D4310831j311499r51379j147621r73589k87212n01660p44059m83121L75329
3562C8286020n62856J54466n87759M90192K64170o4503P25916K50513J3710k38355
3552C8731514L1756l25674j63043N4532M92266M17185k53464l77908L55647L88620
3542C9351431J83290p99779m05271o38177n28403p79474j159660l65794m97207
3533C4360956r98831p78799p88474q70414j033477j037861n72340n48253j293475
3524B6439032n20057o29315j041727p43016j036530p58685n46234j211330j073686
3515A8878452o31585m75972m23347m01188j83809o17365l31598j035185n61503
$$ plain form
3579 61302382 58599761 56589838 54469670 52169504 49850862 48002282 46415091 44310831
3571 44310831 42999332 42047953 40900332 39926743 39639531 39137871 38393812 37910691 38286020
3562 38286020 37723164 37877630 37289871 37780063 38044233 37979730 38705646 38956159 38969869 38731514
3552 38731514 38763270 38437596 38274553 38329085 38821351 39238536 38985072 38607164 38962811 39351431
3542 39351431 39534721 38734942 38329671 37691494 37163091 36383617 35223957 34858163 34360956
3533 34360956 33362125 32583326 31794852 30924438 29890961 28853100 28280760 27732507 26439032
3524 26439032 25918975 25289660 24247933 23504917 22468387 21709702 21163468 19952138 18878452
3515 18878452 18246867 17770895 17347548 16946360 16762551 16145186 15813588 14778403 14216900
3506A4216900k73430j45003Q6300J08678l55599p80817J01991p80713q4621K44701
3496A2338387l17527l64129j97829m01195p2320q0696K17284l41334k63276J94975
3486A0712340m64483j46405r3987k3050O8884l83188l53017J64869m31699l7758
3476I012506J62234o6703L96739j1641o3428m70875l00127P53159P23659q54340
3466I281183j75294J41261j28164J06609Q0462N29078J18070m1828l0033j98218
3456I683126m0747J88067J19328m99392K95870j42764k52803J45883n17536K16422
3446I195454l1184R781M01624Q26296m3547L133P79556O80586n79364o55448j23091
3435A0463796m94328J6866k83882n49923M31853L93359l72347L3272N19381m44576
$$ plain form
3506 14216900 13943470 13798467 13884767 13993445 13637846 12857029 12959020 12178307 12093686 12338387
3496 12338387 12020860 11656731 11458902 11057707 10985387 10904691 11121975 10780641 10517365 10712340
3486 10712340 10247857 10101452 10007465 9984415 10053299 9670111 9317094 9481963 9050264 9012506
3476 9012506 9174740 9108037 9504776 9493135 9429707 8958832 8658705 9411864 10135523 9281183
3466 9281183 9105889 9247150 9118986 9225595 9306057 9835135 9953205 9911377 9881344 9683126
3456 9683126 9642379 9830446 9949774 9450382 9746252 9603488 9350685 9496568 8979032 9195454
3446 9195454 9164270 9174051 9575675 10401971 10358424 10361557 11141113 11821699 11242335 10586887 10463796
3435 10463796 9969468 9986334 9702452 9152529 9584382 9977741 9605394 9638666 10158047 9713471
3425I713471J43964J19315K85375M98843M1040J24712J74375J01093J41779N81732
3415A1925699M60157M48953O03941p7524J68463K83031J97710M08290Q14627j79924
3405A5053423j182156l48673k31001l76660n39814k68231K62684l2962P7603n43986
3395A1870227J4074O19249K46661K68726q7374K82833m08398j86093K15263K6291
3385A2861459K14439K88876j3074J0178J14806l29702R4875M35804L23768J037783
3375A5039212O31862K83955n82134o24639r98976l42689O51096k13341m01962
3366A3442384K69174L09708j66329J25376O7387O51502N4454n57372L20022L40826
3356A4857132M67328p9291n0489R5883m09684M77437P70496M35755r0000L59619
$$ plain form
3425 9713471 9857435 9976750 10262125 10760968 10802008 10926720 11101095 11202188 11343967 11925699
3415 11925699 12385856 12834809 13438750 13361226 13529689 13812720 14010430 14418720 15233347 15053423
3405 15053423 13871267 13522594 13291593 12914933 12375119 12106888 12369572 12336610 12414213 11870227
3395 11870227 11884301 12503550 12750211 13018937 12931563 13214396 12805998 12619905 12835168 12861459
3385 12861459 13075898 13364774 13351700 13361878 13476684 13146982 13241857 13677661 14001429 15039212
3375 15039212 15671074 15955029 15372895 14748256 13749280 13406591 14057687 13844346 13442384
3366 13442384 13711558 14021266 13854937 13980313 14047700 14699202 14753656 14196284 14516306 14857132
3356 14857132 15324460 15245169 15194680 15290563 14880879 15358316 16128812 16564567 16474567 16834186
3346A6834186n1190K29405K61800M49576L62506n1517K65106K1390M33771J78506
3336A8933539L19754O10273l9424Q6474M59098O74235J003101J90500M12453O01425
3326B3251428M33584O17593J267368J113109O06324Q06608J092819J074979R00003
3317C1163815J054131J169422J586511K066189K310767K580475K845947L429860
3309D8207117L544650L817927M792019N422899O658602Q061043R266724Q124048
3301I7895029M298531m049036j0287648r574058q133983o060005m344576k603688
3293E7140566k341647j649442q39370o86253l49465O8143j90359O20555J509802
3284E3282530J783494J551455J946514K288767L031032L893452N415480P266551
$$ plain form
3346 16834186 16782996 17012401 17274201 17723777 18086283 18034766 18299872 18321262 18755033 18933539
3336 18933539 19253293 19863566 19824142 19910616 20369714 21043949 22047050 22237550 22650003 23251428
3326 23251428 23685012 24302605 25569973 26683082 27289406 28096014 29188833 30263812 31163815
3317 31163815 32217946 33387368 34973879 37040068 39350835 41931310 44777257 48207117
3309 48207117 51751767 55569694 60361713 65784612 72443214 80504257 89770981 97895029
3301 97895029 102193560 98144524 87856876 78282818 70148835 64088830 59744254 57140566
3293 57140566 54798919 53149477 52310107 51623854 51274389 51342532 51152173 51772728 53282530
3284 53282530 55066024 56617479 58563993 60852760 63883792 67777244 73192724 80459275
3276H0459275Q141209R364466R315391P159127l5787p499129r579637p847290
3268H9477625o018213m144975j868059L86146J66927m16991j264088r32715j192004
3259G4193653K01524P57780Q76589J999016K128532K105144K015021L258648L295977
3250I0831884L219466L607002L718425M637527N544880N191879N422921O675045
3242A28849029P337094P806191P817012Q648960O625114M365120J682378l874545
3234A69256353q498066j1899431j3000087j2707217j1556353r544154q449943
3227I3601102p507630o131384m808808m307266m175044l214633k897423k944467
3219E7614447k308167j871393j852424j797067j980396r73748j083764j603690
$$ plain form
3276 80459275 88600484 97964950 107280341 114439468 114403681 106904552 97324915 89477625
3268 89477625 83459412 79314437 77446378 77832524 77999451 77582460 76318372 75385657 74193653
3259 74193653 74395177 75152957 76029546 78028562 80157094 82262238 84277259 87535907 90831884
3250 90831884 94051350 97658352 101376777 106014304 111559184 116751063 122173984 128849029
3242 128849029 136186123 143992314 151809326 160458286 167083400 171448520 173130898 169256353
3234 169256353 160758287 148858856 135858769 123151552 111595199 102051045 93601102
3227 93601102 86093472 79962088 75153280 70846014 66670970 63456337 60558914 57614447
3219 57614447 55306280 53434887 51582463 49785396 47805000 46831252 45747488 44143798
3211D4143798j054230j390139j037955j123772j402389o84876j039693j264170
3203C5146574q29272o32587j056767n59216p74211r13351p67188r34075n13319
3194B8166588p51139o26532l06521r11660p19786j094799j004462n81639m39249
3185B1730801k62608k25016l18561L52861o39156k82652p38036o56431o3140k15622
3175A8682440q44288o09805k25868m62090J3242J134l60107k93989k730o21641
3165A5276298n19777l58412J3026L42282l98221o02069m54857j08089j57388k34298
3155A2798495k35291l52110l12787l07386L12520j11100M5344N9398k78481l86466
3145A1232136l23611j50196q2825P7o1650j64867l84057l35433J27176J40173
$$ plain form
3211 44143798 43089568 41699429 40661474 39537702 38135313 37450437 36410744 35146574
3203 35146574 34317302 33684715 32627948 32068732 31294521 30381170 29613982 28679907 28166588
3194 28166588 27415449 26788917 26482396 25570736 24850950 23756151 22751689 22170050 21730801
3185 21730801 21468193 21243177 20924616 21277477 20638321 20355669 19617633 18961202 18898062 18682440
3175 18682440 17838152 17228347 17002479 16540389 16553631 16554765 16194658 15900669 15897939 15276298
3165 15276298 14756521 14398109 14411135 14753417 14355196 13753127 13298270 13190181 13032793 12798495
3155 12798495 12563204 12211094 11898307 11590921 11903441 11792341 11837685 11897083 11618602 11232136
3145 11232136 10908525 10758329 10675504 10675581 10613931 10449064 10065007 9729574 9856750 9996923
3135I996923N15507k64561r06889k74487P7456j85547j89911l51873j18085J41145
3125H439678p266J67176Q2937L8390J05632q80420J14373L00412j478o0694j04197
3114H194543L3883J13056j10377N10754n80325p63784l59214l2239P23572N17373
3104H247242p24702o05020N22904K66024j70940K0227r9965k24017J61989l24904
3094G068838j65233L21687m42929J85298M5243k90071j32996l53209J78796m8439
3084F366985j70840K20861l8704k75049q7909k56900j64319j3066M59092M4698
3074F084849k00080j62853M7848N9971K2445J47808o0824J86512O01536K1269
3064F748481j64156M4078J17902l24576j097025L60105L73588n4130k75089k4759
$$ plain form
3135 9996923 10512430 10247869 9340980 9066493 9143949 8958402 8768491 8416618 8298533 8439678
3125 8439678 8432412 8599588 8682525 8720915 8826547 7946127 8060500 8360912 8359434 8298740 8194543
3114 8194543 8228426 8341482 8231105 8741859 8161534 7397750 7038536 7006297 7729869 8247242
3104 8247242 7522540 6917520 7440424 7706448 7535508 7555735 7455770 7231753 7393742 7068838
3094 7068838 6903605 7225292 6782363 6967661 7012904 6722833 6589837 6236628 6415424 6366985
3084 6366985 6196145 6417006 6378302 6103253 6015344 5758444 5594125 5581059 6040151 6084849
3074 6084849 5884769 5721916 5769764 5829735 5852180 5999988 5939164 6125676 6727212 6748481
3064 6748481 6584325 6628403 6746305 6421729 5324704 5684809 6058397 6004267 5729178 5704419
3054E704419n7320n84710J2239K66007L87279j28660Q5015n5302P0706K30918
3044E930591n8452J18935k6952l31619r1571j32829m627J72631L5582n76499N28672
3033E563862m40903J51253m94094j29106l17539L8441O80371N79018L08977j61874
3023E778406l30059r7648K62644P9153o37514n989K40702K42888J64300l53986
3013E342897M12044J42489M7113L42640j28214k88253o0463L45407j22725J39768
3003F172703L32745K81865j39226j17916L99422k7225O00530L21354o8746n72604
2993G182902m170J43068K88963J14620J68906p1145k16756j55871L16123L41458
2983H108098l32596n14687Q5089j74769L83849J2867l3371J65148J21200M97714
$$ plain form
3054 5704419 5647099 5062389 5074628 5340635 5727914 5599254 5684269 5628967 5699673 5930591
3044 5930591 5872139 5991074 5964122 5632503 5540932 5408103 5403476 5576107 5611689 5035190 5563862
3033 5563862 5122959 5274212 4780118 4651012 4333473 4371914 5052285 5631303 5940280 5778406
3023 5778406 5448347 5350699 5613343 5692496 5054982 5048993 5289695 5532583 5696883 5342897
3013 5342897 5754941 5897430 5944543 6287183 6158969 5870716 5810253 6155660 6032935 6172703
3003 6172703 6505448 6787313 6648087 6530171 6929593 6902368 7502898 7824252 7755506 7182902
2993 7182902 7178732 7321800 7610763 7725383 7894289 7823144 7606388 7450517 7766640 8108098
2983 8108098 7775502 7260815 7345904 7171135 7554984 7567851 7534480 7699628 7820828 8318542
2973H318542k79623K64476N35880J68693J53567P7635j88815M05684J43013j53420
2963I445632O22092L16715k33982M6975N92093M25355P5492j64902J52122j17230
2953A1160362J64568j97451p1922L84938n8632l15950L24366l5192m61613J69454
2943A1062928R35541L22499N42473O2826M22178J6857P19816N57200O28103J18551
2933A5388972M27341Q93936M23428P18811O6420N48725P38789N34161M41084M33386
2923B0615053j71944k43869j86246j7098N28883R4481j77759N13732R0249j08669
2913B0936813K94428O8284N99469J76879M23416P75434L80445Q4611N11798J956735
2903B6208312J512482J639603J945556J606542P26887P52356m31405r60174j534857
$$ plain form
2973 8318542 8038919 8303395 8839275 9007968 9161535 9239170 9050355 9456039 9599052 9445632
2963 9445632 10067724 10384439 10150457 10197432 10789525 11214880 11290372 11125470 11277592 11160362
2953 11160362 11324930 11127479 11055557 11440495 11381863 11065913 11390279 11355087 10893474 11062928
2943 11062928 11998469 12320968 12863441 12926267 13348445 13365302 14085118 14642318 15270421 15388972
2933 15388972 15816313 16710249 17133677 17852488 17918908 18467633 19206422 19740583 20181667 20615053
2923 20615053 20443109 20199240 20012994 19995896 20524779 20619260 20441501 20955233 21045482 20936813
2913 20936813 21231241 21299525 21898994 22075873 22499289 23274723 23655168 23739779 24251577 26208312
2903 26208312 27720794 29360397 31305953 32912495 33639382 34391738 33960333 33000159 31465302
2894C1465302j886231j642059j590273p56211j052448j631774k10784l62016m05380
2885B1928126J01893k01994k47134j34357K87844O59281Q484K75004K38240P47511
2875B3662898N14329L1738N71029N05582K48892Q1945j06380k22785m44215m28569
2865B4414464m93784q48584j209319q01597p30226q83106j335696q40522p8749
2856A7192881l02424n87373k21663M39194J59842k41658j90379k72410j21736
2847A5854274k02454m9926n12042k70932n96566o34934l14654l14489K5838j431522
2837A1552593o08541m57255l60483J92485q79671j16707l07467q51066n0254l02818
2827G810816m21181k14038n4111j75081j57181M17422l41726K1910Q6104o37394
$$ plain form
2894 31465302 29579071 27937012 26346739 25590528 24538080 22906306 22695522 22333506 21928126
2885 21928126 22030019 21828025 21580891 21446534 21734378 22393659 22402143 22677147 22915387 23662898
2875 23662898 24177227 24208965 24779994 25285576 25534468 25616413 25510033 25287248 24843033 24414464
2865 24414464 23920680 23072096 21862777 21061180 20330954 19447848 18112152 17271630 17192881
2856 17192881 16890457 16303084 16081421 16520615 16680457 16438799 16248420 15976010 15854274
2847 15854274 15651820 15601894 15089852 14818920 14222354 13587420 13272766 12958277 12984115 11552593
2837 11552593 10944052 10486797 10126314 10318799 9439128 9322421 9014954 8163888 8113634 7810816
2827 7810816 7389635 7175597 7121486 6946405 6789224 7206646 6864920 6886830 6972934 6335540
2817F335540m69874R9547L53924q23495k83771j32977l4107j08451j57995l55382
2807D422959l3028J49305n36429J74621p2575n09564K03684O4583K25712l64704
2797C724564j98049m26518l62645O06423l3518l45204k28056K60438J54604l80589
2787B771450K46890p500q76555L87454M68338k90652p639N72613k88115j46876
2777B829408k065o39K89361n43355k13125m12238k1307J33619m6796J5634j24823
2766A903674k79978L9865l8951O3201l13839O50526k38882p9414J30819k78041
2756A558980o38791l6824M54329m26755K13646L18114k27182j08152L4706m13184
2746G28887n3008M14563L63980m1345k42936m8632l8716L63972j12893n36929
$$ plain form
2817 6335540 5865666 5965213 6319137 5495642 5211871 5078894 5044787 4936336 4778341 4422959
2807 4422959 4389931 4539236 4002807 4177428 4104853 3595289 3798973 3863556 4089268 3724564
2797 3724564 3526515 3099997 2737352 3343775 3310257 2965053 2736997 2997435 3152039 2771450
2787 2771450 3018340 3010840 2134285 2521739 2990077 2699425 2691786 3264399 2976284 2829408
2777 2829408 2827343 2826704 3116065 2572710 2359585 1947347 1926040 2059659 2012863 2028497 1903674
2766 1903674 1623696 1663561 1624610 1687811 1373972 2024498 1785616 1706202 1837021 1558980
2756 1558980 920189 883365 1337694 910939 1124585 1442699 1215517 1107365 1142071 728887
2746 728887 675879 1090442 1454422 1413077 1170141 1121509 1082793 1446765 1333872 796943
2736G96943r8441m56730K7487J30865L16174k3725K03967k6627l88060J77090
2726F58943j6547l41015J35037o441L19476m5390o00503k1537M47037O43244R1322
2715A263626l16499l24111m52896J06022J21010j29521o4903K178J60600l70633
2705e127J2732K33982J08401M7106l06301r0644k36480K39911M786n21132J94883
2694c17883M11555P82829l88574m18878m5889r5420J6190j5604N73184m99815
2684A695r3290k34256l21388M48177J89669p336n06401j38318J022235n8719J81189
2673D83257K4635k14131N7074J53716j5452o11337k66886O05786j27097l3642
2663E5923J66963k03442j89795J94925j9727J26403K57139l01863M3377L4716
$$ plain form
2736 796943 698502 241772 269259 400124 716298 692573 896540 869913 481853 658943
2726 658943 642396 301381 436418 429977 749453 704063 103560 82023 529060 1172304 1263626
2715 1263626 947127 623016 170120 276142 397152 267631 202728 204906 365506 -5127
2705 -5127 7605 241587 349988 397094 90793 149 -236331 3580 8366 -512766 -317883
2694 -317883 93672 876501 487927 69049 23160 -72260 -56070 -71674 501510 1695
2684 1695 -91595 -325851 -647239 -199062 -9393 -16729 -523130 -661448 360787 302068 483257
2673 483257 507892 293761 350835 504551 489099 -122238 -389124 216662 89565 55923
2663 55923 222886 19444 -170351 24574 4847 131250 388389 86526 129903 164619
2653A64619j79173j63890K26403j5184M9023o9657l9424l33524J10211R10468
2643F59872N4147p13651l10787J78580L51387k70033J38424m6079K52273o2756
2633B31377r8107J25215K60711J38995j41331l19807O0015j99347N20555j64971
2623D13305O7120L69463J50790J87493m45483J1869p6692j64104K7344K6645P1293
2612F39043m1896J88531L74942l57832l90403n5765L4117J88630O4860j488K19504
2601H62243K40065k87839k40668K31126k02825L72222j08363k26376j65142L73300
2591H47743n7792K780n060k17765L12539K77155r9727O2958q4410J75596L44799
2580A558816r36953J07028k20506l43541J91490L5940J07706L453K19840K65343
$$ plain form
2653 164619 -14554 -178444 47959 32775 81798 12141 -27283 -360807 -250596 659872
2643 659872 714019 368 -310419 -131839 219548 -50485 87939 41860 294133 231377
2633 231377 133270 258485 519196 658191 516860 197053 257068 57721 578276 413305
2623 413305 480425 849888 1000678 1188171 742688 754557 677865 513761 541105 567750 639043
2612 639043 597147 785678 1160620 802788 412385 356620 390737 579367 644227 642739 862243
2601 862243 1102308 814469 573801 804927 602102 974324 865961 639585 474443 847743
2591 847743 789951 792731 787671 569906 882445 1159600 1059873 1122831 1038421 1214017 1558816
2580 1558816 621863 728891 508385 164844 356334 392274 499980 503433 723273 988616
2570I88616j91981l28271K7372o00190N80070J5570m17679J1520M64742l28875
2560B20894l4698m48704k42493N53727L00898j09904m08187N32874M88422l29284
2550E23545n3901J01970k19596p7049j80946L53515K67353m8499N6613M9433j6037
2539G56401m07889k66549m03874N02043L5359r6052O190l54281j98162l1180M80832
2528B2838N15899l9184j20842l58419k10351M63917m53647j66110N1529R0246
2518b04124k43517k75026K45502N73303k01769N6860k8396k03205j58730M21670
2508a7432j95187L8018p6079M17345l35213J0170j43636j595l56300j77500K32812
2497f04597M6513L54381m7219n53637k17098N09898l41632j30611O86485q9361
$$ plain form
2570 988616 796635 468364 495736 -104454 475616 491186 73507 85027 549769 220894
2560 220894 186196 -262508 -505001 48726 349624 239720 -168467 364407 852829 523545
2550 523545 469644 571614 352018 274969 94023 447538 714891 666392 723005 772438 756401
2539 756401 348512 81963 -321911 180132 215491 119439 125629 -228652 -426814 -457994 22838
2528 22838 538737 499553 378711 20292 -190059 273858 -179789 -345899 -294370 -204124
2518 -204124 -447641 -722667 -477165 96138 -105631 -48771 -77167 -280372 -439102 -17432
2508 -17432 -212619 -174601 -250680 166665 -168548 -158378 -302014 -303609 -659909 -837409 -604597
2497 -604597 -558084 -203703 -250922 -804559 -1021657 -511759 -853391 -984002 -297517 -386878
2487c86878J29659p46422L17935L96772l96027P5791K72978J7185K16931k72378
2477c74454n56392M09431M96538j90648j98242L51422m23674j74756j4425r7746
2467g72946J91991O5284j07494L73822j24960J36047m7202j06902j90096L36307
2457b46149n7562j9498j19990M64192n03272L09354j86697r8208l77641j10274
2447i45745j19354j02722K89204M01219k55654m8131M78657j16870q1164k37237
2437g37797L97770q7154n85615k7684j10080o8633j28047J70913P47050j75555
2427f04832p02150R5076M0591j22858j3442K40846J48486M31022j5061l37043
2417h39365j79128k98491K14273M93221L12717j05470o3456o12359L12876j60767
$$ plain form
2487 -386878 -257219 -1003641 -685706 -288934 -684961 -609170 -336192 -319007 -102076 -374454
2477 -374454 -930846 -521415 -24877 -215525 -413767 -62345 -486019 -660775 -675200 -772946
2467 -772946 -580955 -515671 -623165 -249343 -374303 -238256 -285458 -392360 -582456 -246149
2457 -246149 -303711 -323209 -443199 20993 -482279 -172925 -359622 -457830 -835471 -945745
2447 -945745 -1065099 -1167821 -878617 -477398 -733052 -781183 -302526 -419396 -500560 -737797
2437 -737797 -340027 -427181 -1012796 -1040480 -1150560 -1219193 -1347240 -1176327 -429277 -604832
2427 -604832 -1306982 -1211906 -1171315 -1294173 -1307615 -1066769 -918283 -487261 -502322 -839365
2417 -839365 -1018493 -1316984 -1102711 -609490 -296773 -402243 -465699 -1078058 -765182 -925949
2407i25949q9236O30039n37269K4015P34351K34433M2558j77840j18500j85945
2397c69343k33432j38119M9141R6346K69697n85052l65194N43092K58890r78029
2387a452003j01087J39106J76094M40594J75553L85863m74018m70857O32148R0202
2377d58405J05348L6466J0628m80023O77064j02967m31454m8542r9926P5454R0805
2366f25552N14710L60794J34520k25618k6181K4273k66183k31396k2902J3004
2356c50531l1291J76008L31508p94640L1296l53241J25342N69975M8640o79369
2346i26303K87102K86642M8109k5831k16327l60861Q785N08329j30983r7151R5917
2335e22572o4153m0670l90672k87949j01735L7410M24013J08676J69767N6028
$$ plain form
2407 -925949 -1015185 -385146 -922415 -898400 -164049 70384 112942 -64898 -183398 -369343
2397 -369343 -602775 -740894 -691753 -595407 -325710 -910762 -1275956 -732864 -473974 -1452003
2387 -1452003 -1553090 -1413984 -1237890 -797296 -621743 -235880 -709898 -1180755 -548607 -458405
2377 -458405 -353057 -316591 -305963 -785986 -108922 -211889 -643343 -691885 -791811 -716357 -625552
2366 -625552 -110842 249952 384472 158854 132673 156946 -109237 -340633 -363535 -350531
2356 -350531 -381822 -205814 125694 -668946 -637650 -990891 -865549 -295574 -246934 -926303
2346 -926303 -639201 -352559 -304450 -330281 -546608 -907469 -898684 -390355 -521338 -618489 -522572
2335 -522572 -586725 -627395 -1018067 -1306016 -1407751 -1370341 -946328 -837652 -667885 -611857
2325f11857m153J5055L80975M9311n30728k73654L0196K16861k47002Q5709n1985
2314i41272n02213L89961j39484k07487K71797m21879K25965K67035j76760R7162
2304a137175J2388J8324n28335L48836K80516k02089k15998L79560J43790J83966
2294g16217k78305L37448J85777j96899j79422j27412L80102k14838L52232r185
2284d66719j77399M76213L09596j88663m88633K84141J21577n05319m48621R6194
2274i87633L03788N26140N1721k35792k67029M9807k5679N82040L01996p29334
2264d29975m9668K2648M06441n12248P0375L48853O8021m0801j25677k38184J55504
2253c24711J45259r0174J39298k64344k6159j42833K77775K20186k22040K69119
$$ plain form
2325 -611857 -616010 -600955 -219980 -170669 -701397 -975051 -944855 -727994 -974996 -889287 -941272
2314 -941272 -1443485 -1053524 -1193008 -1400495 -1128698 -1550577 -1324612 -1057577 -1234337 -1137175
2304 -1137175 -1124787 -1106463 -1634798 -1285962 -1005446 -1207535 -1423533 -1043973 -900183 -716217
2294 -716217 -994522 -657074 -471297 -668196 -847618 -975030 -594928 -809766 -457534 -466719
2284 -466719 -644118 -167905 141691 -46972 -535605 -251464 -129887 -635206 -1083827 -987633
2274 -987633 -683845 -157705 -105984 -341776 -608805 -558998 -584677 -2637 299359 -429975
2264 -429975 -479643 -456995 -50554 -562802 -492427 -143574 -75553 -116354 -242031 -480215 -324711
2253 -324711 -179452 -269626 -130328 -394672 -420831 -563664 -285889 -65703 -287743 -18624
2243a8624l18016r2619K7877n777J13263M05884j89274l79286J3900l30497R158
2232g64011J00651L01538J33841L96871j2929n13185L08717J62887J6298K1240
2222A51918l54780j65502J06151j03554Q4570P2348P88395j11471m67601j93047
2212a92573j93396L72889J177K59300m80162R0192O75983m17187J15389K5719
2202B57331j11039k73495k67723j13509N80142L90517l34873K67738J45549K0633
2192E61271N2017j95397J37321l8599L85297M8391k59768L20700l90934P0321
2182F90620L73785m5550J87857O9144K05465k62526q3633M99113R3978O216m3782
2171A690687j3651k63356M33028J86238K24577M07244k63835l21840O31631O7304
$$ plain form
2243 -18624 -336640 -429259 -401382 -407159 -293896 111988 -77286 -456572 -442672 -773169 -764011
2232 -764011 -663360 -361822 -227981 168890 155961 -357224 -48507 114380 130678 151918
2222 151918 -202862 -368364 -262213 -365767 -281197 -208849 579546 468075 474 -192573
2212 -192573 -385969 -13080 -11903 247397 -232765 -142573 533410 116223 231612 257331
2202 257331 146292 -127203 -394926 -508435 71707 462224 127351 395089 540638 561271
2192 561271 613288 417891 555212 516613 901910 950301 690533 1011233 620299 690620
2182 690620 1064405 1018855 1206712 1275856 1481321 1218795 1135162 1634275 1728253 1734469 1690687
2171 1690687 1677036 1413680 1846708 2032946 2257523 2664767 2400932 2079092 2710723 2778027
2161B778027O00374k24663k69673J64121m24486Q9716K07411O07411K95737l52413
2151C471562L9486L37108k38200L8798M98631M95724m37842R6001K29223J64407
2141D694898l39748J65240N59447J67808J67808M62077P15759j95256l22945L85707
2131F460795L42461N21117Q53830M62218R9355P97901K99867K74042J251616J037563
2121A2400765N25552M52978P73476Q23399N33196J431654J794952K128895J632802
2112B2497669J540399Q10605J615313K335043K186152L405206L750265M940270
2104D3080922P534513Q990832J2900038J7187513K2614544K7074136K2251197
2097A61633695J210718k5176409k6434560k4072617j8946684j2211134r727287
$$ plain form
2161 2778027 3378401 3153738 2884065 3048186 2623700 2713416 2920827 3528238 3823975 3471562
2151 3471562 3511048 3848156 3609956 3648754 4147385 4643109 4205267 4301268 4530491 4694898
2141 4694898 4355150 4520390 5079837 5247645 5415453 5877530 6593289 6398033 6075088 6460795
2131 6460795 6803256 7324373 8178203 8640421 8739776 9537677 9837544 10111586 11363202 12400765
2121 12400765 12926317 13379295 14152771 14976170 15509366 16941020 18735972 20864867 22497669
2112 22497669 24038068 24848673 26463986 28799029 30985181 34390387 38140652 43080922
2104 43080922 50615435 59606267 72506305 89693818 112308362 139382498 161633695
2097 161633695 162844413 137668004 111233444 87160827 68214143 56003009 46275722
2090D6275722p043695m902159l727969k870130k298430r39474r12549j089741
2082B2491575j619809j989338j450810j477833j289249j219165j035305q89361
2074A1520705r25937j57060m23867p70062k59797J79949n57257j066539k77740
2065G262395r77440m19654j25624L02213J43176p91061o62571K26452k90132p9762
2055D587992k91018k90035J35729J42166q3172k7175m37841j77295m45155J5598
2045C129794j11767J02999k49927K5715l65251l9274j2622l7370j03616M84227
2035B822908n97376N60433n24681m37639J32968p39505K39223R2264k33885L08245
2025A622955Q9985l90990K83276j77048P74739J70762n92180k54853l36649J90082
$$ plain form
2090 46275722 39232027 34329868 30601899 27731769 25433339 24493865 23581316 22491575
2082 22491575 20871766 18882428 17431618 15953785 14664536 13445371 12410066 11520705
2074 11520705 10594768 10437708 10013841 9243779 8983982 9163931 8606674 7540135 7262395
2065 7262395 6284955 5865301 5739677 6041890 6185066 5394005 4731434 4957886 4667754 4587992
2055 4587992 4296974 4006939 4142668 4284834 4201662 4174487 3736646 3559351 3114196 3129794
2045 3129794 3018027 3121026 2871099 2896814 2531563 2492289 2479667 2442297 2338681 2822908
2035 2822908 2225532 2785965 2261284 1823645 1956613 1217108 1456331 1548595 1314710 1622955
2025 1622955 1712940 1321950 1605226 1428178 2202917 2373679 1781499 1526646 1189997 1380079
2015A380079J47626l80421j93446k33435K89534n09260k53669l63203J44920N21781
2005E50506L65939m35753j5471J43482n9092j77187j23260K47938M4824K54949
1995G96875o0930o06411M01417R6263l53779J35127J38041n4709k70332O2305
1985B83867q90222M55339K73252O0051n9434J66944r9093l069j48651J61005J51965
1974C51954m56693N4434J01251j68495k28411Q9572J82219L15860n5311p23352
1964e36972Q7006n5354j02508K11388N12578O8657o55677M42343R6930K53331
1954C21722k32149J05981j86879j69637m72815L9619L03306l7428J02084k96962
1944e23158k30948K48547K49574K0012K8693r0486l98697P0623M7755L87545p0018
$$ plain form
2015 1380079 1527705 1147284 953838 720403 1009937 500677 247008 -116195 28725 550506
2005 550506 916445 480692 465221 608703 549611 372424 249164 497102 541926 796875
1995 796875 735945 129534 530951 627214 273435 408562 546603 491894 221562 283867
1985 283867 -606355 -151016 122236 182287 122853 289797 190704 187635 38984 199989 351954
1974 351954 -104739 -50305 50946 -117549 -345960 -256388 -74169 241691 186380 -536972
1964 -536972 -449966 -505320 -607828 -396440 116138 184795 -470882 -28539 68391 321722
1954 321722 89573 195554 8675 -160962 -633777 -594158 -290852 -328280 -226196 -523158
1944 -523158 -754106 -505559 -255985 -235973 -207280 -297766 -696463 -625840 -578085 -190540 -260558
1933b60558J77309j69443j5086k91233j05401L92311k3259k5747j43801N91232
1923A26324k06553o19643K36078J49607M38935j79681o41302M83814j59686l25353
1913f97460l56866J73883N78225k88423m3594N0523O04300k98622n27644M76203
1903c29475k20134j49158K72833k2266k05150O11054p2732k48958P3550J72919
1893a17517l16780M53170o5735j99375K80100p39613M97515L57143m50217L31444
1883C0135J61658k23240m23878o5588M95134p94895m2131J45411m9748J76070
1873e91072j56032J92102K26756J27912p8070m68716k39643K49714K70861o2550
1863e28738J54996m98144L66877K35635J16089j54766m98468j94751K66604p3787
$$ plain form
1933 -260558 -83249 -252692 -267778 -559011 -664412 -272101 -295360 -321107 -464908 126324
1923 126324 -80229 -699872 -463794 -314187 124748 -54933 -696235 -212421 -372107 -697460
1913 -697460 -1054326 -880443 -302218 -590641 -634235 -583712 20588 -278034 -805678 -329475
1903 -329475 -549609 -698767 -425934 -448200 -653350 -42296 -115028 -363986 -290436 -117517
1893 -117517 -434297 18873 -46862 -246237 33863 -705750 -208235 148908 -301309 30135
1883 30135 191793 -31447 -455325 -520913 -25779 -820674 -862805 -717394 -767142 -591072
1873 -591072 -747104 -555002 -328246 -200334 -278404 -747120 -986763 -737049 -466188 -528738
1863 -528738 -373742 -871886 -505009 -269374 -153285 -308051 -806519 -1001270 -734666 -808453
1853h08453J03609j2818J27506N66986J88266K67183l98184J01743m44105R86
1843c07281L7161k04834n61312N52198J85890O8699k73000K88483J86127J32961
1833A05092j81644l83455J6960L06341K63725Q7079k30810k63156K8438J02783
1823a48647l04885P7963J64728l84273P9165K8969k7259K80412q6859n96537O2034
1812h55189k04963k33295J38282K68838K13500J50233j62617N4680R352m1610
1802f62789l17667N5936j8052n059N30398o58466j31213M0147L2166n0149N3271
1791a131477L84824M3118j63476l81161j22006N68900K13099j71297K11977n90800
1781a138299M75769k63490J78032j4292k2767M35500L21486k81721n31941k71630
$$ plain form
1853 -808453 -704844 -717662 -590156 -23170 165096 432279 34095 135838 -308267 -307281
1843 -307281 -270120 -474954 -1036266 -484068 -298178 -229479 -502479 -213996 -27869 105092
1833 105092 -76552 -460007 -443047 -136706 127019 214098 -16712 -279868 -251430 -148647
1823 -148647 -453532 -375569 -210841 -595114 -515949 -486980 -514239 -233827 -320686 -917223 -855189
1812 -855189 -1060152 -1293447 -1155165 -886327 -672827 -522594 -685211 -630531 -621179 -662789
1802 -662789 -980456 -924520 -942572 -947631 -417233 -1075699 -1206912 -1166765 -1134599 -1184748 -1131477
1791 -1131477 -746653 -703535 -867011 -1248172 -1370178 -801278 -588179 -759476 -547499 -1138299
1781 -1138299 -662530 -926020 -747988 -762280 -785047 -349547 -28061 -309782 -841723 -1113353
1771a113353J41547O09124k2163j26341L29326l10972J19837n56731o40290Q33548
1761g36468r0480M07075Q7321k96076r6112K44642M68033j62064m44653L15134
1751c03648n8528l62045l45847L59937k01752j02993K02257j80398n66016N95508
1741i63525k55940o9861J64139L3334K20843n03459N62005L47269l08036O90400
1731h2831l36307j9797l30798k86677M95047l0153L99593m0266q092m52402l27480
1720a020163N1652K9642K52281Q7821p5973p3380n25646J65990o1578L12129q8221
1709i45446J18758J58160p8956q6208K12183N0642J86212P3838J90124n91710
1699g12403m845O51495j24747r1503k28823p11009N15381O6596K93454r6562j0512
$$ plain form
1771 -1113353 -971806 -362682 -384845 -511186 -181860 -492832 -372995 -929726 -1570016 -736468
1761 -736468 -826948 -419873 -332552 -628628 -724740 -480098 -12065 -174129 -618782 -303648
1751 -303648 -362176 -724221 -1070068 -710131 -911883 -1014876 -812619 -993017 -1559033 -963525
1741 -963525 -1219465 -1289326 -1125187 -1091853 -871010 -1374469 -812464 -465195 -773231 -82831
1731 -82831 -419138 -438935 -769733 -1056410 -561363 -591516 -191923 -232189 -240281 -692683 -1020163
1720 -1020163 -968511 -938869 -686588 -598767 -674740 -748120 -1273766 -1107776 -1169354 -857225 -945446
1709 -945446 -826688 -668528 -747484 -833692 -621509 -570867 -384655 -310817 -120693 -712403
1699 -712403 -717248 -65753 -190500 -282003 -510826 -1221835 -706454 -639858 -346404 -442966 -453478
1688d53478m37797n53170J78260R6587j20591K27011j33845j11858L75842J62020
1678g71019M9898O7853K76190K68012o45077o95893P90948M21061l1771n36789
1668h06587K15003K13023l1635n52805k18687P61992o4795j19586K01491k2361
1658d24947L41589l12007k94963m8091j80527J04704M72160M5686J08050k49711
1648d38057j83722j11666M57120k66131q3955l19488j46846K69196K41802J60043
1638d21704l35769J76026j98165J21914L92403j28212n67789N172j55169K24965
1628h86328K72428m7161o2416l62151M05771K9611n75547P53819l77530k73473
1618a122977L25349k43508M75690k2259M19207k79341k37418l16986R8497J82422
$$ plain form
1688 -453478 -891275 -1444445 -1266185 -1169598 -1290189 -1063178 -1197023 -1308881 -933039 -771019
1678 -771019 -721121 -653268 -377078 -109066 -754143 -1450036 -659088 -238027 -269798 -806587
1668 -806587 -591584 -378561 -410196 -963001 -1181688 -419696 -484491 -604077 -402586 -424947
1658 -424947 -83358 -395365 -690328 -738419 -918946 -814242 -342082 -296396 -188346 -438057
1648 -438057 -621779 -733445 -276325 -542456 -626411 -945899 -1092745 -823549 -581747 -421704
1638 -421704 -757473 -581447 -779612 -657698 -265295 -393507 -961296 -956124 -1111293 -886328
1628 -886328 -613900 -661061 -723477 -1085628 -679857 -650246 -1225793 -471974 -849504 -1122977
1618 -1122977 -797628 -1041136 -565446 -587705 -168498 -447839 -685257 -1002243 -903746 -721324
1608g21324M7855K20553j26395L56554J43039l42129J87091l06052k83491l1927
1598h56226O17718m2923k16439n7889j22165k14076J68821J91561L38810J24171
1588f8637K82947o19009l76594m71436l89715P12197K20451m09378j42948M44286
1578h17836l7606j61503p5986M48770l86657L80745K87240K74210n14280l13520
1568i16423J90526j08480o9629K42180o51430J69711J00272l21591Q56154L25403
1558a83307j47365J56429K42452k78778q08648J31452N91078j90307r4398m6757
1548f28149l48747O17031k56186k94728J22200K9730k25266J23890O4194l87027
1538a183058K15226L53542Q332m4248K847o39608K38569L14174L8989N0821j8862
$$ plain form
1608 -721324 -673469 -452916 -579311 -222757 -79718 -421847 -234756 -540808 -824299 -856226
1598 -856226 -238508 -281431 -497870 -555759 -677924 -892000 -723179 -531618 -192808 -68637
1588 -68637 214310 -404699 -781293 -1252729 -1642444 -930247 -709796 -1119174 -1262122 -817836
1578 -817836 -855442 -1016945 -1092931 -644161 -1030818 -650073 -362833 -88623 -602903 -916423
1568 -916423 -725897 -834377 -904006 -661826 -1313256 -1143545 -1043273 -1364864 -508710 -183307
1558 -183307 -330672 -174243 68209 -210569 -1019217 -887765 -296687 -486994 -581392 -628149
1548 -628149 -976896 -359865 -616051 -910779 -788579 -758849 -984115 -860225 -796031 -1183058
1538 -1183058 -967832 -614290 -605958 -650206 -647359 -1286967 -1048398 -734224 -695235 -644414 -663276
1527f63276j90051K09677N39484l78831j02033J12820J85274k81517l96575j72544
1517a137572Q0674J90362J30865j5690j82430N0717M57585K24046m98209q1782
1507g81434J27154j37284L67053m1765o67337M70477l6491J82540l899L13733
1497b07253L9947l40721j06481M37341n3578R910k58686j35077K44919n94911
1487i64590K06439j00265r4572L62119L21427q014k01579l91949J5593k53441
1477a108832o2676P3595J58046L49687n9478k08999l00054O82874L20469r6798
1467b52166j17988L66711L2260n03556M5306J19385j32565J8840q1192k35328
1457g40293k72359n67029N53989N18642j30462k18550J66303k23838K06486L05041
$$ plain form
1527 -663276 -853327 -643650 -104166 -482997 -585030 -472210 -286936 -568453 -965028 -1137572
1517 -1137572 -1056898 -866536 -735671 -751361 -933791 -883074 -425489 -201443 -699652 -781434
1507 -781434 -654280 -791564 -424511 -466276 -1133613 -663136 -699627 -517087 -520986 -207253
1497 -207253 -167306 -508027 -614508 -177167 -230745 -220835 -479521 -614598 -369679 -964590
1487 -964590 -758151 -858416 -952988 -590869 -269442 -277456 -479035 -870984 -855391 -1108832
1477 -1108832 -1171508 -1097913 -939867 -590180 -649658 -858657 -1158711 -475837 -155368 -252166
1467 -252166 -370154 -3443 28817 -474739 -429433 -310048 -442613 -423773 -504965 -740293
1457 -740293 -1012652 -1579681 -1025692 -507050 -637512 -856062 -689759 -913597 -707111 -402070
1447d02070J90877j0422m53037j10711J30433N00151j43623o58439K50581L69742
1437c36518k05206j15107L17072p18325j27013K35025J74924K40279j828J64428
1427c72269j39109m003n56027Q8417j48222r1534L86721K25149j11643L55074
1417c67446N04815m14776q1560k64504o8423l88415j71889J70000k46191M46700
1407h81689O38051l96682j36047J23408J2171K72661j09662l91281O58963K15556
1397E449n15488L9535j41056J36546L7631J99228K51362r1543o71865n8964P11521
1386i7644m57835K62232l17808m95675L44233J12101O67576l2359k49739j1532
1376b76450L44908k62808r4362o04974j61756K50521l72862k40891J9794N43422
$$ plain form
1447 -402070 -211193 -221615 -674652 -785363 -654930 -154779 -298402 -956841 -706260 -336518
1437 -336518 -541724 -656831 -339759 -1058084 -1185097 -950072 -775148 -534869 -536697 -372269
1427 -372269 -511378 -515381 -1071408 -982991 -1131213 -1222747 -836026 -610877 -722520 -367446
1417 -367446 137369 -277407 -358967 -623471 -691894 -1080309 -1252198 -1082198 -1328389 -881689
1407 -881689 -243638 -640320 -776367 -652959 -640788 -368127 -477789 -869070 -210107 5449
1397 5449 -510039 -470504 -611560 -475014 -437383 -238155 13207 -78336 -750201 -809165 -97644
1386 -97644 -555479 -293247 -611055 -1106730 -762497 -650396 17180 -15179 -264918 -276450
1376 -276450 68458 -194350 -288712 -893686 -1055442 -804921 -1177783 -1418674 -1398880 -855458
1366h55458J86412j76640J82420l65626j40789L08114m55327N52064M77670p0079
1356c57239k56482N0046K61500p9318K33735l0035j29904n43973J27871L71540
1346c52259J88659j55731J1161l25982K37689l24377J23669k4629k40634K37653
1336f24781K21741r0663K65186n69383L67112K43463r07211K00038J48861K11869
1326e33768k35059Q5384J89280n84133K05323K47062O1032j12114J65029L76248
1316a35716m42698j03080L71563l82144n8163L51006l71891J76353o169L20165
$$ plain form
1366 -855458 -669046 -845686 -663266 -1028892 -1169681 -861567 -1316894 -764830 -287160 -357239
1356 -357239 -613721 -563675 -302175 -381493 -147758 -177793 -307697 -851670 -723799 -352259
1346 -352259 -163600 -319331 -308170 -634152 -396463 -720840 -597171 -621800 -862434 -624781
1336 -624781 -403040 -493703 -228517 -797900 -430788 -187325 -1094536 -894498 -745637 -533768
1326 -533768 -768827 -683443 -494163 -1078296 -872973 -625911 -564879 -676993 -511964 -135716
1316 -135716 -578414 -681494 -309931 -692075 -750238 -399232 -771123 -594770 -600939 -280774
$$ [...]
##END NTUPLES=NMR SPECTRUM
##END=
