##TITLE=1H_CA-9078-2
 CDCl3
 8 sc, 
 18.10.2022
##JCAMPDX= 6.0         $$ Bruker NMR JCAMP-DX V2.0
##DATA TYPE= NMR SPECTRUM
##DATA CLASS= NTUPLES
##ORIGIN= UXNMR, Bruker Analytische Messtechnik GmbH
##OWNER= root
$$ XWIN-NMR		Version 3.5
$$ Tue Oct 18 16:50:11 2022 Russian Standard Time (UT+4h)  she@DPX200
##.OBSERVE FREQUENCY= 200.1313499994
##.OBSERVE NUCLEUS= ^1H
##.ACQUISITION MODE= SIMULTANEOUS
##.ACQUISITION SCHEME= undefined
##.AVERAGES= 8
##.DIGITISER RES= 18
##SPECTROMETER/DATA SYSTEM= spect
##.PULSE SEQUENCE= zg30
##.SOLVENT NAME= CDCl3
##.SHIFT REFERENCE= (INTERNAL, CDCl3, 0, 15.7965)
##AUDIT TRAIL= $$ (NUMBER, WHEN, WHO, WHERE, WHAT)
$$ ##TITLE= Audit trail, XWIN-NMR		Version 3.5
$$ ##JCAMPDX= 5.01
$$ ##ORIGIN= Bruker BioSpin GmbH
$$ ##OWNER= she
$$ F:/spectra/data/she/nmr/H-F/1/pdata/1/auditp.txt
$$ ##AUDIT TRAIL=  $$ (NUMBER, WHEN, WHO, WHERE, WHAT)
(   1,<2022-10-18 16:48:52.10 +0400>,<she>,<DPX200>,
      <created by zg, POWCHK disabled, PULCHK disabled
       configuration hash MD5:
       00 E9 B6 7A A2 85 ED C7 34 08 36 98 17 FE 4E 26
       data hash MD5: 16K
       BF 9E 86 F5 0A A6 A7 39 1E 3C FD 15 DB 21 17 86>)
(   2,<2022-10-18 16:48:54.48 +0400>,<she>,<DPX200>,
      <Start of raw data processing
       efp BC_mod = 2 LB = 0.24 FT_mod = 6 PKNL = 1 PHC0 = -18042.08 PHC1 = 17.2007 SI = 16K 
       data hash MD5: 16K
       69 89 E7 9C 04 C4 01 4B CA 55 24 D3 39 51 A6 64>)
(   3,<2022-10-18 16:49:18.09 +0400>,<she>,<DPX200>,
      <pk PHC0 = -148.56 PHC1 = -9.199999 
       data hash MD5: 16K
       36 9A 6B 2E EE BD 6C A0 61 3A F5 38 88 9C 79 A6>)
(   4,<2022-10-18 16:49:21.53 +0400>,<she>,<DPX200>,
      <abs ABSG = 5 
       data hash MD5: 16K
       92 77 0A 8E CA 8F 99 D9 26 98 0C AB A7 B4 AE 5A>)
$$ ##END=
$$ 
$$ hash MD5
$$ 46 1C 03 9D 07 FB 78 14 2A 5D 01 17 E6 6E 0C 44
##$RELAX= 
##$RELAX= 
##$RELAX= 
##$RELAX= 
##$RELAX= 
##$RELAX= 
$$ Bruker specific parameters
$$ --------------------------
##$DU= <F:/spectra>
##$EXPNO= 1
##$NAME= <H-F>
##$PROCNO= 1
##$TYPE= <nmr>
##$USER= <she>
##$AMP= (0..31)
100 100 100 100 100 100 100 100 100 100 100 100 100 100 100 100 100 100 
100 100 100 100 100 100 100 100 100 100 100 100 100 100 
##$AQSEQ= 0
##$AQ_mod= 1
##$AUNM= <au_zg>
##$AUTOPOS= <>
##$BF1= 200.13
##$BF2= 200.13
##$BF3= 200.13
##$BF4= 200.13
##$BF5= 200.13
##$BF6= 200.13
##$BF7= 200.13
##$BF8= 200.13
##$BYTORDA= 1
##$CFDGTYP= 0
##$CFRGTYP= 5
##$CHEMSTR= <none>
##$CNST= (0..31)
1 1 145 1 1 1 1 1 1 1 1 1 1 1 1 1 1 1 1 1 1 1 1 1 1 1 1 1 1 1 1 1 
##$CPDPRG= <>
##$CPDPRG1= <>
##$CPDPRG2= <>
##$CPDPRG3= <>
##$CPDPRG4= <mlev>
##$CPDPRG5= <mlev>
##$CPDPRG6= <mlev>
##$CPDPRG7= <mlev>
##$CPDPRG8= <mlev>
##$CPDPRGB= <>
##$CPDPRGT= <>
##$D= (0..31)
0 1.2 0 0 0 0 0 0 0 0.06 0 0.03 0 0 0 0 0.0002 0 0 0 0 0 0 0 0 0 0 0 0 
0 0 0 
##$DATE= 1666097331
##$DBL= (0..7)
120 120 120 120 120 120 120 120 
##$DBP= (0..7)
150 150 150 150 150 150 150 150 
##$DBP07= 0
##$DBPNAM0= <>
##$DBPNAM1= <>
##$DBPNAM2= <>
##$DBPNAM3= <>
##$DBPNAM4= <>
$$ [...]
##$SUBNAM3= <"">
##$SUBNAM4= <"">
##$SUBNAM5= <"">
##$SUBNAM6= <"">
##$SUBNAM7= <"">
##$SUBNAM8= <"">
##$SUBNAM9= <"">
##$SW= 18.0517283424941
##$SWIBOX= (0..15)
0 0 2 0 0 0 0 0 0 0 0 0 0 0 0 0 
##$SW_h= 3612.71676300578
##$TD= 16384
##$TD0= 1
##$TE= 0
##$TE2= 300
##$TE3= 300
##$TEG= 300
##$TL= (0..7)
0 120 120 120 120 120 120 120 
##$TP= (0..7)
150 150 150 150 150 150 150 150 
##$TP07= 0
##$TPNAME0= <>
##$TPNAME1= <>
##$TPNAME2= <>
##$TPNAME3= <>
##$TPNAME4= <>
##$TPNAME5= <>
##$TPNAME6= <>
##$TPNAME7= <>
##$TPOAL= (0..7)
0.5 0.5 0.5 0.5 0.5 0.5 0.5 0.5 
##$TPOFFS= (0..7)
0 0 0 0 0 0 0 0 
##$TUNHIN= 0
##$TUNHOUT= 0
##$TUNXOUT= 0
##$USERA1= <user>
##$USERA2= <user>
##$USERA3= <user>
##$USERA4= <user>
##$USERA5= <user>
##$V9= 5
##$VALIST= <valist>
##$VCLIST= <CCCCCCCCCCCCCCC>
##$VD= 0
##$VDLIST= <DDDDDDDDDDDDDDD>
##$VPLIST= <PPPPPPPPPPPPPPP>
##$VTLIST= <TTTTTTTTTTTTTTT>
##$WBST= 1024
##$WBSW= 4
##$XGAIN= (0..3)
0 0 0 0 
##$XL= 0
##$YL= 0
##$YMAX_a= 402480
##$YMIN_a= -293008
##$ZGOPTNS= <>
##$ZL1= 120
##$ZL2= 120
##$ZL3= 120
##$ZL4= 120
##$ABSF1= 15.79537
##$ABSF2= -2.256481
##$ABSG= 5
##$ABSL= 3
##$ALPHA= 0
##$AQORDER= 0
##$ASSFAC= 0
##$ASSFACI= 0
##$ASSFACX= 0
##$ASSWID= 0
##$AUNMP= <proc_1d>
##$AZFE= 0.1
##$AZFW= 0.1
##$BCFW= 0
##$BC_mod= 2
##$BYTORDP= 0
##$COROFFS= 0
##$CY= -3
##$DATMOD= 1
##$DC= 0
##$DFILT= <>
##$DTYPP= 0
##$F1P= 0
##$F2P= 0
##$FCOR= 1
##$FTSIZE= 16384
##$FT_mod= 6
##$GAMMA= 0
##$GB= 0
##$INTBC= 1
##$INTSCL= 3.70164e-10
##$ISEN= 128
##$LB= 0.24
##$LEV0= 0
##$LPBIN= 0
##$MAXI= 10000
##$MC2= 0
##$MEAN= 0
##$ME_mod= 0
##$MI= 1.114404
##$NCOEF= 0
##$NC_proc= -6
##$NLEV= 6
##$NOISF1= 3.799351
##$NOISF2= 2.8
##$NSP= 0
##$NTH_PI= 0
##$NZP= 0
##$OFFSET= 15.79647
##$PC= 1
##$PHC0= -18190.64
##$PHC1= 8.000702
##$PH_mod= 1
##$PKNL= yes
##$PPARMOD= 0
##$PSCAL= 0
##$PSIGN= 0
##$REVERSE= no
##$SF= 200.129995010485
##$SI= 16384
##$SIGF1= 3
##$SIGF2= 2
##$SINO= 5.538805
##$SIOLD= 16384
##$SREGLST= <1H.CDCl3>
##$SSB= 0
##$STSI= 16384
##$STSR= 0
##$SW_p= 3612.71676300578
##$SYMM= 0
##$S_DEV= 0
##$TDeff= 16384
##$TDoff= 0
##$TI= <>
##$TILT= no
##$TM1= 0
##$TM2= 0
##$TOPLEV= 0
##$USERP1= <user>
##$USERP2= <user>
##$USERP3= <user>
##$USERP4= <user>
##$USERP5= <user>
##$WDW= 1
##$XDIM= 16384
##$YMAX_p= 288970465
##$YMIN_p= -597318
$$ End of Bruker specific parameters
$$ ---------------------------------
##NTUPLES= NMR SPECTRUM
##VAR_NAME=  FREQUENCY,     SPECTRUM/REAL,   SPECTRUM/IMAG
##SYMBOL=    X,             R,               I
##VAR_TYPE=  INDEPENDENT,   DEPENDENT,       DEPENDENT
##VAR_FORM=  AFFN,          ASDF,            ASDF
##VAR_DIM=   16384,         16384,           16384
##UNITS=     HZ,            ARBITRARY UNITS, ARBITRARY UNITS
##FACTOR=    0.220516191357247, 1,           1
##FIRST=     3161.34739992588, 0,            0
##LAST=      -451.369363079903, 0,           0
##MIN=       -451.369363079903, -597318,     0
##MAX=       3161.34739992588, 288970465,    0
$$ Real data points
##PAGE= N=1
##DATA TABLE= (X++(R..R)), XYDATA
$$ [...]
7167E31318l3550k7363P851N1280k1647P405k6416l9296R958K1189k3746k6402
7155D30581L7122M0725M616j8868K589J568j29O7605P130k9258K8553M0105K93
7142F12632r881M7246L1282K9762n524j0555m450L3363J5821j5885J6705L7946
7130G78462M298J0931K7929J5046M443N1501O929L5943L8649N9458M2860L4725
7118A111174P3898P2374M9883O4804L9210O5992O0463P1789K4484j5370L9046
7107A657747M0340L6896M4865P2607N7970L6606M1237N3446M0841k0481L9836
7096B101910J08630M8203O411N0099O7806N1727Q6931Q7162N8031N7028Q0327
7085B804265J05891O5198M5145J36084J04606P9335R3920Q6516J03458J01891
$$ y = [531318, 497768, 470405, 478256, 529536, 507889, 515294, 488878, 449582, 459540, 480729, 456983, 430581, 467703, 508428, 513044, 494176, 496765, 498333, 498204, 565809, 572939, 543681, 572234, 612339, 612632, 602751, 649997, 681279, 711041, 705517, 694962, 690512, 723875, 739696, 723811, 740516, 778462, 782760, 793691, 821620, 836666, 841109, 892610, 899539, 935482, 974131, 1033589, 1076449, 1111174, 1185072, 1257446, 1307329, 1372133, 1411343, 1477335, 1537798, 1609587, 1634071, 1618701, 1657747, 1698087, 1734983, 1779848, 1852455, 1910425, 1947031, 1988268, 2041714, 2082555, 2062074, 2101910, 2210540, 2258743, 2265154, 2315253, 2383059, 2434786, 2521717, 2608879, 2666910, 2723938, 2804265, 2910156, 2975354, 3020499, 3156583, 3261189, 3340524, 3434444, 3520960, 3624418, 3726309]
7075C726309J22674J26014J22495J62654J62358J71546J85536K07229J99327K03056
7065E389198K11124K69044K57100K65471L00858K74689L31992L39163L67803L71562
7055H378004L23164L99230M38874L97697M43073N38296N78926O44227P17150Q37182
7045A3695823J014546J186925J368765J590887J856495K131557K545247K955347
7037B8345592L488326M271055N213438O285210P016546P193108O317619M680869
7029G2811763L201828J695382M68723j403503l991858o197642p739123p779035
7021E1066535o783825n645434m601520l886752l362663k904403k444405k032807
7013A9404726j667363j392514j191980j005101q73401p59511p16699o45938n78515
$$ y = [3726309, 3848983, 3974997, 4097492, 4260146, 4422504, 4594050, 4779586, 4986815, 5186142, 5389198, 5600322, 5869366, 6126466, 6391937, 6692795, 6967484, 7299476, 7638639, 8006442, 8378004, 8701168, 9100398, 9539272, 9936969, 10380042, 10918338, 11497264, 12141491, 12858641, 13695823, 14710369, 15897294, 17266059, 18856946, 20713441, 22844998, 25390245, 28345592, 31833918, 36104973, 41318411, 47603621, 54620167, 61813275, 68130894, 72811763, 76013591, 77708973, 78177696, 76774193, 72782335, 66584693, 58845570, 51066535, 44282710, 38637276, 34035756, 30149004, 26786341, 23881938, 21437533, 19404726, 17737363, 16344849, 15152869, 14147768, 13274367, 12514856, 11798157, 11152219, 10573704]
7004A0573704m40758l52598l09964k58863k44966j87185k31568k95521k99823
6995G952458k23154k99628k76830j88549j76436j08447p9574L1581P7028J53938
6985F862387K82423L52756L17447J99284m7479k98051n28198n99084n81614n09829
6975E450042l88693l46915l02005k49171k18876j72871j76311j63825j31630j01324
6965C198421l4619p8668j14805o0878p5229q3684r1840m0430o9072l3809k6475
6954B488912m4162j6721j9387p763n4592p0247m8574j8647n6186o2069r3073m0478
6942A957013l7306m2013j9119l8297k8982P085k5830j5464n071k8396K6292K8229
6930A778141O72J8912J161r119k4184K7101R309L81L6109K3720q278M3389R4243
$$ y = [10573704, 10132946, 9780348, 9470384, 9211521, 8966555, 8779370, 8547802, 8252281, 7952458, 7729304, 7429676, 7152846, 6964297, 6787861, 6679414, 6599840, 6631421, 6708449, 6862387, 7144810, 7497566, 7815013, 8014297, 7966818, 7668767, 7140569, 6541485, 5959871, 5450042, 5061349, 4714434, 4412429, 4163258, 3944382, 3771511, 3595200, 3431375, 3299745, 3198421, 3163802, 3085134, 2970329, 2909451, 2834222, 2750538, 2658698, 2618268, 2549196, 2515387, 2488912, 2444750, 2428029, 2408642, 2400879, 2346287, 2276040, 2227466, 2208819, 2152633, 2090564, 1997491, 1957013, 1919707, 1877694, 1858575, 1820278, 1791296, 1798381, 1772551, 1757087, 1752016, 1723620, 1749912, 1778141, 1778813, 1797725, 1798886, 1789767, 1765583, 1792684, 1801993, 1802374, 1838483, 1862203, 1853925, 1897314, 1991557]
6917A991557N0599P6075J05739J48734J43309J75285J84541J48317J92471K21862
6907C438489K69464K92423L25313L98896L99395K68211M0336j88868l67027m70897
6897D405735m68087m59838l36618k79607k40298j79736j47621j07581q4181p0653
6887B031515o1707n7924m871j83J3857M8028N716P881p946Q859p3K4500j7532
6874A990120k1470l7826l0144n0221m1840r132R906Q560N194L7267L3224n36Q267
6861A901369P5864N9836M1623O9984M9328l1018l9794m9479q1946j11174r9896
6850A784697p4614r2914m3489p3753n0029o0647m7394n6251o5400N51m861M4118
6838A260014M4349K7390Q7926Q1770J02064J40323L1467o1342j71420j52953r2643
$$ y = [1991557, 2042156, 2118231, 2223970, 2372704, 2516013, 2691298, 2875839, 3024156, 3216627, 3438489, 3707953, 4000376, 4325689, 4724585, 5123980, 5392191, 5432527, 5243659, 4876632, 4405735, 3937648, 3477810, 3141192, 2861585, 2621287, 2441551, 2293930, 2186349, 2102168, 2031515, 1969808, 1911884, 1907013, 1906830, 1920687, 1968715, 1974431, 1982312, 1974366, 1983225, 1983152, 2007652, 1990120, 1968650, 1930824, 1900680, 1850459, 1808619, 1799487, 1809393, 1817953, 1823147, 1860414, 1893638, 1893102, 1901369, 1977233, 2037069, 2078692, 2148676, 2198004, 2166986, 2127192, 2077713, 1995767, 1884593, 1784697, 1710083, 1617169, 1573680, 1499927, 1449898, 1389251, 1341857, 1285606, 1220206, 1220757, 1215896, 1260014, 1304363, 1331753, 1419679, 1501449, 1603513, 1743836, 1775303, 1713961, 1542541, 1389588, 1296945]
6827A296945j08283p5526n5643l8934n6775m5505n1699o4800l8307m9078m3945
6816F68450k8567l8310q703k6300m8166J8730j003k9559j4114M596L8558Q684
6804E44296m9499k0094k2233Q851q002k5513q20k1158q020j5007J8667M515k0863
6791C85120j9536k7451l7576k5567J6222l87k5660J6120n427m266k0786q971L6981
6778B78816j2827J2284j9651l8500J1592J9328J7073j6263k9920j3159K0320J6254
6766B45347R257J1806j0325J3283O446l5252j5897L094l279K5220k9101J7374
6754B37973K8090k647j0588k0618j3325l426R281j7403k3071N581K6926M699p376
6741B14096k865K4455K0704k9106M3413j1350k0601J8248j5343k4215J6219J4723
$$ y = [1296945, 1188662, 1113136, 1057493, 1018559, 961784, 916279, 864580, 799780, 761473, 712395, 668450, 639883, 601573, 592870, 566570, 518404, 537134, 536131, 506572, 492458, 497054, 535612, 544296, 494797, 474703, 452470, 461321, 453319, 427806, 426986, 405828, 397808, 382801, 401468, 405983, 385120, 365584, 338133, 300557, 274990, 291212, 290825, 265165, 281285, 275858, 271592, 250806, 241835, 278816, 265989, 278273, 258622, 220122, 231714, 251042, 268115, 251852, 221932, 208773, 229093, 245347, 254604, 266410, 256085, 269368, 275814, 240562, 224665, 227759, 224480, 249700, 220599, 237973, 266063, 263416, 252828, 232210, 218885, 215459, 224740, 207337, 184266, 189847, 216773, 221472, 214096, 211231, 235686, 256390, 227284, 270697, 259347, 238746, 256994, 241651, 217436, 233655, 248378]
6729B48378O574o132L1404J6615k9630L7855L1633j6578l9224R8k0525N321m506
6716B61283j4203M318p691k4943k509J4464M0686k7588J2767P596m2502j1175
6704B10503k0810L8597R521k3542m151J6341n797q379Q974q71L410j7348j5238
6691A91210K4023N808k5936j4797J3399l291o85K0969r153L0764O827J9997o415
6678B52720l8662L3900J0042m2389K1084k2252k3487J3018k0652J0184M5837j1372
6666B27971l1011r399o057L122L8092L01j4025k0216P501K0550K0101J4334j5546
6653B35718J6963m330j3988J2806J4882k4662j7571k879J24j5790P75L3099K2236
6640B57383M4788K9419k3346K9056K2803K1063J8808L6645M5996L2917Q875N2917
$$ y = [248378, 254952, 248820, 280224, 296839, 267209, 305064, 336697, 320119, 280895, 280993, 260468, 265789, 261283, 247080, 251398, 243707, 218764, 216255, 230719, 271405, 243817, 256584, 264180, 221678, 210503, 189693, 228290, 237811, 214269, 210118, 226459, 220662, 212283, 221257, 220386, 223796, 206448, 191210, 215233, 221041, 195105, 180308, 193707, 190416, 189731, 210700, 201547, 232311, 239138, 259135, 252720, 214058, 247958, 258000, 215611, 236695, 214443, 190956, 203974, 183322, 193506, 239343, 227971, 196960, 187561, 181504, 184626, 222718, 223019, 208994, 188778, 196279, 216829, 236930, 251264, 235718, 252681, 248351, 234363, 247169, 262051, 237389, 219818, 216939, 217063, 201273, 202048, 235147, 257383, 302171, 331590, 308244, 337300, 360103, 381166, 399974, 436619, 482615, 515532, 524407, 577324]
6628E77324J1251P717j5390J2014K87q834j3523m4317m4001m0627J2981J0313
6616D65195k6872k7282J791J1055j8898m8216N734J5626m4979j3813K3225j1911
6604C30655K5654j3496K040m3774l9363N712J7280k9990R692R784m1627O281k8603
6591B10245k1412J0052p190K5995J5373k4543j2570J4279J1760K640j84l2562
6579A91883j2655J6107J9704k275j3973M4219n204q805K7803p533l720j7324o414
6566B21813l066l0308J903N5635n689l6149n990J0279k0269m961K3145j7151n923
6553A83269R555O654J4352L8755J3664N989L2263L0089M4210M026J2680L3449
6541D28955k3143K1764n881j1602K6816p358N0601M506j3516M001Q096K7541Q935
$$ y = [577324, 588575, 596292, 580902, 592916, 593203, 584369, 570846, 526529, 482528, 441901, 454882, 465195, 438323, 411041, 412832, 423887, 404989, 356773, 362507, 378133, 333154, 319341, 342566, 330655, 356309, 342813, 344853, 301079, 261716, 267428, 284708, 254718, 264410, 274194, 232567, 238848, 210245, 188833, 198885, 191695, 217690, 233063, 208520, 195950, 210229, 221989, 224629, 224445, 191883, 179228, 195335, 215039, 212764, 198791, 243010, 237806, 229001, 256804, 249271, 245551, 228227, 221813, 218747, 188439, 190342, 245977, 240288, 204139, 198149, 208428, 188159, 183198, 206343, 189192, 183269, 192824, 199478, 213830, 252585, 266249, 272238, 304501, 334590, 378800, 382826, 395506, 428955, 405812, 427576, 421695, 410093, 436909, 429551, 480152, 484658, 471142, 475143, 483239, 510780, 519715]
6528E19715n1043N142K3185k4959j9573J9978j3067Q298J3115l3567R738o823
6516D50139j1339k5195J3671l2179k040L9566j9860j2423R482l9468m6275J5300
6504C39379K9445L3941N0081M228J5009J5991M069N6381P1254J846j033M1985
6492F62576L6806N7266l030N7020j8730q694K0763j7910l9274l7133k1247k6289
6480F62124J2750M9539R096m7881k5528L7579J5279j0171j2856N571j922K999
6468F96579J2919m853j4343K9056K3546K2486P5291J9958l1404j3725o6822n2598
6456F96090o4620l7198J1270m3525k851j6630M835L1391j4945m2010P0831k957
6444E89681n0470R969l7044m4660o0j915J5271J2365M5070L4223m748K0142m35
$$ y = [519715, 468672, 473814, 496999, 472040, 452467, 472445, 459378, 467676, 480791, 447224, 456962, 450139, 438800, 413605, 427276, 395097, 393057, 432623, 412763, 400340, 409822, 370354, 324079, 339379, 368824, 402765, 452846, 457074, 472083, 488074, 492143, 548524, 619778, 621624, 620591, 662576, 699382, 756648, 753618, 810638, 791908, 783214, 803977, 786067, 746793, 709660, 688413, 662124, 674874, 724413, 733509, 685628, 660100, 697679, 712958, 702787, 689931, 695502, 693580, 696579, 709498, 704645, 690302, 719358, 742904, 765390, 840681, 860639, 829235, 815510, 748688, 696090, 631470, 594272, 605542, 562017, 559166, 542536, 547371, 578762, 563817, 521807, 592638, 589681, 539211, 549180, 512136, 467476, 467416, 465501, 480772, 493137, 538207, 572430, 567682, 587824, 587389]
6431E87389l9790K727n5654m7866k5547K1848R735l1150m0718L3540j230j6230
6419C97054l1996L101P468J8736J1954k0851n608r542J8475k4633m481L5819K0645
6406D16141J469j393R217P0j5767j3638m5963K88L5210k9754j3513M0368L9780
6393D22515k6014k4730j0757K3054j1341pK327k6340J4877K0605j3813k7726J2586
6380C55236K4252j2497k610K6163k0401k1146J1173J9144m2598N479j982J9304
6368C59517j8875m989O639j9472L0534J3053j3948j5169k0032K6878L6981K5449
6356D06566j3455j5477r525J0191j965q542J8031k1178J7366J1074j719J9551
6344D10918j9863K7899k1151J8145l0558r504K5044M3863P326l7370R584K8710
$$ y = [587389, 547599, 550326, 494672, 446806, 421259, 443107, 452842, 421692, 380974, 414514, 413284, 397054, 365058, 368159, 375627, 394363, 406317, 385466, 379858, 370316, 388791, 364158, 359677, 395496, 416141, 417610, 416217, 425434, 425504, 409737, 396099, 350136, 350424, 385634, 355880, 342367, 382735, 422515, 396501, 371771, 361014, 384068, 372727, 372720, 375047, 348707, 363584, 384189, 370376, 342650, 355236, 379488, 366991, 364381, 390544, 370143, 348997, 360170, 379314, 336716, 342195, 340213, 359517, 340642, 335653, 342292, 322820, 353354, 366407, 352459, 337290, 317258, 344136, 381117, 406566, 393111, 377634, 368109, 378300, 376335, 367793, 385824, 364646, 382012, 393086, 391367, 410918, 391055, 418954, 397803, 415948, 385390, 375886, 400930, 444793, 452119, 414749, 424333, 453043]
6332D53043n542q526l824J3888J2546J1444q127K1283K3522j446k009j2479Q274
6319E02047j9095k5216M7456P261p653j1126Q751L095L4462K7400L936j3667o803
6306E50848J3060J1599L0112r689j111J8336J6798k3706L3774K7493l370M73K8576
6293F93193J5912p54m688N3624j1553l863M5370n258j5854K7364k1319K756K9757
6280H04687R690j4856M1328J4220l037J4944K4261J2530J5783p818J252K279m041
6267I11222p703J0561L1691L9373k3743n662K9377J1973L5643j2973o885J2507
6255A025381O4325k0976j5276j9481j2696O7399P955q088J8737L2308k959q922
6243A127707K0582P08J8277M4782k0566K3661N8202J0749k8862j486K7107L3491
$$ y = [453043, 447501, 438975, 435151, 449039, 461585, 473029, 464902, 486185, 509707, 508261, 506252, 493773, 502047, 482952, 457736, 505192, 512453, 504800, 493674, 502425, 505520, 539982, 567382, 571318, 557651, 550848, 563908, 575507, 605619, 595930, 594819, 613155, 629953, 606247, 640021, 667514, 664144, 664617, 693193, 709105, 708351, 703663, 757287, 745734, 741871, 787241, 781983, 766129, 793493, 772174, 774930, 804687, 814377, 799521, 840849, 855069, 852032, 866976, 891237, 903767, 919550, 911732, 912984, 915263, 911222, 903519, 914080, 945771, 985144, 961401, 955739, 985116, 997089, 1032732, 1019759, 1012874, 1025381, 1089706, 1068730, 1053454, 1033973, 1021277, 1088676, 1096631, 1088543, 1107280, 1139588, 1136629, 1127707, 1148289, 1148997, 1167274, 1212056, 1191490, 1215151, 1273353, 1284102, 1255240, 1253754, 1280861, 1314352]
6231A314352M8973N4374R166L9782M0095M5351O1812k3680m841O469K288M49K2786
6218A617376J4975k3615L3661K6571M9738K6907K4304L9006L5470L0361J365K2746
6206A898865R7810M2803L7155M8817N0447R0918L9675L2245N0573P5740O8792
6195B533840N4471K2662N9573N5099P0015R1483R7682J00793R1120Q7370P4218
6184C338326J16352R6207R9996J29630R7829J19189J46685J17914J24960J34559
6174D521647J80212J81388J61244K07961J88460K29804K21103K41777K73724L62727
6164F770047M19331M42659M54006N52499N99353O55954P84732Q82890J054960
6155A2616431J248324J470800J704232J775574J617924J127182M16015j96375
$$ y = [1314352, 1363325, 1417699, 1426865, 1466647, 1506742, 1552093, 1613905, 1590225, 1585384, 1591853, 1594141, 1594590, 1617376, 1632351, 1608736, 1642397, 1668968, 1718706, 1745613, 1769917, 1808923, 1844393, 1874754, 1876119, 1898865, 1996675, 2039478, 2076633, 2125450, 2175897, 2266815, 2306490, 2338735, 2389308, 2465048, 2533840, 2588311, 2610973, 2670546, 2725645, 2795660, 2887143, 2984825, 3085618, 3176738, 3264108, 3338326, 3454678, 3550885, 3650881, 3780511, 3878340, 3997529, 4144214, 4262128, 4387088, 4521647, 4701859, 4883247, 5044491, 5252452, 5440912, 5670716, 5891819, 6133596, 6407320, 6770047, 7189378, 7632037, 8086043, 8638542, 9237895, 9893849, 10678581, 11561471, 12616431, 13864755, 15335555, 17039787, 18815361, 20433285, 21560467, 21976482, 21780107]
6147B1780107o45638p81093n40232k71527O6941M63907Q44723J162538J355535
6138B3435261J340390J040163P07141N04095N52198P79490P21984L10594k47348
6129B9143968q31916j247223j280284j007980m84387L9347M46381O41011M52051
6120B5870968l4995m91050p19044n61199j79325L32735Q79509J333192J397775
6111B7828566R67601L6324j309860k365585k731512k611637k278640j949164j608502
6102A3977591j354045j105038q81179p99896o30012n20394l99105l33136l17144
6093G637642l08346k75685k21121k32547k08557j89495k22539j99312k02903j72698
6083E404439j63018j19993j42273q6265j11313j31145r0806j06091q6185n1766
$$ y = [21780107, 21134469, 20353376, 19813144, 19541617, 19608558, 20072465, 20917188, 22079726, 23435261, 24775651, 25815814, 26522955, 27027050, 27579248, 28358738, 29080722, 29391316, 29143968, 28312052, 27064829, 25784545, 24776565, 24292178, 24331525, 24777906, 25418917, 25870968, 25835973, 25344923, 24625879, 24064680, 23885355, 24218090, 25097599, 26430791, 27828566, 28796167, 28832491, 27522631, 25157046, 22425534, 19813897, 17535257, 15586093, 13977591, 12623546, 11518508, 10637329, 9837433, 9207421, 8687027, 8287922, 7954786, 7637642, 7329296, 7053611, 6832490, 6599943, 6391386, 6201891, 5979352, 5780040, 5577137, 5404439, 5241421, 5121428, 4979155, 4892890, 4781577, 4650432, 4559626, 4453535, 4367350, 4315584]
6073D315584r3578n8492n2632o5287n6264j2255l8761k3600j12328j09920p0981
6062C621486q7077n3616r2726n4895p2855n4100o4088l5359l5871J126j4056l3479
6050C024490n2500K7840j6551J1302L3022K8158L894J4464Q0362J4285O3511L8448
6038C270725k9029r465j2104k9898L5441k4605J3349K0443N4217N3731P7800R5767
6026C516372P6750R0241J20069O6239K2460q301L0073M4555N5089J10897J41810
6015D266254R0477J69534J95380J60336K29419K51598K67413K92843L77099M41910
6005F742263N04584N68759O02126N21306K79259q4136l51003n02751m95045m39739
5995G345623l73006l41108k08027j42912j17603p4225k315R684L4128M8064O1954
$$ y = [4315584, 4222006, 4163514, 4110882, 4045595, 3989331, 3977076, 3938315, 3914715, 3802387, 3692467, 3621486, 3534409, 3480793, 3388067, 3333172, 3260317, 3206217, 3142129, 3106770, 3070899, 3072025, 3057969, 3024490, 2971990, 2999830, 2983279, 2994581, 3027603, 3055761, 3059655, 3074119, 3154481, 3168766, 3232277, 3270725, 3241696, 3232231, 3220127, 3190229, 3225670, 3201065, 3214414, 3234857, 3289074, 3342805, 3420605, 3516372, 3593122, 3683363, 3803432, 3869671, 3892131, 3883830, 3913903, 3958458, 4013547, 4124444, 4266254, 4356731, 4526265, 4721645, 4881981, 5111400, 5362998, 5630411, 5923254, 6300353, 6742263, 7246847, 7815606, 8417732, 8939038, 9218297, 9134161, 8783158, 8280407, 7785362, 7345623, 6972617, 6631509, 6423482, 6280570, 6162967, 6088742, 6086427, 6096111, 6130239, 6178303, 6240257]
5984F240257J17201Q2726J10288R5264R3749J48471J35766J50854J47295K34831
5974G556702K37509J88845K35784K95946L07155L71672M39307N07237N52353O37777
5964A1330287P17529Q36153R30439J117755J253898J443065J735792K078315K468608
5955B3911841K713761K691402K070360R66525l77173j277858j508814j255571
5947B7934473p75936k48003K74301O77514P44168N01067O3523l49079m48130j66376
5937B8207522K58905P02631J077398J255915J076291O24340k0637n43807q26090
5928C1812468q19333o59374o11887q30799j121212j314460j289233r90597o61928
5919B3513645k81265Q2740L56550O06493P00213N10573L4602n98626j318705j747000
$$ y = [6240257, 6357458, 6440184, 6550472, 6645736, 6739485, 6887956, 7023722, 7174576, 7321871, 7556702, 7794211, 7983056, 8218840, 8514786, 8821941, 9193613, 9632920, 10140157, 10692510, 11330287, 12047816, 12883969, 13814408, 14932163, 16186061, 17629126, 19364918, 21443233, 23911841, 26625602, 29317004, 31387364, 32353889, 31976716, 30698858, 29190044, 27934473, 27158537, 26910534, 27184835, 27862349, 28606517, 29107584, 29171107, 28822028, 28373898, 28207522, 28466427, 29169058, 30246456, 31502371, 32578662, 33203002, 33182365, 32638558, 31812468, 30993135, 30333761, 29721874, 28891075, 27769863, 26455403, 25166170, 24175573, 23513645, 23232380, 23315120, 23671670, 24278163, 24978376, 25488949, 25523551, 24924925, 23606220, 21859220]
5909B1859220j858243j733615j467437j296706j128460r69684q00212p64908o73349
5900A1166606n09791m42215l97158k86732l16485k40861k11497k07861j34196
5891H419810j47736j51572j05302j21619j36275j25075r6774n5001l8645o0004
5881G381807l3490j9717j2737j7915N6085N6175N4572M3273M1287J06053J20669
5870G776062J59568J51344J90905K42797K46297K42447K67918K69717K22939K47663
5860A0017657K22894J99606K00246K06353J76941J31493Q3061N5667L1532J061
5850A1326511N3876N6272J29055J59038J82125K30051L16149L89126L61351M49876
5840A3653430M93445N17642N73236O27844O76845P51059Q29677Q51173R49229
$$ y = [21859220, 20000977, 18267362, 16799925, 15503219, 14374759, 13405075, 12604863, 11839955, 11166606, 10656815, 10214600, 9817442, 9530710, 9214225, 8973364, 8761867, 8554006, 8419810, 8272074, 8120502, 8015200, 7893581, 7757306, 7632231, 7535457, 7480456, 7441811, 7381807, 7348317, 7328600, 7315863, 7297948, 7354033, 7410208, 7464780, 7508053, 7549340, 7655393, 7776062, 7935630, 8086974, 8277879, 8520676, 8766973, 9009420, 9277338, 9547055, 9769994, 10017657, 10240551, 10440157, 10640403, 10846756, 11023697, 11155190, 11238251, 11293918, 11325450, 11326511, 11380387, 11436659, 11565714, 11724752, 11906877, 12136928, 12453077, 12842203, 13203554, 13653430, 14146875, 14664517, 15237753, 15865597, 16542442, 17293501, 18123178, 18974351, 19923580]
5831A9923580J092860J228309J448257J679352J808381J780266J421861Q60539
5823C1243405P4612p09046j187854j329943j288112j078573q09670m91605k39633
5814B4183581K1378J91878L82494M77412O62687Q78036J131669J412495J778254
5805C1119884K210973K569730L006699L343089L258435K566762J265070l97190
5797D8943452j913170l011820l597869l485032l016123k486980k002209j544442
5789B7885807j127783q67602o32872l65664j68889m1045N1182J89990L44497N65901
5779B5833522P89248J049250J253505J215011R53885L20556n25336j346666j824382
5770B7718593k050102j928428j655342j470271j318989j176940j092769j015264
$$ y = [19923580, 21016440, 22244749, 23693006, 25372358, 27180739, 28961005, 30382866, 31243405, 31318017, 30608971, 29421117, 28091174, 26803062, 25724489, 24914819, 24423214, 24183581, 24204959, 24396837, 24779331, 25256743, 25919430, 26797466, 27929135, 29341630, 31119884, 33330857, 35900587, 38907286, 42250375, 45508810, 48075572, 49340642, 48943452, 47030282, 44018462, 40420593, 36935561, 33919438, 31432458, 29430249, 27885807, 26758024, 25890422, 25257550, 24891886, 24722997, 24681952, 24733134, 24923124, 25267621, 25833522, 26622770, 27672020, 28925525, 30140536, 31094421, 31414977, 30889641, 29542975, 27718593, 25668491, 23740063, 22084721, 20614450, 19295461, 18118521, 17025752, 16010488]
5762A6010488q26171p31085o36629n52232n49620n29188n38593n28519m49072
5753A0669379l46609l19987k32825k30348j81075j29332q6197p0530j2009o9311
5743H991156j18507j94559k50096k98502l11737k91942l27021l01754k67759k44096
5733F385183j79495j94036j74993r6440j14056r2980o0773p2994p9017q4214j30463
5722E105722q6905p2003r2866r8845o0079k2503m1450q1288p1772o3558o0578
5711D353875p2389p6008q4743k4936J7522k0075j0877o014L9188j5093J192L4918
5699D136560O6440M0944j3382M907L4139M1270N9313Q0816Q1317J25967J17219
5688D775510J40039q374r7113j77450j84144q9987m4401l2353n9229K5762M8791
$$ y = [16010488, 15184317, 14453232, 13816603, 13264371, 12714751, 12185563, 11646970, 11118451, 10669379, 10322770, 10002783, 9769958, 9539610, 9358535, 9229203, 9143006, 9072476, 9060467, 8991156, 8872649, 8678090, 8427994, 8129492, 7817755, 7525813, 7198792, 6897038, 6629279, 6385183, 6205688, 6011652, 5836659, 5740219, 5626163, 5533183, 5472410, 5399416, 5320399, 5236185, 5105722, 5018817, 4946814, 4853948, 4755103, 4695024, 4672521, 4631071, 4549783, 4478011, 4414453, 4353875, 4281486, 4205478, 4120735, 4095799, 4113321, 4093246, 4082369, 4076355, 4115543, 4100450, 4101642, 4136560, 4203000, 4243944, 4230562, 4235469, 4269608, 4310878, 4370191, 4451007, 4532324, 4658291, 4775510, 4915549, 4907175, 4810062, 4632612, 4448468, 4358481, 4314080, 4281727, 4222498, 4248260, 4297051]
5677D297051M5556m936J8182P708P4055Q9252J29592J29353J58221J99327J90678
5666E334039J94539J82580J90154K60341L31156L07521K46308j2093k70817m35695
5656F328033l83017l54171k93269j84851j05819k8086J3758k7361O8741J24025
5646E157983J14502N2092K7202J8825M8129N4481Q3363J58182J96402K73249L76484
5635F560894M41219N11840M75934K79713r0988n04316o09313o01391n49700l85535
5625E528357k87248k46172j84618j33884n7412o4873J5632Q7841R7481J19201
5615D874305J69312J01719O4269K0226K8753Q4843R4918K10858L23310L70238
5605F342751L04202J71900j39589m54121m65905m01126l37924l29756k57664j83865
$$ y = [4297051, 4342607, 4337671, 4355853, 4363561, 4437616, 4526868, 4656460, 4785813, 4944034, 5143361, 5334039, 5528578, 5711158, 5901312, 6161653, 6492809, 6800330, 7046638, 7034545, 6763728, 6328033, 5945016, 5590845, 5297576, 5112725, 5006906, 4978820, 4992578, 4965217, 5033958, 5157983, 5272485, 5324577, 5351779, 5370604, 5418733, 5473214, 5556577, 5714759, 5911161, 6184410, 6560894, 7002113, 7513953, 7989887, 8269600, 8178612, 7674296, 7064983, 6463592, 5913892, 5528357, 5241109, 4994937, 4810319, 4676435, 4619023, 4554150, 4569782, 4657623, 4755104, 4874305, 5043617, 5145336, 5209605, 5229831, 5258584, 5343427, 5438345, 5649203, 5972513, 6342751, 6646953, 6818853, 6679264, 6225143, 5759238, 5358112, 5020188, 4690432, 4432768, 4248903]
5595D248903j52499j05382q5767n9535n9454o868N948k2268L3174O0149J6495
5584C872896N6183P2748Q3594O2831Q7927J19841J40602R8600K0135j23011j64063
5573D328283k10912k13683j38787j19355j28359p1475n7581l0427j1446k100l8726
5562C305432m7128J3556K5376M295M8789M4964M3770M5350P4818R9949J09549
5551C768720J14228J45240K14017J64591J70996J53800J59158J10039j692j19364
5541D879733j26938j44928j16680r4795o7619n9410m2288J2114L2069O1604P5282
5530D408144O3104J47899J62549J35293R9042J02856N3022O6249J1067m8749j23938
5519E076538k13419k42859k44003k03639j65625j86436j04021p9354m6504k7139
$$ y = [4248903, 4096404, 3991022, 3905255, 3845720, 3786266, 3779398, 3785346, 3763078, 3796252, 3856401, 3872896, 3929079, 4001827, 4085421, 4148252, 4236179, 4356020, 4496622, 4595222, 4615357, 4492346, 4328283, 4117371, 3903688, 3764901, 3645546, 3517187, 3445712, 3388131, 3357704, 3346258, 3344158, 3305432, 3258304, 3271860, 3297236, 3301531, 3350320, 3395284, 3439054, 3484404, 3559222, 3659171, 3768720, 3882948, 4028188, 4242205, 4406796, 4577792, 4731592, 4890750, 5000789, 4999097, 4879733, 4752795, 4607867, 4491187, 4396392, 4328773, 4269363, 4227075, 4239189, 4271258, 4332862, 4408144, 4471248, 4619147, 4781696, 4916989, 5016031, 5118887, 5171909, 5238158, 5249225, 5200476, 5076538, 4863119, 4620260, 4376257, 4172618, 4006993, 3820557, 3716536, 3637182, 3590678, 3563539]
5509C563539J3253J3343P0395Q6256P4936Q7737M4797k1845k6447j10703k07275
5498C587986j83849k18096j37907j81164r6297q7067p2885q0977l2658l4160p6826
5487B386100l7575k6641j2975j9829J8270K0289M05q445J0621J9563m7948n7098
5475B244737j04957n8345j4796j0213m7571l0670k7659Q934N5189J9O9503O5732
5463B149903k053J3114P1081O3229P9095J24655J37627O4646K2083n5027j15165
5452B553188j13455j40968m8990o3990q2491k0125q439m943L763N1969L4202N2419
5440B212140N6865r250K4758O0296K2853K9771K7261K0541k1766n0636l2972p4059
5428B265802q6471q6542o6530p5155q6424m9171k7257n3773k7958j3120J1266
$$ y = [3563539, 3576792, 3590135, 3660530, 3746786, 3821722, 3909459, 3954256, 3932411, 3905964, 3795261, 3587986, 3404137, 3186041, 3048134, 2866970, 2770673, 2683606, 2610721, 2529744, 2497086, 2462926, 2386100, 2348525, 2321884, 2308909, 2289080, 2307350, 2327639, 2328044, 2319599, 2330220, 2349783, 2301835, 2244737, 2139780, 2081435, 2066639, 2056426, 2008855, 1978185, 1950526, 1959460, 2014649, 2014668, 2084171, 2149903, 2147850, 2160964, 2232045, 2295274, 2374369, 2499024, 2636651, 2701297, 2723380, 2668353, 2553188, 2439733, 2298765, 2249775, 2185785, 2103294, 2083169, 2074730, 2069787, 2073550, 2125519, 2159721, 2212140, 2269005, 2259755, 2284513, 2344809, 2367662, 2397433, 2424694, 2445235, 2423469, 2372833, 2339861, 2265802, 2179331, 2092789, 2026259, 1951104, 1864680, 1815509, 1788252, 1734479, 1706521, 1693401, 1704667]
5417A704667J4603L7041J5941N9161L2450N499j3112n3254p6351j09816r2749
5406A524080n8386n6540j0342j9011j7791p342j8714j8203m1519L191J67k1001
5394A258589o996J2475k0314j1435J738L6981m871R501j3495O453k4665l1675
5382A212286J2359Q389k2855j8884n393Q886j8462L0108L5599K2255J6472P147
5370A287907K1737o276j6772J2151p386J2337M714M0457K3437L0136O1845K335
5358A466622m5629k3733l5334n2194K8020n3608j1192k3873J7677K6150L174j4089
5346A281991o74K7640Q312J2138J9582Q073L118J5610J3679l887K9267M4417K0193
5333A479459L6169K1111k7297o1977r9735m4624l4618k0774j2865k7890k124k8594
$$ y = [1704667, 1719270, 1756311, 1772252, 1831413, 1863863, 1869362, 1856250, 1802996, 1726645, 1616829, 1524080, 1465694, 1409154, 1398812, 1379801, 1362010, 1354668, 1335954, 1317751, 1276232, 1279423, 1279590, 1258589, 1251593, 1264068, 1243754, 1232319, 1234057, 1271038, 1266167, 1275668, 1262173, 1268626, 1243961, 1212286, 1224645, 1233034, 1210179, 1191295, 1185902, 1194788, 1176326, 1206434, 1242033, 1264288, 1280760, 1287907, 1309644, 1303368, 1286596, 1298747, 1291361, 1303698, 1308412, 1348869, 1372306, 1402442, 1464287, 1466622, 1420993, 1397260, 1361926, 1309732, 1337752, 1284144, 1272952, 1249079, 1266756, 1292906, 1296080, 1281991, 1281317, 1308957, 1317269, 1329407, 1348989, 1357062, 1360180, 1375790, 1389469, 1385582, 1414849, 1459266, 1479459, 1515628, 1536739, 1509442, 1447465, 1347730, 1303106, 1268488, 1247714, 1234849, 1206959, 1204835, 1176241]
5321A176241k7918L2201K0957r988k814L3511J1877o249N0759P498n178J5112
5309A296009L0612L0515M2967L8637K3162K7636P316p8893m9022q1494l9723M084
5297A251806j7628K4360r548L2924m7183j1186j5136j9687R051k7774m7555q909
5285A113535J8938Q507J0877j1193k2030L1205p174k675L0441m1427k4426n6000
5273A048578k4061k2030k2874k4308k1774O866j3621l465K8591j4899n8430K1428
5261I00001J6806l7992j0912L1753J8990K882j7664l0027N870K2205J8993k2764
5249H98141K6502n0932j6194M126J4142J6934k194k1054l0747Q157o93l994J9109
5236H61303k8013m1043J1548L5548N456m617r29j018l0591K6450k107j7012K3935
$$ y = [1176241, 1148323, 1180524, 1201481, 1191493, 1188679, 1222190, 1234067, 1227818, 1278577, 1286075, 1280897, 1296009, 1326621, 1357136, 1400103, 1438740, 1461902, 1489538, 1496854, 1417961, 1368939, 1287445, 1247722, 1251806, 1234178, 1258538, 1248990, 1281914, 1234731, 1223545, 1208409, 1188722, 1197773, 1169999, 1122444, 1113535, 1132473, 1140980, 1151857, 1140664, 1118634, 1149839, 1142665, 1139990, 1170431, 1129004, 1104578, 1048578, 1024517, 1002487, 979613, 955305, 933531, 940397, 926776, 923311, 951902, 937003, 878573, 900001, 916807, 878815, 867903, 899656, 918646, 921528, 903864, 873837, 879707, 901912, 920905, 898141, 924643, 873711, 857517, 861643, 875785, 892719, 890525, 869471, 838724, 846881, 846188, 842194, 861303, 833290, 792247, 803795, 839343, 844799, 840182, 839253, 838235, 807644, 834094, 831987, 814975, 838910]
5223H38910J9834o189k1441K9422J6582j4445k3592j1949j5920O792k3917l989
5211G90098L2999j1585k3890K3791j8065n559N913l0346p683K0212j8082r112
5199G48691P809q73J6753j9855m464K2520l2420J9367Q259r415P58M2385J5188
5186H14703m5144j3539M0687Q754K462k2396L6759J3158P371J2409Q465j098J1248
5173H73839K3253j8435P207o505l9745K5088L545n9344k9292k7908K7878k7002
5161G52579l2478Q092K2421l3712k6674K1136j758J9589l2662K1161n526k0547
5149F91621j9015M313M410k6413L862k8295J584K9480k1320k1914K0936m531j2583
5136F22135j5314J6415L9816j6214j2061J4307k295R578L796r299k9436K1068
$$ y = [838910, 858744, 852555, 831114, 860536, 877118, 862673, 839081, 827132, 811212, 818004, 794087, 790098, 823097, 811512, 787622, 811413, 793348, 787789, 793702, 763356, 755673, 775885, 757803, 748691, 756500, 755627, 772380, 752525, 748061, 770581, 738161, 757528, 765787, 756372, 757130, 799515, 814703, 769559, 756020, 796707, 805461, 807923, 785527, 822286, 835444, 842815, 855224, 863689, 862591, 873839, 897092, 878657, 885864, 879359, 839614, 864702, 868247, 808903, 779611, 751703, 779581, 752579, 720101, 728193, 750614, 716902, 690228, 711364, 709606, 729195, 696533, 717694, 712168, 691621, 672606, 676919, 681329, 654916, 658778, 630483, 632067, 661547, 640227, 618313, 639249, 634718, 622135, 606821, 623236, 663052, 646838, 634777, 649084, 646789, 656367, 660163, 650864, 621428, 642496]
5124F42496Q948k5260q936K1905j9953L2462K344r514r180M274l3953K6345J9412
5111F51390l04L051K7646M3851l839Q393J3668r924J6829L3872O25J3537J2899
5098H11694O164P879J1986p615J8102n586J7884J0792k6367n5655J0198l3915
5086G65561l7361j5944m0516L878j6321J898O3180R890k1894J8521J3115J2221
5074G56228l0321l1473l2797j960L3513L1895n767n706J8815j4736M0124M1576
5062G99391J9214k5140K9675K1673n394J2841l043p105q586J5477l5061k6040
5050G87902L2925m110j2373K8382J7195O257j1588P4L3128L9000J424l0956k258
5037H85002K2020k679K6326J0451O479j650L779N196p431J2524o623J7086m687
$$ y = [642496, 651444, 626184, 617248, 639153, 619200, 651662, 654006, 644492, 635312, 639586, 605633, 631978, 651390, 651086, 654137, 681783, 725634, 721795, 730188, 743856, 733932, 750761, 784633, 785258, 798795, 811694, 817858, 825737, 837723, 830108, 848210, 842624, 860508, 871300, 844933, 789278, 799476, 765561, 728200, 712256, 671740, 675618, 659297, 661195, 724375, 734265, 712371, 730892, 744007, 756228, 725907, 694434, 661637, 659677, 693190, 725085, 719318, 713612, 732427, 717691, 757815, 799391, 818605, 793465, 823140, 844813, 839419, 852260, 849217, 842112, 833526, 849003, 813942, 787902, 820827, 816717, 804344, 832726, 849921, 856178, 844590, 844664, 877792, 916792, 918216, 887260, 885002, 907022, 904343, 930669, 941120, 947599, 945949, 949728, 954924, 947493, 960017, 953394, 970480, 965793]
5024I65793N478M72n399J2810Q459K4951M7652Q3372O9017P0838J34603R5605
5012A513651R4676M3112q4044p3806j12243j18741r1261m5409n2842m0403n2212
5001I80478n6555l489j0062l6796q340K2077o469J6297n4372j0490K9894L2789
4989H94962r539O659M1952K9480P958Q342J7295O6716O4833j0233k1133n1722
4977A045570m5515l9721J1750k0091l3613P318l9020k0431J6615j4726j2956o259
4965H48921j0852p259L8427j2559J9944L5347p48p322Q21j665J3294K889J2825
4952I32063N670q790O499M8212J7505j6322L6791k6818J0911L457j8329j2668
4940I78181K8998P291N161j5887k232J2122k7405k8999l9112J5438p744K6771
$$ y = [965793, 971271, 971743, 966344, 979154, 987613, 1012564, 1060216, 1143588, 1212605, 1283443, 1418046, 1513651, 1608327, 1651439, 1567395, 1493589, 1381346, 1262605, 1171344, 1125935, 1073093, 1032690, 980478, 923923, 920434, 910372, 873576, 865236, 887313, 880844, 897141, 842769, 832279, 862173, 894962, 885423, 892082, 934034, 963514, 971472, 979814, 997109, 1063825, 1128658, 1118425, 1097292, 1045570, 1000055, 960334, 972084, 951993, 918380, 925698, 886678, 866247, 882862, 868136, 855180, 848921, 838069, 830810, 869237, 856678, 876622, 911969, 911221, 903899, 904720, 903055, 916349, 919238, 932063, 937733, 928943, 935442, 983654, 1001159, 984837, 1021628, 994810, 1005721, 1009178, 990849, 978181, 1007179, 1014470, 1019631, 1003744, 1001512, 1013634, 986229, 957230, 918118, 933556, 925812, 952583]
4928I52583J7420p506K4592K2408L480K8949l313J4476K9379J363L0203J3646
4916A127680J2189J3078K8863M2295M3536K913j2185K7695R544m2682J8504m986
4904A266444k4888J1845J4842n942L455O883Q761j0530J9132J3016M872J5432
4892A323322r399J8553r856M1764N943k0581K9375K6826K4803K6284O827K1541
4880A485402Q256K6795N791O785M6402J554m290L8924J2853k8446N5599J0383
4868A666008J041j769k5199j6099J3903O0745q113R798j6673L2687L0847J8635
4856A765811K2162k5995j818L7924Q6188K3320K5790L1579K6090N6927L6155L0516
4844B114649K3817N0979J03497P4643N1629M2381N6001K8985j5657K2976J9748
$$ y = [952583, 970003, 962497, 987089, 1009497, 1012977, 1041926, 1038613, 1053089, 1082468, 1083831, 1114034, 1127680, 1139869, 1152947, 1181810, 1224105, 1267641, 1270554, 1258369, 1286064, 1295608, 1252926, 1271430, 1266444, 1241556, 1253401, 1268243, 1262301, 1265756, 1272639, 1281400, 1270870, 1290002, 1303018, 1307890, 1323322, 1313923, 1332476, 1322620, 1364384, 1370327, 1349746, 1379121, 1405947, 1430750, 1457034, 1463861, 1485402, 1493658, 1520453, 1526244, 1533029, 1579431, 1580985, 1576695, 1615619, 1628472, 1600026, 1655625, 1666008, 1667049, 1665280, 1640081, 1623982, 1637885, 1698630, 1690517, 1700315, 1683642, 1716329, 1747176, 1765811, 1787973, 1761978, 1760160, 1798084, 1884272, 1907592, 1933382, 1964961, 1991051, 2047978, 2084133, 2114649, 2138466, 2189445, 2292942, 2367585, 2419214, 2461595, 2517596, 2546581, 2530924, 2553900, 2573648]
4833B573648l065M389L7466L6040n23L0900P0888L1537R6036N2827L4537M2175
4821C006855P3138P0557K7855N7888N7587N8075Q3827Q0454J26149J13201O2978
4810C818564J24426J08418J30862Q8275L7543J1316Q1642O1300P4507Q9989Q5547
4799D712389R5612P0697J13315J29090J22267J70250K00575J98573J46906J92149
4789F151823J57962J55803J85051K00819K56643K28791K78998K69451K84806L53876
4779H524023L03138K98527L69877L61538L89389M45923M61467N10362N29059N97114
4769A2790417O75156P07374Q25631R02829R98244J181317J356909J448448J661090
4760B2547415J826003J973627K099563K063223J843789J491643J018336N95900
$$ y = [2573648, 2570583, 2574972, 2612438, 2648478, 2647955, 2678855, 2749743, 2781280, 2877316, 2930143, 2964680, 3006855, 3079993, 3150550, 3178405, 3236293, 3293880, 3351955, 3435782, 3516236, 3642385, 3755586, 3818564, 3942990, 4051408, 4182270, 4270545, 4308088, 4319404, 4401046, 4462346, 4536853, 4626842, 4712389, 4808001, 4878698, 4992013, 5121103, 5243370, 5413620, 5614195, 5812768, 5959674, 6151823, 6309785, 6465588, 6650639, 6851458, 7108101, 7336892, 7615890, 7885341, 8170147, 8524023, 8827161, 9125688, 9495565, 9857103, 10246492, 10692415, 11153882, 11664244, 12193303, 12790417, 13465573, 14172947, 14998578, 15901407, 16899651, 18080968, 19437877, 20886325, 22547415, 24373418, 26347045, 28446608, 30509831, 32353620, 33845263, 34863599, 35459499]
4752C5459499K53223l1662l71664j047334j577699j464775j128101p71815l44385
4743B8975287j8332K60889O06907Q68729J115616J437927J757260K147056K506464
4734C9657803K804648K857867K712429K099575J159876j3251j202728k176419
4726D7899800k565182k625163k388682j912276j590869j155954p80491m82355
4718C4398828k06511P6333L34078N86298Q82596J291969J850539K404058K831900
4709D4450088L140725L414053L784538M264425M591835M745039N292745O968856
4701H0652304R764065J3285464J4502347J1850002M288242j0676552j8656828
4694A05009044j6721153j4405985j1151722q377966o554028n181341l978219l173367
$$ y = [35459499, 35712722, 35681060, 35309396, 34262062, 32684363, 31219588, 30091487, 29319672, 28975287, 28956955, 29217844, 29824751, 30693480, 31809096, 33247023, 35004283, 37151339, 39657803, 42462451, 45320318, 48032747, 50132322, 51292198, 51278947, 50076219, 47899800, 45334618, 42709455, 40320773, 38408497, 36817628, 35661674, 34881183, 34398828, 34192317, 34268650, 34602728, 35189026, 36071622, 37363591, 39214130, 41618188, 44450088, 47590813, 51004866, 54789404, 59053829, 63645664, 68390703, 73683448, 80652304, 90416369, 103701833, 118204180, 130054182, 134342424, 123665872, 105009044, 88287891, 73881906, 62730184, 54352218, 47798190, 42616849, 38638630, 35465263]
4686C5465263k636382k236190j877937j614968j384633j209431j147460j077774
4678B2280488r97203r68682r66175j047199j036725q83344q14473p31573o31086
4669A4204028o21801n86193n24558m56675m78538m51030m52884m09373l93437
4660I829539l86719l71181l53283l00088l10349k06943j96272j80803j81844k32113
4650G109944j98917j85630j78217j32203j42648j45261j34160j45974j19605j06760
4640E620569j20397j28198r3797q6343n9857q7418q7057r5406p6220o2512j22850
4629D600514r3311j11222p1137r1658q3530j02936j09835o4690p3074m3772n9620
4618C695729l9989k9865n3789n0281l455j0370p930J8179n787k4064m690L3800
$$ y = [35465263, 32828881, 30592691, 28714754, 27099786, 25715153, 24505722, 23358262, 22280488, 21283285, 20314603, 19348428, 18301229, 17264504, 16381160, 15566687, 14835114, 14204028, 13582227, 12996034, 12471476, 12014801, 11536263, 11085233, 10632349, 10222976, 9829539, 9442820, 9071639, 8718356, 8418268, 8107919, 7900976, 7704704, 7523901, 7342057, 7109944, 6911027, 6725397, 6547180, 6414977, 6272329, 6127068, 5992908, 5846934, 5727329, 5620569, 5500172, 5371974, 5278177, 5191834, 5131977, 5044559, 4957502, 4862096, 4785876, 4723364, 4600514, 4507203, 4395981, 4324844, 4233186, 4149656, 4046720, 3936885, 3872195, 3799121, 3755349, 3695729, 3655740, 3625875, 3572086, 3521805, 3518350, 3507980, 3500050, 3518229, 3512442, 3488378, 3483688, 3517488]
4606C517488m2100n1291J6343K2986k320L4974K5697J015j6424k8891j8920m7665
4594C410892J1166j4165o910K2016L2270K3036N1074Q4402J41515J44557J05843
4583D005696K4497j04807j36170j18719r0504o7602m4834k6110L812K9942L940
4572C479141K7604L4194K0906L9253J1226N5534M4475J196M141L3085J8693J7034
4560C786482l2268k1967L135K4659m387k7856r131j2648j4269j1705p6502l0536
4548C573007L7377m934k8155K015J935J1149M7664L2013P623K4536J7352M9278
4536C770860K0727K2567N9523O4299O1658P7890P5793J08276O8649N0089M5387
4525D425718M2694M8442N978K5954J2351r030n154l5526j06521l2030o1611j18694
$$ y = [3517488, 3475388, 3424097, 3440440, 3463426, 3461106, 3496080, 3521777, 3522792, 3506368, 3477477, 3458557, 3410892, 3422058, 3407893, 3400983, 3422999, 3455269, 3478305, 3529379, 3613781, 3755296, 3899853, 4005696, 4030193, 3925386, 3789216, 3670497, 3579993, 3512391, 3467557, 3441447, 3445259, 3475201, 3479141, 3506745, 3540939, 3561845, 3601098, 3612324, 3667858, 3712333, 3713529, 3717670, 3750755, 3769448, 3786482, 3754214, 3732247, 3735382, 3760041, 3755654, 3727798, 3718667, 3706019, 3691750, 3680045, 3603543, 3573007, 3610384, 3605450, 3577295, 3579310, 3581245, 3592394, 3640058, 3672071, 3679694, 3704230, 3721582, 3770860, 3791587, 3814154, 3873677, 3937976, 3999634, 4077524, 4153317, 4261593, 4330242, 4380331, 4425718, 4468412, 4516854, 4522832, 4548786, 4561137, 4552107, 4546953, 4511427, 4404906, 4372876, 4311265, 4192571]
4513D192571j05810j38790j34176j01893q8391m9257l2994k4131o2100n5314j0150
4502C389565J2295k0790N2372L2762N0304M8624O5370P7817L6470N8423O6948
4491C870160O9845N9119L9071J7969j823k3065j6856n65o0273l1531n7324m7945
4479C816782n0814j03094o3599l3750o5683o8789j8514j3747K2322q67q65J6953
4467C436335K6941n2435n4642m9732o3143o4367k8642Q78k67R84M907J6207L2962
4454C205986L9522L4090M9467L7107M9160N0670M9044O0923L2308L1270M0397
4443C679944K6729M1937Q2810J41783J12706J88480K20648J30972Q0209n3157
4433D653061j35071j46824k07289j90111j12657p6278j12892o1850n1827n2082
$$ y = [4192571, 4086761, 3947971, 3813795, 3711902, 3623511, 3574254, 3541260, 3517129, 3455029, 3399715, 3389565, 3401860, 3381070, 3433442, 3466204, 3516508, 3565132, 3630502, 3708319, 3744789, 3803212, 3870160, 3940005, 3999124, 4038195, 4056164, 4054341, 4031276, 4014420, 4013855, 3953582, 3922051, 3864727, 3816782, 3765968, 3662874, 3599275, 3565525, 3499842, 3431053, 3412539, 3398792, 3421114, 3420247, 3419382, 3436335, 3463276, 3410841, 3356199, 3306467, 3243324, 3178957, 3150315, 3151193, 3150926, 3151910, 3156817, 3173024, 3205986, 3245508, 3279598, 3329065, 3366172, 3415332, 3466002, 3515046, 3575969, 3608277, 3639547, 3679944, 3706673, 3748610, 3831420, 3973203, 4085909, 4274389, 4495037, 4626009, 4706218, 4653061, 4517990, 4371166, 4163877, 3973766, 3861109, 3784831, 3671939, 3610089, 3558262, 3506180]
4423C506180R604n8105j8228m447j3843j812L5843M5610K3330L7366J6000J2326
4411C589824P2608J15295P6905R6561J64725J92513J92680J99892J52309j4199
4401D839113j57049j64499j71504k11626j28237j30344p4193q0515Q944M1125
4391C771215M362O4115K8441M3156Q9124O4904N9749J35303J17744J45782J69000
4380D692895J69107J14243Q6345J19484P7031M9011Q0336K3981k8632r1083j21537
4369E171181j55796j71257j34857n9692m3932m5020k0917N2160P1674N6035P3404
4358D792983O2042N1037Q317M6721J9890l776N087j6518n1940m8422q1492q6929
4346D697000q3226r4024l2583m0449q4789n3988k6522j9486l6326p834K1197j3436
$$ y = [3506180, 3515784, 3457679, 3439451, 3435004, 3421161, 3419349, 3455192, 3500802, 3524132, 3561498, 3577498, 3589824, 3662432, 3777727, 3854632, 3951193, 4115918, 4308431, 4501111, 4701003, 4853312, 4839113, 4682064, 4517565, 4346061, 4134435, 4006198, 3875854, 3801661, 3721146, 3730090, 3771215, 3775577, 3839692, 3868133, 3911289, 4000413, 4065317, 4125066, 4260369, 4378113, 4523895, 4692895, 4862002, 4976245, 5062590, 5182074, 5259105, 5308116, 5388452, 5412433, 5383801, 5292718, 5171181, 5015385, 4844128, 4709271, 4649579, 4605647, 4560627, 4539710, 4591870, 4663544, 4719579, 4792983, 4855025, 4906062, 4914379, 4961100, 4980990, 4977214, 4982301, 4965783, 4913843, 4865421, 4783929, 4697000, 4613774, 4519750, 4487167, 4446718, 4361929, 4307941, 4281419, 4261933, 4225607, 4217773, 4238970, 4225534]
4334D225534K1709N0115O2620P4393P5038O0112R6807R9256J02937Q5147N5385
4323E009053j8341K997N6392l2540n4611n9628o2296q6430n7488q0126p9240q6701
4311D451041o7473o1069m5867o2063m7612m3087l0232l1061l9363n8278m1351
4300C923585j3071J3849m650n1721q2127J4362O6771P924J8936k3002R968M1888
4288C922712J2706P032K5786P999k6236l2009J1026p3374j7158Q975o8320m0872
4276C738267J3548j1616m2139p112J8692n2169k7837M445j9715P47R025r592k3990
4263C590554j2252o870M3627Q2528O240J7675M0539N6159N1072N4951K6954M3218
4251C994395J9736J7809K7990J7694M682l5810j8245k2201j9006j0870J3877J0832
$$ y = [4225534, 4247243, 4297358, 4359978, 4434371, 4509409, 4569521, 4666328, 4765584, 4868521, 4953668, 5009053, 4990712, 4993709, 5050101, 5017561, 4962950, 4903322, 4841026, 4754596, 4697108, 4616982, 4537742, 4451041, 4383568, 4322499, 4276632, 4214569, 4166957, 4123870, 4093638, 4062577, 4023214, 3964936, 3923585, 3910514, 3924363, 3919713, 3867992, 3785865, 3800227, 3866998, 3874922, 3893858, 3870856, 3880824, 3922712, 3935418, 3942450, 3968236, 3976235, 3949999, 3917990, 3929016, 3855642, 3838484, 3847459, 3779139, 3738267, 3751815, 3740199, 3698060, 3690948, 3709640, 3657471, 3629634, 3634079, 3614364, 3615111, 3624136, 3614544, 3590554, 3578302, 3571432, 3615059, 3697587, 3703827, 3721502, 3762041, 3818200, 3869272, 3924223, 3951177, 3994395, 4014131, 4031940, 4059930, 4077624, 4082306, 4046496, 4028251, 4006050, 3987044, 3976174, 3990051, 4000883]
4239D000883N014L5154K5492L8913L9318K3291M1590M9687K0525J3887M3418p34
4227D336438J507J9802L7212O9355K0763K5329J1715L859L3576L9960J2569L4079
4215D646164N4921N0035K2192j675M3045K5005Q504P778K7078K9268N3427L8949
4203E004691P8600O5254M1486M5870K4056J6060L6929n006K0168N7581K3917L6897
4191E446503P4154M4520N4992M6145K2452R1381J58278J51724J30686J30918J40861
4180F492614J46862R6644R2612J36108J07414J09096J25699J11178J19283J74535
4170G712045J77409J72432K23070K09892J89681J80733K35924K23831J72409J84625
4160I682051J86620J48868J24508K04141J56799K01692K02077J90064K06372K34566
$$ y = [4000883, 4005897, 4041051, 4066543, 4105456, 4144774, 4168065, 4209655, 4259342, 4279867, 4293754, 4337172, 4336438, 4337945, 4357747, 4394959, 4464314, 4485077, 4510406, 4522121, 4525980, 4559556, 4599516, 4612085, 4646164, 4701085, 4751120, 4773312, 4771637, 4814682, 4839687, 4848191, 4855969, 4883047, 4912315, 4965742, 5004691, 5083291, 5148545, 5190031, 5235901, 5259957, 5276017, 5312946, 5307940, 5328108, 5385689, 5409606, 5446503, 5520657, 5565177, 5620169, 5666314, 5688766, 5780147, 5938425, 6090149, 6220835, 6351753, 6492614, 6639476, 6736120, 6828732, 6964840, 7072254, 7181350, 7307049, 7418227, 7537510, 7712045, 7889454, 8061886, 8284956, 8494848, 8684529, 8865262, 9101186, 9325017, 9497426, 9682051, 9868671, 10017539, 10142047, 10346188, 10502987, 10704679, 10906756, 11096820, 11303192, 11537758]
4150A1537758K50643K75144K87540K87093L04658L13179L55788L12591L06089
4141A4230483K76804K75605L60531L68847L76031L94878M34420M44345M58949
4132A7620893N07886M83787N54926N79899O62103O82519P10951P61332Q61756
4123B3426052R28229R74267J027512J120700J139234J128937J187455J223141
4115C2155527J233823J345772J437692J532084J622557J729476J841983J915153
4107D4814067K145186K401930K759719L353359L960502M615186N403939O123739
4099G5577627O984725P923486R094878J0551127J2437761J4979660J8462451K2774692
4091A78786407K6736737K9118817K7197749J9271674P859081n737501j7609463
$$ y = [11537758, 11788401, 12063545, 12351085, 12638178, 12942836, 13256015, 13611803, 13924394, 14230483, 14507287, 14782892, 15143423, 15512270, 15888301, 16283179, 16717599, 17161944, 17620893, 18128779, 18612566, 19167492, 19747391, 20409494, 21092013, 21802964, 22564296, 23426052, 24354281, 25328548, 26356060, 27476760, 28615994, 29744931, 30932386, 32155527, 33389350, 34735122, 36172814, 37704898, 39327455, 41056931, 42898914, 44814067, 46959253, 49361183, 52120902, 55474261, 59434763, 64049949, 69453888, 75577627, 82562352, 90485838, 99580716, 110131843, 122569604, 137549264, 156011715, 178786407, 205523144, 234641961, 261839710, 281111384, 288970465, 283232964, 265623501]
4084B65623501k4975307k7494685k5072103k1187299j7615804j4733685j2536234
4077A22008384j0339541q081659o052527m623211m130364m258643m651177n030939
4069G4840323n127994m899364m354497l709500l141964k593832k194022j877786
4061D6941364j661068j536753j538618j499333j468947j376484j331135j206686
4053C5322340j132888j094449j075583j049197r80886r09530q45655p17331o77835
4044B6838986o16127n68042n57352n27424n01409m71177m73384l91920m13814
4035B2318337l31786l06203k95414k29765k25741j78203j32718j28115k06504
4026B0283888j64166j50066j15416m5038p1234j97412l05035m17763n11130n19181
$$ y = [265623501, 240648194, 213153509, 188081406, 166894107, 149278303, 134544618, 122008384, 111668843, 103587184, 97534657, 92911446, 88781082, 84522439, 79871262, 74840323, 69712329, 64812965, 60458468, 56748968, 53607004, 51013172, 48819150, 46941364, 45280296, 43743543, 42204925, 40705592, 39236645, 37860161, 36529026, 35322340, 34189452, 33095003, 32019420, 30970223, 29989337, 29079807, 28234152, 27516821, 26838986, 26222859, 25654817, 25097465, 24570041, 24068632, 23597455, 23124071, 22732151, 22318337, 21986551, 21680348, 21384934, 21155169, 20929428, 20751225, 20618507, 20490392, 20283888, 20119722, 19969656, 19854240, 19809202, 19737968, 19540556, 19235521, 18817758, 18306628, 17787447]
4016A7787447m65063l90827l75266l38555l48163l57199l29611l19694k44211
4007A4618858j92560j70799j44517j36167j11176r0374k2856l9714j6420l2013
3997A3662262p127r687J2656L8575M4641R4968J41979R2383O2494O9126M5646
3986A4247916O0418J06420O1583P0337J10453J41393J20937J55153J94559K10480
3976A5479649K47017L19273L16560L74824M78238M58831M87032N13833N33016
3967A9208273N50787N64502O33019O13921O28766O66771P11909P39283P15462
3958B5032693Q11404Q69541R37347R73184J083354J176863J197880J308437J345388
3949C4736091J460337J507449J521100J456378J340433J332421J391229J412112
$$ y = [17787447, 17322384, 16931557, 16556291, 16217736, 15869573, 15512374, 15182763, 14863069, 14618858, 14426298, 14255499, 14110982, 13974815, 13863639, 13773265, 13750409, 13710695, 13694275, 13662262, 13655135, 13645448, 13658104, 13696679, 13741320, 13836288, 13978267, 14070650, 14133144, 14202270, 14247916, 14308334, 14414754, 14476337, 14546674, 14657127, 14798520, 14919457, 15074610, 15269169, 15479649, 15726666, 16045939, 16362499, 16737323, 17215561, 17674392, 18161424, 18675257, 19208273, 19759060, 20323562, 20956581, 21570502, 22199268, 22866039, 23577948, 24317231, 25032693, 25844097, 26713638, 27650985, 28624169, 29707523, 30884386, 32082266, 33390703, 34736091, 36196428, 37703877, 39224977, 40681355, 42021788, 43354209, 44745438, 46157550]
3941D6157550J475596J551010J586598J553761J518202J502311J416363J329619
3933E8091010J286604J273877J169784R78463Q78247Q51528Q01142P50634O62390
3924F6743679O48255O16553M94675L43496K77306J21204l0175j40447k42772l53192
3914F8478582l81866m57892n42824o05506o43890p17907p99267r29823j006770
3905F2392837j115868j222196j297757j340744j358941j405043j346431j354883
3897E1950974j326413j278404j275293j251484j216691j228435j229115j254452
3889D1890687j212585j231748j223384j189199j131136j082920j027126r81821
3881C2810768r16757q58970q24092p77673p76290p19978p02253o87719o81961
$$ y = [46157550, 47633146, 49184156, 50770754, 52324515, 53842717, 55345028, 56761391, 58091010, 59377614, 60651491, 61821275, 62799738, 63677985, 64529513, 65330655, 66081289, 66743679, 67391934, 68008487, 68503162, 68846658, 69123964, 69245168, 69214993, 69074546, 68831774, 68478582, 68096716, 67638824, 67096000, 66490494, 65846604, 65128697, 64329430, 63399607, 62392837, 61276969, 60054773, 58757016, 57416272, 56057331, 54652288, 53305857, 51950974, 50624561, 49346157, 48070864, 46819380, 45602689, 44374254, 43145139, 41890687, 40678102, 39446354, 38222970, 37033771, 35902635, 34819715, 33792589, 32810768, 31894011, 31035041, 30210949, 29433276, 28656986, 27937008, 27234755, 26547036, 25865075]
3872B5865075o59760o67482o94988o97414o76785p12217o76567o55809o29636
3863A9794417n90621n55979m99313m81865m97047m26056m72431m76487m06094
3854A5388524m43600m21539l63900l85261l36426k85556k85829k22561j88489
3845A2455363j59800j38649r6547q9683m1675J4209m2270k1581q5481o2422o2601
3834A1668863q6535k7136R047P1142K9158k0240j51172k29984k09132j86137j71712
3823A0696162r6316j12377o9012q4049l1055j9436k4541O4255N0263O2253R0852
3812A0526999J50955J75839K23064K36605K98122L02224M20968M99167N23796
3803A3357739N67140N15334M99870N80392N41170M00111J91057L9870j08447k49701
$$ y = [25865075, 25205315, 24537833, 23842845, 23145431, 22468646, 21756429, 21079862, 20424053, 19794417, 19203796, 18647817, 18148504, 17666639, 17169592, 16743536, 16271105, 15794618, 15388524, 14944924, 14523385, 14159485, 13774224, 13437798, 13152242, 12866413, 12643852, 12455363, 12295563, 12156914, 12060367, 11970684, 11929009, 11943218, 11900948, 11879367, 11793886, 11731464, 11668863, 11582328, 11555192, 11564239, 11635381, 11664539, 11644299, 11493127, 11263143, 11054011, 10867874, 10696162, 10599846, 10487469, 10418457, 10334408, 10303353, 10283917, 10259376, 10323631, 10373894, 10436147, 10526999, 10677954, 10853793, 11076857, 11313462, 11611584, 11913808, 12334776, 12833943, 13357739, 13924879, 14440213, 14940083, 15520475, 16061645, 16461756, 16652813, 16692683, 16584236, 16334535]
3793A6334535l08556l12930k70459j93195j27509j16520o2761p7104p8381p7640
3783A4709480j50252k87651l64868m53478n17098n18865m93127m47623m37543
3774A1038975l59823k60324k61662k52761j87084j54272j89030j66989j78864
3765I028166j26105j62523j89822j71371j11535j22821j54885j27952j27344j15425
3755G618383j00576j16349q4050j22922j50451j11655q6363j08800j19683j20047
3745F497487o7007r3575j07201o1398n9273n5538n1611l9099q1312l5370k6537
3734E819566n9913k8209p5129l9472q52L160k0601j7980J5996L433L0875K9257
3722E660131M7590Q1400M2820L0649K5182K3930J0356O632M8502Q093m1299p125
$$ y = [16334535, 16025979, 15713049, 15442590, 15249395, 15121886, 15005366, 14942605, 14865501, 14787120, 14709480, 14559228, 14271577, 13906709, 13453231, 12936133, 12417268, 11924141, 11476518, 11038975, 10679152, 10418828, 10157166, 9904405, 9717321, 9563049, 9374019, 9207030, 9028166, 8902061, 8739538, 8549716, 8378345, 8266810, 8143989, 7989104, 7861152, 7733808, 7618383, 7517807, 7401458, 7317408, 7194486, 7044035, 6932380, 6846017, 6737217, 6617534, 6497487, 6430480, 6336905, 6229704, 6168306, 6109033, 6053495, 6001884, 5962785, 5881473, 5846103, 5819566, 5759653, 5731444, 5656315, 5616843, 5615991, 5619151, 5598550, 5580570, 5596566, 5599999, 5630874, 5660131, 5707721, 5789121, 5831941, 5862590, 5887772, 5911702, 5922058, 5928690, 5977192, 5985285, 5943986, 5936861]
3710E936861L2885K02l835K4280L1657J006j544J6071J3866O96j9247k1715k4148
3697E987035p946J9964K7187j4932l5712L4285R644N5966K9539M3129O9608O3714
3685F281481J5876L9061O7622N3384L6933J1425L9316P0389K9994K7300L4220
3674F707001L0218Q8843P2705M0651R1194L9201M4896K8558P6585P1654L0161
3663G321667N9377O8357O4197N5121O9547N1328J03996J03846P0609P5814R7702
3652H141561J06487J22160J06848J60754J35430R8958J43987J49284J52354J72775
3642I490598J88261K15037J79386J81914J71388J98573K59915K38172K30863K49867
3632A1603974K84160K92593K82286L22942L08016L48999L79671L74618M18113
$$ y = [5936861, 5969746, 5969948, 5966113, 5990393, 6022050, 6023056, 6021512, 6037583, 6051449, 6052145, 6032898, 6011183, 5987035, 5979089, 5999053, 6026240, 6011308, 5975596, 6009881, 6019525, 6075491, 6105030, 6148159, 6217767, 6281481, 6297357, 6336418, 6404040, 6457424, 6494357, 6505782, 6545098, 6615487, 6645481, 6672781, 6707001, 6737219, 6826062, 6898767, 6939418, 7030612, 7069813, 7114709, 7143267, 7219852, 7291506, 7321667, 7381044, 7449401, 7513598, 7568719, 7638266, 7689594, 7793590, 7897436, 7968045, 8043859, 8141561, 8248048, 8370208, 8477056, 8637810, 8773240, 8872198, 9016185, 9165469, 9317823, 9490598, 9678859, 9893896, 10073282, 10255196, 10426584, 10625157, 10885072, 11123244, 11354107, 11603974, 11888134, 12180727, 12463013, 12785955, 13093971, 13442970, 13822641, 14197259, 14615372]
3623A4615372M61454M99251N44787N66536N95116O52746P07960P75570P43125
3614B0161917P49095P56416P51515O91680O72449O52866O14838O04878O02618
3605B6258272N49000O01858O11735O55379O47189N70144N36438N17791M84100
3596C1431906L39949L09934K35558J73667J33948J87869J56508J90673K56905
3587C3416917K44559L24768L24843L34334L78653L88904L94607M38562M65876
3578C6712023N75030N95221O52430P38740Q19528R05610R87899J070554J134107
3569D4191142J282952J340972J462261J556575J707681J865713K019343K166991
3561E7593630K282381K379414K452823K562301K577780K556475K577185K567889
$$ y = [14615372, 15076826, 15576077, 16120864, 16687400, 17282516, 17935262, 18643222, 19418792, 20161917, 20911012, 21667428, 22418943, 23110623, 23783072, 24435938, 25050776, 25655654, 26258272, 26807272, 27409130, 28020865, 28676244, 29323433, 29893577, 30430015, 30947806, 31431906, 31771855, 32081789, 32317347, 32491014, 32624962, 32812831, 32969339, 33160012, 33416917, 33661476, 33986244, 34311087, 34645421, 35024074, 35412978, 35807585, 36246147, 36712023, 37287053, 37882274, 38534704, 39273444, 40092972, 40998582, 41986481, 43057035, 44191142, 45474094, 46815066, 48277327, 49833902, 51541583, 53407296, 55426639, 57593630, 59876011, 62255425, 64708248, 67270549, 69848329, 72404804, 74981989, 77549878]
3553G7549878K624160K597741K636039K716281K768815K853602K874075K870312
3545I9490903K778856K682008K498055K288003K116848J936240J805704J679704
3537A17276321J675809J678495J678787J739023J778391J745753J688850J604233
3529A30865662J491634J315685J173473R97146Q49009P17319O46779O08276O19970
3520A39284953P32497Q93565J142378J343247J511515J704432J864098J992781
3512A50469466K145010K340441K596386K931876L328188L752263M273367M780600
3504A76617597N307770N713196N984928N973470N599167M901486L814931K521390
3496B16433935J053392l76076j524586k382759k831533k937788k849107k618500
$$ y = [77549878, 80174038, 82771779, 85407818, 88124099, 90892914, 93746516, 96620591, 99490903, 102269759, 104951767, 107449822, 109737825, 111854673, 113790913, 115596617, 117276321, 118952130, 120630625, 122309412, 124048435, 125826826, 127572579, 129261429, 130865662, 132357296, 133672981, 134846454, 135843600, 136692609, 137409928, 138056707, 138664983, 139284953, 140017450, 140911015, 142053393, 143396640, 144908155, 146612587, 148476685, 150469466, 152614476, 154954917, 157551303, 160483179, 163811367, 167563630, 171836997, 176617597, 181925367, 187638563, 193623491, 199596961, 205196128, 210097614, 213912545, 216433935, 217487327, 217111251, 215586665, 213203906, 210372373, 207434585, 204585478, 201966978]
3488B01966978k432994k347895k446317k927136l687583m701498n915766p030457
3480A70477332p894950q406240q597475q352405p817005p074365o213649n374122
3472A10747121m602669l951144l409588l043870k690934k518185k394021k283475
3464H5853235k241644k145135k039783j905895j787928j664469j577993j521836
3456G0968552j476500j487133j570514j701840j811686k014197k120426k201059
3448E6585197k236569k300742k200618k063427j971055j819999j632985j507864
3440D0851938j478572j334442j235731j204773j136731j147379j076817j053664
3432C1183829j047887r80834r58249q99994q55110q01204p55765p32712o77882
$$ y = [201966978, 199533984, 197186089, 194739772, 191812636, 188125053, 183423555, 177507789, 170477332, 162582382, 154176142, 145578667, 137226262, 129409257, 122334892, 116121243, 110747121, 106144452, 102193308, 98783720, 95739850, 93048916, 90530731, 88136710, 85853235, 83611591, 81466456, 79426673, 77520778, 75732850, 74068381, 72490388, 70968552, 69492052, 68004919, 66434405, 64732565, 62920879, 60906682, 58786256, 56585197, 54348628, 52047886, 49847268, 47783841, 45812786, 43992787, 42359802, 40851938, 39373366, 38038924, 36803193, 35598420, 34461689, 33314310, 32237493, 31183829, 30135942, 29155108, 28196859, 27296865, 26441755, 25640551, 24884786, 24152074, 23474192]
3423B3474192o20188o09942n64604n01193m94716n16037m67757m25895m14513
3414A8859347m39245m28580m20305m15316l69471l49377l23881l52198k93992
3405A5466982k62765k94880k66919k71993k26201k25396k56703k78390k19247
3396A3164488k44827k41223k17981k29356k11822j81989j90281j71643r7467r6602
3386A1281297j34743j45807j64249j13465j28878j41924j23215j27028j25583
3377A0076405j51193j11671p9201j05182q9034r4878q7957n2954n1463n3832l7147
3366I161893k4057k5866j2913k1647K8637K3905N6338L5555K2566J1630q0323
3355I175718j57523j02754j53982j05904o890l4164j0368l0038J964Q649L4210
$$ y = [23474192, 22854004, 22244062, 21679458, 21178265, 20683549, 20167512, 19699755, 19273860, 18859347, 18420102, 17991522, 17571217, 17155901, 16786430, 16437053, 16113172, 15760974, 15466982, 15204217, 14909337, 14642418, 14370425, 14144224, 13918828, 13662125, 13383735, 13164488, 12919661, 12678438, 12460457, 12231101, 12019279, 11837290, 11647009, 11475366, 11377899, 11281297, 11146554, 11000747, 10836498, 10723033, 10594155, 10452231, 10329016, 10201988, 10076405, 9925212, 9813541, 9734340, 9629158, 9540124, 9445246, 9357289, 9304335, 9252872, 9199040, 9161893, 9137836, 9111970, 9099057, 9077410, 9106047, 9129952, 9186290, 9221845, 9244411, 9256041, 9175718, 9018195, 8915441, 8761459, 8655555, 8648665, 8614501, 8604133, 8574095, 8576059, 8584708, 8618918]
3344H618918K5179o17M5906M5746M2820N2337L6655L6992M9620N3732M855M029
3332I016172N0958O5071R3812J18953J74412J63934J05681j2322k13628k63873
3322I299170k33730j75419j63930j42338j07126p2448r4888o6953m5156p1455
3312H125727m3776l390N946J1798L3916O728J7087L7067J6810K9955J1607K4703
3300H274178R5877L3772k013j6044N451J5299n6742l2961o5208j11257j11224
3289H029128j08056p4609o1930k9473N315M9015j7259N7918J18222R4882J07566
3278H170719J53440J99690K00159K13239K65171K76084J83586J50325Q9228J0076
3268I911717n9285j65423j60556j26860j65185j04935j03633l259j6653K4716
$$ y = [8618918, 8644097, 8643480, 8689386, 8735132, 8777952, 8830289, 8866944, 8903936, 8953556, 9007288, 9012143, 9016172, 9067130, 9132201, 9226013, 9344966, 9519378, 9683312, 9788993, 9776671, 9563043, 9299170, 9065440, 8890021, 8726091, 8583753, 8476627, 8404179, 8309291, 8242338, 8197182, 8125727, 8081951, 8078561, 8084507, 8096305, 8130221, 8136949, 8154036, 8191103, 8207913, 8237868, 8249475, 8274178, 8370055, 8403827, 8401814, 8385770, 8391221, 8406520, 8349778, 8316817, 8251609, 8140352, 8029128, 7921072, 7846463, 7784533, 7755060, 7760375, 7809390, 7792131, 7850049, 7968271, 8063153, 8170719, 8324159, 8523849, 8724008, 8937247, 9202418, 9478502, 9662088, 9812413, 9901641, 9911717, 9852432, 9687009, 9526453, 9399593, 9234408, 9129473, 9025840, 9022581, 9005928, 9030644]
3258I030644K9450N4590J2287j3472M4832N4160M1861N2891J03359J40953J41623
3247I693178J42735J30040J36451P4261K6390P2051L6844L7395O8605J82745J20301
3236A0720996J54110J58480J44519K24900K30918K36669K76630K46495K87184
3227A2680901L03835L74794L98223N34116N91655O49468O51573N22109L13933
3218A7020607J11426K44428L26016L72640L86385K61249L2957m4117K2783R2722
3208A8827096K39622L76390M27250M94706O01860P03239P69081Q40556R56295
3199B4236095J090209J211882J348571J467512J640486J752376J678510J443138
3191C5868779R13027J53172n95937j321219j893608k136624k084414j805578j461112
$$ y = [9030644, 9060094, 9114684, 9126971, 9113499, 9158331, 9212491, 9254352, 9307243, 9410602, 9551555, 9693178, 9835913, 9965953, 10102404, 10176665, 10203055, 10275106, 10311950, 10349345, 10417950, 10600695, 10720996, 10875106, 11033586, 11178105, 11403005, 11633923, 11870592, 12147222, 12393717, 12680901, 12984736, 13359530, 13757753, 14291869, 14883524, 15532992, 16184565, 16706674, 17020607, 17132033, 17376461, 17702477, 18075117, 18461502, 18722751, 18755708, 18711591, 18734374, 18827096, 19066718, 19443108, 19870358, 20365064, 20966924, 21670163, 22439244, 23279800, 24236095, 25326304, 26538186, 27886757, 29354269, 30994755, 32747131, 34425641, 35868779, 36781806, 36934978, 36339041, 35017822, 33124214, 30987590, 28903176, 27097598, 25636486]
3182B5636486j252819j105717j023820j066196j020674q91483p96931o69915n59288
3173A7249643n18948m76258m57467m13332l24106k90578k92610k53422k11895
3164A4011027j67931j82548j65451j31011n6946r1835l2730q197N303O5663N8370
3153A3303714M5176Q7467J58322J28957J27148N9299N7776J14178K05354L32761
3143A4620152L73440L46478J95643j68359l67601m27112l22431j53464p1997J0465
3133A4035214L2927R3544Q8868R8863K22942K56371L71164L99999M64751N48223
3123A6612866M90671N22417N90472P59143J104513J394077J672592J788086J575831
3114B6510668R98947N87371M51752N76888R73019J491328K140116L165372M601556
$$ y = [25636486, 24383667, 23277950, 22254130, 21187934, 20167260, 19275777, 18478846, 17808931, 17249643, 16730695, 16254437, 15796970, 15383638, 15059532, 14768954, 14476344, 14222922, 14011027, 13843096, 13660548, 13495097, 13364086, 13307140, 13215305, 13182575, 13174378, 13179681, 13245344, 13303714, 13348890, 13436357, 13594679, 13723636, 13850784, 13910083, 13967859, 14082037, 14287391, 14620152, 14993592, 15340070, 15535713, 15367354, 14999753, 14572641, 14250210, 14096746, 14024749, 14035214, 14068141, 14161685, 14250553, 14349416, 14572358, 14828729, 15199893, 15599892, 16064643, 16612866, 17103537, 17625954, 18216426, 18975569, 20080082, 21474159, 23146751, 24934837, 26510668, 27509615, 28096986, 28548738, 29125626, 30098645, 31589973, 33730089, 36895461, 41497017]
3105D1497017O048106O346446N085011J217505n027539p230830o163138n183836
3097C6588742l804374k707427k017604j431338r00488m49636j2597L97913O41716
3088B6304907P76222N07159m6525j41875J48844O02956J042320J500007K128223
3079C2822238L212226M639136N903368N708616M035260n68021o279231p345151
3071D2128441o235475n181854l792924k917664k286674j834073j427445j149058
3063A7303274j005927p91945n89560m28219k53648k63598k74906l33719l26106
3054A3035646l97669m83659n08000m54696l90808l28236k74763k68744k45303
3045I683768k48345j96927j87672j55001j26812j53398j37303j14278o6398q7233
$$ y = [41497017, 47545123, 53891569, 58976580, 60194085, 55166546, 47935716, 41772578, 36588742, 32784368, 30076941, 28059337, 26627999, 25727511, 25277875, 25265278, 25663191, 26304907, 27081129, 27588288, 27541763, 27399888, 27548732, 28151688, 29194008, 30694015, 32822238, 36034464, 40673600, 46576968, 52285584, 56320844, 55752823, 49473592, 42128441, 35892966, 30711112, 26918188, 24000524, 21713850, 19879777, 18452332, 17303274, 16297347, 15505402, 14915842, 14487623, 14233975, 13970377, 13695471, 13361752, 13035646, 12637977, 12154318, 11646318, 11191622, 10800814, 10472578, 10197815, 9929071, 9683768, 9435423, 9238496, 9050824, 8895823, 8769011, 8615613, 8478310, 8364032, 8297634, 8210401]
3035H210401m5059l9144j9547j490N2846R0072O8607J03661K50037L09438L09582
3024I289404K91977K07035r2218l25145l97335l57381k85873k43751k04935j28848
3014G752930j64755j31834o5043n1865l1476J9463N0282k7779j40827j48589j41515
3003F918992j28536j07017p4514k5871o5211j1108l800K0162K8932O0407J11549
2992F723985J46857J10279L5561j07589r4938p3937p5159j4666L7320l551k8037
2981F656125j9332k6275j6663r7320k00701j92104j79942j15091j24533q7666
2971E596498k611M2948O1349L0443n5101n6219j22936j52245j49989j60092j35700
2960D896345q8722n7287o0134J6382K5907J5674j9129j2390L103R801o833m8409
$$ y = [8210401, 8165342, 8126198, 8106651, 8105161, 8158007, 8248079, 8316686, 8420347, 8670384, 8979822, 9289404, 9581381, 9788416, 9696198, 9371053, 8973718, 8616337, 8330464, 8086713, 7881778, 7752930, 7588175, 7456341, 7391298, 7339433, 7307957, 7327420, 7377702, 7349923, 7209096, 7060507, 6918992, 6790456, 6683439, 6608925, 6583054, 6517843, 6506735, 6502935, 6523097, 6552029, 6612436, 6723985, 6870842, 6981121, 7016682, 6909093, 6814155, 6740218, 6665059, 6650393, 6687713, 6684162, 6656125, 6636793, 6610518, 6593855, 6496535, 6295834, 6103730, 5923788, 5808697, 5684164, 5596498, 5593887, 5636835, 5698184, 5728627, 5673526, 5617307, 5494371, 5342126, 5192137, 5032045, 4896345, 4807623, 4750336, 4690202, 4706584, 4732491, 4748165, 4729036, 4716646, 4719749, 4729550, 4722717, 4674308]
2948D674308r651l0378o8550l4562n7591m5361J7808j0741J7300J996L8709P9929
2936D573216J16619N0366O2645l61l0440p079q959j8750o5785n9424l5197n9553
2924D517298o6952l4739l6476l4797J722r936L51N987J7669J4169K0523k3778
2912D371041m2150m9073r2753m2860k5921p3467l0513J6166l3734L9822K518j193
2900D037883K7639Q994N3696O1745L6370N3313L9504K1055K9013K4111O4637J2370
2888D470330k7109j2934k6458L1193K8666N2626r1M1838K1173N427J9438J4027
2876D618126K4802L5485M694m792K2988J7877K8910j032R385O395k0190p67l6339
2863D705542M0080K2249N1965J8889L0262K9489P3195O6993P9078O7412N1767
$$ y = [4674308, 4664657, 4634279, 4565729, 4531167, 4473576, 4428215, 4446023, 4435282, 4452582, 4454578, 4493287, 4573216, 4689835, 4740201, 4802846, 4802485, 4772045, 4764966, 4756007, 4737257, 4671472, 4612048, 4576851, 4517298, 4450346, 4415607, 4379131, 4344334, 4346056, 4336120, 4336471, 4342458, 4360127, 4374296, 4394819, 4371041, 4328891, 4279818, 4187065, 4144205, 4118284, 4044817, 4014304, 4030470, 3996736, 4036558, 4039076, 4037883, 4065522, 4074516, 4128212, 4189957, 4226327, 4279640, 4319144, 4340199, 4369212, 4393323, 4457960, 4470330, 4443221, 4430287, 4403829, 4435022, 4463688, 4516314, 4516223, 4558061, 4579234, 4584661, 4604099, 4618126, 4642928, 4678413, 4683107, 4678315, 4701303, 4719180, 4748090, 4747058, 4756443, 4762838, 4742648, 4741881, 4705542, 4745622, 4767871, 4819836, 4838725, 4868987, 4898476, 4971671, 5038664, 5117742, 5185154, 5236921]
2852E236921Q4169M8458J12350J28881N3696N3841Q5125Q7616O7265R584k7871
2841E940035r6570j61505j14011r9819o8301n2227p7293m6457k9904n6783q054
2830E129111J3658j215l574r652J6335K555j0597m427J445J5852l2544P88R20
2817E118655l3452n4606p9273q7563o9393q2063r7764q7207q8543n0362o0685
2806D327744q5497o0723m3975q9258k9235m5187k1503p1203o2201o4990o0943
2795C693029n2718r3668p6047m0993k7533o1891j02226j20826j12082p4041j00146
2784B830858j01657n4020p8918o0721l3378o8064l1952m4031k5784n2392m6629
2773B233312m0758m9367n113l7152n6475j2076P335k6342o7892J1915p649n0296
$$ y = [5236921, 5321090, 5369548, 5481898, 5610779, 5664475, 5718316, 5803441, 5891057, 5958322, 5967906, 5940035, 5843465, 5681960, 5567949, 5468130, 5399829, 5347602, 5270309, 5223852, 5193948, 5137165, 5129111, 5142769, 5141554, 5137980, 5128328, 5144663, 5147218, 5136621, 5132194, 5133639, 5149491, 5116947, 5117735, 5118655, 5085203, 5030597, 4951324, 4863761, 4794368, 4712305, 4614541, 4527334, 4438791, 4388429, 4327744, 4242247, 4181524, 4137549, 4048291, 4019056, 3973869, 3952366, 3881163, 3818962, 3753972, 3693029, 3640311, 3546643, 3470596, 3429603, 3402070, 3340179, 3237953, 3117127, 3005045, 2931004, 2830858, 2729201, 2675181, 2596263, 2535542, 2502164, 2434100, 2402148, 2358117, 2332333, 2279941, 2233312, 2192554, 2143187, 2138074, 2100922, 2044447, 2032371, 2039706, 2013364, 1945472, 1957387, 1949738, 1899442]
2761A899442p1650j6276k9121k4958k6231m3866K4556j9321n5204j631j8649k3173
2749A593918n6769j4540k9238J6397L2159m4339j7628Q33k2433j6574K3177M303
2737A469266j8479n3002J2961l44j2017M689q983k9954Q858K0306k1114j0103
2725A362084j3748J3035k9688J2117J3593K6481L284m1800K5902J2037P154o4068
2713A326383l6431r620k0559l1806k0264j9023P427l0948l0391Q313L295q264
2701A138112j9639l709K5878J1438l3834R016j4082J0136J4973L188K1004j3612
2689A148869J6287K6581j0281L5230J3490J8339N554J3543l9254o0755o7790m3275
2677A056538k0917p2712k4715J9355j4954l1483j1704l6020j5397k9745k2688
$$ y = [1899442, 1827792, 1811516, 1782395, 1757437, 1731206, 1687340, 1711896, 1692575, 1637371, 1635740, 1617091, 1593918, 1537149, 1522609, 1493371, 1509768, 1541927, 1497588, 1479960, 1480793, 1458360, 1441786, 1464963, 1469266, 1450787, 1397785, 1410746, 1410402, 1398385, 1403074, 1394091, 1364137, 1372995, 1393301, 1372187, 1362084, 1348336, 1361371, 1331683, 1343800, 1357393, 1383874, 1387158, 1345358, 1371260, 1383297, 1390451, 1326383, 1289952, 1280332, 1259773, 1227967, 1207703, 1188680, 1196107, 1165159, 1134768, 1143081, 1146376, 1138112, 1118473, 1114764, 1140642, 1152080, 1118246, 1127262, 1113180, 1123316, 1138289, 1141477, 1162481, 1148869, 1165156, 1191737, 1181456, 1216686, 1230176, 1248515, 1254069, 1267612, 1228358, 1167603, 1099813, 1056538, 1035621, 962909, 938194, 957549, 942595, 911112, 899408, 863388, 847991, 818246, 795558]
2666G95558j5381r00j5760l569j3639M7026L2307k5754k8988K6951j578j7150
2654G79123k9681J712J0979O9926J1639j6134k368m6838l4895j6246l0991J7508
2642G13734J3991k8705m8439j6080n812j5851l4122J3632K9078j6279l0427j571
2630E73149M383l5767k6903k6375K285L15L5107n300P619j0122J9613l787k4697
2617E09520J7911k084m1313J3967J0279J4048O483j3477L0955r049N118K6136
2605E68494p635j1194K4328J0682p121n570J8226k9006J2198m763J8384J7239
2593F04262J413Q902J5036p07p722j0079j7954m01J9120j2945j8512k356n922
2580E72135K1757K0953j786k6487l0898Q107O0946n699j3773O397Q367N580R766
$$ y = [795558, 780177, 779277, 763517, 759948, 746309, 793335, 825642, 799888, 770900, 797851, 796273, 779123, 749442, 751154, 762133, 832059, 843698, 827564, 825196, 778358, 743463, 727217, 696226, 713734, 727725, 699020, 650581, 634501, 628689, 612838, 578716, 592348, 621426, 605147, 574720, 573149, 577532, 541765, 514862, 488487, 490772, 491087, 526194, 520894, 528513, 518391, 538004, 534217, 509520, 527431, 525347, 484034, 498001, 508280, 522328, 528811, 515334, 546289, 537240, 542358, 568494, 560859, 549665, 573993, 584675, 577554, 571984, 590210, 561204, 573402, 568639, 587023, 604262, 605675, 614577, 629613, 628906, 621184, 611105, 593151, 592750, 611870, 598925, 580413, 578057, 572135, 593892, 614845, 613059, 586572, 555674, 563781, 624727, 619028, 605255, 611652, 620019, 625599, 635365]
2567F35365J1056L0845M0548J3433k3381j2328k4081m581k405K1091M0887L3667
2555G60116r632M551q255J6930k1744l3243j4338m0357l4582k5326k123L4159
2543F26156m1903l3966j4289j5475K0306J3403j3512K458K0225M0310j3306Q504
2531E98911j9497M275J6604l1612m039K0210p45R252j4601M014K8713Q057j4769
2518F04773k1801j0560j6512j6689j5990m9808l5987j4096K962J4100m6424j0748
2506C83220l2483j2967P881N289m4845m791M1550J0203l743J3227l8860k8171
2494B95510J1679k8592j2914N314j1349M602k624N968L3921j5271R493l4857k9106
2481B31774K5465J5200q751J859l2212k6078J4184k6011k9365j2652N2494o287
$$ y = [635365, 646421, 677266, 717814, 731247, 707866, 695538, 671457, 666876, 664471, 685562, 726449, 760116, 750484, 755035, 746780, 763710, 741966, 708723, 694385, 654028, 619446, 594120, 591997, 626156, 584253, 550287, 535998, 520523, 540829, 554232, 540720, 543178, 563403, 603713, 590407, 598911, 579414, 583689, 600293, 568681, 564642, 584852, 584107, 593359, 578758, 582772, 611485, 619542, 604773, 582972, 572412, 555900, 539211, 523221, 473413, 437426, 423330, 426292, 440392, 393968, 383220, 350737, 337770, 345651, 350940, 306095, 301304, 342854, 353057, 349314, 362541, 323681, 295510, 307189, 278597, 265683, 270997, 259648, 264250, 261626, 267594, 301515, 286244, 295737, 260880, 231774, 257239, 272439, 263688, 265547, 233335, 207257, 221441, 195430, 166065, 153413, 205907, 199620]
2469A99620L176q837m9960k1921O806J5607M3790k6599j7162L0443j5612k0865
2457A38486M143j3005j5450R433j0601j4020j959J9648K1068J2283q348k1919
2445A19759j3695l2568J5910m694n3833M172L9148J1866J6375j0155N350K2940
2433A20575k0406j7873M442J2017j4569l6616K9363k7830L4725l024J5905j418
2421I5291l1843n695k2929L1169m601m039j3597j8434J9784L6867j2470j0748
2409E8755L1130j254j2047K0175k4136j4605k6270l841J2344M013j93j7514K405
2396B8962M68m118j1133j2030K5063J8170o148n337j250N3411l4398j6668J4421
2383D9413l6149Q379J0220J469j2556M465J2220K3733n280l0408k6587K3126L1831
$$ y = [199620, 202796, 193959, 143999, 122078, 128884, 144491, 188281, 161682, 144520, 174963, 159351, 138486, 142629, 129624, 114174, 123607, 113006, 98986, 97027, 116675, 137743, 150026, 141678, 119759, 106064, 73496, 89406, 84712, 30879, 35051, 74199, 86065, 102440, 92285, 97635, 120575, 100169, 82296, 86738, 98755, 84186, 47570, 76933, 49103, 83828, 80804, 96709, 95291, 63448, 57753, 34824, 65993, 61392, 57353, 43756, 25322, 45106, 81973, 69503, 58755, 89885, 88631, 76584, 96759, 72623, 58018, 31748, 27907, 40251, 44264, 44071, 26557, 28962, 29430, 25312, 14179, 2149, 27212, 45382, 39234, 33897, 32647, 86058, 51660, 34992, 49413, 13264, 21643, 31863, 33332, 20776, 25241, 37461, 61194, 55914, 25506, -1081, 22045, 53876]
2370E3876N474l7672k7861j8563K1024L126k2574j2907J4243K3845k0291J2732
2358e548l2117J6579J1230j1231J8563k0409j5284N0953k6104k2834J9543k667
2346a9326M1706J3999K116m707j7100k6822j4064n898K5830j4724j4859J6738
2334a7111J8011k2581J5420L1225L4371o657k0473p493p253J6855p930r821j0503
2321F060P563k1219k7144L6580K3642r14K4878J6412l9394j0036k5919Q514l813
2308d790R937R025J324l579k6464J3502j502q706J0346Q383j931j4847j5804J7106
2294h000j3284k7890K6861m788l7150K4641K187P63R942J3378K1340M037J0630
2281B2667r238m330m3691K8575J5025j0907p538J0766n348J7543n182k8931j1935
$$ y = [53876, 59350, 21678, -6183, -24746, -3722, -596, -23170, -36077, -21834, 2011, -18280, -5548, -37665, -21086, -9856, -21087, -2524, -22933, -38217, 12736, -13368, -36202, -16659, -19326, 22380, 36379, 38495, 33788, 16688, -10134, -24198, -30096, -4266, -18990, -33849, -17111, 900, -21681, -6261, 24964, 59335, 52678, 32205, 24712, 17459, 34314, 26384, 16563, 6060, 13623, -7596, -34740, 1840, 25482, 24568, 49446, 65858, 26464, 16428, -9491, -977, -4790, 5147, 14172, 15496, 11917, -14547, -1045, -2547, -11253, -907, 7476, 5545, -9302, -25106, -8000, -21284, -49174, -22313, -27101, -64251, -39610, -37423, -36660, -26718, -13340, 8000, 12037, 22667, 13429, 9099, -34592, -6017, 9008, -1899, -9437, 1329, -4019, 13524, 8342, -20589, -32524]
2268c2524K280j2907J8372N1221N48K5777m1097j8329j7587j3763L524J0607m6845
2255g0723J398L8240j9960J0037J4787K3068k9351l3988N0174J2084O788k5006
2243b2452R061K9036m4182q856K6182j7324J1709j9926J5979m616j2879K2866
2231a5402L3330o081j1553l4322Q342J9096k2191m935J5361J4857k0263K2764
2219i97J1077j973k1087J2703L934m2673J1147J40O598m774j7165N252K993J0208
2205b4617j65j1530j2994R821L0972l1406m419M844j6383k1113J0125M8457N356
2192a3052j8136m2697l0802M1566O228K2345J4871N15K8649k8831k2113K5650
2180a5807m241k4511K7034K2217p145j7881J2576k1635O454O665p494M4276M194
$$ y = [-32524, -30244, -43151, -24779, 26442, 26990, 52767, 11670, -6659, -24246, -38009, -34485, -23878, -70723, -69325, -31085, -51045, -41008, -26221, -3153, -32504, -66492, -16318, -4234, 2554, -22452, -13391, 15645, -28537, -37393, -11211, -28535, -16826, -36752, -20773, -25389, -38268, -15402, 17928, 11847, 294, -34028, -25686, -6590, -28781, -33716, -18355, -3498, -23761, -997, 10080, 8107, -12980, -277, 3657, -39016, -27869, -27729, -21131, -25905, -43070, -37818, -34825, -24617, -24782, -36312, -49306, -39485, -8513, -39919, -44338, -39494, -55877, -76990, -66865, -18408, -13052, -31188, -73885, -104687, -63121, -56893, -34548, -19677, -19162, 9487, -19344, -41457, -15807, -20048, -44559, -17525, 4692, -2453, -20334, -7758, -29393, -22939, -16274, -23768, 20508, 24702]
2167B4702n1323K2512J1531j2202J3784l6399j0995K8320L5504k704J1098q636
2155B5192k5320j2842k909J4763j2746K5476J1454P372k5490r382K1170j0730
2143F008R033J5736K7502j6080j2691M7938O89M30j2255J0382k7766j4581P488
2130D1833P191j5520j1760l416L9861J1837m2030J3322K3836J0687m667o368k8774
2117C6032K5921J9212o912N685K2930p045m154J1490J5809j7818j3501P321R08
2104I5878L562K3442L998P699J202l3533L5481K1191J3074J2493p531L2076o084
2091B02948r911K4838K2098K497L4167L5804n9262K1915M6611j908K4599Q484
2079C52880L7341N3727N79p623L0192M5841K0911K5048K7316N8296M4745M6031
$$ y = [24702, -26621, -4109, 7422, -4780, 9004, -27395, -38390, -10070, 25434, 22730, 33828, 25192, -128, -12970, -15879, -1116, -13862, 11614, 23068, 30440, 4950, -4432, 16738, 6008, 15041, 30777, 58279, 42199, 29508, 77446, 78135, 78565, 66310, 76692, 48926, 34345, 41833, 49024, 33504, 21744, 18328, 58189, 70026, 27996, 41318, 65154, 75841, 71174, 64806, 36032, 61953, 81165, 74253, 79938, 102868, 95823, 91669, 103159, 118968, 101150, 87649, 94970, 95878, 99440, 122882, 126880, 134579, 135781, 102248, 137729, 158920, 171994, 184487, 176956, 209032, 202948, 193037, 217875, 239973, 242470, 276637, 312441, 253179, 275094, 321705, 319797, 344396, 352880, 390221, 443948, 444527, 436904, 467096, 512937, 533848, 558896, 586212, 644508, 689253, 735284]
2067G35284L3733L4542O0996J10436J00929R7455J07605J10673J05401J37522
2057A634576J61053K55380K59274L03871M47778O43302Q68874R62545Q03870M91694
2047F832217m70647j232752j022635q01354n99783m41190l52413k88888j86342
2038A436213j48848j32626j18424n2566j3166k4062k6322n8935j16708p9541m5636
2027F19379p5487j8948l0643m3843J8719l2451l5077j9343k4114l6753p259q086
2015C06094m1337j5680k3351l3160K5311l0555p042L426J065Q04l762l3571k1587
2002A26655r700L5023k7307k5494m566N416K4853k2485n465o686N89J8812L10
1989A09955j7698n506K3507K9140k8491m2661k0838L0311j4432K369L685K6892
$$ y = [735284, 769017, 803559, 864555, 974991, 1075920, 1173375, 1280980, 1391653, 1497054, 1634576, 1795629, 2051009, 2310283, 2614154, 3061932, 3705234, 4574108, 5536653, 6340523, 6832217, 6361570, 5128818, 4106183, 3304829, 2705046, 2263856, 1911443, 1622555, 1436213, 1287365, 1154739, 1036315, 983749, 970583, 946521, 920199, 861264, 744556, 665015, 619379, 543892, 524944, 494301, 450458, 469177, 436726, 401649, 382306, 358192, 321439, 314180, 306094, 264757, 249077, 225726, 192566, 217877, 187322, 180280, 183706, 184771, 185575, 181813, 148242, 126655, 116955, 151978, 124671, 99177, 94611, 100027, 124880, 102395, 96930, 90244, 90833, 109645, 109955, 92257, 86751, 110258, 139398, 110907, 68246, 47408, 77719, 63287, 65656, 69341, 96233]
1977I6233J2766p3417k3227j4891k3782L2983j2868m77L4085Q174m3637J344j1261
1964a7975j2780M0683J8635k1354j1426r229J4067Q703P58l383j4096k3995P136
1951b4256J8386j8060J3877j7886L641K5379l007J209J711j5119j0138m540L9448
1938A0645J3176k2287j1007K734j2622J2595j9852r501J2298k3910R146k270M053
1925c6802O758J108R207O324p942k1801K002l0912m92J235m770J8825k174Q511
1911e0923N297j2006j0606j6255K2934L6842K5404P69k1524n5838J9416Q812q894
1898e6572R403j735K7552k9639r304j4588J1400L9048j0756k2909Q785K6675l689
1885b6329k383r321m705O376o695J4106J9386l6n4107l450K3815m950J9373J0251
$$ y = [96233, 108999, 35582, 12355, -2536, -26318, 6665, -6203, -6680, 27405, 35579, -8058, -6714, -17975, -30755, 9928, 28563, 7209, -4217, -13446, 621, 9324, 10082, 6699, -7397, -31392, -24256, -5870, -23930, -10053, -27939, -24298, 1081, -1926, -717, 994, -14125, -24263, -28803, 10645, 23821, 1534, -9473, -6739, -19361, -6766, -26618, -36119, -23821, -47731, -38585, -40855, -36802, -30044, -28936, -19729, -13405, -21347, -43148, -41146, -72058, -72550, -71315, -76085, -57260, -59434, -50923, -45626, -57632, -68238, -84493, -61559, -24717, 687, 1456, -20068, -75906, -56490, -47678, -56572, -47169, -48904, -21352, -50991, -60295, -74883, -63483, -24435, -35191, -58100, -49315, -22640, -26329, -28712, -38033, -42738, -36362, -43057, -28951, -9565, -9601, -63708, -67158, -43343, -48293, -28920, -18669]
1871a8669L215k0763l2301r25O519J1928l3611l3585N3409L2786j2399k3936k8009
1858i6341K830L8759M7082l0629j5076l0103J5228K0971k0526o661K1414j949
1846e5001M9393p450j2905l1520n587m374m789n503J9084n786J5772r737M178
1833e4225K716j2701J3027R713m670m151q882L529M6990m6650j0440O660L5583
1820b3501j8848j2578P299l2343j2759M5880m718M096K8149k7020l1859l181l42
1807h1725L0231J6136M509K2943K2291l0921k5255L2888j0565q489l3052j2568
1795g3577J3023J5796j05j1930Q377J8250J5346j5950P605l0397J7371J4876k557
1782b3872k3264k2341K9723K6566j1242J568k272J9621J0634K902q368Q435l0995
$$ y = [-18669, -15454, -36217, -68518, -69443, -62924, -50996, -84607, -118192, -64783, -31997, -44396, -68332, -96341, -93511, -54752, -7670, -38299, -53375, -83478, -68250, -47279, -67805, -74466, -53052, -55001, -5608, -13058, -25963, -57483, -63070, -67444, -72233, -77736, -58652, -64438, -48666, -58403, -54225, -51509, -64210, -51183, -41470, -46140, -50291, -59173, -55644, -8654, -55304, -65744, -59084, -23501, -42349, -54927, -47628, -79971, -92730, -46850, -51568, -47472, -19323, -46343, -78202, -81383, -81725, -51494, -35358, -30849, -7906, 14385, -16536, -41791, -8903, -19468, -27957, -61009, -73577, -60554, -44758, -44863, -56793, -48416, -30166, -14820, -30770, -23165, -53562, -36191, -21315, -23872, -47136, -69477, -39754, -13188, -24430, -22862, -25134, -5513, 5121, 8023, -345, 8090, -22905]
1769b2905j344j8116J8534J4822J9782k1943m5333L4080l391k9490K2204q093
1757d1193q001n586j7589J2916L3881J9670j2166K9976l7377J6321q630n6959
1745g4737l196J9052j5938K750L1745j5142l5548J9464M1995l7937j0809L2993
1733d5308N49j6060K5338q232j7172J0118J5369P368m0785J4986k716n252J0814
1720e0983M5924j7936m1231J6162j5825m00m088j0527k1726L1165N660L6479L259
1707b4067K09j9053R300K1550l1410L1913n684J4049k4023l4872J7131J3848J9847
1694a1262j4473j7191l3440L3033J3422m1531R054J946m482o020k6861r362P9319
1681b7848j7392j6343p660N2950m5984l0185J0911N314K091K6483K657j3063l765
$$ y = [-22905, -24249, -42365, -23831, -9009, 10773, -11170, -56503, -22423, -25814, -55304, -33100, -41193, -49194, -54780, -72369, -59453, -25572, -5902, -18068, 11908, -25469, -9148, -17778, -74737, -77933, -58881, -74819, -72069, -40324, -55466, -91014, -71550, -29555, -67492, -78301, -45308, -44759, -60819, -35481, -43713, -60885, -50767, -35398, -28030, -68815, -53829, -56545, -61797, -50983, -5059, -22995, -64226, -48064, -63889, -64289, -68377, -78904, -100630, -69465, -63805, -27326, -24067, -23858, -42911, -33611, -12061, -43471, -11558, -17242, -3193, -27216, -62088, -44957, -31109, -11262, -25735, -42926, -76366, -43333, -29911, -71442, -62388, -60442, -64924, -70944, -97805, -107167, -27848, -45240, -61583, -69243, -16293, -62277, -92462, -81551, -76237, -74146, -47663, -45006, -58069, -61834]
1668f1834L7943j0113m3778L8234J4684k963K8708j2668l0420j7992O234R130
1656d4835j6138j2889k2834J8549l151J3250J1975R644l246j708J3790J2920k7948
1643e2621j3846J0774L2732j169m4411k736J4630k6321K0767J1609n471M566m993
1630e6490k1400J7350L5708k5484P670K4950p18n1948o000k2405K8084r12P361
1617f4234L3914p246j3093k5044L5607q491j3107J1541Q500K1909k4322j3635
1605e7701J2461k3287L281j397J9938J910P882J1065K133j5535J1754k0590k7507
1592g5593R562L0064j388K208K0932N499k7279j5478L028m722j7137j4660J2398
1579g2566K1077K1293N732R272M265k5512k1982j4644P529J9335J4646l060K70
$$ y = [-61834, -23891, -34004, -77782, -39548, -24864, -27827, 881, -11787, -42207, -60199, -53965, -44835, -60973, -73862, -96696, -78147, -81298, -68048, -56073, -46429, -49675, -51383, -37593, -24673, -52621, -66467, -55693, -22961, -24130, -68541, -71277, -56647, -82968, -62201, -50592, -56063, -51497, -56490, -77890, -60540, -24832, -50316, -42646, -17696, -18414, -70362, -76362, -98767, -70683, -71595, -64234, -30320, -37566, -50659, -75703, -40096, -48587, -61694, -50153, -41653, -19744, -44066, -57701, -45240, -68527, -65246, -66643, -46705, -44795, -36913, -25848, -23715, -39250, -27496, -48086, -75593, -66031, -35967, -37355, -35147, -14215, -8716, -35995, -51473, -48445, -53167, -70304, -84964, -72566, -51489, -30196, -24464, -15192, -10927, -36439, -58421, -73065, -65536, -46201, -31555, -34615, -34345]
1566c4345R101k176k5491J4769R695l2394M0589J7806l8969J736q554K0708o290
1553c3815J5429m29l705K839K593k5947j5041J8775o098J4558p767J2453j7916
1540d4071l048P539J9929k8770q131K2923o129j308l03l166J7135m1545l4219
1527a03164L9043K3083j8217Q124J0610j1664o133j276J483M570j324o67j6638
1514g2170j1518R788J5384K7321j2967J5258P672o2391P798M0050R823j4455j9034
1501e9441n325Q273j088R664J6083J24k5374K3559K2272J5896l5418l2329K6686
1488c6418J0422o690j1783K7746j9965K47K6292m800K83o145L952j3744l044J4757
1474a8890k293k6472j41K2735J162m357J4355R281K3704j3022N156K4020k4407
$$ y = [-34345, -25244, -27420, -52911, -38142, -28447, -60841, -20252, -2446, -41415, -39679, -48233, -27525, -33815, -18386, -18815, -22520, -19681, -17088, -43035, -58076, -39301, -45399, -30841, -38608, -26155, -44071, -47119, -39580, -19651, -48421, -56552, -33629, -39758, -41066, -41369, -44535, -27400, -68945, -103164, -64121, -41038, -59255, -51131, -40521, -52185, -58318, -59594, -58111, -53541, -54865, -55532, -72170, -83688, -73900, -58516, -31195, -44162, -28904, -21232, -83623, -75825, -35775, -25952, -40407, -59441, -64766, -56493, -57581, -47917, -31834, -31710, -57084, -33525, -11253, 4643, -30775, -63104, -36418, -25996, -32686, -44469, -16723, -36688, -36441, -10149, -14949, -14666, -20811, -16859, -30603, -33647, -18890, -21183, -47655, -47796, -25061, -23899, -28256, -13901, -4620, 19084, 6062, 11218, 35238, 10831]
1461A0831m5636k6099J4926M4193O63l6892j0480K8288K1330L380l5386n9158
1449i0040L1797P077j3413m695J0729O812K8012k4635j4171O087J3991L8390j3773
1436a7832o90L1557l3076L6141K2980l5255l4016R776M750j17J5290l0421J5935
1423a4978K20J359n072K2456k2849p850K4393k692J6861l3690Q415K3259k7146
1410a7314n1244j1048J8671K5001j4455J5773k1813j3575J9084l445K3306L135
1398b7924Q445P514l6016j6241J5936P815L658J6422k9431K7054M653k0734j1880
1385e0729J1824r184m335K8495j6121J8094Q446m084O664M0387k1803l5545K2110
1372e781j3729o044J9090J936r065m7067L774J0517K161K164q260N054K3635J411
$$ y = [10831, -34805, -60904, -45978, -1785, -1122, -38014, -48494, -20206, 1124, 4504, -30882, -90040, -58243, -51166, -64579, -69274, -58545, -51733, -23721, -48356, -62527, -56440, -42449, -4059, -17832, -18522, 13035, -20041, 16100, 39080, 3825, -30191, -20415, -15665, -15782, -492, -30913, -14978, -14758, -13399, -18471, 3985, -18864, -26714, -2321, -5013, 11848, -21842, -13427, 9832, -17314, -68558, -79606, -60935, -35934, -50389, -34616, -56429, -70004, -50920, -54365, -31059, -27924, -19479, -11965, -47981, -64222, -48286, -40471, -36813, -20391, -49822, -22768, -18115, -38849, -50729, -38905, -48089, -52424, -23929, -40050, -21956, -13510, -17594, -10930, 29457, 7654, -27891, -5781, -19510, -25554, -6464, -4528, -13593, -60660, -56886, -46369, -44208, -42044, -50304, -45250, -21615, -20204]
1358b0204J1447p868j5079J1757J8445j3678k845k0911j4763j55J6989K2217R543
1345e105l8271l727J2504P552k7129J4981K0451J904k2255n430K5371L5945l2136
1332a5345l986K2811k3229q331J7157j885J4658K244O828J9505j3672n0440Q561
1319b5124J3933J0081J9959l2329Q440L7510N607k2124l8871k7671q434L076L3820
1306b2127J6816m666O553k3596L742L5342k3664n163m4767R771N13L9615k4217
1293c5848N319j0317J3772Q130p240j8833o256J0351J1194j5592K6101J2892k3617
1280b9944K0386J1008J651O25k7742j419P718l9503K4628n153k1350L1793K4673
1267b629O400k7119l85r41N014o776J9264j6058q907J0993N188J3670k6552k5072
$$ y = [-20204, -8757, -16625, -31704, -19947, -1502, -15180, -18025, -38936, -53699, -53854, -36865, -14648, -5105, -43376, -47103, -34599, -27047, -54176, -39195, -18744, -16840, -39095, -44525, -19154, 16791, -15345, -19331, 3480, -19749, -28080, -10923, -12808, 1850, 4094, 10922, 30427, 16755, -33685, -25124, -11191, -1110, 18849, -13480, -5040, 32470, 38077, 15953, -22918, -50589, -59023, -55947, -22127, -5311, -9977, -3424, -27020, -23278, 12064, -11600, -16763, -61530, -51759, -51246, -11631, -35848, -30529, -40846, -27074, -18944, -26184, -45017, -51273, -40922, -29728, -45320, -19219, -6327, -29944, -9558, 1450, 3101, 3726, -24016, -25435, -17717, -57220, -32592, -37745, -59095, -27302, -2629, 3771, -23348, -23733, -24674, -19660, -26436, -7172, -23230, -32137, -21144, -15956, -2286, -28838, -53910]
1253e3910J1397K5167o383J8961j6708p54K1892l0893n918J5958K9386J0551l5314
1240a6568n11K9818J3082m0320J2400k6487K5889l2110n12K9300P897K3050j1917
1227A3011k4498K3970q091j1668O890J047p634j8123M3391k7203n423K322O016
1214e993M0978l7298P804n524l9248J643K0596L2196k5023J3963P926j0474j0321
1201h775M708l5361q753n481K4353L3307j9051l3875J4904L4425O720L097j0871
1188f53L2781k660l1859L2712P84l7192l6835K1094p430j6150N379p941R642L3461
1174d867J0703l0080L970P384l123Q017K3289J474k0035k8939r454J7418k9845
1161e4088j3531n263n012K1520J3694L0045J928J7648n698J9505J4979J8330L331
$$ y = [-53910, -42513, -17346, -23729, -4768, -21476, -22230, -338, -31231, -37149, -21191, 8195, 18746, -16568, -17079, 12739, 25821, -14499, -2099, -28586, -2697, -34807, -35319, -6019, 1878, 24928, 13011, -11487, 12483, 4392, -7276, -386, 661, -6973, -25096, 18295, -8908, -14331, -12009, -5993, 34985, -2313, 5491, -33, -39281, -37638, -17042, 15154, -9869, 4094, 12020, 1546, -8775, -4067, -39428, -48181, -53662, -29309, 3998, -15053, -48928, -34024, 401, 7121, 10218, -653, 32128, 29468, -2391, 30321, 31105, -6087, -42922, -21828, -29258, -45408, -40029, -47970, -38328, -4867, 5836, -24244, -20274, -12890, -16013, -7996, 15293, 16767, -3268, -32207, -41661, -24243, -54088, -67619, -72882, -77894, -56374, -42680, -12635, -10707, 6941, 1243, 20748, 35727, 54057, 57388]
1148E7388m1453l2437K7053L656l100j7033J2962r554K539M276J2075K638o52
1135A8358N769K000k9948p130K985K3779k1175l0687J7021l770K0407J8859K2176
1122C8644j6829R562P413m6889m0079J4547J7213J563j836O71j5414K5683M657
1109a094r124r323K9897k1949k9577K9355j0359p047N45K981r988J4842k470R441
1095a3870k5675K3952k607K4581J3739m7209r558K3419K997J1132J7216j061o0066
1082d3010P881J0069M91P9683j5144m25k7340J7777J1531k7302m213J8123l9975
1069a1854O212J8756J1417j4438r375l0634J5106K255M288j9194J8047K5610o397
1056I799k5632J5335J7109M877j4585j6571J6621O371m0896j6219J9992J8731
$$ y = [57388, 15935, -16502, 10551, 14207, 11107, -5926, 7036, -2518, 21, 4297, 16372, 19010, 18358, 24127, 26127, -3821, -10951, -7966, 15813, -5362, -36049, -19028, -22798, -2391, 16468, 38644, 21815, 31377, 38790, -8099, -48178, -33631, -16418, -14855, -16691, -16020, -31434, -5751, -1094, -10218, -19541, 10356, -11593, -41170, -11815, -22174, -29221, -28676, -25695, -35683, -20841, -23311, -13870, -39545, -15593, -18200, 6381, 20120, -27089, -36647, -13228, -10231, 901, 18117, 17056, -43010, -35129, -25060, -24569, 55114, 39970, 39545, 12205, 29982, 41513, 14211, 9998, 28121, -11854, -5642, 13114, 24531, 10093, 718, -29916, -14810, -12555, -8267, -27461, -9414, 16196, 9799, -15833, -498, 16611, 21488, 6903, -9668, 6953, 13324, -27572, -43791, -23799, -5068]
1044e068P287l9876J3120L5637M330j1448k6580q257L2849j4761M435j1330J334
1031a8328n448p895l5439R699K0009J3985J5077n391O777L1625j2734p801K6716
1018C0852l4826j4229m076J3630r8J5882j5358k6728K273J706L3313j7980J3436
1005b203M0312m0581k1769J8809M155m2667M331L9706l354k115M153L536L0096
992C2409j6571m7654J1273L6515Q8q16k3424n897J8066O637L1904l325l2081j5720
978h596K588j026L3618k0409n141n52J0533J774J0777J5875N128m992n832l5606
964a861k2765J1777K2865K7659k1614R075l5371M30J2140j4517j8048J1884N8303
951C9957J589J2996l0539j7664K2686K4947J2917k0460l4536j4455k0665k175
$$ y = [-5068, 2219, -37657, -24537, 11100, 15430, 3982, -22598, -30855, 1994, -12767, -8332, -19662, -18328, -23776, -31671, -67110, -57411, -37402, -23417, -8340, -13731, -6954, 24671, 11937, 4136, 30852, -3974, -18203, -22279, -8649, -8747, 7135, -8223, -34951, -32678, -30972, 2341, -15639, -2203, 38109, -2472, -24241, -5432, -1277, -43944, -39613, 93, -3261, -5376, -1223, 2313, 32409, 15838, -31816, -20543, 15972, 16060, 15244, -8180, -14077, 3989, 10626, 42530, 39205, 7124, -8596, -6008, -7034, 26584, 6175, 1034, 482, 11015, 12789, 23566, 39441, 44569, 39577, 33745, -1861, -24626, -12849, 10016, 37675, 16061, 25136, -10235, -9805, 2335, -12182, -30230, -18346, 39957, 41546, 54542, 24003, 6339, 29025, 53972, 66889, 46429, 11893, -2562, -23227, -25402]
939b5402K7287J4587j0257n246K5016q600n171K266k4789m2236P875k458K3099
926b4029M1993m306M742K648K6927j4786k9439l4366M8359J5258J72k1639o106
$$ y = [-25402, 1885, 16472, 6215, 969, 25985, 17385, 12214, 14480, -10309, -52545, -44670, -47128, -24029, 17964, 13658, 18400, 21048, 47975, 33189, 3750, -30616, 17743, 33001, 33173, 11534, 5428]
$$ [...]
##END NTUPLES=NMR SPECTRUM
##END=
