##TITLE=1H_CA-9078-1
 CDCl3
 8 sc, 
 17.10.2022
##JCAMPDX= 6.0         $$ Bruker NMR JCAMP-DX V2.0
##DATA TYPE= NMR SPECTRUM
##DATA CLASS= NTUPLES
##ORIGIN= UXNMR, Bruker Analytische Messtechnik GmbH
##OWNER= root
$$ XWIN-NMR		Version 3.5
$$ Mon Oct 17 16:27:54 2022 Russian Standard Time (UT+4h)  she@DPX200
##.OBSERVE FREQUENCY= 200.1313499994
##.OBSERVE NUCLEUS= ^1H
##.ACQUISITION MODE= SIMULTANEOUS
##.ACQUISITION SCHEME= undefined
##.AVERAGES= 8
##.DIGITISER RES= 18
##SPECTROMETER/DATA SYSTEM= spect
##.PULSE SEQUENCE= zg30
##.SOLVENT NAME= CDCl3
##.SHIFT REFERENCE= (INTERNAL, CDCl3, 0, 15.7645)
##AUDIT TRAIL= $$ (NUMBER, WHEN, WHO, WHERE, WHAT)
$$ ##TITLE= Audit trail, XWIN-NMR		Version 3.5
$$ ##JCAMPDX= 5.01
$$ ##ORIGIN= Bruker BioSpin GmbH
$$ ##OWNER= she
$$ F:/spectra/data/she/nmr/H-F/1/pdata/1/auditp.txt
$$ ##AUDIT TRAIL=  $$ (NUMBER, WHEN, WHO, WHERE, WHAT)
(   1,<2022-10-17 16:26:41.26 +0400>,<she>,<DPX200>,
      <created by zg, POWCHK disabled, PULCHK disabled
       configuration hash MD5:
       00 E9 B6 7A A2 85 ED C7 34 08 36 98 17 FE 4E 26
       data hash MD5: 16K
       1B CC 0A 46 C5 B0 8A BD 57 09 4D 1E 0A 97 6A E9>)
(   2,<2022-10-17 16:26:43.64 +0400>,<she>,<DPX200>,
      <Start of raw data processing
       efp BC_mod = 2 LB = 0.24 FT_mod = 6 PKNL = 1 PHC0 = -18180.38 PHC1 = -3.999313 SI = 16K 
       data hash MD5: 16K
       7F BD 73 13 F1 CB DE A1 5E 20 1A D2 AB E3 09 24>)
(   3,<2022-10-17 16:27:08.71 +0400>,<she>,<DPX200>,
      <pk PHC0 = 148.7661 PHC1 = 12.8 
       data hash MD5: 16K
       BE 01 B4 E9 2B 66 A9 A9 35 70 DC 78 96 DC 67 29>)
(   4,<2022-10-17 16:27:12.15 +0400>,<she>,<DPX200>,
      <abs ABSG = 5 
       data hash MD5: 16K
       53 83 58 5F E6 5E F7 9C 3E 68 DC 42 82 7B E1 38>)
$$ ##END=
$$ 
$$ hash MD5
$$ 34 2B 82 4B AF 07 99 5D EF 94 0F C0 CE 60 EE 4A
##$RELAX= 
##$RELAX= 
##$RELAX= 
##$RELAX= 
##$RELAX= 
##$RELAX= 
$$ Bruker specific parameters
$$ --------------------------
##$DU= <F:/spectra>
##$EXPNO= 1
##$NAME= <H-F>
##$PROCNO= 1
##$TYPE= <nmr>
##$USER= <she>
##$AMP= (0..31)
100 100 100 100 100 100 100 100 100 100 100 100 100 100 100 100 100 100 
100 100 100 100 100 100 100 100 100 100 100 100 100 100 
##$AQSEQ= 0
##$AQ_mod= 1
##$AUNM= <au_zg>
##$AUTOPOS= <>
##$BF1= 200.13
##$BF2= 200.13
##$BF3= 200.13
##$BF4= 200.13
##$BF5= 200.13
##$BF6= 200.13
##$BF7= 200.13
##$BF8= 200.13
##$BYTORDA= 1
##$CFDGTYP= 0
##$CFRGTYP= 5
##$CHEMSTR= <none>
##$CNST= (0..31)
1 1 145 1 1 1 1 1 1 1 1 1 1 1 1 1 1 1 1 1 1 1 1 1 1 1 1 1 1 1 1 1 
##$CPDPRG= <>
##$CPDPRG1= <>
##$CPDPRG2= <>
##$CPDPRG3= <>
##$CPDPRG4= <mlev>
##$CPDPRG5= <mlev>
##$CPDPRG6= <mlev>
##$CPDPRG7= <mlev>
##$CPDPRG8= <mlev>
##$CPDPRGB= <>
##$CPDPRGT= <>
##$D= (0..31)
0 1.2 0 0 0 0 0 0 0 0.06 0 0.03 0 0 0 0 0.0002 0 0 0 0 0 0 0 0 0 0 0 0 
0 0 0 
##$DATE= 1666009600
##$DBL= (0..7)
120 120 120 120 120 120 120 120 
##$DBP= (0..7)
150 150 150 150 150 150 150 150 
##$DBP07= 0
##$DBPNAM0= <>
##$DBPNAM1= <>
##$DBPNAM2= <>
##$DBPNAM3= <>
##$DBPNAM4= <>
$$ [...]
##$SUBNAM3= <"">
##$SUBNAM4= <"">
##$SUBNAM5= <"">
##$SUBNAM6= <"">
##$SUBNAM7= <"">
##$SUBNAM8= <"">
##$SUBNAM9= <"">
##$SW= 18.0517283424941
##$SWIBOX= (0..15)
0 0 2 0 0 0 0 0 0 0 0 0 0 0 0 0 
##$SW_h= 3612.71676300578
##$TD= 16384
##$TD0= 1
##$TE= 0
##$TE2= 300
##$TE3= 300
##$TEG= 300
##$TL= (0..7)
0 120 120 120 120 120 120 120 
##$TP= (0..7)
150 150 150 150 150 150 150 150 
##$TP07= 0
##$TPNAME0= <>
##$TPNAME1= <>
##$TPNAME2= <>
##$TPNAME3= <>
##$TPNAME4= <>
##$TPNAME5= <>
##$TPNAME6= <>
##$TPNAME7= <>
##$TPOAL= (0..7)
0.5 0.5 0.5 0.5 0.5 0.5 0.5 0.5 
##$TPOFFS= (0..7)
0 0 0 0 0 0 0 0 
##$TUNHIN= 0
##$TUNHOUT= 0
##$TUNXOUT= 0
##$USERA1= <user>
##$USERA2= <user>
##$USERA3= <user>
##$USERA4= <user>
##$USERA5= <user>
##$V9= 5
##$VALIST= <valist>
##$VCLIST= <CCCCCCCCCCCCCCC>
##$VD= 0
##$VDLIST= <DDDDDDDDDDDDDDD>
##$VPLIST= <PPPPPPPPPPPPPPP>
##$VTLIST= <TTTTTTTTTTTTTTT>
##$WBST= 1024
##$WBSW= 4
##$XGAIN= (0..3)
0 0 0 0 
##$XL= 0
##$YL= 0
##$YMAX_a= 532348
##$YMIN_a= -818820
##$ZGOPTNS= <>
##$ZL1= 120
##$ZL2= 120
##$ZL3= 120
##$ZL4= 120
##$ABSF1= 15.71621
##$ABSF2= -2.335639
##$ABSG= 5
##$ABSL= 3
##$ALPHA= 0
##$AQORDER= 0
##$ASSFAC= 0
##$ASSFACI= 0
##$ASSFACX= 0
##$ASSWID= 0
##$AUNMP= <proc_1d>
##$AZFE= 0.1
##$AZFW= 0.1
##$BCFW= 0
##$BC_mod= 2
##$BYTORDP= 0
##$COROFFS= 0
##$CY= -3
##$DATMOD= 1
##$DC= 0
##$DFILT= <>
##$DTYPP= 0
##$F1P= 0
##$F2P= 0
##$FCOR= 1
##$FTSIZE= 16384
##$FT_mod= 6
##$GAMMA= 0
##$GB= 0
##$INTBC= 1
##$INTSCL= 3.70164e-10
##$ISEN= 128
##$LB= 0.24
##$LEV0= 0
##$LPBIN= 0
##$MAXI= 10000
##$MC2= 0
##$MEAN= 0
##$ME_mod= 0
##$MI= 1.114404
##$NCOEF= 0
##$NC_proc= -6
##$NLEV= 6
##$NOISF1= 3.799351
##$NOISF2= 2.8
##$NSP= 0
##$NTH_PI= 0
##$NZP= 0
##$OFFSET= 15.76452
##$PC= 1
##$PHC0= -18031.62
##$PHC1= 8.800687
##$PH_mod= 1
##$PKNL= yes
##$PPARMOD= 0
##$PSCAL= 0
##$PSIGN= 0
##$REVERSE= no
##$SF= 200.130001404463
##$SI= 16384
##$SIGF1= 3
##$SIGF2= 2
##$SINO= 5.538805
##$SIOLD= 16384
##$SREGLST= <1H.CDCl3>
##$SSB= 0
##$STSI= 16384
##$STSR= 0
##$SW_p= 3612.71676300578
##$SYMM= 0
##$S_DEV= 0
##$TDeff= 16384
##$TDoff= 0
##$TI= <>
##$TILT= no
##$TM1= 0
##$TM2= 0
##$TOPLEV= 0
##$USERP1= <user>
##$USERP2= <user>
##$USERP3= <user>
##$USERP4= <user>
##$USERP5= <user>
##$WDW= 1
##$XDIM= 16384
##$YMAX_p= 477155303
##$YMIN_p= -346885
$$ End of Bruker specific parameters
$$ ---------------------------------
##NTUPLES= NMR SPECTRUM
##VAR_NAME=  FREQUENCY,     SPECTRUM/REAL,   SPECTRUM/IMAG
##SYMBOL=    X,             R,               I
##VAR_TYPE=  INDEPENDENT,   DEPENDENT,       DEPENDENT
##VAR_FORM=  AFFN,          ASDF,            ASDF
##VAR_DIM=   16384,         16384,           16384
##UNITS=     HZ,            ARBITRARY UNITS, ARBITRARY UNITS
##FACTOR=    0.220516191357247, 1,           1
##FIRST=     3154.95334799403, 0,            0
##LAST=      -457.763415011748, 0,           0
##MIN=       -457.763415011748, -346885,     0
##MAX=       3154.95334799403, 477155303,    0
$$ Real data points
##PAGE= N=1
##DATA TABLE= (X++(R..R)), XYDATA
$$ [...]
7049D3267019m698955l569923l008025k677935k500471k113264j828009j725035
$$ 43267019 38568064 34998141 31990116 29312181 26811710 24698446 22870437 21145402
7041B1145402j293181j027853p54369n98311m75495l30687j60662r6892k78284
$$ 21145402 19852221 18824368 18069999 17471688 16996193 16665506 16504844 16407952 16129668
7032A6129668k12115j84371j18392J49500K82782K42162j74494o15733r73425
$$ 16129668 15917553 15733182 15614790 15764290 16047072 16289234 16114740 15499007 14525582
7023A4525582j240978j156908j102554r57799p42776o68026n14780l51309m77280
$$ 14525582 13284604 12127696 11025142 10067343 9324567 8656541 8141761 7790452 7313172
7014G313172l09526k10906l26892j55932r4978j34932k07364k30385q9047k40211
$$ 7313172 7003646 6792740 6465848 6309916 6214938 6080006 5872642 5642257 5553210 5312999
7004E312999k25504j07719j25585K7455n9480p4380j94975j38957j35897j45592
$$ 5312999 5087495 4979776 4854191 4881646 4822166 4747786 4552811 4413854 4277957 4132365
6994D132365j77938j48265n3131j41825K3632j28594j30373n2295o6487K3691
$$ 4132365 3954427 3806162 3753031 3611206 3634838 3506244 3375871 3323576 3257089 3280780
6984C280780j6800o3389j4418P0273K1895r3246n8060n4653k9014n4457j42049
$$ 3280780 3263980 3200591 3186173 3256446 3278341 3185095 3127035 3072382 3043368 2988911 2846862
6973B846862k17734k8701Q1389m3075J05597r9131n4584j3790J05740Q6587J572
$$ 2846862 2629128 2600427 2681816 2638741 2744338 2645207 2590623 2576833 2682573 2769160 2770732
6962B770732j53542l3550J44068O9592o6954k714J64523K9182O9609Q3001J50937
$$ 2770732 2617190 2583640 2727708 2797300 2730346 2727632 2892155 2921337 2990946 3073947 3224884
6951C224884R4191K65033J60460J79486K58451K81876K90922L68645L86779N76348
$$ 3224884 3319075 3584108 3744568 3924054 4182505 4464381 4755303 5123948 5510727 6087075
6941F087075N00088M71258O08163O94204P05790M60125J54505l31734o73190q06793
$$ 6087075 6587163 7058421 7666584 8360788 9066578 9526703 9681208 9349474 8676284 7869491
6931G869491q31526o63565p63184n77965m08528m38408k98918k72151q6572j60905
$$ 7869491 7037965 6374400 5611216 5033251 4624723 4186315 3887397 3615246 3528674 3367769
6921C367769l2026Q2044k02131j47697O0990m1633L2649l8981M766K2874J2280
$$ 3367769 3335743 3417787 3215656 3067959 3128949 3087316 3119965 3080984 3085750 3108624 3120904
6910C120904K8175K3276k7130r5231J7173o1305j64770Q2o1595Q2773j03583J9548
$$ 3120904 3149079 3172355 3145225 3049994 3067167 3005862 2841092 2841174 2779579 2862352 2758769 2778317
6898B778317J06311M2468J03669L1872P0384L1034Q2914o3654o2884l1326J4521
$$ 2778317 2884628 2927096 3030765 3062637 3133021 3164055 3246969 3183315 3120431 3089105 3103626
6887C103626n2484j31683r0298q5482j08970o6796r364j15939j98816q4258r5241
$$ 3103626 3051142 2919459 2829161 2743679 2634709 2567913 2558549 2442610 2243794 2159536 2064295
6876B064295L3710k01700o8524p7373j29601K4678j0323r8646j10018j8941J74844
$$ 2064295 2098005 1896305 1827781 1750408 1620807 1645485 1635162 1536516 1426498 1407557 1582401
6865A582401m7587j33084J0277n5225K9094m3941K7643L1717r7151j7934o2600
$$ 1582401 1534814 1401730 1412007 1356782 1385876 1341935 1369578 1401295 1304144 1286210 1223610
6854A223610n4496p0396q9273l007n5426M0336q0486o5556q4723J9759l5561n8290
$$ 1223610 1169114 1098718 1009445 1006438 951012 991348 910862 845306 760583 780342 744781 686491
6842F86491M8034m9975m9026L9314M9507n8868L2484j08778q6031l9292K1032
$$ 686491 734525 684550 635524 674838 724345 665477 697961 589183 503152 463860 484892
6831D84892k2814p1437O650P530J12652l6269J1876p0868n0054L7146N3038l0846
$$ 484892 462078 390641 397291 404821 517473 481204 493080 422212 372158 409304 462342 431496
6819D31496K742m5769r6572J06996j9168l0834N4665o416p7322j0805k7311j8502
$$ 431496 434238 388469 291897 398893 379725 348891 403556 397140 319818 309013 281702 263200
6807B63200K3181N4459p743n9291P1118K7290k6808n431O5819P748l4588K5435
$$ 263200 286381 340840 333097 273806 344924 372214 345406 339975 405794 413542 378954 404389
6795D04389Q4633k255l7560j1943m7791o4115j6209N5879q1507o3224N2446Q7039
$$ 404389 489022 486767 449207 437264 389473 325358 309149 365028 283521 220297 272743 359782
6783C59782J8979j51492o3534o9259J09292N9728n366L2129l7534q736J3434O9033
$$ 359782 378761 227269 163735 94476 203768 263496 258130 290259 252725 243989 257423 326456
6771C26456M6255K9587k2558o4877j19893J21848J20816k5321M047o9643J5085
$$ 326456 372711 402298 379740 314863 194970 316818 437634 412313 416360 346717 361802
6760C61802p2753o3620O9593j3423O4580J77592r3044k7296O0567J69m8549o919
$$ 361802 289049 225429 295022 281599 346179 523771 430727 403431 463998 464167 415618 408699
6748D08699K4921m6926j16849L2129R1286n3324J5289L5178P4957o8316p7103
$$ 408699 433620 386694 269845 301974 393260 339936 355225 390403 465360 397044 319941
6737C19941L9376J24021q4j33150n5456q879J3998Q1199R8943k8283n9538J6235
$$ 319941 359317 483338 483254 350104 294648 285769 299767 380966 479909 451626 392088 408323
6725D08323l9480n1912N5004M1875l2298l1598J1962N146l8314k7361J13843N2522
$$ 408323 368843 316931 371935 413810 381512 349914 361876 367022 328708 301347 415190 467712
6713D67712K2802o688R787q2125k695P7891r3746M7638r439O8245k8278j02980
$$ 467712 490514 483826 493613 411488 408793 486684 392938 440576 431137 499382 471104 368124
6701C68124q2400K7190j3950o5927l0340M0738P1736K3188o5790o7534R2459J03152
$$ 368124 285724 312914 298964 233037 202697 243435 315171 338359 272569 205035 297494 400646
6689D00646J7425m5993m1258J32649L4395j29193J24180L3159l1018N6399j03715
$$ 400646 418071 372078 330820 463469 497864 368671 492851 526010 494992 551391 447676
6678D47676o862L7483R7695K3083L1226P1828N2251j2199n6901j7844L2671l1208
$$ 447676 440814 478297 575992 599075 630301 702129 754380 742181 685280 667436 700107 668899
6666F68899r9598o0545l277M7940N892M0785P6994L6700R4493Q7390Q6831M2090
$$ 668899 569301 508756 505479 553419 559311 600096 677090 713790 808283 895673 982504 1024594
6654A024594j94258j14212Q6346j11320l3936j3794j12068n2249L3650L5028o836
$$ 1024594 830336 716124 802470 691150 657214 643420 531352 479103 512753 547781 540945
6643E40945P4811l6585j33887O8428K5467p5310k4837q190J11165L4040j1199
$$ 540945 615756 579171 445284 513712 539179 463869 439032 430842 542007 576047 564848
6632E64848j36453m1950O8794j01635l8827M7705p1930m235M0085L985p6368O1051
$$ 564848 428395 386445 455239 353604 314777 362482 290552 286317 326402 330387 254019 315070
6620C15070K9727O9223l5765k9835L1473J8136m1842J00779K3074j57385r95k8326
$$ 315070 344797 414020 378255 348420 379893 398029 356187 456966 480040 322655 321660 293334
6608B93334O727K4821O8194P3017j07761p0951K1658q4748q6043O5095J52802
$$ 293334 300061 324882 393076 466093 358332 287381 309039 224291 138248 203343 356145
6597C56145o0061L763J0559j05705k6341k1030Q5074N9450l9508k5664j6544J2460
$$ 356145 296084 299847 310406 204701 178360 157330 242404 301854 262346 236682 220138 232598
6585B32598O5083n801Q4282j3948o3815K9240N0674P6809P8784M4855o6727L6928
$$ 232598 297681 291880 376162 362214 298399 327639 378313 455122 533906 578761 512034 548962
6573E48962J77871K6694M4869o0702L6580o4336j733p327N4083J23138k17481
$$ 548962 726833 753527 798396 737694 774274 709938 708205 700878 754961 878099 660618
6562F60618l4808o777M4017M4774J30869k3124J2425J1316k691M4095k6801n0781
$$ 660618 625810 619033 663050 707824 838693 815569 827994 839310 836619 880714 853913 803132
6550H03132j31954N2198j2827l7124J27698n0669p8767n4726n7819M0203M194
$$ 803132 671178 723376 710549 673425 801123 750454 671687 616961 559142 599345 603539
6539F03539P2468R6256n1689P5937N5734o2926R095M3073P2303k3783R9238m2810
$$ 603539 676007 772263 720574 796511 852245 789319 798414 841487 913790 890007 989245 946435
6527I46435N7212J95997M0072L9856j1701K1164P3890p9857r1790j6900j3102
$$ 946435 1003647 1199644 1239716 1279572 1267871 1289035 1362925 1283068 1191278 1174378 1161276
6516A161276N9863Q5793l9904j27433p2871r4426J00088J3844M325p7129L1330
$$ 1161276 1221139 1306932 1267028 1139595 1066724 972298 1072386 1086230 1090555 1013426 1044756
6505A044756J7213l6174M2074J7884R1576r558L1057J51292J53307N3763n7120
$$ 1044756 1061969 1025795 1067869 1085753 1177329 1167771 1198828 1350120 1503427 1557190 1500070
6494A500070q4237l4650j03996j53884p8240n3350J1621j14095q8902N022n5596
$$ 1500070 1415833 1381183 1277187 1123303 1045063 991713 1003334 889239 800337 805359 749763
6483G49763k7292j0246n3485O3029k4382k8452K499k3159M6613q9584J33937j533
$$ 749763 722471 712225 658740 721769 697387 668935 671434 648275 694888 605304 739241 737708
6471G37708n9503R2107N4835M9776m4541m9770o6895n4334O8630m3592j00135
$$ 737708 678205 770312 825147 874923 830382 780612 713717 659383 728013 684421 584286
6460E84286j2843K2190L6387l1212j8241j62631L4075k4j47480K6119J41081J6236
$$ 584286 571443 593633 630020 598808 580567 417936 452011 451987 304507 330626 471707 487943
6448D87943m7087j4724p0335M9738N4934o675Q5541l4469N0161J7770o6307O0119
$$ 487943 440856 426132 355797 405535 460469 453794 539335 504866 555027 572797 506490 566609
6436E66609K023J4344n4971j12987j26452j3815R9924M3734K4397K3474q0879
$$ 566609 568632 582976 528005 415018 288566 274751 374675 418409 442806 466280 385401
6425C85401J0142N6555L9129N4096o8979p0595O213r023l2160R2601n9370R5K5184
$$ 385401 395543 452098 491227 545323 476344 405749 411962 402939 370779 463380 404010 404105 429289
6412D29289J1179J3648p778n5026l6335k2515K2817Q9372J1209j2590O2449n4618
$$ 429289 440468 454116 446338 391312 354977 332462 355279 444651 455860 443270 505719 451101
6400D51101q2042N2478P0529R803j04112J28607J0084J14629k074o769p1630q1488
$$ 451101 369059 421537 492066 501869 397757 526364 536448 651077 649003 642234 570604 489116
6388D89116P5577R815n8863j1592J7216N6108l1279m5664l0592O3526Q0480l8188
$$ 489116 564693 574508 515645 504053 521269 577377 546098 500434 469842 533368 613848 575660
6376E75660l1025P3658m2776J08827j5366k8598Q6650q228K5367J6986j25087
$$ 575660 544635 618293 575517 684344 668978 640380 727030 718802 744169 761155 636068
6365F36068K7936L5691M2150M2639o0035l4367q7961R0282N0934j7256O8347O9939
$$ 636068 664004 699695 741845 784484 724449 690082 602121 692403 743337 726081 794428 864367
6353H64367n6388Q8579P550J217j9953l4927j2748K0630n9879L5480J68076J69841
$$ 864367 807979 896558 904108 905325 885372 850445 837697 858327 798448 833928 1002004 1171845
6341A171845j32203j14705L2761L7202J00682m9829K65M7243P2127Q4109K5138
$$ 1171845 1039642 924937 957698 994900 1095582 1045753 1046018 1093261 1165388 1249497 1274635
6330A274635l1220j6295N9334j0230n365k7534J7742n1626K3114Q3960J52799
$$ 1274635 1243415 1227120 1286454 1276224 1270859 1243325 1261067 1209441 1232555 1316515 1469314
6319A469314l2040k443k1476M2495r225Q629P3683R881Q5203k2307K1369M0556
$$ 1469314 1437274 1434831 1413355 1455850 1446625 1455254 1528937 1538818 1624021 1601714 1623083 1663639
6307A663639R8142K3688l1434j22022P8837k6778Q1930J64108J653j55937P941
$$ 1663639 1761781 1785469 1754035 1632013 1710850 1684072 1766002 1930110 1931763 1775826 1783767
6296A783767N875J1969l5499Q0492R0055K3724P1691n2131K1142Q0784J10476
$$ 1783767 1789642 1801611 1766112 1846604 1936659 1960383 2032074 1979943 2001085 2081869 2192345
6285B192345K9572l4546L9532O532l1941J41074Q7401R735n1834J1065J24346
$$ 2192345 2221917 2187371 2226903 2233435 2201494 2342568 2429969 2439704 2387870 2398935 2523281
6274B523281J24796j02136N8210O3545J01864O3712l561O6233n4508P2914J00801
$$ 2523281 2648077 2545941 2604151 2667696 2769560 2833272 2829711 2895944 2841436 2914350 3015151
6263C015151Q0156L7568J4534J47628J06758L8884P3881k5989Q5461R4761J01901
$$ 3015151 3095307 3132875 3147409 3295037 3401795 3440679 3514560 3488571 3574032 3668793 3770694
6252C770694K47410M4450L5059R5742P0575J24013P9956J39981J78849J64995
$$ 3770694 4018104 4062554 4097613 4193355 4263930 4387943 4467899 4607880 4786729 4951724
6242D951724O8975K23588J11446N6806K28883K98996J45415K02698K50956K48707
$$ 4951724 5020699 5244287 5355733 5412539 5641422 5940418 6085833 6288531 6539487 6788194
6232F788194K18756J81206K02744L39114L41789K27904K35451K62513L79561K71842
$$ 6788194 7006950 7188156 7390900 7730014 8071803 8299707 8535158 8797671 9177232 9449074
6222I449074L14124L84061M05578L91834N09624L53450O31521P05671O00146Q09187
$$ 9449074 9763198 10147259 10552837 10944671 11454295 11807745 12439266 13144937 13745083 14554270
6212A4554270P59207Q52953R16752R47971J322302J440027J712726J887487K347063
$$ 14554270 15313477 16166430 17083182 18031153 19353455 20793482 22506208 24393695 26740758
6203B6740758K539112L055589L444199L580120L246372K070784K92992j101516
$$ 26740758 29279870 32335459 35779658 39359778 42606150 44676934 44969926 43868410
6195D3868410j683597j818253j269993m17447K93500R69095J759630K560997L005475
$$ 43868410 42184813 40366560 39096567 38679120 38972620 39941715 41701345 44262342 47267817
6186D7267817K870269K031096J261426Q45956R68869J304063J332995N18908q22293
$$ 47267817 50138086 52169182 53430608 54276564 55245433 56549496 57882491 58401399 57579106
6177E7579106k110592k809264k711618k050064r73177Q5400J027893J288294P40288
$$ 57579106 55468514 52659250 49947632 47897568 46924391 47009791 48037684 49325978 50066266
6168E0066266l88123j206926j418598j081675l56731Q04622J801569K755133L107203
$$ 50066266 49678143 48471217 47052619 45970944 45614213 46418835 48220404 50975537 54082740
6159E4082740K338765k85283l274214n446996o046126n728962m665187l761248
$$ 54082740 56421505 56136222 52862008 47415012 41368886 35639924 30974737 27213489
6151B7213489k932805k299480j807082j482143j302455j269184j035629q89866
$$ 27213489 24280684 21981204 20174122 18691979 17389524 16120340 15084711 14194845
6143A4194845p79319p15583n62821m77118m09992m33332k96176j50343l56101
$$ 14194845 13415526 12699943 12137122 11660004 11250012 10816680 10520504 10370161 10014060
6134A0014060l87800k41884k80790j77318k06681j58242k8118r2817o1479j60262
$$ 10014060 9626260 9384376 9103586 8926268 8719587 8561345 8533227 8440410 8378931 8218669
6124H218669j85956n1618j54318p2756n1447j51832r2400j48063k7438o6252p4368
$$ 8218669 8032713 7981095 7826777 7754021 7702574 7550742 7458342 7310279 7282841 7216589 7142221
6113G142221l2566K4865r2757j33983q1183j2165Q3052Q3196R2729K8284j01971
$$ 7142221 7109655 7134520 7041763 6907780 6826597 6814432 6897484 6980680 7073409 7101693 6999722
6102F999722j79817o5500N095j27944p0792n3910K8096m1575J6001J42146J00293
$$ 6999722 6819905 6754405 6759500 6631556 6560764 6506854 6534950 6493375 6509376 6651522 6751815
6091F751815J36154J78471N9417M2650j04191j53642j60789O1355m5421o7809
$$ 6751815 6887969 7066440 7125857 7168507 7064316 6910674 6749885 6811240 6765819 6698010
6081F698010O0373J92041J19191N5859J44630J45449J54741P2692J79925J06071
$$ 6698010 6758383 6950424 7069615 7125474 7270104 7415553 7570294 7642986 7822911 7928982
6071G928982R8348l9644j06922K29873J06102K5931J51792K26271L14937J86116
$$ 7928982 8027330 7987686 7880764 8110637 8216739 8242670 8394462 8620733 8935670 9121786
6061I121786J40119K42550K47484N17518N27388N09356O64576O16948P19580R50918
$$ 9121786 9261905 9504455 9751939 10269457 10796845 11306201 11970777 12587725 13307305 14258223
6051A4258223J118125J208534J157217R84805K47650l72707j051065j196453r12206
$$ 14258223 15376348 16584882 17742099 18726904 18974554 18601847 17550782 16354329 15442123
6042A5442123q11883p04793m20071j79165j41567j57894N0277J16883L7688J10497
$$ 15442123 14630240 13925447 13505376 13326211 13184644 13026750 13077027 13193910 13231598 13342095
6032A3342095K52082J26412K80216J65460K91511L28730L68966M81673M69012
$$ 13342095 13594177 13720589 14000805 14166265 14457776 14786506 15155472 15637145 16106157
6023A6106157M01237O61598O57188O19920R08575Q91676J026930J151424J381936
$$ 16106157 16507394 17168992 17826180 18446100 19354675 20246351 21273281 22424705 23806641
6014B3806641J553361J720890K074121K483401K773896L301356L751037M318342
$$ 23806641 25360002 27080892 29155013 31638414 34412310 37713666 41464703 45783045
6006D5783045M918454N394134M749037K698692j31602k784472l632237l226010
$$ 45783045 50701499 56095633 60844670 63543362 63411760 60627288 56995051 53769041
5998E3769041k384073r23086O349J007264J649368J494337M89749n07557j112415
$$ 53769041 51384968 50461882 50468231 51475495 53124863 54619200 55108949 54601392 53488977
5989E3488977j102820j83148R34075J832092K800583K778091K120415P25579q56202
$$ 53488977 52386157 52203009 53137084 54969176 57769759 60547850 62668265 63393844 62537642
5980F2537642j908235k078185j604784j200593j374137k158765k703568k676395
$$ 62537642 60629407 58551222 56946438 55745845 54371708 52212943 49509375 46832980
5972D6832980k188629j397871p42269m8142O04492J089874J598673J636308O72734
$$ 46832980 44644351 43246480 42504211 42456069 43060561 44150435 45749108 47385416 48058150
5963D8058150o75038k317845l465246l858681l684572l161212k553168j946880
$$ 48058150 47383112 45065267 41600021 37741340 34056768 30895556 28342388 26395508
5955B6395508j619266j191438q25439o74116o39222n00537l22632n02421n91947
$$ 26395508 24776242 23584804 22759365 22085249 21446027 20945490 20622858 20120437 19528490
5946A9528490n38742m17664j95443l78898l17392m12466l79940l38411m19948
$$ 19528490 18989748 18572084 18376641 17997743 17680351 17267885 16887945 16549534 16129586
5937A6129586l63292m66514m62358l77733l52249l15058k84438k71954j05927
$$ 16129586 15766294 15299780 14837422 14459689 14107440 13792382 13507944 13235990 13130063
5928A3130063j75381j90964q4121j82658Q992j18068j07299l398L9651O1765m6935
$$ 13130063 12954682 12763718 12679597 12496939 12505931 12387863 12280564 12277166 12316817 12378582 12331647
5917A2331647J08096L6498R5047J21860Q1449P3139J67922K50284J76988J69723
$$ 12331647 12439743 12476241 12571288 12693148 12774597 12847736 13015658 13265942 13442930 13612653
5907A3612653M23822L58150L03078M01879N14221O08598O04689N99257O86832
$$ 13612653 14036475 14394625 14697703 15099582 15613803 16222401 16827090 17426347 18113179
5898A8113179N52391N85997P44095O08069N67858L23947K28744J42787n4254K243
$$ 18113179 18665570 19251567 19995662 20603731 21171589 21495536 21724280 21867067 21812813 21815056
5888B1815056K17048J95905K49265M51422M50128K66280N39567O38985P24834
$$ 21815056 22032104 22228009 22477274 22928696 23378824 23645104 24184671 24823656 25548490
5879B5548490R92577J139492J010117J056968J158084J291349J411378J573710
$$ 25548490 26541067 27680559 28690676 29747644 30905728 32197077 33608455 35182165
5871C5182165J824593K082108K214427K603609K943490L217523L526835L659868
$$ 35182165 37006758 39088866 41303293 43906902 46850392 50067915 53594750 57254618
5863E7254618L178577J956030J88035j726485k758970k926656k698112k110226
$$ 57254618 60433195 62389225 62577260 60850775 58091805 55165149 52467037 50356811
5855E0356811j375681q55446n67430J21306N01704N11432Q43943J080692J511530
$$ 50356811 48981130 48125684 47558254 47679560 48181264 48692696 49536639 50617331 52128861
5846E2128861K218829K869044L673101M431583N206496N949698O760764O854473
$$ 52128861 54347690 57216734 60889835 65321418 70527914 76477612 83238376 90092849
5838I0092849N984758L312385m69658l852402o633087p967703p731060o767640
$$ 90092849 96077607 99389992 98920334 95067932 88434845 80467142 72736082 65968442
5830F5968442n599461m500292l495877k636065j937824j414387q36667k45665
$$ 65968442 60368981 55868689 52372812 49736747 47798923 46384536 45547869 45302204
5822D5302204L2267M92334Q51723J226177J722877K077737K302660K460219K421470
$$ 45302204 45334471 45826805 46678528 47904705 49627582 51705319 54007979 56468198 58889668
5813E8889668J995670Q77416j092523l260666m681144n178568m974165m299890
$$ 58889668 60885338 61762754 60670231 57409565 52728421 47549853 42575688 38275798
5805C8275798l514385k919569k354710j849408j380835j097752j116338r76784
$$ 38275798 34761413 31841844 29487134 27637726 26256891 25159139 24042801 23066017
5797B3066017q67410r06001p04509p34096o96524q24560j050942j019447r09433
$$ 23066017 22198607 21292606 20588097 19854001 19157477 18332917 17281975 16262528 15353095
5788A5353095q32522o00141p98672o24125n16068l17069l35245l46835k25002
$$ 15353095 14520573 13920432 13121760 12497635 11981567 11664498 11329253 10982418 10757416
5779A0757416k05817j28130k64388j69762q7618j01243j53661j89536j47734k63049
$$ 10757416 10551599 10423469 10159081 9989319 9901701 9800458 9646797 9457261 9309527 9046478
5769I046478j34557j40597k87708k86210k92542j81993k73112k15961j55951k11844
$$ 9046478 8911921 8771324 8483616 8197406 7904864 7722871 7449759 7233798 7077847 6866003
5759F866003j51031q6183M340o2963q9333k1063m0851m4825j8770n404j82479
$$ 6866003 6714972 6628789 6633129 6570166 6480833 6459770 6418919 6374094 6355324 6349920 6167441
5748F167441j35222j13898r1883m1705j60053N0823m3906j14174p0565q2909L4899
$$ 6167441 6032219 5918321 5826438 5784733 5624680 5675503 5631597 5517423 5446858 5363949 5398848
5737E398848q1163j3329l0460q423R3032K8363P3798l7244j68285M2458N7251
$$ 5398848 5317685 5304356 5273896 5265473 5358505 5386868 5460666 5423422 5255137 5297595 5354846
5726E354846k2301p093j33065l9715o4272j69009n7193P3222l7561p1732O0942
$$ 5354846 5332545 5325452 5192387 5152672 5088400 4919391 4862198 4935420 4897859 4826127 4887069
5715D887069Q6407L2156l2870M781R4022j4858J161J50535J36442J17911K0422
$$ 4887069 4973476 5005632 4972762 4977543 5071565 5056707 5057868 5208403 5344845 5462756 5483178
5704E483178K567J01931M79J36223J25424M6584O4130j32594l1694q1792m4625
$$ 5483178 5485745 5587676 5588155 5724378 5849802 5896386 5960516 5827922 5796228 5714436 5669811
5693E669811j22442j3880j19503j45720q182m9490j15633K7099J22464m0895O308
$$ 5669811 5547369 5533489 5413986 5268266 5260084 5210594 5094961 5122060 5244524 5203629 5209937
5682E209937J76939P0383N5791Q3387L3138J78791J88202L13577K21433J00104
$$ 5209937 5386876 5457259 5513050 5596437 5629575 5808366 5996568 6310145 6531578 6631682
5672F631682J52615j12215r7858j53151j63392r0416j27924l9232J9820j67722
$$ 6631682 6784297 6672082 6574224 6421073 6257681 6167265 6039341 6000109 6019929 5852207
5662E852207j54253j14712j21909k8533q4665q0683K9265q4486j02225J7742N2265
$$ 5852207 5697954 5583242 5461333 5432800 5348135 5267452 5296717 5212231 5110006 5127748 5180013
5651E180013j3950N7202Q7922j5568R3307J65130K19110K06426J48419K33149
$$ 5180013 5166063 5223265 5311187 5295619 5388926 5554056 5773166 5979592 6128011 6361160
5641F361160L1663r3144p2880j58449k43449j67078j50980r6622N4478M9916j24285
$$ 6361160 6392823 6299679 6226799 6068350 5824901 5657823 5506843 5410221 5464699 5514615 5390330
5630E390330o3608P1476n3696O1492J4403J5576l0943j06604O9125m0516j08726
$$ 5390330 5326722 5398198 5344502 5405994 5420397 5435973 5405030 5298426 5367551 5327035 5218309
5619E218309M1186J04247J47593J2529L9994J90465J02300L5634J21071O9666
$$ 5218309 5259495 5363742 5511335 5523864 5563858 5754323 5856623 5892257 6013328 6082994
5609F082994J59845J33674J33494J32660J53971J93979K04336K56444L84193K29269
$$ 6082994 6242839 6376513 6510007 6642667 6796638 6990617 7194953 7451397 7835590 8064859
5599H064859L85138M45897K42610J6083k19345m57768k93304k80995j87083j45622
$$ 8064859 8449997 8895894 9138504 9154587 8935242 8477474 8184170 7903175 7716092 7570470
5589G570470p5188J7420n1316n9199J44974K76938O6659J75247L58369M34350
$$ 7570470 7495282 7512702 7461386 7402187 7547161 7824099 7890758 8066005 8424374 8858724
5579H858724L48202J58613R2427J79974J6675j79294k25947l10510n76227m20728
$$ 8858724 9206926 9365539 9457966 9637940 9654615 9475321 9249374 8938864 8362637 7941909
5569G941909l39080l82624l45921j20568l3264j62673j11625k205j6222N6762
$$ 7941909 7602829 7220205 6874284 6753716 6720452 6557779 6446154 6443949 6427727 6484489
5559F484489j343L165J06695Q4311L6873o1764r9468k24162m69841l30424j79195
$$ 6484489 6483146 6486311 6593006 6677317 6714190 6652426 6552958 6328796 5858955 5528531 5349336
5548E349336k27701k56256j39510k84651k99539o1606p1365j19451n1237m5245
$$ 5349336 5121635 4865379 4725869 4441218 4141679 4080073 4008708 3889257 3838020 3792775
5538C792775j17137m5341K2641n112p5865o5830R5488P5667M439j3511N6993l8939
$$ 3792775 3675638 3630297 3652938 3647826 3571961 3506131 3601619 3677286 3681725 3668214 3725207 3686268
5526C686268j0158N6002L2505Q8895j04628L470r1405j64020j5324k9732j64809
$$ 3686268 3676110 3732112 3764617 3853512 3748884 3752354 3660949 3496929 3481605 3451873 3287064
5515C287064j22274m1045k3770j56672Q4093R7310R024m9366j5589J22260R6007
$$ 3287064 3164790 3123745 3099975 2943303 3027396 3124706 3133730 3084364 3068775 3191035 3287042
5504C287042J9631O7575K17250J41657J36674J21306J46893J44378K91760P785
$$ 3287042 3306673 3374248 3591498 3733155 3869829 3991135 4138028 4282406 4574166 4581951
5494D581951K5876r3636k42181l02971k56880J2745j51599j16471J0745r5786
$$ 4581951 4607827 4514191 4272010 3969039 3712159 3724904 3573305 3456834 3467579 3371793
5484C371793r790M5035J29908J24866Q8176N2556n1872J05037k6928P3853j0852
$$ 3371793 3362003 3407038 3536946 3661812 3749988 3802544 3750672 3855709 3828781 3902634 3891782
5473C891782L4271J13187R5476j03547j01435l5977j80658j70919j69352m4169
$$ 3891782 3926053 4039240 4134716 4031169 3929734 3893757 3713099 3542180 3372828 3328659
5463C328659k29949k33483p1627j36474l2780N2880Q095M2616n3628O0656J53049
$$ 3328659 3098710 2865227 2793600 2657126 2624346 2677226 2685321 2727937 2674309 2734965 2888014
5452B888014P8567o2832P2740j7091q9018j63499j71764j6832j50196j99141j14074
$$ 2888014 2966581 2903749 2976489 2959398 2870380 2706881 2535117 2518285 2368089 2168948 2054874
5441B054874j1896j32595m7765r3524m2600J13685K0873j7051q4992l5123J5297
$$ 2054874 2042978 1910383 1862618 1769094 1726494 1840179 1861052 1844001 1759009 1723886 1739183
5430A739183k5796j7951P5845P0030k91J06127j18442p3813N1654J6577j50556
$$ 1739183 1713387 1695436 1771281 1841311 1841020 1947147 1828705 1754892 1806546 1823123 1672567
5419A672567M5862k496n8061J04379M6149k9473n9171Q604J14989K6421J0937
$$ 1672567 1718429 1715933 1657872 1762251 1808400 1778927 1719756 1728360 1843349 1869770 1880707
5408A880707J2570o3186m6620N5495J3105L3616N9460J09231M3784n3047K20018
$$ 1880707 1893277 1830091 1783471 1838966 1852071 1885687 1945147 2054378 2098162 2045115 2265133
5397B265133l4791K1200j1787l9285K6996R829k00473p7135o5139M401j1067n880
$$ 2265133 2230342 2251542 2239755 2200470 2227466 2237295 2036822 1959687 1894548 1898949 1887882 1882002
5385A882002n2871n0191l7016P6045m2387k4912N6748K7387m3084P8391M2104
$$ 1882002 1829131 1778940 1741924 1817969 1775582 1750670 1807418 1834805 1791721 1870112 1912216
5374A912216M1691r71M6478J49915J22930K03904M4304N7126n6989j41976r5116
$$ 1912216 1953907 1952936 1999414 2149329 2272259 2476163 2520467 2577593 2520604 2378628 2283512
5363B283512o0695j76448o1243k01617o848J30944N380j02627n6370q2627L8236
$$ 2283512 2222817 2046369 1985126 1783509 1776661 1907605 1912985 1810358 1753988 1671361 1709597
5352A709597L8636P3438j552q5497q996K13908K20710n8964m1348R0281J43828
$$ 1709597 1748233 1821671 1820119 1734622 1725626 1939534 2160244 2101280 2059932 2150213 2294041
5341B294041J73055J4085l2377j1619j10906j36972k8970J588j44039j21973j2875
$$ 2294041 2467096 2481181 2448804 2437185 2326279 2189307 2160337 2161925 2017886 1895913 1883038
5330A883038p7585k8889n3599o8308m1768j13274O2495R6446j5596j564K4952
$$ 1883038 1805453 1776564 1722965 1654657 1612889 1499615 1562110 1658556 1642960 1641396 1666348
5319A666348M6311K5492p9694j1302o8305j2731Q7101m171j2044l1722j12888
$$ 1666348 1712659 1738151 1658457 1647155 1578850 1566119 1653220 1649049 1637005 1605283 1492395
5308A492395m2897N7893k4055M1r1978r7311J1788K3070R510p1735m1287J04698
$$ 1492395 1449498 1507391 1483336 1483377 1391399 1294088 1305876 1328946 1338456 1266721 1225434 1330132
5296A330132l3332j09697N2825Q4302l930j05157J3177Q0119q415M9096O7719
$$ 1330132 1296800 1187103 1239928 1324230 1320300 1215143 1228320 1308439 1300024 1349120 1416839
5285A416839K1585n2422M578j7842L5841J9519j15526K7016m6835L931N5769l1467
$$ 1416839 1438424 1386002 1390580 1372738 1408579 1428098 1312572 1339588 1292753 1296684 1352453 1320986
5273A320986o3797P928M6182j0612M4694l2822R1510O1716J7614p5201j21795
$$ 1320986 1257189 1265117 1311299 1300687 1345381 1312559 1404069 1465785 1483399 1408198 1286403
5262A286403J00363L6798m7197j40014j9553L1808q218m6287m8478L1356P0545
$$ 1286403 1386766 1423564 1376367 1236353 1216800 1248608 1240390 1194103 1145625 1176981 1247526
5251A247526N8308P4273L8131M2458q1105j25053J08840j09827J4245J9589m8009
$$ 1247526 1305834 1380107 1418238 1460696 1379591 1254538 1363378 1253551 1267796 1287385 1239376
5240A239376q683m1637K5313j5268N2893r396n0286j50513J42404n0489O0560
$$ 1239376 1230693 1189056 1214369 1199101 1251994 1242598 1192312 1041799 1184203 1133714 1194274
5229A194274k2303n2631N669M5615m0456k1722Q8720K3279k0507m4809P7127o6703
$$ 1194274 1171971 1119340 1125009 1170624 1130168 1108446 1197166 1220445 1199938 1155129 1232256 1165553
5217A165553l7989J07353P3107J875n1984j03840l0555Q1252O1386r8934P325
$$ 1165553 1127564 1234917 1308024 1309899 1257915 1154075 1123520 1204772 1266158 1167224 1174549
5206A174549j1946N2937M7587M5914m5413k0211k9372m4059k7300m888k276j4376
$$ 1174549 1162603 1215540 1263127 1309041 1263628 1243417 1214045 1169986 1142686 1137798 1135522 1121146
5194A121146m4972p036K0350n0811N9064p4973j19080l4944j737j4598J2575R3703
$$ 1121146 1076174 1069138 1089488 1038677 1097741 1022768 903688 868744 867007 852409 864984 958687
5182I58687l500M4874o2219r3458k5183J38747J07576j20228j47348J00539l0683
$$ 958687 955187 1000061 937842 844384 819201 957948 1065524 945296 797948 898487 867804
5171H67804o7603Q0402J565l809j4725j14828J00215O0767p8257M277K0315P5132
$$ 867804 800201 880603 882168 878359 863634 748806 849021 909788 831531 835808 856123 931255
5159I31255o9307n5249j8948M4645j10733K1022N8942m6389p8717l4002Q0541
$$ 931255 861948 806699 787751 832396 721663 742685 801627 755238 676521 642519 723060
5148G23060R9886j9176N8530J09617J0943J09292q9111l9902n2432N322J8122
$$ 723060 822946 803770 862300 971917 982860 1092152 1003041 963139 910707 916029 934151
5137I34151P5010q5522M4926Q4437L6976R9376l1293L0612M2491P9139J31452
$$ 934151 1009161 923639 968565 1053002 1089978 1189354 1158061 1188673 1231164 1310303 1441755
5126A441755o3652m0889l1805l3413k2243l1572Q8597o8523L878o2079r7910r9315
$$ 1441755 1378103 1337214 1305409 1271996 1249753 1218181 1306778 1238255 1242133 1180054 1082144 982829
5114I82829J0552j04863N7582K6426j9973L7577p0542J817K2849J5872Q9667l1203
$$ 982829 993381 888518 946100 972526 952553 990130 919588 921405 944254 960126 1049793 1018590
5102A018590l1921L2322J2678n3270R2286K5172J1005L6299n182N3554M060n7327
$$ 1018590 986669 1018991 1031669 978399 1070685 1095857 1106862 1143161 1137979 1191533 1195593 1138266
5090A138266O0165J01464j26677k8842J6504M5436O5382l3391K1151L7884r3179
$$ 1138266 1198431 1299895 1173218 1144376 1160880 1206316 1271698 1238307 1259458 1297342 1204163
5079A204163l6107n506P2827L1615O5358k9606q2211J14949K7804J01753P7325
$$ 1204163 1168056 1162550 1235377 1266992 1332350 1302744 1220533 1335482 1363286 1465039 1542364
5068A542364R0969l2492O4765N3809O1262R2085k6775O9616P5250N0304J37876
$$ 1542364 1633333 1600841 1665606 1719415 1780677 1872762 1845987 1915603 1990853 2041157 2179033
5057B179033J33261J66002J62443K03712J20826j05695l07480k06965k26352j80879
$$ 2179033 2312294 2478296 2640739 2844451 2965277 2859582 2552102 2345137 2118785 1937906
5047A937906k0696j80407j04807j9199K0096n7167j3750l8969o935K4705n2804
$$ 1937906 1917210 1736803 1631996 1612797 1632893 1575726 1561976 1523007 1516072 1540777 1487973
5036A487973j21019q73m3545J51464k8236R6731l2188l5668N5248R319K803m905
$$ 1487973 1366954 1366081 1322536 1474000 1445764 1542495 1510307 1474639 1529887 1539206 1542009 1537104
5024A537104J30359L2806p5496n377j02540p1558N8609K8939p1048m9759L187
$$ 1537104 1667463 1700269 1624773 1619396 1516856 1445298 1503907 1532846 1461798 1412039 1415226
5013A415226K0870n1156j2075N7478O8152j3526J7402M3659j51881J6299m3851
$$ 1415226 1436096 1384940 1372865 1430343 1498495 1484969 1502371 1546030 1394149 1410448 1366597
5002A366597p160p538O2810J16570j529K4513j13266p9535L057P3586K6825L4487
$$ 1366597 1359437 1351899 1414709 1531279 1529750 1554263 1440997 1361462 1364519 1438105 1464930 1499417
4990A499417K8976N2553P8704k6399J9390L3420l290K6387q3127K5177Q8763r6241
$$ 1499417 1528393 1580946 1659650 1633251 1652641 1686061 1682771 1709158 1626031 1651208 1739971 1643730
4978A643730P5465k8193P5585J5391p1179n5781l228j0328Q1824j9688j30461
$$ 1643730 1719195 1691002 1766587 1781978 1710799 1655018 1651790 1641462 1723286 1703598 1573137
4967A573137K7824n566r197Q7280R0182J2972j5329P959P1349k7091l9038K0803
$$ 1573137 1600961 1595395 1586198 1673478 1763660 1776632 1761303 1769262 1840611 1813520 1774482 1795285
4955A795285J21221J08082P1374o1163k7870J53954K0545J23953r6977O7381P9642
$$ 1795285 1916506 2024588 2095962 2034799 2006929 2160883 2181428 2305381 2208404 2275785 2355427
4944B355427P8585n3089J8562j7275M9973P457j8768r0150l568K9386k9720k896
$$ 2355427 2434012 2380923 2399485 2382210 2432183 2439640 2420872 2330722 2327154 2356540 2326820 2323924
4932B323924P698l7274p4841J85212J11226N8947p352o6973P330M0919O4192J16781
$$ 2323924 2331622 2294348 2219507 2404719 2515945 2574892 2567540 2500567 2507897 2548816 2613008 2729789
4920B729789M4986Q413L1145J8337M7305K13592J32710O3103P4922m1932j90902
$$ 2729789 2774775 2783188 2814333 2832670 2879975 3093567 3226277 3289380 3364302 3322370 3131468
4909C131468J09538O3651n7465p3998L5248J1051m116n0297l377R7779O5439J00405
$$ 3131468 3241006 3304657 3247192 3173194 3208442 3219493 3215377 3165080 3161703 3259482 3324921 3425326
4897C425326N9724L2140l6791Q362J65661J84697J43717R8146J35741J21888R3007
$$ 3425326 3485050 3517190 3480399 3488761 3654422 3839119 3982836 4080982 4216723 4338611 4431618
4886D431618R2484l21L2611J83849J03141Q6173Q4226R2694K7627J54289o795
$$ 4431618 4524102 4523781 4556392 4740241 4843382 4929555 5013781 5106475 5134102 5288391 5281596
4875E281596P0807J7204p2428Q3252P1911l9835O3110R9321J33586K5379J04515
$$ 5281596 5352403 5369607 5297179 5380431 5452342 5412507 5475617 5574938 5708524 5733903 5838418
4864E838418J86664K50076J60804J60846J76837J97985K23699K55509J56078J8283
$$ 5838418 6025082 6275158 6435962 6596808 6773645 6971630 7195329 7450838 7606916 7625199
4854G625199K0744O3052Q491R8570R9268O7544K26615O7439L21664J26952K40677
$$ 7625199 7645943 7708995 7717486 7816056 7915324 7982868 8209483 8276922 8598586 8725538 8966215
4843H966215K57395K30205L50293K30111K58198J96562L39326L66664J59651K36188
$$ 8966215 9223610 9453815 9804108 10034219 10292417 10488979 10828305 11194969 11354620 11590808
4833A1590808K72942L36452M37249L24939L44229N44310M04364N01463N30648
$$ 11590808 11863750 12200202 12637451 12962390 13306619 13850929 14255293 14756756 15287404
4824A5287404N37833N68790M53829N43671O19334M68738N48306P14871P18966
$$ 15287404 15825237 16394027 16847856 17391527 18010861 18479599 19027905 19742776 20461742
4815B0461742P17030Q95292R32063J059580J239133J378449J561700J751278J873392
$$ 20461742 21178772 22074064 23006127 24065707 25304840 26683289 28244989 29996267 31869659
4806C1869659K144893K429281K885469L329547M090447M299087L726514K288427
$$ 31869659 34014552 36443833 39329302 42658849 46749296 51048383 54774897 57063324
4798E7063324J243341J394290J787653K216299K352205J612745M56343j073012
$$ 57063324 58306665 59700955 61488608 63704907 66057112 67669857 68126200 67053188
4790F7053188k158923k584633k698554k191597j639258j083305m62215L7909L73018
$$ 67053188 64894265 62309632 59611078 57419481 55780223 54696918 54234703 54272612 54645630
4781E4645630O84654R49103J551751K024525K677218L474571L992506M684096
$$ 54645630 55330284 56279387 57831138 59855663 62532881 66007452 69999958 74684054
4773G4684054N638756O005283O448315O466407N718786L985620J126556j745375
$$ 74684054 80322810 86328093 92776408 99242815 104961601 108947221 110073777 108328402
4765A08328402m287598n819405n980469n099955m031715k908525j913529j018415
$$ 108328402 104040804 98221399 92240930 87140975 83109260 80200735 78287206 77268791
4757G7268791L0647J093367J928456K468595L207951M070476N133684O453508
$$ 77268791 77299438 78392805 80321261 82789856 85997807 90068283 95201967 101655475
4749A01655475Q458919J0751972J3108054J5740677J7564885K0682904K6369560
$$ 101655475 110114394 120866366 133974420 149715097 167279982 187962886 214332446
4742B14332446L1949501L3362059K0082165r916103l7336682m4376260l8747970
$$ 214332446 246281947 279644006 299726171 289810068 252473386 208097126 169349156
4735A69349156l0387947k2189329j6577817j2688211r886151p646844o376217
$$ 169349156 138961209 116771880 100194063 87505852 77619701 69972857 63596640
4728F3596640n770555n131133m636193l909971l177682k649907k178583k112868
$$ 63596640 57826085 52694952 48058759 44148788 40971106 38321199 36142616 34029748
4720C4029748j953303j815089j484838j382170j453322j494889j542183j711755
$$ 34029748 32076445 30261356 28776518 27394348 25941026 24446137 22903954 21192199
4712B1192199j244612r71480q50300m95804n23731l74517m05883k69134k48858
$$ 21192199 19947587 18976107 18125807 17630003 17106272 16731755 16325872 16056738 15807880
4703A5807880k86170m14479m68814m59478m63185m56530l32085l11898k99757
$$ 15807880 15521710 15107231 14638417 14178939 13715754 13259224 12927139 12615241 12315484
4694A2315484l34980l58478m01011l55748j18550k40213l46199k06853k38320
$$ 12315484 11980504 11622026 11221015 10865267 10746717 10506504 10160305 9953452 9715132
4685I715132r3846j49915j15548j11120k54607j97117k06650q8323o4811k11746
$$ 9715132 9621286 9471371 9355823 9244703 8990096 8792979 8586329 8498006 8433195 8221449
4675H221449k40407k06883k36955k74185l44248j95799q5764o7492j73776j51008
$$ 8221449 7981042 7774159 7537204 7263019 6918771 6722972 6637208 6569716 6395940 6244932
4665F244932k68590j82114j84989o7475k9008j92214j20731o3671p4785n0403
$$ 6244932 5976342 5794228 5609239 5541764 5512756 5320542 5199811 5136140 5061355 5010952
4655E010952l4844l360p0468N8495J5823k727J379k3657j41535M0194N383j7480
$$ 5010952 4976108 4972748 4902280 4960775 4976598 4973871 4975250 4951593 4810058 4850252 4855635 4838155
4643D838155N1799k8155N4351R2458J9539N3139J46152O0494j2276P8352J06589
$$ 4838155 4889954 4861799 4916150 5008608 5028147 5081286 5227438 5287932 5275656 5354008 5460597
4632E460597K16098K21952J41752L06289K57974K46477J7080k19876l45379l99745
$$ 5460597 5676695 5898647 6040399 6346688 6604662 6851139 6868219 6648343 6302964 5903219
4622E903219l70040k40248r2368k4158j05524p9487M5331O209R585K8000P6302
$$ 5903219 5533179 5292931 5200563 5176405 5070881 4991394 5036725 5042934 5052519 5080519 5156821
4611E156821L2807k9484J26063Q9716P7814P2980J2654J03612P4689P061L7609
$$ 5156821 5189628 5160144 5286207 5375923 5453737 5526717 5539371 5642983 5717672 5724733 5762342
4600E762342n8016K8594K3095P6081J64032Q2574J22628Q7144m5620R9359P6939
$$ 5762342 5704326 5732920 5756015 5832096 5996128 6078702 6201330 6288474 6242854 6342213 6419152
4589F419152N0061p8002O9652J18894K9917k9524k2664M9491j8229m3053j04109
$$ 6419152 6469213 6391211 6460863 6579757 6609674 6580150 6557486 6606977 6588748 6545695 6441586
4578F441586P846j52801k65622j2562o1365j8531p9005j8533M0597m2659K1131
$$ 6441586 6449432 6296631 6031009 6018447 5957082 5938551 5859546 5841013 5881610 5838951 5860082
4567E860082J73538J80533J09768K73518J90731K58194J35301P7306J92322J42638
$$ 5860082 6033620 6214153 6323921 6597439 6788170 7046364 7181665 7258971 7451293 7593931
4557G593931P9744J39647J78969J47605j9148L1941J36371J0197o8747r3837j30591
$$ 7593931 7673675 7813322 7992291 8139896 8120748 8152689 8289060 8299257 8230510 8136673 8006082
4546H006082j80777j62153k54792k75041j90271k54304k55808l06742o8478m4792
$$ 8006082 7825305 7663152 7408360 7133319 6943048 6688744 6432936 6126194 6057716 6012924
4536F012924j29000q9895o093m2874L4669O0074J68663M2772J10598K42251J40992
$$ 6012924 5883924 5794029 5787936 5745062 5779731 5839805 6008468 6051240 6161838 6404089 6545081
4525F545081J52522M2033J23586J07941J16373K24080K74535J66793J93781J48569
$$ 6545081 6697603 6739636 6863222 6971163 7087536 7311616 7586151 7752944 7946725 8095294
4515H095294n0588j8870L8477j37065j89148j96249j05196j12156j03434j60968
$$ 8095294 8044706 8025836 8064313 7927248 7738100 7541851 7436655 7324499 7221065 7060097
4505G060097k32456k70853j84328k09262k14037j52958j29657O5500p8009j1008
$$ 7060097 6827641 6556788 6372460 6163198 5949161 5796203 5666546 5732046 5654037 5643029
4495E643029l235J6594j1439K2215L7355m5202J52451J55502J98104J41599P7746
$$ 5643029 5639794 5656388 5644949 5667164 5704519 5659317 5811768 5967270 6165374 6306973 6384719
4484F384719K08262J88832K05575L40909K80690L00181K43551L09495K48839K99289
$$ 6384719 6592981 6781813 6987388 7328297 7608987 7909168 8152719 8462214 8711053 9010342
4474I010342R114j98936m84411m91264m62373m81169k10400j78517j66737q2990
$$ 9010342 9019456 8820520 8336109 7844845 7382472 6901303 6690903 6512386 6345649 6262659
4464F262659q0596k2817L5180n6225j0386k7956o544j4380Q7990J2262J19701
$$ 6262659 6182063 6159246 6194426 6138201 6127815 6099859 6093315 6078935 6166925 6179187 6298888
4453F298888J73604L6778J50217K74414K59961J67483M44870L06406L36151M04816
$$ 6298888 6472492 6509270 6659487 6933901 7193862 7361345 7806215 8112621 8448772 8853588
4443H853588K20976K01503j33800l26953m50109l97389l94744m34075k67147q0667
$$ 8853588 9074564 9276067 9142267 8815314 8365205 7967816 7573072 7138997 6871850 6791183
4433F791183l3290j73110q8745R0284n4066N8249J51513R2650K34682L07872K08773
$$ 6791183 6757893 6584783 6496038 6586322 6532256 6590505 6742018 6834668 7069350 7377222 7585995
4422G585995K67701o0090J100J13863Q6060J54499K97989K14338K59899J77032
$$ 7585995 7853696 7793606 7794706 7908569 7994629 8149128 8447117 8661455 8921354 9098386
4412I098386K13756J68913l0513q5431j40759j45229j32891j97145l77764k93907
$$ 9098386 9312142 9481055 9450542 9365111 9224352 9079123 8946232 8749087 8371323 8077416
4402H077416k42004k29925j72853k12349p4296Q59o8317Q6859O2913J31354K29564
$$ 8077416 7835412 7605487 7432634 7220285 7145989 7146848 7078531 7165390 7228303 7359657 7589221
4391G589221J94227K22864K83983J74259O5186J6701R6804O5006p9508j25217
$$ 7589221 7783448 8006312 8290295 8464554 8529740 8546441 8643245 8708251 8628743 8503526
4381H503526j30154j27078j48190k819k8466j97803j15432m9539J1420j27792
$$ 8503526 8373372 8246294 8098104 8095285 8066819 7869016 7753584 7704045 7715465 7587673
4371G587673q2406m8061m8642j0871J101P3590K4310L0562J44745J37764J95403
$$ 7587673 7505267 7457206 7408564 7397693 7398794 7472384 7496694 7527256 7672001 7809765 8005168
4360H005168N5926J35876K38969J41460J99466J10581R7713R5881r578n6632p9506
$$ 8005168 8061094 8196970 8435939 8577399 8776865 8887446 8985159 9081040 9071462 9014830 8935324
4349H935324p2905o2005j29198k23638j70149k00264j54750k10929k08888k41383
$$ 8935324 8862419 8800414 8671216 8447578 8277429 8077165 7922415 7711486 7502598 7261215
4339G261215j81074j00439j31142l1576l873p493j6487Q910j18341J4797R3624
$$ 7261215 7080141 6979702 6848560 6816984 6813111 6805618 6789131 6798041 6679700 6694497 6788121
4328F788121J2467O8209Q1088k1927l9490j3057J06157M4338o2141l0187p2857
$$ 6788121 6800588 6868797 6949885 6927958 6888468 6875411 6981568 7025906 6963765 6933578 6860721
4317F860721K1132n5845k6004J6969L827j28681k4375n6738j29683m447o6722
$$ 6860721 6881853 6826008 6800004 6816973 6820800 6692119 6667744 6611006 6481323 6476876 6410154
4306F410154L9135M0709r9898l625j6994n438j8859Q8471J45146j03229O0909
$$ 6410154 6449289 6489998 6390100 6386475 6369481 6364043 6345184 6433655 6578801 6475572 6536481
4295F536481M7038L1920J17078O3379J04468m448j46363L1981R052p7952K591
$$ 6536481 6583519 6615439 6732517 6795896 6900364 6895916 6749553 6781534 6790586 6712634 6715225
4284F715225N7090P0132j04403m4317J32264J42163R4850J88852J38180K9226
$$ 6715225 6772315 6842447 6738044 6693727 6825991 6968154 7063004 7251856 7390036 7419262
4274G419262J69297O0499R1780m9960K05439J5601J70273J58998L0914J89141
$$ 7419262 7588559 7649058 7740838 7690878 7896317 7911918 8082191 8241189 8272103 8461244
4264H461244R1790J85947J07790L500j1391J6533j40995l3812j0981j09445J21884
$$ 8461244 8553034 8738981 8846771 8850271 8838880 8855413 8714418 8680606 8669625 8560180 8682064
4253H682064J56345L628N1465m9290Q4667J40047J54953J34171J51622J44394
$$ 8682064 8838409 8842037 8893502 8844212 8928879 9068926 9223879 9358050 9509672 9654066
4243I654066M8283Q9686J05210J5721Q4128J25396J25299J06379J50180M4363
$$ 9654066 9702349 9792035 9897245 9912966 9997094 10122490 10247789 10354168 10504348 10548711
4233A0548711L8769P4848J67511K16212J39502J63112P4455J89227J65810M6747
$$ 10548711 10587480 10662328 10829839 11046051 11185553 11348665 11423120 11612347 11778157 11824904
4223A1824904J64632J91204J73264K57932K05011J34272K35455J51143K63971
$$ 11824904 11989536 12180740 12354004 12611936 12816947 12951219 13186674 13337817 13601788
4214A3601788J88583J48561K64755K84772M06930L59151K93730K88696L12121
$$ 13601788 13790371 13938932 14203687 14488459 14895389 15254540 15548270 15836966 16149087
4205A6149087L74385K94265J53843L09066L39911J82249K18254M41083L16076
$$ 16149087 16523472 16817737 16971580 17280646 17620557 17802806 18021060 18462143 18778219
4196A8778219L48016L52321L37774L11320L45066L85145M72164M78760M26117
$$ 18778219 19126235 19478556 19816330 20127650 20472716 20857861 21330025 21808785 22234902
4187B2234902M33510L24144M12572K50873M51266N90666P12716N40519N71978
$$ 22234902 22668412 22992556 23405128 23656001 24107267 24697933 25410649 25951168 26523146
4178B6523146O19609O65322P09897O73917P01598P20338P98079R08707R61683
$$ 26523146 27142755 27808077 28517974 29191891 29893489 30613827 31411906 32320613 33282296
4169C3282296J195835J090595J060542J149533J282265J320874J346017J772566
$$ 33282296 34478131 35568726 36629268 37778801 39061066 40381940 41727957 43500523
4161D3500523J822439J995995J911666K028335K217936K364256K341088K443132
$$ 43500523 45322962 47318957 49230623 51258958 53476894 55841150 58182238 60625370
4153F0625370K416088K450821K410500K640510K681854K886214L102901L201694
$$ 60625370 63041458 65492279 67902779 70543289 73225143 76111357 79214258 82415952
4145H2415952L374912L808796M188797M972513N740355O289679O991120P852240
$$ 82415952 85790864 89599660 93788457 98760970 104501325 110791004 117782124 125634364
4137A25634364Q915108J0335096J2184532J4297095J6614938J9329408K2393106
$$ 125634364 134549472 144884568 157069100 171366195 187981133 207310541 229703647
4130B29703647K6739150L2569590L9441146M3845838M0290625K7874407J3111261
$$ 229703647 256442797 289012387 328453533 372299371 412589996 440464403 453575664
4123D53575664M674154N673044R190894M041547j2033686l2173746m5952580m8792489
$$ 453575664 458249818 463922862 473113756 477155303 465121617 432947871 386995291 338202802
4115C38202802m4015291l6927058k9599312k3106019j7393801j2740828r077587
$$ 338202802 294187511 257260453 227661141 204555122 187161321 174420493 165342906
4108A65342906o648931n528293m942713n002453n853922o701303p832221q687065
$$ 165342906 158693975 153165682 148222969 143220516 137366594 130665291 122833070 114146005
4100A14146005q662537p853900o639003n531579m683390m066548l830636l520355
$$ 114146005 105483468 97629568 90990565 85458986 80775596 76709048 72878412 69358057
4092F9358057l106292k719927k269761j858094j620986j359353j347486j465574
$$ 69358057 66251765 63531838 61262077 59403983 57782997 56423644 55076158 53610584
4084E3610584j419326j444869j312460j286215j323171j065793j074138r36234
$$ 53610584 52191258 50746389 49433929 48147714 46824543 45758750 44684612 43748378
4076D3748378r30281q26339o49593m84109l52871l68836m01544k59291m17578
$$ 43748378 42818097 41991758 41342165 40858056 40505185 40136349 39734805 39475514 39057936
4067C9057936l64522l63745l91505l70098m01613l13773k62312m55161l63894
$$ 39057936 38693414 38329669 37938164 37568066 37166453 36852680 36590368 36135207 35771313
4058C5771313k99613j62718Q3985Q3383j57658l69490o45662r02491r01825r87173
$$ 35771313 35471700 35308982 35392967 35476350 35318692 34949202 34303540 33401049 32499224 31512051
4048C1512051r60393r28501p11570o11213m25924m22567l19170l89856j84385
$$ 31512051 30551658 29623157 28911587 28300374 27874450 27451883 27132713 26742857 26558472
4039B6558472j43103k01164l29810j58987n7572N2216l8678j459K3121j57822
$$ 26558472 26415369 26214205 25884395 25725408 25667836 25720052 25681374 25679915 25703036 25545214
4029B5545214n5280J16207n215Q4284K25636L22057K72074K37843K26660K78236
$$ 25545214 25489934 25606141 25600926 25685210 25910846 26232903 26504977 26742820 26969480 27247716
4019B7247716K60602K38957K82183L43497M17169N70817N45063L55014N94230
$$ 27247716 27508318 27747275 28029458 28372955 28790124 29360941 29906004 30261018 30855248
4010C0855248P33303Q31617P77238Q49128R19492Q31366R61285J056815J016444
$$ 30855248 31588551 32420168 33197406 34046534 34966026 35797392 36758677 37815492 38831936
4001C8831936J226366J314076J322471J430715J508098J619440J695971J904190
$$ 38831936 40058302 41372378 42694849 44125564 45633662 47253102 48949073 50853263
3993E0853263J961149K083937K047537K191043K284989K342716K429591K260093
$$ 50853263 52814412 54898349 56945886 59136929 61421918 63764634 66194225 68454318
3985F8454318K258794K137962J973873K025878K244750K450232K390482K491983
$$ 68454318 70713112 72851074 74824947 76850825 79095575 81545807 83936289 86428272
3977H6428272K717294K893666L015388K915536K939729K975583K996215K917287
$$ 86428272 89145566 92039232 95054620 97970156 100909885 103885468 106881683 109798970
3969A09798970K751800K618971K464336K395884K288611J983842J772540J460704
$$ 109798970 112550770 115169741 117634077 120029961 122318572 124302414 126074954 127535658
3961A27535658J298149J316049J193393J088880Q42086O69037L77364J09081j44924
$$ 127535658 128833807 130149856 131343249 132432129 133274215 133943252 134320616 134429697 134284773
3952A34284773m23075m71904o35344r32198r09599r37961j028765j022461j226270
$$ 134284773 133861698 133389794 132754450 131822252 130912653 129974692 128945927 127923466 126697196
3943A26697196j478069j604228j898264k140074k206846k417852k465889k618035
$$ 126697196 125219127 123614899 121716635 119576561 117369715 114951863 112485974 109867939
3935A09867939k585786k671714k583864k560717k428819k552717k330364k332915
$$ 109867939 107282153 104610439 102026575 99465858 97037039 94484322 92153958 89821043
3927H9821043k458360k397262k268651k407704k318270k397443k507718k338484
$$ 89821043 87362683 84965421 82696770 80289066 77970796 75573353 73065635 70727151
3919G0727151k266074k034464j874334j754398j669265j538109j543580j632309
$$ 70727151 68461077 66426613 64552279 62797881 61128616 59590507 58046927 56414618
3911E6414618j727267j614842j694436j677042j666592j543534j532770j577611
$$ 56414618 54687351 53072509 51378073 49701031 48034439 46490905 44958135 43380524
3903D3380524j554046j494065j345579j132693j168016j143465j142353j044808
$$ 43380524 41826478 40332413 38986834 37854141 36686125 35542660 34400307 33355499
3895C3355499j082121j127024j006075j026054q83117r02256q70528p16497o60039
$$ 33355499 32273378 31146354 30140279 29114225 28231108 27328852 26458324 25741827 25081788
3886B5081788n83623n29264m93848n06915m04900l61496l20989k84411k99369
$$ 25081788 24498165 23968901 23475053 22968138 22563238 22201742 21880753 21596342 21296973
3877B1296973p2574j64003j57132j45356L6304J27533O2599K24492J90785P1287
$$ 21296973 21224399 21060396 20903264 20757908 20794212 20921745 20984344 21208836 21399621 21470908
3867B1470908j003P7009L0703R6682J09400L25058J53945Q6886k42597l95684
$$ 21470908 21469905 21546914 21577617 21674299 21783699 22108757 22262702 22349588 22106991 21711307
3857B1711307r5454j47376M4696J51029L15763M12623M42723N17564M85386L86733
$$ 21711307 21615853 21468477 21513173 21664202 21979965 22392588 22835311 23352875 23838261 24224994
3847B4224994N29438M92447O41896Q86676Q85301R02938Q00375O49619L93801
$$ 24224994 24754432 25246879 25888775 26775451 27660752 28563690 29364065 30013684 30407485
3838C0407485J41113l6907l5203j35720k93528k30576k22152k07935o5583j14388
$$ 30407485 30548598 30511691 30476488 30340768 30047240 29816664 29594512 29386577 29320994 29206606
3828B9206606k83734l26679l45335m40127o88439q34504r48358r18967r19964
$$ 29206606 28922872 28596193 28250858 27810731 27122292 26287788 25339430 24420463 23500499
3819B3500499r50823q03402p29940p01815n87776m41016l59435m07428l69435
$$ 23500499 22549676 21746274 21016334 20314519 19726743 19285727 18926292 18518864 18149429
3810A8149429l50416l47124k68216k52874j70718k06784k68323k56335k83460
$$ 18149429 17799013 17451889 17183673 16930799 16760081 16553297 16284974 16028639 15745179
3801A5745179j59464k79775l61178k28311j99426k05231q0714j74930j98946r2701
$$ 15745179 15585715 15305940 14944762 14716451 14517025 14311794 14231080 14056150 13857204 13764503
3791A3764503k53700k34901j84820j32067o1813j46396j96966k1081r1926k16538
$$ 13764503 13510803 13275902 13091082 12959015 12897202 12750806 12553840 12532759 12440833 12224295
3781A2224295j70168j19096j69117J3179o0307j33024p7725p1540m8889J5428
$$ 12224295 12054127 11935031 11765914 11779093 11718786 11585762 11508037 11436497 11387608 11403036
3771A1403036n4538q9029o5967n2702j0984q0087m6621l478M500j0738K5144L6993
$$ 11403036 11348498 11259469 11193502 11140800 11129816 11049729 11003108 10999630 11004130 10993392 11018536 11055529
3759A1055529P1001J22711j34188Q3876L0680Q4394j3227m6191R7797m9449n9349
$$ 11055529 11126530 11249241 11115053 11198929 11229609 11314003 11300776 11254585 11352382 11302933 11243584
3748A1243584M4495l885J1024j0585L7548R2455J04478m6933O2485J06346m1704
$$ 11243584 11288079 11284194 11295218 11284633 11322181 11414636 11519114 11472181 11534666 11641012 11599308
3737A1599308M6105P4729J08733J08449K03162n2252k0340K01062R9857n7514
$$ 11599308 11645413 11720142 11828875 11937324 12140486 12088234 12067894 12268956 12368813 12311299
3727A2311299Q9890N0697J07858J45692J56362J10769M9178N1842M4232J34349
$$ 12311299 12401189 12451886 12559744 12705436 12861798 12972567 13021745 13073587 13117819 13252168
3717A3252168L23930J17950J18176J14905J01472J24754R8048J24148J82354L4856
$$ 13252168 13576098 13694048 13812224 13927129 14028601 14153355 14251403 14375551 14557905 14592761
3707A4592761J84081K33113J30768J1610K17786K13210J62323J17536J66379J9915
$$ 14592761 14776842 15009955 15140723 15152333 15370119 15583329 15745652 15863188 16029567 16049482
3697A6049482J38365J98570J59379K07994J50855K12020K20829K77374K31195
$$ 16049482 16187847 16386417 16545796 16753790 16904645 17116665 17337494 17614868 17846063
3688A7846063L40672L14205J29987L26250L22725K70305L12818L53125L22413
$$ 17846063 18186735 18500940 18630927 18957177 19279902 19550207 19863025 20216150 20538563
3679B0538563L78676M43997L92093L50022M19457M55085M32918M20196L87010
$$ 20538563 20917239 21361236 21753329 22103351 22522808 22977893 23410811 23831007 24218017
3670B4218017N90050M60021N94687N71109M94213O07948O99068O36526O82331
$$ 24218017 24808067 25268088 25862775 26433884 26928097 27536045 28235113 28871639 29553970
3661B9553970P93863R18818R72241Q84201Q80102R91957J084537J130338J294789
$$ 29553970 30347833 31266651 32238892 33123093 34003195 34995152 36079689 37210027 38504816
3652C8504816J311529J246183J373126J334474J488635J427577J403753J386081
$$ 38504816 39816345 41062528 42435654 43770128 45258763 46686340 48090093 49476174
3644D9476174J144955J254134J305794J218104J305102J171118J160622J209258
$$ 49476174 50621129 51875263 53181057 54399161 55704263 56875381 58036003 59245261
3636E9245261J312139J099817J180977J142322R68454Q25570Q29347N71505L75427
$$ 59245261 60557400 61657217 62838194 63980516 64948970 65774540 66603887 67175392 67550819
3627F7550819M97833M07782M47099N28886M91539N61142O52355P70935P88486
$$ 67550819 68048652 68456434 68903533 69432419 69923958 70485100 71137455 71908390 72696876
3618G2696876P56974Q29539Q67934R37993R30257R74195J016049J163682J409712
$$ 72696876 73453850 74283389 75151323 76089316 77019573 77993768 79009817 80173499 81583211
3609H1583211J442032J694156J895188K004349K226945K543446K612561K778445
$$ 81583211 83025243 84719399 86614587 88618936 90845881 93389327 96001888 98780333
3601I8780333L046339L167972L529889L797709L933510M183397M633434M954846
$$ 98780333 101826672 104994644 108524533 112322242 116255752 120439149 125072583 130027429
3593A30027429M975965N139137N125855N197046N134755N051239M961230M877784
$$ 130027429 135003394 140142531 145268386 150465432 155600187 160651426 165612656 170490440
3585A70490440M960039M963557N066646N281447N284586N407263N524625N318403
$$ 170490440 175450479 180414036 185480682 190762129 196046715 201453978 206978603 212297006
3577B12297006N281755M941519M660314M153761L846108L399304L019032K665402
$$ 212297006 217578761 222520280 227180594 231334355 235180463 238579767 241598799 244264201
3569B44264201K366708K282017K079172K178980K331536K218245K393427K308632
$$ 244264201 246630909 248912926 250992098 253171078 255502614 257720859 260114286 262422918
3561B62422918K378114K326891K085592J963245J828401J522763J273839J111765
$$ 262422918 264801032 267127923 269213515 271176760 273005161 274527924 275801763 276913528
3553B76913528J247058J268400J487411J761328K205276K598046L051940L735522
$$ 276913528 278160586 279428986 280916397 282677725 284883001 287481047 290532987 294268509
3545B94268509M086149M688318N331623N790306O393017P231543Q299776R070573
$$ 294268509 298354658 303042976 308374599 314164905 320557922 327789465 336089241 345159814
3537C45159814J0144263J1011951J1624090J1922382J1404526J0273423Q657125
$$ 345159814 355304077 366316028 377940118 389862500 401267026 411540449 420197574
3530D20197574O041712L059822J75304k627538m638188n998739o383720o440781
$$ 420197574 426239286 429299108 429474412 426846874 422208686 416209947 409826227 403385446
3522D03385446n901866n381663n061950m899614n460601o637766q538064j0603029
$$ 403385446 397483580 392101917 387039967 382140353 376679752 370041986 361503922 350900893
3514C50900893j2861289j4827951j6056754j6740946j6438946j5585622j4087953
$$ 350900893 338039604 323211653 307154899 290413953 273975007 258389385 244301432
3507B44301432j2369421j0427575q900985p667308o560549o031497n826577n537930
$$ 244301432 231932011 221504436 212603451 204936143 198375594 192344097 186517520 180979590
3499A80979590n400929n209758n074725m711803m122863l666957l309877k928143
$$ 180979590 175578661 170368903 165294178 160582375 156459512 152792555 149482678 146554535
3491A46554535k543555k522912k691905k986648l402882l951670m407119m748754
$$ 146554535 144010980 141488068 138796163 135809515 132406633 128454963 124047844 119299090
3483A19299090n042356n178575n087887m955173m616591m090998l890004l467626
$$ 119299090 114256734 109078159 103990272 99035099 94418508 90327510 86437506 82969880
3475H2969880l253187l021489k714197k428622k364594k310383k232462k033729
$$ 82969880 79716693 76695204 73981007 71552385 69187791 66877408 64644946 62611217
3467F2611217k180734k086567k065140j991583j777144j866278j725523j566471
$$ 62611217 60430483 58343916 56278776 54287193 52510049 50643771 48918248 47351777
3459D7351777j488079j440562j244180j282335j150292j042373r28274r47487
$$ 47351777 45863698 44423136 43178956 41896621 40746329 39703956 38775682 37828195
3451C7828195r19975q26089o65281p88296r00342p84707q34706p61065o96184
$$ 37828195 36908220 36082131 35416850 34628554 33728212 32943505 32108799 31347734 30651550
3442C0651550o05367n50242o24930n01564n75826m66756m19452m03731m81739
$$ 30651550 30046183 29495941 28871011 28369447 27793621 27326865 26907413 26503682 26021943
3433B6021943n12267m80607m72891m04294l72795n04662l82061k59364k35939
$$ 26021943 25509676 25029069 24556178 24151884 23779089 23274427 22892366 22633002 22397063
3424B2397063l34728k28829l10382l28692l64001k93692j85326k39132j65480
$$ 22397063 22062335 21833506 21523124 21194432 20830431 20536739 20351413 20112281 19946801
3415A9946801j41879k46255k22625k05813j15448q5783k09016L7808j19046k4485
$$ 19946801 19804922 19558667 19336042 19130229 19014781 18928998 18719982 18757790 18638744 18614259
3405A8614259k5288m177L9629q6656J02734J65449m9283j0132o2346j27263k50954
$$ 18614259 18588971 18584794 18624423 18537767 18640501 18805950 18756667 18746535 18684189 18556926 18305972
3394A8305972k51677k38010k54464j46749l104j16507J7299k8879l4359M5942
$$ 18305972 18054295 17816285 17561821 17415072 17411968 17295461 17312760 17283881 17249522 17295464
3384A7295464j08752m9889Q3575J02642J61867J08588N2782J10902K33581j1654
$$ 17295464 17186712 17136823 17220398 17323040 17484907 17593495 17646277 17757179 17990760 17979106
3374A7979106J3107K57562K03041J08412K76847L01181J92356K24915K29653m4958
$$ 17979106 17992213 18249775 18452816 18561228 18838075 19139256 19331612 19556527 19786180 19741222
3364A9741222l15393m08373m92775l92635k95034k53220k18221j70801j69828
$$ 19741222 19425829 19017456 18524681 18132046 17837012 17583792 17365571 17194770 17024942
3355A7024942R815p0497j53848q5726L2743j4704J9993r8790j09743l7824K2204
$$ 17024942 17034757 16964260 16810412 16724686 16757429 16742725 16762718 16663928 16554185 16516361 16538565
3344A6538565m527N1789N5296L6547L3917N7120J24838K60243J60977Q5998l9590
$$ 16538565 16534038 16585827 16641123 16677670 16711587 16768707 16893545 17153788 17314765 17400763 17361173
3333A7361173q8535k19117l65761k80147l20686k15400o4877k64361k43237q6240
$$ 17361173 17272638 17053521 16687760 16407613 16086927 15871527 15806650 15542289 15299052 15212812
3323A5212812n3268j70234j20788L8497J4871J0782K8007O1085R6471m456J29639
$$ 15212812 15159544 14989310 14868522 14907019 14921890 14932672 14960679 15021764 15118235 15113779 15243418
3312A5243418J93952J13648J87706L49979K23817P689Q0313p1323r3720j57807
$$ 15243418 15437370 15551018 15738724 16088703 16312520 16320209 16400522 16329199 16235479 16077672
3302A6077672P9178J69325J30523K15468K96805L27733K63569K62168K98806J69627
$$ 16077672 16156850 16326175 16456698 16672166 16968971 17296704 17560273 17822441 18121247 18290874
3292A8290874J5104j19621j14481k37266k41738j19867q905K2716O2669J08575
$$ 18290874 18305978 18186357 18071876 17834610 17592872 17473005 17464100 17486816 17549485 17658060
3282A7658060J00211J75059J663l7348O7476J43520j8164Q1133N5372J55418K62897
$$ 17658060 17758271 17933330 17934993 17897645 17965121 18108641 18090477 18171610 18226982 18382400 18645297
3271A8645297K46720J76603R9745K54324M18070L22022L85562N19984L89991M42050
$$ 18645297 18892017 19068620 19168365 19422689 19840759 20162781 20548343 21068327 21458318 21900368
3261B1900368N45771N99153O89230R01467R30356O80292M20827J5875l83011j67033
$$ 21900368 22446139 23045292 23734522 24635989 25566345 26246637 26667464 26683339 26300328 26133295
3251B6133295j14554J70536L77677M19489N92289P02337R03637Q79305O13133
$$ 26133295 26018741 26189277 26566954 26986443 27578732 28281069 29184706 30064011 30677144
3242C0677144M13019m9248j14166L3884J89004L66891N96829O02678P32339J043790
$$ 30677144 31090163 31040915 30926749 30960633 31149637 31516528 32113357 32716035 33448374 34492164
3232C4492164J112246J093251J581544J764055J813619J736764J235791J145195
$$ 34492164 35604410 36697661 38279205 40043260 41856879 43593643 44829434 45974629
3224D5974629J148149J446107J538501J716251J873133J502971R54784J17685
$$ 45974629 47122778 48568885 50107386 51823637 53696770 55199741 56154525 56272210
3216E6272210j007564k154366k843899l080295k857145k758936k776407k514740
$$ 56272210 55264646 53110280 50266381 47186086 44328941 41570005 38793598 36278858
3208C6278858k416050j996035j614975j444763j261794j178125q54333q24787
$$ 36278858 33862808 31866773 30251798 28807035 27545241 26367116 25512783 24687996
3200B4687996p40516n62912o51343n68863m69558k94596m95558m20417l48942
$$ 24687996 23947480 23384568 22733225 22164362 21694804 21400208 20904650 20484233 20135291
3191B0135291m50753l33620k75747k01367k15191k4377N7877J18744k5416q7886
$$ 20135291 19684538 19350918 19075171 18873804 18658613 18634236 18692113 18810857 18785441 18697555
3181A8697555l6427j0812p3365j50427j54166k06443j47972r7966Q3125l079l2654
$$ 18697555 18661128 18650316 18576951 18426524 18272358 18065915 17917943 17819977 17903102 17900023 17867369
3170A7867369p6937l37527m14431k44536j62846J51115L3901L4830q7145j00552
$$ 17867369 17790432 17452905 17038474 16793938 16631092 16782207 16816108 16850938 16763793 16663241
3160A6663241J0690K0688J06837J98359L34070N23095N85478P93079J167795J252664
$$ 16663241 16673931 16694619 16801456 16999815 17333885 17856980 18442458 19235537 20403332 21655996
3150B1655996J128721L18104p82833j389558j356033j075480p39019m74490m50309
$$ 21655996 22784717 23102821 22319988 20930430 19574397 18498917 17759898 17285408 16835099
3141A6835099m96248l49824j51915j00971M8808o689k20310j85562m1402j2666
$$ 16835099 16338851 15989027 15837112 15736141 15784949 15778260 15557950 15372388 15330986 15318320
3131A5318320O4064J04159J08427J91187L02041M90700R10821R88124J090679
$$ 15318320 15382384 15486543 15594970 15786157 16088198 16578898 17489719 18477843 19568522
3122A9568522P86233j02363j169802j564802j490421j289645p99425o04907l30499
$$ 19568522 20354755 20252392 19082590 17517788 16027367 14737722 13938297 13333390 13002891
3113A3002891k62745Q501n5565m928k3339j65050k13240l39608j81131j34538
$$ 13002891 12740146 12748647 12693082 12688154 12664815 12499765 12286525 11946917 11765786 11631248
3103A1631248j30461j21079Q5579J57216K31035J99863J36377L08220K28745K16364
$$ 11631248 11500787 11379708 11465287 11622503 11853538 12053401 12189778 12497998 12726743 12943107
3093A2943107P1397k43705m08918k19053l38016n16101m88199l18353j93482k13586
$$ 12943107 13014504 12770799 12361881 12142828 11804812 11288711 10800512 10482159 10288677 10075091
3083A0075091k03210J9561J6492n4564j09113n7879n3299J36281O6540m3302J97676
$$ 10075091 9871881 9891442 9907934 9853370 9744257 9686378 9633079 9769360 9835900 9792598 9990274
3072I990274J00498K61985L44003L69522L28160L19806M15514N41129N06712P89155
$$ 9990274 10090772 10352757 10696760 11066282 11394442 11714248 12129762 12670891 13177603 13966758
3062A3966758O50789K71728j9565n22350o82961p06817m07239m09507n07122m22525
$$ 13966758 14617547 14889275 14869710 14347360 13664399 12957582 12550343 12140836 11633714 11211189
3052A1211189l58255k71653k48442j48566j12456k2940K05473J63205J81643K35231
$$ 11211189 10852934 10581281 10332839 10184273 10071817 10048877 10254350 10417555 10599198 10834429
3042A0834429J59820j3276j18366k87805k73059k1094O9924K6665J02843J31813
$$ 10834429 10994249 10980973 10862607 10574802 10301743 10280649 10350573 10377238 10480081 10611894
3032A0611894K68950K26164K55894J51968q5122k23444k61260l03514r9882k24316
$$ 10611894 10880844 11107008 11362902 11514870 11429748 11206304 10945044 10641530 10541648 10317332
3022A0317332j09983k23950l15027j30184k07470l4029M6556L569O5071n1577
$$ 10317332 10207349 9983399 9668372 9538188 9330718 9296689 9343245 9346814 9411885 9360308
3012I360308m4235j91105k53233l67640k44604j76271j06258p4042L4003J58493
$$ 9360308 9316073 9124968 8871735 8504095 8259491 8083220 7976962 7902920 7936923 8095416
3002H095416L4261O1678j14335m8469l17023r8877j21305k52768k19532n078J10263
$$ 8095416 8129677 8191355 8077020 8028551 7711528 7612651 7491346 7238578 7019046 7013968 7124231
2991G124231M0575q005P2632k02100M558k14484r9005N8134m7349l4944o7611
$$ 7124231 7164806 7156801 7229433 7027333 7031891 6817407 6718402 6776536 6729187 6694243 6626632
2980F626632l8699O9480n0280L3170n106J3766j51543M1442J17418N239q3438
$$ 6626632 6587933 6657413 6607133 6640303 6635197 6648963 6497420 6538862 6656280 6661519 6578081
2969F578081n173k0194p074j9159j15069p3049j9187q1980K4714p5479r527J13706
$$ 6578081 6572908 6552714 6545640 6526481 6411412 6338363 6319176 6237196 6261910 6186431 6176904 6290610
2957F290610J49814K03625P8441R0216j14017R6601J31870J85760J44203J16665
$$ 6290610 6440424 6644049 6722490 6812706 6698689 6795290 6927160 7112920 7257123 7373788
2947G373788P4695M379j38066p6823k44498j0773j80478n5294n2761j81544n8716
$$ 7373788 7448483 7452862 7314796 7237973 6993475 6982702 6802224 6746930 6694169 6512625 6453909
2936F453909R0786p2140n3285j26989j47845j47351N5836L8781J02123N6070J57870
$$ 6453909 6544695 6472555 6419270 6292281 6144436 5997085 6052921 6091702 6193825 6249895 6407765
2925F407765J35175j5265M4803K8626K3961j120P3474M0282N8677J05513J68784
$$ 6407765 6542940 6527675 6572478 6601104 6625065 6623945 6697419 6737701 6796378 6901891 7070675
2914G070675J32893J59537P8897J6804k7070j8425j58983l3246O1914J99994o496
$$ 7070675 7203568 7363105 7442002 7458806 7431736 7413311 7254328 7221082 7282996 7482990 7476494
2903G476494j9168N0385k6159r20n5915L1871j30829j55956J4095N9836M0366
$$ 7476494 7457326 7507711 7481552 7480632 7424717 7456588 7325759 7169803 7183898 7243734 7284100
2892G284100N8806O5559l3065o6488L2384J75350j5561M1528J73933P0806J46346
$$ 7284100 7342906 7408465 7375400 7308912 7341296 7516646 7501085 7542613 7716546 7787352 7933698
2881G933698N7864J33468J35136P0346J37457K18336J18540O8394J28815o2688
$$ 7933698 7991562 8125030 8260166 8330512 8467969 8686305 8804845 8873239 9002054 8939366
2871H939366j59440k91367k72960j67543j84348j54412j16684k21489J2858M5819
$$ 8939366 8779926 8488559 8215599 8048056 7863708 7709296 7592612 7371123 7383981 7429800
2861G429800k5970k750q5680l7296P8878O0902q0745k1631R5320O4591J6160M285
$$ 7429800 7403830 7401080 7315400 7278104 7356982 7417884 7337139 7315508 7410828 7475419 7491579 7495864
2849G495864k0538q1101J6175q5340j35216q4572j4185q4428j84214j39887j52761
$$ 7495864 7475326 7394225 7410400 7325060 7189844 7105272 7091087 7006659 6822445 6682558 6529797
2838F529797j27140q5217n6947r0625o8696m7282k1316n2331j36864j09803M5085
$$ 6529797 6402657 6317440 6260493 6169868 6101172 6053890 6032574 5980243 5843379 5733576 5778661
2827E778661j59204j93430j43577j13437j18131j33850j46863k33700k7361j54869
$$ 5778661 5619457 5426027 5282450 5169013 5050882 4917032 4770169 4536469 4509108 4354239
2817D354239r4541k1835j04006r2487j13784j24255j42062o5815M8632j21675
$$ 4354239 4259698 4237863 4133857 4041370 3927586 3803331 3661269 3595454 3644086 3522411
2807C522411j36740l6609l7811l6752n7871J8454o3478r0042o772N1399m8202
$$ 3522411 3385671 3349062 3311251 3274499 3216628 3235082 3171604 3081562 3074790 3126189 3077987
2796C077987m5466j03760k7404k5894n0141r0276J4462j3398j47726o1879O8221
$$ 3077987 3032521 2928761 2901357 2875463 2825322 2735046 2749508 2736110 2588384 2526505 2594726
2785B594726l5096o6660R65M5984n1944k4374q0407m2099Q4349J1767j19075j4201
$$ 2594726 2559630 2492970 2493935 2539919 2487975 2463601 2383194 2341095 2425444 2437211 2318136 2303935
2773B303935R797L979l5740r5818O5234r0673j1943J2650p4687q1529k2557O9202
$$ 2303935 2313732 2317711 2281971 2186153 2251387 2160714 2148771 2161421 2086734 2005205 1982648 2051850
2761B051850n44O8146J67599n5200l9633j0609P2139r3770J40434p5988p132Q2345
$$ 2051850 2051306 2119452 2287051 2231851 2192218 2181609 2253748 2159978 2300412 2224424 2217292 2299637
2749B299637j45819q85k9756j02163p8888R2360j9914j69902P1806J05206l1782
$$ 2299637 2153818 2152933 2123177 2021014 1942126 2034486 2014572 1844670 1916476 2021682 1989900
2738A989900j00720j41015P8211j40652m2912O9279k9367J3070N8468K1053L1625
$$ 1989900 1889180 1748165 1826376 1685724 1642812 1712091 1682724 1695794 1754262 1775315 1806940
2727A806940p8969J1630Q7862j9504O5982J15192q1036L0431P8466K8916P8571
$$ 1806940 1727971 1739601 1827463 1807959 1873941 1989133 1908097 1938528 2016994 2045910 2124481
2716B124481L3551q8982m6100j12516p265j24914j49352m0521p8141R689j18242
$$ 2124481 2158032 2069050 2022950 1910434 1903169 1778255 1628903 1588382 1510241 1519930 1401688
2705A401688k5446j00362N2953m3431O4182N9814j45791j13944O9595J5332N2577
$$ 1401688 1376242 1275880 1328833 1285402 1349584 1409398 1263607 1149663 1219258 1234590 1287167
2694A287167j08971K8371n8501j01362J72621m5614l3642P1857J15656L2093J737
$$ 1287167 1178196 1206567 1148066 1046704 1219325 1173711 1140069 1211926 1327582 1359675 1361412
2683A361412m9496j5660l2646l5609n7399k7200o5788j10308J3532q0759n7399
$$ 1361412 1311916 1296256 1263610 1228001 1170602 1143402 1077614 967306 980838 900079 842680
2672H42680k2985R5577O1736j34583r6728J6304k8344r205K2974R460m0o3180
$$ 842680 819695 915272 977008 842425 745697 762001 733657 724452 747426 756886 756846 693666
2660F93666l6673J5560M9891l4465J379p261N2527o6047o4250N5784N8940J9950
$$ 693666 656993 672553 722444 687979 689358 682097 734624 668577 604327 660111 719051 739001
2648G39001M8499k0435o790p6443o079L0162q4171K3835N239m826L8047o8455
$$ 739001 787500 767065 760275 683832 677753 707915 623744 647579 652818 647992 686039 617584
2636F17584P7263J1579k7714N7398r7601Q1460Q2456l7635k9232N4008L0373k9951
$$ 617584 694847 706426 678712 736110 638509 719969 802425 764790 735558 789566 819939 789988
2624G89988M75L0162N9317o5060n2975l7328o877P3651P4536m6127P0110j9455
$$ 789988 790463 820625 879942 814882 761907 724579 717702 791353 865889 819762 889872 870417
2612H70417O8575n844L5909J31041p3743n0226N4402n5143l1241M0300j46025
$$ 870417 938992 933148 969057 1100098 1026355 976129 1030531 975388 944147 984447 838422
2601H38422K7250J4161p5056N214P0820m438Q7869l235L0838J7454P2121J9649
$$ 838422 865672 879833 804777 809991 880811 876373 964242 961007 991845 1009299 1081420 1101069
2589A101069n1971j2407o8715o831q019R8695r55L0461J9221L9305L6294n4745
$$ 1101069 1049098 1036691 967976 961145 953126 1051821 1050866 1081327 1100548 1139853 1176147 1121402
2577A121402N4345M3102m6771p5523O6153l4880L9875R4874j43389m8580L9700
$$ 1121402 1175747 1218849 1172078 1096555 1162708 1127828 1167703 1262577 1119188 1070608 1110308
2566A110308r058K6948m6753k1445o9152K6083P6517j23658r63j39314J7752N6691
$$ 1110308 1101250 1128198 1081445 1060000 990848 1016931 1093448 969790 968827 829513 847265 903956
2554I03956k1681o9768Q0477M3353j10405J61821Q9485j45738j44053N9907Q1793
$$ 903956 882275 812507 892984 936337 825932 987753 1077238 931500 787447 847354 929147
2543I29147R163q2484j737k8612N2515R6163M8470N9815j3769k43652r9383O8815
$$ 929147 938310 855826 854089 825477 877992 974155 1022625 1082440 1068671 825019 725636 794451
2531G94451o6033j01486N8276j00202p8600k8484o3660L242N1090J11139j26918
$$ 794451 728418 626932 685208 585006 506406 477922 414262 417504 468594 579733 452815
2520D52815Q5112M4263k2189n4773o0062N814K3196M1752j07539M2654k9205K7380
$$ 452815 537927 582190 560001 505228 445166 450980 474176 515928 408389 451043 421838 449218
2508D49218n2695m9788P7694R1403j05095M0940m5497p8567P8262L7097r4367
$$ 449218 396523 346735 424429 515832 410737 451677 406180 327613 405875 442972 348605
2497C48605o6949N1513l2468n1464J4899J4991k1027L206l2010O6555O016n9365
$$ 348605 281656 333169 300701 249237 264136 279127 258100 261306 229296 295851 301867 242502
2485B42502j12601m5184O710O3718P4755L7411l5716L0604l4024J0538q3668q2841
$$ 242502 129901 84717 91427 155145 229900 267311 231595 262199 228175 238713 155045 72204
2473G2204P9074K3965M4459r626m2672k3864m9546m0186J00830J3572M8259l904
$$ 72204 151278 175243 219702 210076 167404 143540 93994 53808 154638 168210 216469 212565
2461B12565m6793l3147l050j4915o2254J7474j0192N3938m9913P1731p3556R5154
$$ 212565 165772 132625 129575 114660 52406 69880 59688 113626 63713 135444 61888 157042
2449A57042j8224j41480L5667l1397K6719P8677o1804K5167J16349p8394n6943
$$ 157042 138818 -2662 33005 1608 28327 107004 45200 70367 186716 108322 51379
2438E1379J05439l1542O2342k1167l4541j0743m0397j3530M1451q115j00199l7600
$$ 51379 156818 125276 187618 166451 131910 121167 80770 67240 108691 100576 377 -37223
2426c7223Q8906J101q1556R2056n864O069k4435Q964N390o0425o631R0586P5678
$$ -37223 51683 52784 -28772 63284 57420 63489 39054 48018 53408 -7017 -13648 76938 152616
2413A52616k7820j33874K6753P9654k4136J6679j15644N007R3394p9571L6781
$$ 152616 124796 -9078 17675 97329 73193 89872 -25772 -20765 72629 -6942 29839
2402B9839N5131N3180l6992l3633o5824R902l999p2712K0315Q4228q5218n7580
$$ 29839 84970 138150 101158 67525 1701 11603 7604 -65108 -44793 39435 -45783 -103363
2390a03363O8865j0221L8899J7264k722M1197k0709M69m5940Q9973j6950j57636
$$ -103363 -34498 -44719 -5820 11444 8722 49919 29210 29679 -16261 73712 56762 -100874
2378a00874J791J05468L5153M500l127j1370j1025j0598q5345m8969N5624K0632
$$ -100874 -99083 6385 41538 46038 42911 31541 20516 9918 -75427 -124396 -68772 -48140
2366d8140O3742m4087m7841O7043J2094N7343j772r0718J8087M7770l7859o1189
$$ -48140 15602 -28485 -76326 -9283 2811 60154 58382 -32336 -14249 33521 -4338 -65527
2354f5527J1251J7264K6139o36J9160K8977Q373M8800m1533k0006P7034N6695
$$ -65527 -54276 -37012 -10873 -11509 7651 36628 45001 93801 52268 32262 109296 165991
2342A65991J4178p2817o363o0546q0867N9629m3959j4427N6243q3051M6549J19840
$$ 165991 180169 107352 100989 40443 -40424 19205 -24754 -39181 17062 -65989 -19440 100400
2330A00400p3694j04022J59558o1613P636P0465r2179n093j8554n6357J0870n4748
$$ 100400 26706 -77316 82242 20629 28265 98730 6551 1458 -17096 -73453 -62583 -117331
2318a17331J52737K1691m5607L8893j03792J24172n6089N8681L0697o254m4071
$$ -117331 35406 57097 11490 50383 -53409 70763 14674 73355 104052 97798 53727
2307E3727n1092R0391m0012J4124n9536m143L4775l5424n356p5552j8861J31829
$$ 53727 2635 93026 53014 67138 7602 3459 38234 2810 -2546 -78098 -96959 34870
2295C4870j1336l4890n2164j4080Q13k7623R4873j8560K3484m1054Q0143l3193
$$ 34870 23534 -11356 -63520 -77600 -76787 -104410 -9537 -28097 -4613 -45667 34476 1283
2283A283r4459K0279j5029Q0583K928l4663Q8826j31446L8548M3519L5498M81
$$ 1283 -93176 -72897 -87926 -7343 -4415 -39078 49748 -81698 -43150 369 35867 36348
2271C6348j06481L4435j31650J26597O8664J3915p2379L7578k8942l0294J2879
$$ 36348 -70133 -35698 -167348 -40751 27913 41828 -30551 7027 -21915 -52209 -39330
2260c9330k6016J1705Q7092j12676l8291J14938Q2798J5609p2262J21774k3816
$$ -39330 -65346 -53641 33451 -79225 -117516 -2578 80220 95829 23567 145341 121525
2249A21525j4784j0132j13896Q257o272p9134P9115O357o5601n61Q1033l3924
$$ 121525 106741 96609 -17287 -9030 -15302 -94436 -15321 -8964 -74565 -75126 5907 -28017
2237b8017l2915N0080O2762l392p0236P626q5161R7493N1431q3206J17761j16308
$$ -28017 -60932 -10852 51910 48518 -21718 -14092 -99253 -1760 49671 -33535 84226 -32082
2225c2082J05401n5443L3673O6473P584j16387j0958N2950j6888J18006k9435
$$ -32082 73319 17876 51549 118022 125606 9219 -1739 51211 34323 152329 122894
2214A22894n3567p5827j7686J1244L9906N3889n873n4426M4599N3439J6974j28475
$$ 122894 69327 -6500 -24186 -12942 26964 80853 74980 20554 65153 118592 135566 7091
2202G091j8721l8323J13534J1781p1742N0764o8964l0351J74722n774J6436n0230
$$ 7091 -11630 -49953 63581 75362 3620 54384 -14580 -44931 129791 124017 140453 90223
2190I0223L8610J8279m0019K7152r5545N4819M6169L012M4676k7551O699L7377
$$ 90223 128833 147112 107093 134245 38700 93519 139688 142700 187376 159825 166524 203901
2178B03901p260R644m1749k3208L1850k8314R8865N3366p4012N155M9608K3539
$$ 203901 196641 206285 164536 141328 173178 144864 243729 297095 223083 228238 277846 301385
2166C01385j4296O6891M6607m2622L7325K5252m3300Q544o6627P299K9424N3361
$$ 301385 287089 353980 400587 357965 395290 420542 377242 385786 319159 326458 355882 409243
2154D09243L4345Q516j7653l1501L9542O5036P1589O7242l3110k1331m432k8387
$$ 409243 443588 452104 434451 402950 442492 507528 579117 646359 613249 591918 587486 559099
2142E59099M4717M7386p1930P8850M0188k3030n9441M088J20246k877p2099J29496
$$ 559099 603816 651202 579272 658122 698310 675280 615839 619927 740173 737296 665197 794693
2130G94693o087p135N2792Q7070k1291J0838M3921J0642K7406M6075J01758J34326
$$ 794693 788606 781471 834263 921333 900042 910880 954801 965443 992849 1038924 1140682 1275008
2118A275008P1312J1433P9533j12347J90922R2402K9152J95108J08489N6312J74520
$$ 1275008 1346320 1357753 1437286 1324939 1515861 1608263 1637415 1832523 1941012 1997324 2171844
2107B171844Q7662J7426O6802R3081m0940Q2371P7275J48893K27872K10625J90810
$$ 2171844 2259506 2276932 2343734 2436815 2395875 2478246 2555521 2704414 2932286 3142911 3333721
2096C333721J92240K64532L35275M35862M48407L20093J93090L34334M11432L78253
$$ 3333721 3525961 3790493 4125768 4561630 5010037 5330130 5523220 5857554 6268986 6647239
2086F647239P20016R73685J140275J423986J544920J885777K613330L306558L923390
$$ 6647239 7367255 8340940 9481215 10905201 12450121 14335898 16949228 20255786 24179176
2077B4179176L041761j08182l551709m583073l978227l040460k074419j664535
$$ 24179176 27220937 27112755 23561046 18977973 14999746 11959286 9884867 8220332
2069H220332j108416r06352o52645m74842m55093m07036l60171k72737k45169
$$ 8220332 7111916 6205564 5552919 5078077 4622984 4215948 3855777 3583040 3337871
2060C337871l07159k24029k80032k06497j81381j78382j28786n7331r0892k00458
$$ 3337871 3030712 2806683 2526651 2320154 2138773 1960391 1831605 1774274 1683382 1482924
2050A482924j34990j64100m5615n2731j21432J6903j02139J3971P2691k8257j02355
$$ 1482924 1347934 1183834 1138219 1085488 964056 980959 878820 892791 965482 937225 834870
2039H34870l4780j17057k7627R3826N697j74845l5963o873p3961J18169m3528
$$ 834870 800090 683033 655406 749232 754929 580084 544121 537248 463287 581456 537928
2028E37928m8442j4696L797L9004J7126j4650o4591j2160O3701j05751j01337
$$ 537928 489486 474790 478587 517591 534717 520067 455476 443316 507017 401266 299929
2017B99929K5241O4635o5929J57371p3660r6813l3471l2413m5664o411k420K6227
$$ 299929 325170 389805 323876 481247 407587 310774 277303 244890 199226 192815 190395 216622
2005B16622O4096l2792k359p1886N4689j36492n6718M465L8899N3616J68094m3819
$$ 216622 280718 247926 245567 173681 228370 91878 35160 39625 78524 132140 300234 256415
1993B56415j24933q7888K2762q933k8849J6024j5480j5834J2097J50002j28509
$$ 256415 131482 43594 66356 57423 28574 44598 29118 13284 25381 175383 46874
1982D6874q9136j0604J00422m445m0930r871J07611M9735R171l3122r1250M0257
$$ 46874 -42262 -52866 47556 43111 2181 -7690 99921 149656 158827 125705 34455 74712
1970G4712k5298O3894q3262J3495N7125k2666M162N662k9960q3697n6234L297
$$ 74712 49414 113308 30046 43541 100666 78000 82162 87824 57864 -25833 -82067 -78770
1958g8770J47094P0133M043j49376o0258J5059p611J2720o4657l2546Q5499K5126
$$ -78770 68324 138457 142500 -6876 -67134 -52075 -59686 -46966 -111623 -144169 -58670 -33544
1946c3544k4209j2470n6098O5453q0958l4272j8226M0378J15870m8562J21651
$$ -33544 -57753 -70223 -126321 -60868 -141826 -176098 -194324 -153946 -38076 -86638 35013
1935C5013o8498j33795J19077n2928N2325n274L5388j1953k6993p3439K4333Q5502
$$ 35013 -33485 -167280 -48203 -101131 -48806 -54080 -18692 -30645 -57638 -131077 -106744 -21242
1923b1242l103N1284r956p6133j03794J07167n8299N7583k491M7394L7988n7763
$$ -21242 -24345 26939 16983 -59150 -162944 -55777 -114076 -56493 -58984 -11590 26398 -31365
1911c1365o5588k4624j7958j6496Q2653K0968Q5629j62242j04280J25899l3155
$$ -31365 -96953 -121577 -139535 -156031 -73378 -52410 33219 -129023 -233303 -107404 -140559
1900a40559N0486J3271j8361k6478n2516M9253P1674k2549m290J9505R986q2499
$$ -140559 -90073 -76802 -95163 -121641 -174157 -124904 -53230 -75779 -80069 -60564 -50578 -133077
1888a33077J4200O5653M0084j813p6514m5044L4188q0694Q5284J3837j0521J03002
$$ -133077 -118877 -53224 -13140 -14953 -91467 -136511 -102323 -183017 -97733 -83896 -94417 8585
1876H585K7131q0479k4388m9720r7928K4305J54374q546j27981M2624M6453P3868
$$ 8585 35716 -44763 -69151 -118871 -216799 -192494 -38120 -46666 -174647 -132023 -85570 -11702
1864a1702M3832m6903r6853J39612n7298k1819o1531K1709J28814k6044j28262
$$ -11702 32130 -14773 -111626 27986 -29312 -51131 -112662 -90953 37861 11817 -116445
1853a16445p732j8428L6034Q708N4548m1648l1111n740N5039N7139p6203o6217
$$ -116445 -124177 -142605 -106571 -97863 -43315 -84963 -116074 -121814 -66775 -9636 -85839 -152056
1841a52056o6992P4708P0965o6090K7136J32645j05252p1154N9578j0178l6584
$$ -152056 -219048 -144340 -73375 -139465 -112329 20316 -84936 -156090 -96512 -106690 -143274
1830a43274O0456J48061q1864M794n5835n1326K4956m4573Q9237l0910K155M4437
$$ -143274 -82818 65243 -16621 -11827 -67662 -118988 -94032 -138605 -49368 -80278 -78123 -33686
1818c3686o9804p6961n621J33564J02688r9791Q558l4877K8305M2434N6848J0205
$$ -33686 -103490 -180451 -186072 -52508 50180 -49611 -41053 -75930 -47625 -5191 51657 61862
1806F1862n415j980O4139p2213j46730m0729N3070J46456j46862j7660j2980r40
$$ 61862 56447 54467 118606 46393 -100337 -141066 -87996 58460 -88402 -106062 -119042 -119982
1794a19982M0425N8270q6910j4326M3243j2388l4331K4996n0265R7587J3757o0416
$$ -119982 -79557 -21287 -108197 -122523 -79280 -91668 -125999 -101003 -151268 -53681 -39924 -100340
1782a00340N5920Q7031J3946o6700l050J01846l9098j73798k762l8373J046n2520
$$ -100340 -44420 42611 56557 -10143 -13193 88653 49555 -124243 -127005 -165378 -164332 -216852
1770b16852K5101Q2376o225K866J03161m2147l7531j18090J01240n5709J3009
$$ -216852 -191751 -109375 -115600 -112734 -9573 -51720 -89251 -207341 -106101 -161810 -148801
1759a48801n7802n020M1361J1707O9501o654N9997k1198O8597n9081p2875O3191
$$ -148801 -206603 -211623 -170262 -158555 -89054 -95708 -35711 -56909 11688 -47393 -120268 -57077
1747e7077q0478K1771M9541j604K9062O7767k5290j12450O3240j05837J9457J1315
$$ -57077 -137555 -115784 -66243 -67847 -38785 28982 3692 -108758 -45518 -151355 -131898 -120583
1735a20583p5846R0758l928j2547j2223J22124k9746q3510L8370k6230P327J03507
$$ -120583 -196429 -105671 -109599 -122146 -134369 -12245 -41991 -125501 -87131 -113361 -106034 -2527
1723b527j3614p2361M6914l187j07251J32250p833k4626J14800j39428l1627J10533
$$ -2527 -16141 -88502 -41588 -44775 -152026 -19776 -27609 -52235 62565 -76863 -108490 2043
1711B043l0348o4174q6479J5523N0209m5352R2762o1475r9860L7380M664P5602
$$ 2043 -28305 -92479 -178958 -163435 -113226 -158578 -65816 -127291 -227151 -189771 -185107 -109505
1699a09505K4900M2584m2335p071R8222o8657n8934K8175L5065j08199J17209
$$ -109505 -84605 -42021 -84356 -91427 6795 -61862 -120796 -92621 -57556 -165755 -48546
1688d8546N0318l2765J32131j14849o7911o8196j07303O1300M7281L475O6936
$$ -48546 1772 -30993 101138 -13711 -81622 -149818 -257121 -195821 -148540 -145065 -78129
1677g8129K9094n0584l380O3824m614o9527J48227j8848J2354J1084q7432O733
$$ -78129 -49035 -99619 -102999 -39175 -43789 -113316 34911 16063 28417 39501 -47931 -41198
1665d1198o0002o3232N7556k6129J66507O2544o5472j16833m3918J7162O7878
$$ -41198 -101200 -164432 -106876 -133005 33502 96046 30574 -86259 -130177 -113015 -45137
1654d5137O76m7813j5804l6701r568R0648J5942j30866M5972O7418p984q2845
$$ -45137 -44461 -92274 -108078 -144779 -154347 -63699 -47757 -178623 -132651 -65233 -73217 -156062
1642a56062k7664R1917j21575R9828O0346j03126K1004p602K9826J5888M1966
$$ -156062 -183726 -91809 -213384 -113556 -53210 -156336 -135332 -142934 -113108 -97220 -55254
1631e5254n0697m867O6587o1545j3054J4584L507R7176k6774j17414l5170J7082
$$ -55254 -105951 -110818 -44231 -105776 -118830 -104246 -100739 -3563 -30337 -147751 -182921 -165839
1619a65839O431J29736j45509k7882N0141K7376j1933K6099l9002N9821n0767
$$ -165839 -159408 -29672 -175181 -203063 -152922 -125546 -137479 -111380 -150382 -90561 -141328
1608a41328p4130N2704L906l7982p4170n68Q5817N6744Q187O2024l4873j08022
$$ -141328 -215458 -162754 -158848 -196830 -271000 -271568 -185751 -129007 -120820 -58796 -93669 -201691
1596b01691K2208Q5423k4453J1094O3232O9256k6275l6084R563J1949p7507o4668
$$ -201691 -179483 -94060 -118513 -107419 -44187 25069 -1206 -37290 -27727 -15778 -93285 -157953
1584a57953J7651l420N2294o3455q3256K0083K581M7022j8756P2629L9184K2915
$$ -157953 -140302 -143722 -91428 -154883 -238139 -218056 -215475 -168453 -187209 -114580 -75396 -52481
1572e2481J1609p077j20090K8131Q231J04908K9791j21257L1576K3598m1623M5475
$$ -52481 -40872 -47949 -168039 -139908 -131677 -26769 3022 -118235 -86659 -63061 -104684 -59209
1560e9209m5613o6581J26013M0178N3908p0522k0380N583N804r6149m1256K2480
$$ -59209 -104822 -171403 -45390 -5212 48696 -21826 -42206 -36623 -30819 -126968 -168224 -145744
1548a45744m5878k3257P0340J5082J2812P4529j57865m0827M3811K0880Q3192
$$ -145744 -191622 -214879 -144539 -129457 -116645 -42116 -199981 -240808 -196997 -176117 -92925
1537i2925L7336q6845m4437j6831J7916l7777j3104K4299P2577N7909K617O6827
$$ -92925 -55589 -142434 -186871 -203702 -185786 -223563 -236667 -212368 -139791 -81882 -79265 -12438
1525a2438n7580L451J2001j04335O2125k19o7303J31829K4647P913n1556O8280
$$ -12438 -70018 -66567 -54566 -158901 -96776 -96995 -164298 -32469 -7822 91 -51465 16815
1513A6815q8471j42696M6980N4978M2875J04808P3069j43202r0212J2436j0505
$$ 16815 -71656 -214352 -167372 -112394 -69519 35289 108358 -34844 -125056 -112620 -123125
1502a23125P629o119J13145j5129l4207K2621m3544K7710k2861p7132L7314J2095
$$ -123125 -115496 -121615 -8470 -23599 -57806 -35185 -78729 -51019 -73880 -151012 -113698 -101603
1490a01603l0902O7864K2447k9633L1112n7939l7150N688P6805L1297O149l289
$$ -101603 -132505 -64641 -42194 -71827 -40715 -98654 -135804 -130116 -53311 -22014 -15865 -19154
1478a9154p8553M6032J6769L7048o5997j48174J4071J1504J7314Q0733J1725l3995
$$ -19154 -97707 -51675 -34906 2142 -63855 -212029 -197958 -186454 -169140 -88407 -76682 -110677
1466a10677O5872l2781q3035P2821n407O4063M0262m8981m0006m3812J6689K5609
$$ -110677 -44805 -77586 -160621 -87800 -93207 -29144 11118 -37863 -77869 -121681 -104992 -79383
1454g9383O5525k7719M4239n318j05588J1378Q4509n2106k6913M5655j11123n7906
$$ -79383 -13858 -41577 2662 -2656 -108244 -96866 -12357 -64463 -91376 -45721 -156844 -214750
1442b14750j3899K8260J18855l5983J533J6723j1142Q0988M5351j2835j63878
$$ -214750 -228649 -200389 -81534 -117517 -115984 -99261 -110403 -29415 15936 3101 -160777
1431a60777N6525n6685p0787R6194J25406n7215m5619L5627M1297m7396N7084
$$ -160777 -104252 -160937 -231724 -135530 -10124 -67339 -112958 -77331 -36034 -83430 -26346
1420b6346m2310o7746M3491J16815o4836m293k2139M3358Q7221j4383j08484Q349
$$ -26346 -68656 -136402 -92911 23904 -40932 -45225 -67364 -24006 63215 48832 -59652 -51303
1408e1303N4603o4938j2555N2564o9835K1948R1691R6590m7593r1535J5880j42934
$$ -51303 3300 -61638 -74193 -21629 -91464 -69516 22175 118765 71172 -20363 -4483 -147417
1396a47417N1147j3506O5718j527k8301j507P6750n821k3157K9227m0647N0866
$$ -147417 -96270 -109776 -44058 -45585 -73886 -75393 1357 -4464 -27621 1606 -39041 11825
1384A1825j7904n2978J9995j25861N8521L4826M4242n7686Q5317q9041L9282N1986
$$ 11825 -6079 -59057 -39062 -164923 -106402 -71576 -27334 -85020 297 -88744 -49462 2524
1372B524P8735k2956j16957o637N57R7067l9038M8402j26609J04423K5177j77426
$$ 2524 81259 58303 -58654 -65291 -64734 32333 -6705 41697 -84912 19511 44688 -132738
1360a32738R548L6647R0632O79k5347N9135M4578q0328l2771l3657m6237J63819
$$ -132738 -123190 -86543 4089 4768 -20579 38556 83134 2806 -29965 -63622 -109859 53960
1348E3960p8318p5132k4462j8401O00M7884J2740r5467J08260P6560N6069m7073
$$ 53960 -24358 -99490 -123952 -142353 -141753 -93869 -81129 -176596 -68336 8224 64293 17220
1336A7220r6766N1843k1897q2656k8517M4150k8620j3215K9715J15203j0889n6580
$$ 17220 -79546 -27703 -49600 -132256 -160773 -116623 -145243 -158458 -128743 -13540 -24429 -81009
1324h1009l9697P3881K7628q9517K3238P3399K6295n7698m5279k8528l5584J26802
$$ -81009 -120706 -46825 -19197 -108714 -85476 -12077 14218 -43480 -88759 -117287 -152871 -26069
1312b6069J02152j09279M3412j229n4512q8889J7523J78795K2912j54218k1622
$$ -26069 76083 -33196 10216 8987 -45525 -134414 -116891 61904 84816 -69402 -91024
1301i1024k8219o016J4853Q4024Q830j8283J6404L3794r8942J8679n2527L6631
$$ -91024 -119243 -125259 -110406 -26382 -17552 -35835 -19431 14363 -84579 -65900 -118427 -81796
1289h1796L1610j14840L1522Q5281o573p1672Q1574n8131q163N831J5715o9143
$$ -81796 -50186 -165026 -133504 -48223 -54796 -126468 -44894 -103025 -111188 -105357 -89642 -158785
1277a58785m8722K6052P7790N0100n337m1240O4216J0557j8055m8510r382K1355
$$ -158785 -207507 -181455 -103665 -53565 -58902 -100142 -35926 -25369 -43424 -91934 -101316 -79961
1265g9961L7645n7007J08757L7540j36284j2753M0081J7510M4386J38139n9170
$$ -79961 -42316 -99323 9434 46974 -89310 -102063 -61982 -44472 -86 138053 78883
1254G8883P038m2439p5600j22176R303J19682p2095o2516K1819N1113j2698L9216
$$ 78883 85921 43482 -32118 -154294 -144991 -25309 -97404 -159920 -138101 -86988 -99686 -60470
1242f0470l5933k2876k1554N0291M4386r4651Q2949P1020k2219o989l9619K3323
$$ -60470 -96403 -119279 -140833 -90542 -46156 -140807 -57858 13162 -9057 -16046 -55665 -32342
1230c2342Q0315j11195j9168M0738k561N3564o5311j4427R693N5292P6026l5470
$$ -32342 47973 -63222 -82390 -41652 -44213 9351 -55960 -70387 -60694 -5402 70624 35154
1218C5154j00139k3402l7660n1255Q1349O3080m5670N263K5223m8687r0222N7571
$$ 35154 -64985 -88387 -126047 -177302 -95953 -32873 -78543 -73280 -48057 -96744 -186966 -129395
1206a29395Q2101j5169l7765J6561L5860P9043J30715l9592j00217m5019j031
$$ -129395 -47294 -62463 -100228 -83667 -47807 31236 161951 122359 22142 -22877 -23908
1195b3908K1739P4575o4581n1002N1815J15544n1669n3822p1403r0153J98360
$$ -23908 -2169 72406 7825 -43177 8638 124182 72513 18691 -52712 -142865 55495
1184E5495m7419q9056N0221P1133l6934p5871L9786M4277P7619j05370r060N9570
$$ 55495 8076 -80980 -30759 40374 3440 -72431 -32645 11632 89251 -16119 -25179 34391
1172C4391m6134O0628l0975K82j11334p6805O8964j8833L0392L114m3789O4504
$$ 34391 -11743 48885 17910 18192 -93142 -169947 -100983 -119816 -89424 -86310 -130099 -65595
1160f5595J13509j28112m0257M5408Q516P2809n6049l7842M8288R7230m4865j09010
$$ -65595 47914 -80198 -120455 -75047 -66531 6278 -49771 -87613 -39325 57905 13040 -95970
1148i5970j0252j8942K2540j328k2870L7728k7103J9917L7904k2880J43953P775
$$ -95970 -106222 -125164 -102624 -103952 -126822 -89094 -116197 -96280 -58376 -81256 62697 70472
$$ [...]
##END NTUPLES=NMR SPECTRUM
##END=
